##TITLE=1H_TG-2324-1
 CDCl3,8 sc, 
 1.04.2021
##JCAMPDX= 6.0         $$ Bruker NMR JCAMP-DX V2.0
##DATA TYPE= NMR SPECTRUM
##DATA CLASS= NTUPLES
##ORIGIN= UXNMR, Bruker Analytische Messtechnik GmbH
##OWNER= root
$$ XWIN-NMR		Version 3.5
$$ Thu Apr  1 09:47:08 2021 Russian Standard Time (UT+4h)  she@DPX200
##.OBSERVE FREQUENCY= 200.131506
##.OBSERVE NUCLEUS= ^1H
##.ACQUISITION MODE= SIMULTANEOUS
##.ACQUISITION SCHEME= undefined
##.AVERAGES= 8
##.DIGITISER RES= 18
##SPECTROMETER/DATA SYSTEM= spect
##.PULSE SEQUENCE= zg30
##.SOLVENT NAME= CDCl3
##.SHIFT REFERENCE= (INTERNAL, CDCl3, 0, 15.9564)
##AUDIT TRAIL= $$ (NUMBER, WHEN, WHO, WHERE, WHAT)
$$ ##TITLE= Audit trail, XWIN-NMR		Version 3.5
$$ ##JCAMPDX= 5.01
$$ ##ORIGIN= Bruker BioSpin GmbH
$$ ##OWNER= she
$$ F:/spectra/data/she/nmr/H-F/1/pdata/1/auditp.txt
$$ ##AUDIT TRAIL=  $$ (NUMBER, WHEN, WHO, WHERE, WHAT)
(   1,<2021-04-01 09:45:28.01 +0400>,<she>,<DPX200>,
      <created by zg, POWCHK disabled, PULCHK disabled
       configuration hash MD5:
       00 E9 B6 7A A2 85 ED C7 34 08 36 98 17 FE 4E 26
       data hash MD5: 16K
       20 D4 B9 C8 5D 91 87 4A 49 B6 56 97 6E EC AE F0>)
(   2,<2021-04-01 09:45:31.17 +0400>,<she>,<DPX200>,
      <Start of raw data processing
       efp BC_mod = 2 LB = 0.24 FT_mod = 6 PKNL = 1 PHC0 = -11122.59 PHC1 = 11.80093 SI = 16K 
       data hash MD5: 16K
       52 FB EE BB 32 03 A5 AD 13 C2 07 5C 51 68 9A 20>)
(   3,<2021-04-01 09:45:52.20 +0400>,<she>,<DPX200>,
      <pk PHC0 = 4.887177 PHC1 = -2.399999 
       data hash MD5: 16K
       72 C4 1C 83 5A 4B 86 1E B8 BB EF 96 27 5B 2A 51>)
(   4,<2021-04-01 09:45:55.50 +0400>,<she>,<DPX200>,
      <abs ABSG = 5 
       data hash MD5: 16K
       4D 21 F2 6B EB 35 E7 59 6C 24 0C 7A B8 58 BD 7C>)
(   5,<2021-04-01 09:46:19.03 +0400>,<she>,<DPX200>,
      <pk PHC0 = 2.316385 PHC1 = -3.8 
       data hash MD5: 16K
       F7 C1 D7 2D 91 07 90 37 95 6C E2 0B 03 AB 39 BF>)
(   6,<2021-04-01 09:46:22.29 +0400>,<she>,<DPX200>,
      <abs ABSG = 5 
       data hash MD5: 16K
       21 F8 6B 84 0B 90 51 B5 9A 5C 47 94 D5 7E 0B 33>)
$$ ##END=
$$ 
$$ hash MD5
$$ 2A 15 23 10 60 48 8F 49 8C 5F 5E BA 26 82 8E 55
##$RELAX= 
##$RELAX= 
##$RELAX= 
##$RELAX= 
##$RELAX= 
##$RELAX= 
$$ Bruker specific parameters
$$ --------------------------
##$DU= <F:/spectra>
##$EXPNO= 1
##$NAME= <H-F>
##$PROCNO= 1
##$TYPE= <nmr>
##$USER= <she>
##$AMP= (0..31)
100 100 100 100 100 100 100 100 100 100 100 100 100 100 100 100 100 100 
100 100 100 100 100 100 100 100 100 100 100 100 100 100 
##$AQSEQ= 0
##$AQ_mod= 1
##$AUNM= <au_zg>
##$AUTOPOS= <>
##$BF1= 200.13
##$BF2= 200.13
##$BF3= 200.13
##$BF4= 200.13
##$BF5= 200.13
##$BF6= 200.13
##$BF7= 200.13
##$BF8= 200.13
##$BYTORDA= 1
##$CFDGTYP= 0
##$CFRGTYP= 5
##$CHEMSTR= <none>
##$CNST= (0..31)
1 1 145 1 1 1 1 1 1 1 1 1 1 1 1 1 1 1 1 1 1 1 1 1 1 1 1 1 1 1 1 1 
##$CPDPRG= <>
##$CPDPRG1= <>
##$CPDPRG2= <>
##$CPDPRG3= <>
##$CPDPRG4= <mlev>
##$CPDPRG5= <mlev>
##$CPDPRG6= <mlev>
##$CPDPRG7= <mlev>
##$CPDPRG8= <mlev>
$$ [...]
##$SUBNAM3= <"">
##$SUBNAM4= <"">
##$SUBNAM5= <"">
##$SUBNAM6= <"">
##$SUBNAM7= <"">
##$SUBNAM8= <"">
##$SUBNAM9= <"">
##$SW= 16.9725357007746
##$SWIBOX= (0..15)
0 0 2 0 0 0 0 0 0 0 0 0 0 0 0 0 
##$SW_h= 3396.73913043478
##$TD= 16384
##$TD0= 1
##$TE= 0
##$TE2= 300
##$TE3= 300
##$TEG= 300
##$TL= (0..7)
0 120 120 120 120 120 120 120 
##$TP= (0..7)
150 150 150 150 150 150 150 150 
##$TP07= 0
##$TPNAME0= <>
##$TPNAME1= <>
##$TPNAME2= <>
##$TPNAME3= <>
##$TPNAME4= <>
##$TPNAME5= <>
##$TPNAME6= <>
##$TPNAME7= <>
##$TPOAL= (0..7)
0.5 0.5 0.5 0.5 0.5 0.5 0.5 0.5 
##$TPOFFS= (0..7)
0 0 0 0 0 0 0 0 
##$TUNHIN= 0
##$TUNHOUT= 0
##$TUNXOUT= 0
##$USERA1= <user>
##$USERA2= <user>
##$USERA3= <user>
##$USERA4= <user>
##$USERA5= <user>
##$V9= 5
##$VALIST= <valist>
##$VCLIST= <CCCCCCCCCCCCCCC>
##$VD= 0
##$VDLIST= <DDDDDDDDDDDDDDD>
##$VPLIST= <PPPPPPPPPPPPPPP>
##$VTLIST= <TTTTTTTTTTTTTTT>
##$WBST= 1024
##$WBSW= 4
##$XGAIN= (0..3)
0 0 0 0 
##$XL= 0
##$YL= 0
##$YMAX_a= 1106948
##$YMIN_a= -936709
##$ZGOPTNS= <>
##$ZL1= 120
##$ZL2= 120
##$ZL3= 120
##$ZL4= 120
##$ABSF1= 15.97507
##$ABSF2= -0.997592
##$ABSG= 5
##$ABSL= 3
##$ALPHA= 0
##$AQORDER= 0
##$ASSFAC= 0
##$ASSFACI= 0
##$ASSFACX= 0
##$ASSWID= 0
##$AUNMP= <proc_1d>
##$AZFE= 0.1
##$AZFW= 0.1
##$BCFW= 0
##$BC_mod= 2
##$BYTORDP= 0
##$COROFFS= 0
##$CY= -3
##$DATMOD= 1
##$DC= 0
##$DFILT= <>
##$DTYPP= 0
##$F1P= 0
##$F2P= 0
##$FCOR= 1
##$FTSIZE= 16384
##$FT_mod= 6
##$GAMMA= 0
##$GB= 0
##$INTBC= 1
##$INTSCL= 2.992141e-10
##$ISEN= 128
##$LB= 0.24
##$LEV0= 0
##$LPBIN= 0
##$MAXI= 10000
##$MC2= 0
##$MEAN= 0
##$ME_mod= 0
##$MI= 1.114404
##$NCOEF= 0
##$NC_proc= -6
##$NLEV= 6
##$NOISF1= 3.799351
##$NOISF2= 2.8
##$NSP= 0
##$NTH_PI= 0
##$NZP= 0
##$OFFSET= 15.95642
##$PC= 1
##$PHC0= -11115.38
##$PHC1= 5.600931
##$PH_mod= 1
##$PKNL= yes
##$PPARMOD= 0
##$PSCAL= 0
##$PSIGN= 0
##$REVERSE= no
##$SF= 200.130011012515
##$SI= 16384
##$SIGF1= 3
##$SIGF2= 2
##$SINO= 5.538805
##$SIOLD= 16384
##$SREGLST= <1H.CDCl3>
##$SSB= 0
##$STSI= 16384
##$STSR= 0
##$SW_p= 3396.73913043479
##$SYMM= 0
##$S_DEV= 0
##$TDeff= 16384
##$TDoff= 0
##$TI= <>
##$TILT= no
##$TM1= 0
##$TM2= 0
##$TOPLEV= 0
##$USERP1= <user>
##$USERP2= <user>
##$USERP3= <user>
##$USERP4= <user>
##$USERP5= <user>
##$WDW= 1
##$XDIM= 16384
##$YMAX_p= 348810853
##$YMIN_p= -926703
$$ End of Bruker specific parameters
$$ ---------------------------------
##NTUPLES= NMR SPECTRUM
##VAR_NAME=  FREQUENCY,     SPECTRUM/REAL,   SPECTRUM/IMAG
##SYMBOL=    X,             R,               I
##VAR_TYPE=  INDEPENDENT,   DEPENDENT,       DEPENDENT
##VAR_FORM=  AFFN,          ASDF,            ASDF
##VAR_DIM=   16384,         16384,           16384
##UNITS=     HZ,            ARBITRARY UNITS, ARBITRARY UNITS
##FACTOR=    0.207333158178282, 1,           1
##FIRST=     3193.35849926577, 0,            0
##LAST=      -203.38063116902, 0,            0
##MIN=       -203.38063116902, -926703,      0
##MAX=       3193.35849926577, 348810853,    0
$$ Real data points
##PAGE= N=1
##DATA TABLE= (X++(R..R)), XYDATA
$$ [...]
$$ plain form
5153 2991691 2979561 2990261 3051166 3083174 3180052 3177283 3203258 3249185 3190820 3116809 3182126 3202406
5141 3202406 3193049 3309934 3392192 3373857 3431288 3371807 3449737 3469913 3453982 3379072 3357341
5130 3357341 3366747 3362176 3439521 3486985 3570268 3634102 3668399 3722016 3645153 3572842 3722984 3798850
5118 3798850 3786245 3795909 3856630 3798016 3730031 3691495 3713976 3724208 3730642 3805839 3880150 3829825
5106 3829825 3829622 3783503 3731884 3707632 3740536 3704697 3660101 3675521 3748615 3774722 3758320 3804822
5094 3804822 3749963 3829315 3899539 3858642 3911705 3954949 3890772 3945785 3889484 3922106 4004894
5083 4004894 3998341 3960978 4016635 4026433 4051146 4001457 3957868 3982933 4137144 4198983 4335066
5072 4335066 4398454 4303603 4292412 4271613 4390020 4342649 4376396 4526841 4574025 4541175 4634985
$$ packed form
5153B991691j2130J0700O0905L2008R6878k769K5975M5927n8365p4011O5317K0280
5141C202406r357J16885Q2258j8335N7431n9481P7930K0176j5931p4910k1731
5130C357341R406m571P7345M7464Q3283O3834L4297N3617p6863p2311J50142P5866
5118C798850j2605R664O0721n8614o7985l8536K2481J0232O434P5197P4311n0325
5106C829825k03m6119n1619k4252L2904l5839m4596J5420P3094K6107j6402M6502
5094C804822n4859P9352P0224m0897N3063M3244o4177N5013n6301L2622Q2788
5083D004894o553l7363N5657R798K4713m9689m3589K5065J54211O1839J36083
5072D335066O3388r4851j1191k0799J18407m7371L3747J50445M7184l2850R3810
$$ plain form
5061 4634985 4678611 4669231 4617277 4670109 4672216 4766807 4808999 4811680 4821238 4888530 4894118 4906903
5049 4906903 4894754 4866651 4961791 5050413 4983923 5032885 5002471 4861819 4830588 4910737 5085397
5038 5085397 5092888 5099262 5116915 5175045 5181346 5148355 5184026 5212522 5208999 5301245 5244136 5238436
5026 5238436 5251321 5237196 5346406 5420676 5379503 5351088 5327177 5367093 5377416 5306451 5356563
5015 5356563 5346104 5329210 5288940 5321254 5399233 5408770 5444184 5652063 5631076 5468608 5470424
5004 5470424 5464060 5597439 5641571 5602465 5657398 5699974 5772232 5797965 5799901 5925759 5974053
4993 5974053 5953232 5832874 5794876 5798048 5882869 5829872 5763421 5785979 5884431 5894685 5938622
4982 5938622 6043046 6083806 6015136 5979456 5995255 6025371 6113608 6152567 6201372 6260778 6209935
$$ packed form
5061D634985M3626r380n1954N2832K107R4591M2192K681R558O7292N588J2785
5049D906903j2149k8103R5140Q8622o6490M8962l0414j40652l1231Q0149J74660
5038E085397P491O374J7653N8130O301l2991L5671K8496l523R2246n7109n700
5026E238436J2885j4125J09210P4270m1173k8415k3911L9916J0323p0965N0112
5015E356563j0459j6894m0270L2314P7979R537L5414K07879k0987j62468J816
5004E470424o364J33379M4132l9106N4933M2576P2258K5733J936J25858M8294
4993E974053k0821j20358l7998L172Q4821n2997o6451K2558R8452J0254M3937
4982E938622J04424M0760o8670l5680J5799L0116Q8237L8959M8805N9406n0843
$$ plain form
4971 6209935 6244469 6375462 6274238 6174459 6162943 6220272 6181276 6235944 6230027 6369265 6438989
4960 6438989 6451508 6477879 6569456 6536562 6659120 6795059 6778614 6849258 6873623 6928565 6939577
4949 6939577 6877456 6925286 6969877 7072938 7300750 7304873 7274122 7290013 7337737 7413458 7500173
4938 7500173 7594845 7630366 7726827 7840890 7879106 8025697 7966429 8035208 8170724 8262009 8329600
4927 8329600 8547086 8704764 8771116 8827133 8921343 9069066 9199259 9320835 9379011 9504252
4917 9504252 9623337 9832900 9943192 10028494 10147487 10273659 10420357 10648565 10762284 10897086
4907 10897086 11058352 11211877 11430120 11528782 11749286 11915108 12134286 12442432 12475929 12631828
4897 12631828 12845641 12996661 13183659 13359176 13546530 13745075 14020771 14181279 14487205
$$ packed form
4971F209935L4534J30993j01224r9779j1516N7329l8996N4668n917J39238O9724
4960F438989J2519K6371R1577l2894J22558J35939j6445P0644K4365N4942J1012
4949F939577o2121M7830M4591J03061K27812M123l0751J5891M7724P5721Q6715
4938G500173R4672L5521R6461J14063L8216J46591n9268O8779J35516R1285O7591
4927H329600K17486J57678O6352N6017R4210J47723J30193J21576N8176J25241
4917I504252J19085K09563J10292Q5302J18993J26172J46698K28208J13719J34802
4907A0897086J61266J53525K18243R8662K20504J65822K19178L08146L3497J55899
4897A2631828K13813J51020J86998J75517J87354J98545K75696J60508L05926
$$ plain form
4888 14487205 14716242 14939088 15092114 15295373 15486230 15667891 15894685 16142517 16507759
4879 16507759 16699203 16938743 17236125 17496829 17820177 18163196 18394288 18669699 18953478
4870 18953478 19234492 19564063 19868716 20185535 20683912 21016380 21358517 21856799 22289131
4861 22289131 22698740 23195069 23567625 24157807 24692017 25096036 25758737 26387499 27008461
4852 27008461 27675047 28356983 29022016 29653075 30392144 31212697 32060736 32875629 33746222
4843 33746222 34750647 35694172 36789460 37997587 39089689 40197358 41331897 42695906
4835 42695906 43987420 45261028 46701558 48180387 49789799 51396190 53099881 54789359
4827 54789359 56586390 58470221 60274712 62217149 64219461 66140725 68124866 70050468
$$ packed form
4888A4487205K29037K22846J53026K03259J90857J81661K26794K47832L65242
4879A6507759J91444K39540K97382K60704L23348L43019K31092K75411K83779
4870A8953478K81014L29571L04653L16819M98377L32468L42137M98282M32332
4861B2289131M09609M96329L72556N90182N34210M04019O62701O28762O20962
4852B7008461O66586O81936O65033O31059P39069Q20553Q48039Q14893Q70593
4843C3746222J004425R43525J095288J208127J092102J107669J134539J364009
4835D2695906J291514J273608J440530J478829J609412J606391J703691J689478
4827E4789359J797031J883831J804491J942437K002312J921264J984141J925602
$$ plain form
4819 70050468 72069433 74036332 75861932 77673866 79327066 80663186 81941227 82833374
4811 82833374 83468957 83714704 83753677 83429033 82794116 81905971 80690528 79307513 77606708
4802 77606708 75762261 73735280 71767310 69680674 67579204 65515648 63473828 61405763
4794 61405763 59439992 57449623 55663332 53909933 52191837 50423158 48808109 47259979
4786 47259979 45623535 44262118 42815145 41335952 40136028 38947984 37743822 36657363
4778 36657363 35499049 34425779 33454323 32442914 31552953 30631434 29846695 29158188 28569090
4769 28569090 27801010 27098886 26472216 25733455 25128996 24549625 23931256 23316661 22853204
4760 22853204 22464291 21997834 21602626 21297747 20887361 20353522 19866460 19542874 19136504
$$ packed form
4819G0050468K018965J966899J825600J811934J653200J336120J278041Q92147
4811H2833374O35583K45747L8973l24644o34917q88145j215443j383015j700805
4802G7606708j844447k026981j967970k086636k101470k063556k041820k068065
4794F1405763j965771j990369j786291j753399j718096j768679j615049j548130
4786D7259979j636444j361417j446973j479193j199924j188044j204162j086459
4778C6657363j158314j073270r71456j011409q89961r21519p84739o88507n89098
4769B8569090p68080p02124o26670p38761o04459n79371o18369o14595m63457
4760B2853204l88913m66457l95208l04879m10386n33839m87062l23586m06370
$$ plain form
4751 19136504 18839817 18570747 18211320 17956004 17756286 17454411 17198474 16901610 16561962
4742 16561962 16357057 16202333 15991613 15875732 15760559 15657838 15482016 15348410 15116840
4733 15116840 14848425 14513781 14363520 14271836 14181088 14152461 14088400 14043419 14036390 13915003 13762118
4722 13762118 13691444 13547440 13433126 13375358 13299261 13310883 13308439 13209485 13135707 13127934 13047950
4711 13047950 13020481 12984503 12847468 12786249 12756094 12742551 12781582 12792874 12666882 12641862 12682204
4700 12682204 12578943 12523052 12539211 12486936 12498034 12466398 12492573 12462109 12438655 12442386 12441085
4689 12441085 12425015 12430739 12384034 12363097 12415646 12420363 12487772 12393674 12458338 12515300 12529461 12499426
4677 12499426 12497550 12480959 12381521 12491880 12477430 12562262 12717502 12767077 12712166 12686022 12717544
$$ packed form
4751A9136504k96687k69070l59427k55316j99718l01875k55937k96864l39648
4742A6561962k04905j54724k10720j15881j15173j02721j75822j33606k31570
4733A5116840k68415l34644j50261r1684r0748k8627o4061m4981p029j21387j52885
4722A3762118p0674j44004j14314n7768p6097J1622k444r8954p3778p773p9984
4711A3047950k7469l5978j37035o1219l0155j3543L9031J1292j25992k5020M0342
4700A2682204j03261n5891J6159n2275J1098l1636K6175l0464k3454L731j301
4689A2441085j6070N724m6705k0937N2549M717O7409r4098O4664N6962J4161l0035
4677A2499426j876j6591r9438J10359j4450Q4832J55240M9575n4911k6144L1522
$$ plain form
4666 12717544 12761027 12758933 12822044 12742735 12811145 12901179 13088699 13019526 13069209 13180652 13214942
4655 13214942 13330130 13263623 13310083 13310820 13403567 13483489 13557595 13594681 13751141 13741546 13817288
4644 13817288 13892183 13952927 13969871 14149604 14300535 14256966 14270447 14309731 14490401 14569509 14639616
4633 14639616 14705441 14826875 14905199 15082679 15164605 15221310 15294663 15442169 15608967 15650488
4623 15650488 15898052 16016786 16085259 16283232 16369512 16535863 16605861 16751046 17018518 17250752
4613 17250752 17329067 17440950 17632920 17803501 17883598 18111672 18351724 18641461 18833487 18974640
4603 18974640 19200930 19404122 19640421 19822902 20060725 20239623 20406679 20633599 20868092
4594 20868092 21037002 21345852 21570418 21655855 21770850 21987829 22208834 22440078 22652334 22889453
$$ packed form
4666A2717544M3483k094O3111p9309O8410R0034J87520o9173M9683J11443L4290
4655A3214942J15188o6507M6460P37R2747P9922P4106L7086J56460r595P5742
4644A3817288P4895O0744J6944J79733J50931m3569J3481L9284J80670P9108P0107
4633A4639616O5825J21434P8324J77480Q1926N6705P3353J47506J66798M1521
4623A5650488K47564J18734O8473J97973Q6280J66351O9998J45185K67472K32234
4613A7250752P8315J11883J91970J70581Q0097K28074K40052K89737J92026J41153
4603A8974640K26290K03192K36299J82481K37823J78898J67056K26920K34493
4594B0868092J68910L08850K24566Q5437J14995K16979K21005K31244K12256K37119
$$ plain form
4584 22889453 23034497 23279091 23404242 23556397 23741402 23825180 24064582 24335365 24514426 24696085
4574 24696085 24867216 25021610 25147270 25258231 25434248 25627898 25731832 25918494 26033948
4565 26033948 26136440 26260564 26407537 26558094 26724978 26896453 26940870 27113652 27289303 27303986
4555 27303986 27378101 27494794 27578503 27564462 27671209 27837255 27854239 27803275 27807317 27822501 27831624
4544 27831624 27741237 27695653 27752232 27631530 27599716 27510290 27432754 27403491 27329659 27346457 27268883
4533 27268883 27095055 26908561 26797003 26771190 26617155 26469509 26332234 26183176 26030785 25949360
4523 25949360 25775951 25574880 25385625 25252896 25089789 24964259 24812924 24681518 24566481
4514 24566481 24425141 24369309 24125289 23886222 23790268 23664863 23403619 23264422 23107670 23006510
$$ packed form
4584B2889453J45044K44594J25151J52155J85005Q3778K39402K70783J79061J81659
4574B4696085J71131J54394J25660J10961J76017J93650J03934J86662J15454
4565B6033948J02492J24124J46973J50557J66884J71475M4417J72782J75651J4683
4555B7303986P4115J16693Q3709j4041J06747J66046J6984n0964M042J5184R123
4544B7831624r0387m5584N6579j20702l1814q9426p7536k9263p3832J6798p7574
4533B7268883j73828j86494j11558k5813j54035j47646j37275j49058j52391q1425
4523B5949360j73409k01071j89255j32729j63107j25530j51335j31406j15037
4514B4566481j41340n5832k44020k39067r5954j25405k61244j39197j56752j01160
$$ plain form
4504 23006510 22846958 22680582 22501649 22348628 22147040 22040882 21785009 21552124 21303617
4495 21303617 21076283 20946179 20782698 20585484 20376006 20162963 19984041 19866313 19736578
4486 19736578 19670721 19486701 19288012 19089877 19089451 18882866 18776552 18678120 18522180 18415837
4476 18415837 18335733 18203516 18088993 17946447 17933194 17828765 17754838 17778766 17838217 17773238
4466 17773238 17684798 17601183 17573358 17604807 17670990 17695467 17632225 17640234 17649409 17696364 17755063 17856477
4454 17856477 17913181 17992742 18098515 18146476 18235446 18399234 18446573 18586729 18699094 18730345
4444 18730345 18941901 19113426 19330719 19406747 19440023 19616525 19855254 20101370 20286944 20438712
4434 20438712 20639633 20869450 21139557 21314051 21472489 21724216 22021180 22229857 22348820
$$ packed form
4504B3006510j59552j66376j78933j53021k01588j06158k55873k32885k48507
4495B1303617k27334j30104j63481j97214k09478k13043j78922j17728j29735
4486A9736578o5857j84020j98689j98135m26k06585j06314r8432j55940j06343
4476A8415837q0104j32217j14523j42546j3253j04429p3927K3928N9451o4979
4466A7773238q8440q3615k7825L1449O6183K4477o3242Q009R175M6955N8699J01414
4454A7856477N6704P9561J05773M7961Q8970J63788M7339J40156J12365L1251
4444A8730345K11556J71525K17293P6028L3276J76502K38729K46116J85574J51768
4434B0438712K00921K29817K70107J74494J58438K51727K96964K08677J18963
$$ plain form
4425 22348820 22478649 22642720 22901981 23058562 23197795 23320796 23336445 23318868 23467332 23482931
4415 23482931 23446973 23337161 23282879 23151989 23052599 22853603 22616878 22432104 22206180 21898530
4405 21898530 21692887 21460715 21168255 20841601 20458616 20222057 19902255 19609596 19359633
4396 19359633 19074406 18721497 18434306 18141711 17965800 17778027 17457182 17208591 17003034
4387 17003034 16757761 16600077 16474372 16154596 15898872 15705302 15442032 15319263 15243968 15058720
4377 15058720 14872938 14726179 14604618 14542816 14490209 14336108 14222303 14026799 13921471 13799740
4367 13799740 13712299 13637449 13546331 13436564 13433465 13358399 13300213 13312347 13279682 13163329 13106952
4356 13106952 13137138 12985132 12903993 12912639 12893810 12903431 12783509 12886936 12864090 12847570 12756089
$$ packed form
4425B2348820J29829J64071K59261J56581J39233J23001J5649j7577J48464J5599
4415B3482931l5958j09812n4282j30890r9390j98996k36725j84774k25924l07650
4405B1898530k05643k32172k92460l26654l82985k36559l19802k92659k49963
4396A9359633k85227l52909k87191k92595j75911j87773l20845k48591k05557
4387A7003034k45273j57684j25705l19776k55724j93570k63270j22769p5295j85248
4377A5058720j85782j46759j21561o1802n2607j54101j13805j95504j05328j21731
4367A3799740q7441p4850r1118j09767l099p5066n8186J2134l2665j16353n6377
4356A3106952L0186j52006q1139Q646j8829R621j19922J03427k2846j6520r1481
$$ plain form
4345 12756089 12670708 12634425 12545051 12603274 12558688 12617404 12616763 12603331 12612182 12683352 12567555 12517515
4333 12517515 12432627 12371748 12409443 12460236 12368530 12289063 12133168 12021674 11961468 11875320 11840233
4322 11840233 11863307 11724370 11744602 11734087 11790870 11795328 11628709 11639450 11722087 11535991 11436840
4311 11436840 11439480 11365509 11420206 11434008 11498748 11437295 11518642 11543046 11517091 11573343 11427099
4300 11427099 11317815 11370505 11309842 11229293 11265165 11291192 11351941 11352970 11286296 11343660 11434985
4289 11434985 11554154 11506501 11430712 11335473 11267525 11337101 11353282 11449380 11450772 11556610 11519966
4278 11519966 11511508 11619394 11615679 11611015 11655416 11653309 11664364 11677894 11660596 11747649 11736573 11786901
4266 11786901 11653437 11790756 11823130 11784602 11894432 11981585 11909888 11800292 11826213 11883178
$$ packed form
4345A2756089q5381l6283q9374N8223m4586N8716o41j3432Q851P1170j15797n0040
4333A2517515q4888o0879L7695N0793r1706p9467j55895j11494o0206q6148l5087
4322A1840233K3074j38937K0232j0515N6783M458j66619J0741Q2637j86096r9151
4311A1436840K640p3971N4697J3802O4740o1453Q1347K4404k5955N6252j46244
4300A1427099j09284N2690o0663q0549L5872K6027O0749J029o6674N7364R1325
4289A1434985J19169m7653p5789r5239o7948O9576J6181R6098J392J05838l6644
4278A1519966q458J07886l715m664M4401k107J1055J3530j7298Q7053j1076N0328
4266A1786901j33464J37319L2374l8528J09830Q7153p1697j09596K5921N6965
$$ plain form
4256 11883178 11901311 11881342 11905039 11896836 11911718 11794757 11861039 11872351 11885543 11910645 11939538
4245 11939538 11976946 11938775 11857915 11872515 11880365 11869020 11838415 11914443 12003483 12063370 12101129
4234 12101129 12152548 12074012 12002957 12010920 11848410 11818262 11906874 12020566 12048780 11968634 11971997
4223 11971997 12000842 11910933 11864984 11813816 11844255 11702469 11640207 11646058 11666663 11699345 11691848
4212 11691848 11693053 11770374 11749389 11760431 11737491 11672359 11582698 11574557 11649484 11625227 11630683 11566682
4200 11566682 11506459 11542936 11510935 11515261 11529603 11601166 11720200 11733427 11716484 11688008 11695494
4189 11695494 11626781 11566849 11612955 11581399 11544395 11641132 11657840 11734241 11795083 11842011 11858910
4178 11858910 11820427 11870059 11755971 11714114 11820767 11861754 12018437 12131240 12108395 12123275
$$ packed form
4256A1883178J8133j9969K3697q203J4882j16961O6282J1312J3192K5102K8893
4245A1939538L7408l8171q0860J4600P850j1345l0605P6028Q9040N9887L7759
4234A2101129N1419p8536p1055P963j62510l0148Q8612J13692K8214q0146L363
4223A1971997K8845q9909m5949n1168L0439j41786o2262N851K0605L2682p497
4212A1691848J205P7321k0985J1042k2940o5132q9661q141P4927k4257N456o4001
4200A1566682o0223L6477l2001M326J4342P1563J19034J3227j6943k8476P486
4189A1695494o8713n9932M6106l1556l7004R6737J6708P6401O0842M6928J6899
4178A1858910l8483M9632j14088m1857J06653M0987J56683J12803k2845J4880
$$ plain form
4168 12123275 12142927 12111366 12101768 12153361 12187562 12177456 12210241 12209779 12190572 12245783 12249582 12261643
4156 12261643 12272371 12251974 12270470 12145073 12053556 12042699 11934037 11949737 11949740 11937022 11963683 11887120
4144 11887120 11905304 11935044 11805315 11772286 11735890 11664349 11662372 11726055 11785609 11789991 11692860
4133 11692860 11639452 11570762 11638760 11687059 11633120 11655317 11655268 11708716 11719763 11758770 11666170 11586382
4121 11586382 11620527 11692865 11618316 11638752 11620350 11686833 11706483 11787055 11806115 11779354 11857664
4110 11857664 11910285 12004599 12013304 12044243 12085834 12087911 12131501 12177388 12242976 12216748 12352567
4099 12352567 12419460 12414694 12481522 12523104 12672659 12678197 12683009 12699851 12741868 12793596 12778718 12798383
4087 12798383 12927452 13106322 13130415 13171639 13168892 13206835 13221390 13228682 13265366 13283751 13349608
$$ packed form
4168A2123275J9652l1561r598N1593L4201j0106L2785m62j9207N5211L799J2061
4156A2261643J0728k0397J8496j25397r1517j0857j08662J5700Lj2718K6661p6563
4144A1887120J8184K9740j29729l3029l6396p1541j977O3683N9554M382r7131
4133A1692860n3408o8690O7998M8299n3939K2197m9N3448J1047L9007r2600p9788
4121A1586382L4145P2338p4549K0436j8402O6483J9650Q0572J9060k6761P8310
4110A1857664N2621R4314Q705L0939M1591K077M3590M5887O5588k6228J35819
4099A2352567O6893m766O6828M1582J49555N538M812J6842M2017N1728j4878J9665
4087A2798383J29069J78870K4093M1224k747L7943J4555P292L6684J8385O5857
$$ plain form
4076 13349608 13403748 13579506 13577624 13627175 13734385 13712106 13648412 13632697 13681266 13704035 13706669
4065 13706669 13726073 13824287 13734115 13703971 13745825 13801771 13807289 13894546 13977777 13949291 13991031
4054 13991031 13990412 14059215 13921035 13912511 13969540 14075047 14135638 14216827 14175392 14218239 14316530
4043 14316530 14379211 14381944 14399101 14464301 14512484 14620164 14615946 14663593 14754999 14753047 14770893 14843015
4031 14843015 14890294 14835423 14848560 14897535 14907445 14926443 14959133 14905579 14925786 14953649 15028944
4020 15028944 15089398 15170795 15211182 15253410 15244165 15180609 15244669 15231653 15206288 15231657 15329496
4009 15329496 15414414 15391409 15521279 15617806 15610428 15613239 15673065 15741185 15787132 15824479 15789651
3998 15789651 15883982 15903321 15989991 16014335 16157268 16188561 16264283 16331169 16291423 16270243 16280789
$$ packed form
4076A3349608N4140J75758j882M9551J07210k2279o3694j5715M8569K2769K634
4065A3706669J9404R8214r0172l0144M1854N5946N518Q7257Q3231k8486M1740
4054A3991031o19O8803j38180q524N7029J05507O0591Q1189m1435M2847R8291
4043A4316530O2681K733J7157O5200M8183J07680m218M7647R1406j952J7846P2122
4031A4843015M7279n4871J3137M8975R910J8998L2690n3554K0207K7863P5295
4020A5028944O0454Q1397M0387M2228r245o3556O4060j3016k5365K5369R7839
4009A5329496Q4918k3005J29870R6527p378K811N9826O8120M5947L7347l4828
3998A5789651R4331J9339Q6670K4344J42933L1293P5722O6886l9746k1180J0546
$$ plain form
3987 16280789 16319322 16354914 16397592 16549722 16656099 16766720 16723192 16713975 16776117 16835811 16852386
3976 16852386 16847039 16923804 17044482 17155424 17163650 17189323 17339127 17292595 17108690 17159241 17360539
3965 17360539 17433206 17473562 17609551 17788527 17908444 17852746 17946100 18005919 18039564 18058447 18004668
3954 18004668 18072240 18181860 18178620 18242313 18362004 18508768 18616008 18738857 18801818 18852071
3944 18852071 18858512 18951533 18960622 19028622 19238854 19256656 19309685 19516248 19550168 19577198 19716383
3933 19716383 19763897 19833328 19912837 19979345 20107953 20147633 20210032 20333118 20434096 20525122 20553756
3922 20553756 20615184 20764743 20933071 20923556 20940078 21085660 21287997 21398879 21439633 21537504
3912 21537504 21542793 21625111 21750573 21860893 21975392 22062438 22083348 22264264 22451342 22526846
$$ packed form
3987A6280789L8533L5592M2678J52130J06377J10621m3528r217O2142N9694J6575
3976A6852386n347P6765J20678J10942Q226K5673J49804m6532j83905N0551K01298
3965A7360539P2667M0356J35989J78976J19917n5698R3354N9819L3645J8883n3779
3954A8004668O7572J09620l240O3693J19691J46764J07240J22849O2961N0253
3944A8852071O441R3021R089O8000K10232J7802N3029K06563L3920K7030J39185
3933A9716383M7514O9431P9509O6508J28608L9680O2399J23086J00978R1026K8634
3922B0553756O1428J49559J68328r515J6522J45582K02337J10882M0754R7871
3912B1537504N289Q2318J25462J10320J14499Q7046K0910J80916J87078P5504
$$ plain form
3902 22526846 22642845 22688812 22786189 22887232 23016486 23128663 23234705 23305288 23414846 23582126
3892 23582126 23803219 23915536 24028523 24083587 24150390 24231114 24324944 24411246 24472535 24706383
3882 24706383 24925222 25119173 25293809 25542239 25677033 25661158 25710699 25950182 26109466 26169970
3872 26169970 26383556 26581419 26726349 26840185 27012516 27149368 27354187 27559572 27811581
3863 27811581 28032636 28144330 28368948 28629790 28806214 29009199 29250774 29448111 29735753
3854 29735753 29920102 30137696 30406348 30687847 30917806 31159116 31318963 31615970 31886463
3845 31886463 32183026 32560145 32825358 33124311 33313203 33646070 34033036 34382315 34789627
3836 34789627 35067431 35463528 35841553 36148238 36534672 36858620 37368137 37743998 38193904
$$ packed form
3902B2526846J15999M5967R7377J01043J29254J12177J06042P0583J09558J67280
3892B3582126K21093J12317J12987N5064O6803Q0724R3830Q6302O1289K33848
3882B4706383K18839J93951J74636K48430J34794j5875M9541K39483J59284O0504
3872B6169970K13586J97863J44930J13836J72331J36852K04819K05385K52009
3863B7811581K21055J11694K24618K60842J76424K02985K41575J97337K87642
3854B9735753J84349K17594K68652K81499K29959K41310J59847K97007K70493
3845C1886463K96563L77119K65213K98953J88892L32867L86966L49279M07312
3836C4789627K77804L96097L78025L06685L86434L23948N09517L75861M49906
$$ plain form
3827 38193904 38588156 39077375 39687534 40243801 40685410 41132679 41655885 42097698 42583110
3818 42583110 43046469 43603847 44180950 44719829 45297515 45920590 46585813 47225163 47841027
3809 47841027 48572934 49278030 49895333 50589271 51251226 51941737 52606245 53345179 54148897
3800 54148897 54856523 55722090 56634572 57400819 58300555 59187213 60058661 60908058 61825574
3791 61825574 62824228 63727366 64660466 65715402 66799418 67802601 68943818 69941926 71035463
3782 71035463 72267930 73486164 74683785 75923794 77275851 78744826 80134934 81615395
3774 81615395 83099192 84609886 86205102 87943988 89712555 91460913 93329455 95328293
3766 95328293 97362323 99578366 101739894 103977894 106413315 108829366 111342107 114068055
$$ packed form
3827C8193904L94252M89219O10159N56267M41609M47269N23206M41813M85412
3818D2583110M63359N57378N77103N38879N77686O23075O65223O39350O15864
3809D7841027P31907P05096O17303O93938O61955O90511O64508P38934Q03718
3800E4148897P07626Q65567R12482P66247Q99736Q86658Q71448Q49397R17516
3791F1825574R98654R03138R33100J054936J084016J003183J141217R98108J093537
3782G1035463J232467J218234J197621J240009J352057J468975J390108J480461
3774H1615395J483797J510694J595216J738886J768567J748358J868542J998838
3766I5328293K034030K216043K161528K238000K435421K416051K512741K725948
$$ plain form
3758 114068055 116804528 119743790 122870920 126012118 129432536 132945950 136666625 140463982
3750 140463982 144473198 148625303 152941969 157580707 162407193 167384883 172513012 177702555
3742 177702555 183006717 188477494 193909740 199201792 204471586 209429238 214335068 218993822
3734 218993822 223422969 227479366 231077476 234345776 237093219 239356755 241201565 242832918
3726 242832918 244168688 245395701 246651552 247998601 249532469 251319511 253369682 256002324
3718 256002324 259033197 262445059 266337967 270635961 275423704 280484529 285908594 291478041
3710 291478041 297066857 302743736 308360929 313736091 318440286 322492681 325682412 327732735
3702 327732735 328652184 328357609 326776844 324204764 320759292 316662794 312172947 307309210
$$ packed form
3758A14068055K736473K939262L127130L141198L420418L513414L720675L797357
3750A40463982M009216M152105M316666M638738M826486M977690N128129N189543
3742A77702555N304162N470777N432246N292052N269794M957652M905830M658754
3734B18993822M429147M056397L598110L268300K747443K263536J844810J631353
3726B42832918J335770J227013J255851J347049J533868J787042K050171K632642
3718B56002324L030873L411862L892908M297994M787743N060825N424065N569447
3710B91478041N588816N676879N617193N375162M704195M052395L189731K050323
3702C27732735R19449k94575j580765k572080l445472m096498m489847m863737
$$ plain form
3694 307309210 302224241 296982395 291728159 286429042 281223646 275950690 270720818 265634654
3686 265634654 260560161 255570546 250595312 245693696 240833272 236017341 231235657 226623653
3678 226623653 222107577 217663821 213315668 209032256 204952753 200928871 196920873 193144422
3670 193144422 189499828 185817225 182272377 178857280 175426687 172190582 169170450 166117048
3662 166117048 163135303 160336249 157700348 155075201 152553621 150039839 147620377 145300586
3654 145300586 143176111 140990654 138967434 136978874 135076842 133227589 131388945 129579924
3646 129579924 127904522 126178349 124549117 122878346 121257477 119816632 118303970 116936994
3638 116936994 115480047 114101408 112805068 111452265 110061508 108848033 107631738 106396380
$$ packed form
3694C07309210n084969n241846n254236n299117n205396n272956n229872n086164
3686B65634654n074493m989615m975234m901616m860424m815931m781684m612004
3678B26623653m516076m443756m348153m283412m079503m023882m007998l776451
3670A93144422l644594l682603l544848l415097l430593l236105l020132l053402
3662A66117048k981745k799054k635901k625147k521580k513782k419462k319791
3654A45300586k124475k185457k023220j988560j902032j849253j838644j809021
3646A29579924j675402j726173j629232j670771j620869j440845j512662j366976
3638A16936994j456947j378639j296340j352803j390757j213475j216295j235358
$$ plain form
3630 106396380 105142275 103982430 102867373 101962227 100874075 99763598 98734432 97921229
3622 97921229 97001933 96054654 95253744 94469289 93739731 93072546 92316122 91697535 91115174
3613 91115174 90554854 89986555 89384519 88915934 88432587 87984471 87527383 87199829 86818920
3604 86818920 86466654 86178597 85971275 85701305 85471563 85190800 85086453 84815878 84576904
3595 84576904 84417334 84234513 84097857 83924800 83793066 83703447 83490875 83336057 83133997 83031680
3585 83031680 82884571 82675382 82541958 82392162 82346052 82151878 81910191 81709880 81410646 81201118
3575 81201118 81030372 80711420 80577895 80398405 80233784 79946347 79681531 79463398 79265896
3566 79265896 79091216 78822584 78696617 78564698 78327812 78197460 78076088 78010505 77773535 77789905
$$ packed form
3630A06396380j254105j159845j115057r05146j088152j110477j029166q13203
3622I7921229r19296r47279q00910p84455p29558o67185p56424o18587n82361
3613I1115174n60320n68299o02036m68585m83347m48116m57088l27554l80909
3604H6818920l52266k88057k07322k69970k29742k80763j04347k70575k38974
3595H4576904j59570j82821j36656j73057j31734q9619k12572j54818k02060j02317
3585H3031680j47109k09189j33424j49796m6110j94174k41687k00311k99234k09528
3575H1201118j70746l18952j33525j79490j64621k87437k64816k18133j97502
3566G9265896j74680k68632j25967j31919k36886j30352j21372o5583k36970J6370
$$ plain form
3556 77789905 77921027 77982747 77970512 77970429 78003127 78241525 78420372 78597968 78736727 78840030 79037539
3545 79037539 79322574 79599982 79847950 80116276 80417075 80714092 80925385 81222564 81563233
3536 81563233 81841434 81969339 82247502 82475340 82591269 82886134 83043794 83138911 83308050 83264299
3526 83264299 83220285 83192771 83255530 83237002 83004787 82789461 82578848 82475230 82309400 81998952
3516 81998952 81659050 81328366 81075825 80813456 80373438 79975703 79694320 79281772 78863574
3507 78863574 78497192 78191292 77798511 77463728 77222258 76978193 76586777 76318357 76019768
3498 76019768 75718795 75523919 75158873 75008853 74816915 74639349 74465932 74237865 74199319 74025065
3488 74025065 73944071 73911865 73899353 73753892 73646576 73674018 73703833 73700571 73730303 73682507 73709068
$$ packed form
3556G7789905J31122O1720j2235q3L2698K38398J78847J77596J38759J03303J97509
3545G9037539K85035K77408K47968K68326L00799K97017K11293K97179L40669
3536H1563233K78201J27905K78163K27838J15929K94865J57660R5117J69139m3751
3526H3264299m4014k7514O2759j8528k32215k15326k10613j03618j65830l10448
3516H1998952l39902l30684k52541k62369m40018l97735k81383m12548m18198
3507G8863574l66382l05900l92781l34783k41470k44065l91416k68420k98589
3498G6019768l00973j94876l65046j50020j91938j77566j73417k28067l8546j74254
3488G4025065q0994l2206j2512j45461j07316K7442K9815l262K9732m7796K6561
$$ plain form
3477 73709068 73750878 73878869 73907262 73981406 74136461 74281785 74425172 74581899 74622414 74693838
3467 74693838 74854033 75032562 75301120 75522837 75800963 76075056 76333980 76580788 76729115
3458 76729115 76889995 77024595 77325625 77517119 77661377 77893918 78016159 78298404 78662190
3449 78662190 79076520 79367414 79629674 79994303 80227586 80500603 80820434 81205168 81599609
3440 81599609 82076349 82580782 83143190 83706194 84286724 84959632 85571995 86196740 86870653
3431 86870653 87549799 88163409 89018158 89883121 90693280 91564727 92575101 93598094 94629031
3422 94629031 95795464 96972399 98072683 99232986 100503064 101896949 103189992 104601856
3414 104601856 106110936 107704463 109191625 110948646 112679937 114354563 116167841 118019364
$$ packed form
3477G3709068M1810J27991K8393P4144J55055J45324J43387J56727M0515P1424
3467G4693838J60195J78529K68558K21717K78126K74093K58924K46808J48327
3458G6729115J60880J34600L01030J91494J44258K32541J22241K82245L63786
3449G8662190M14330K90894K62260L64629K33283K73017L19831L84734L94441
3440H1599609M76740N04433N62408N63004N80530O72908O12363O24745O73913
3431H6870653O79146O13610Q54749Q64963Q10159Q71447J010374J022993J030937
3422I4629031J166433J176935J100284J160303J270078J393885J293043J411864
3414A04601856J509080J593527J487162J757021J731291J674626J813278J851523
$$ plain form
3406 118019364 120030148 122034432 124082762 126171365 128231062 130477520 132667004 134934027
3398 134934027 137377418 139711742 142122719 144640328 147294126 149926216 152617134 155455193
3390 155455193 158270590 161130920 164060283 167163617 170386847 173646388 176866908 180178341
3382 180178341 183340427 186431581 189407142 192166216 194540306 196571724 198247279 199197891
3374 199197891 199601042 199439619 198585743 197050658 195000626 192368695 189142658 185495043
3366 185495043 181409923 177115260 172819813 168337733 163911498 159479896 155215244 151128031
3358 151128031 147082511 143329089 139742949 136248725 133049254 130073111 127050114 124180070
3350 124180070 121544628 118986203 116555692 114264304 112097019 110033753 108022487 106185089
$$ packed form
3406A18019364K010784K004284K048330K088603K059697K246458K189484K267023
3398A34934027K443391K334324K410977K517609K653798K632090K690918K838059
3390A55455193K815397K860330K929363L103334L223230L259541L220520L311433
3382A80178341L162086L091154K975561K759074K374090K031418J675555R50612
3374A99197891M03151j61423q53876j535085k050032k631931l226037l647615
3366A85495043m085120m294663m295447m482080m426235m431602m264652m087213
3358A51128031m045520l753422l586140l494224l199471k976143l022997k870044
3350A24180070k635442k558425k430511k291388k167285k063266k011266j837398
$$ plain form
3342 106185089 104403164 102687750 101183804 99673258 98218522 96730597 95261919 94046397
3334 94046397 92761178 91492983 90376125 89233976 88263597 87246427 86193824 85265991
3326 85265991 84408658 83504684 82596403 81865576 81243229 80509644 79779963 79097786 78575519
3317 78575519 77966635 77480750 77005411 76451039 75908378 75351435 74855195 74450005 73846194
3308 73846194 73390314 72936144 72461914 72084300 71528878 71045992 70634047 70160830 69607139
3299 69607139 69086993 68532930 68081745 67683124 67234564 66780131 66308536 65783470 65356681
3290 65356681 64838236 64390896 63936032 63479257 63051152 62631663 62282605 61957383 61535477
3281 61535477 61072301 60626536 60314533 59904676 59597149 59314873 59019378 58696081 58412533
$$ packed form
3342A06185089j781925j715414j503946j510546j454736j487925j468678j215522
3334I4046397j285219j268195j116858j142149r70379j017170j052603r27833
3326H5265991q57333r03974r08281p30827o22347p33585p29681o82177n22267
3317G8575519o08884m85885m75339n54372n42661n56943m96240m05190o03811
3308G3846194m55880m54170m74230l77614n55422m82886m11945m73217n53691
3299F9607139n20146n54063m51185l98621m48560m54433m71595n25066m26789
3290F5356681n18445m47340m54864m56775m28105m19489l49058l25222m21906
3281F1535477m63176m45765l12003m09857l07527k82276k95495l23297k83548
$$ plain form
3272 58412533 58173344 57965999 57828902 57674337 57506113 57328590 57238085 57052980 56891466 56755755
3262 56755755 56717060 56779524 56830338 56837449 56976654 57061175 57204109 57282816 57328679 57454597 57658143
3251 57658143 57808174 57959641 58119454 58234134 58352402 58645893 58810371 59094464 59387519
3242 59387519 59632325 59858472 60077727 60308394 60536977 60823027 61177776 61651325 62075214
3233 62075214 62626958 63058561 63419080 63793109 64206324 64511647 64798783 65145251 65410975
3224 65410975 65591564 65756794 66084532 66396482 66648067 66870175 66955360 67030020 67159886 67346508
3214 67346508 67513850 67610526 67738762 67922794 68193563 68508010 68839682 69178964 69501760 69758938
3204 69758938 70119396 70542455 70918709 71329938 71835817 72379242 73018751 73663950 74276889
$$ packed form
3272E8412533k39189k07345j37097j54565j68224j77523r0505j85105j61514j35711
3262E6755755l8695O2464N0814P111J39205Q4521J42934P8707M5863J25918K03546
3251E7658143J50031J51467J59813J14680J18268K93491J64478K84093K93055
3242E9387519K44806K26147K19255K30667K28583K86050L54749M73549M23889
3233F2075214N51744M31603L60519L74029M13215L05323K87136L46468K65724
3224F5410975J80589J65230L27738L11950K51585K22108Q5185P4660J29866J86622
3214F7346508J67342R6676J28236J84032K70769L14447L31672L39282L22796K57178
3204F9758938L60458M23059L76254M11229N05879N43425O39509O45199O12939
$$ plain form
3195 74276889 74981793 75633223 76376370 77111069 77836550 78519869 79368580 80280760 81138529
3186 81138529 81908653 82845318 83649660 84542800 85320920 86259059 87119497 88176087 89218357
3177 89218357 90311646 91432247 92529856 93679439 94809966 96138661 97392977 98616120
3169 98616120 99859263 101267949 102710630 104350864 105976629 107738336 109566818 111348392
3161 111348392 113214274 115352554 117451593 119496505 121601468 123764929 125902092 128240846
3153 128240846 130536848 132788227 134943334 137019391 138934004 140687547 142321466 143622317
3145 143622317 144521291 145053354 145329641 145376883 145061774 144387270 143441135 142203277 140554095
3136 140554095 138674735 136515751 134157405 131544897 128915941 126249516 123462422 120774396
$$ packed form
3195G4276889P04904O51430P43147P34699P25481O83319Q48711R12180Q57769
3186H1138529P70124R36665Q04342Q93140P78120R38139Q60438J056590J042270
3177H9218357J093289J120601J097609J149583J130527J328695J254316J223143
3169I8616120J243143J408686J442681J640234J625765J761707J828482J781574
3161A11348392J865882K138280K099039K044912K104963K163461K137163K338754
3153A28240846K296002K251379K155107K076057J914613J753543J633919J300851
3145A43622317Q98974N32063K76287M7242l15109o74504r46135j237858j649182
3136A40554095j879360k158984k358346k612508k628956k666425k787094k688026
$$ plain form
3128 120774396 117997086 115377156 112729481 110173440 107449896 104923777 102461746 99992855
3120 99992855 97526280 95172365 92991185 90852529 88869311 86839843 85000904 83103631
3112 83103631 81297450 79410951 77666952 75860588 74302114 72841530 71339443 69890573
3104 69890573 68557569 67290902 65992462 64747341 63414103 62199000 60998020 59973976
3096 59973976 58980849 57949427 57090082 56310047 55466699 54664048 53893245 53200885 52530853
3087 52530853 51802672 51147952 50642335 50164564 49522740 49007406 48641138 48061342 47665361
3078 47665361 47356184 46934033 46543400 46223189 45990402 45578311 45310928 45156938 44958505
3069 44958505 44687509 44633249 44593093 44474346 44288434 44136533 44132611 44069571 44011442 43978966 44063313
$$ packed form
3128A20774396k777310k619930k647675k556041k723544k526119k462031k468891
3120I9992855k466575k353915k181180k138656j983218k029468j838939j897273
3112H3103631j806181j886499j743999j806364j558474j460584j502087j448870
3104F9890573j333004j266667j298440j245121j333238j215103j200980j024044
3096E9973976r93127j031422q59345p80035q43348q02651p70803o92360o70032
3087E2530853p28181o54720n05617m77771o41824n15334l66268n79796l95981
3078D7665361l09177m22151l90633l20211k32787m12091k67383j53990j98433
3069D4958505k70996n4260m0156j18747j85912j51901l922o3040n8129l2476Q4347
$$ plain form
3058 44063313 44037849 44125690 44199857 44293604 44399026 44565589 44662472 44899933 45111061 45288311
3048 45288311 45450183 45826568 46058811 46309541 46518190 46855136 47227824 47686228 48087464
3039 48087464 48462796 48869454 49349400 49886452 50345924 50813895 51400676 51935891 52264652
3030 52264652 52733234 53152454 53427780 53483184 53658670 53591931 53425469 53197157 53000854 52775885
3020 52775885 52690868 52571416 52522955 52463828 52581654 52598140 52727972 52919084 52996885 53170398
3010 53170398 53426960 53595550 53940050 54270580 54538436 54871698 55181233 55590594 55965946
3001 55965946 56327088 56732018 57221701 57769455 58368495 58843238 59482500 60055391 60517811
2992 60517811 61155346 61913988 62592110 63310205 64140832 65035001 65972755 66842032 67790508
$$ packed form
3058D4063313k5464Q7841P4167R3747J05422J66563R6883K37461K11128J77250
3048D5288311J61872L76385K32243K50730K08649L36946L72688M58404M01236
3039D8087464L75332M06658M79946N37052M59472M67971N86781N35215L28761
3030E2264652M68582M19220K75326N5404J75486o6739j66462k28312j96303k24969
3020E2775885q5017j19452m8461n9127J17826J6486J29832J91112P7801J73513
3010E3170398K56562J68590L44500L30530K67856L33262L09535M09361L75352
3001E5965946L61142M04930M89683N47754N99040M74743O39262N72891M62420
2992F0517811O37535P58642O78122P18095Q30627Q94169R37754Q69277R48476
$$ plain form
2983 67790508 68753312 69721625 70759547 71850888 73043503 74312914 75618310 76813679
2975 76813679 78187299 79655089 81171778 82569520 84016237 85599904 87209272 88909885
2967 88909885 90660510 92395120 94077056 95768755 97512225 99260103 101068419 102882671
2959 102882671 104573682 106338641 108173136 110006404 111705404 113313142 114824531 116364220
2951 116364220 117725995 119071240 120410807 121700838 122862340 124089981 125130058 126073682
2943 126073682 126932055 127606811 128052195 128365909 128770580 128874451 128845004 128698215 128457880
2934 128457880 128023454 127567915 127003562 126221164 125291455 124299628 123234753 121899820 120448303
2925 120448303 119017900 117431155 115761369 114072784 112348509 110478268 108632306 106718741
$$ packed form
2983F7790508R62804R68313J037922J091341J192615J269411J305396J195369
2975G6813679J373620J467790J516689J397742J446717J583667J609368J700613
2967H8909885J750625J734610J681936J691699J743470J747878J808316J814252
2959A02882671J691011J764959J834495J833268J699000J607738J511389J539689
2951A16364220J361775J345245J339567J290031J161502J227641J040077R43624
2943A26073682Q58373O74756M45384L13714M04671J03871k9447j46789k40335
2934A28457880m34426m55539n64353p82398r29709r91827j064875j334933j451517
2925A20448303j430403j586745j669786j688585j724275j870241j845962j913565
$$ plain form
2917 106718741 104613931 102520225 100447029 98310835 96151003 93994835 91887421 89701580
2909 89701580 87669666 85467821 83348369 81397542 79412532 77320796 75386162 73444787
2901 73444787 71519175 69737780 67905215 66114549 64385711 62738126 61164665 59632069
2893 59632069 58054961 56661608 55296474 53917510 52605912 51416667 50155516 48944067
2885 48944067 47951201 46933014 45789051 44686437 43759572 42958144 42032084 41228020 40403608
2876 40403608 39776729 39180261 38374210 37679550 36993141 36369186 35739542 35186801 34632824
2867 34632824 34145891 33619198 33130255 32663598 32250151 31924679 31522721 31220422 30834224
2858 30834224 30519488 30218527 29927942 29626914 29369944 29059070 28634809 28357657 28166531
$$ packed form
2917A06718741k104810k093706k073196k136194k159832k156168k107414k185841
2909H9701580k031914k201845k119452j950827j985010k091736j934634j941375
2901G3444787j925612j781395j832565j790666j728838j647585j573461j532596
2893E9632069j577108j393353j365134j378964j311598j189245j261151j211449
2885D8944067r92866j018187j143963j102614r26865q01428r26060q04064q24412
2876D0403608o26879n96468q06051o94660o86409o23955o29644n52741n53977
2867C4632824m86933n26693m88943m66657m13447l25472m01958l02299l86198
2858C0834224l14736l00961k90585l01028k56970l10874m24261k77152j91126
$$ plain form
2849 28166531 28015839 27858919 27748776 27543087 27451031 27217515 26987219 26865231 26781804 26666531
2839 26666531 26483285 26397722 26310765 26315372 26178014 26109164 26120865 26028160 25973954 25951550 25903935
2828 25903935 25790126 25780271 25842709 25789100 25792368 25817534 25804163 25863544 25955362 25990232 25934256
2817 25934256 25849124 25866466 25849825 25931007 25953973 25982692 25996575 26100370 26101759 26029916 26038135
2806 26038135 26069834 26080724 26031928 25952174 25905717 26002581 25985949 25901860 25868249 25849673 25868101
2795 25868101 25777494 25735164 25804277 25883302 25774857 25750890 25784130 25725384 25708643 25731754 25724561
2784 25724561 25698738 25745316 25748223 25735729 25778436 25794603 25798158 25790989 25820445 25926465 26106319
2773 26106319 26311607 26393587 26494532 26559970 26778577 26876083 26938202 27049876 27270645 27425519
$$ packed form
2849B8166531j50692j56920j10143k05689r2056k33516k30296j21988q3427j15273
2839B6666531j83246q5563q6957M607j37358o8850J1701r2705n4206k2404m7615
2828B5903935j13809r855O2438n3609L268K5166j3371N9381R1818L4870n5976
2817B5934256q5132J7342j6641Q1182K2966K8719J3883J03795J389p1843Q219
2806B6038135L1699J0890m8796p9754m6457R6864j6632q4089l3611j8576J8428
2795B5868101r0607m2330O9113P9025j08445k3967L3240n8746j6741K3111p193
2784B5724561k5823M6578K907j2494M2707J6167L555p169K9456J06020J79854
2773B6106319K05288Q1980J00945O5438K18607R7506O2119J11674K20769J54874
$$ plain form
2763 27425519 27577941 27858155 28123421 28262675 28390051 28682046 28920374 29028367 29204070
2754 29204070 29400036 29691127 29946805 30172106 30432680 30610793 30895488 31139923 31367862
2745 31367862 31484391 31572699 31774532 31932095 32109957 32313599 32544361 32834858 32955127 33110664
2735 33110664 33181721 33221854 33323056 33480050 33534204 33568476 33676946 33891326 34214378 34359210
2725 34359210 34402176 34450185 34454397 34499268 34506270 34547562 34613406 34666402 34763042 34838853 34932422 35039536
2713 35039536 35110203 35166706 35144539 35087003 35067563 35001768 35001159 35013472 35157478 35239810 35317296
2702 35317296 35383717 35468309 35388246 35456427 35527259 35510780 35499803 35594891 35685126 35728298 35868977
2691 35868977 36002828 36178373 36248364 36320917 36512773 36683985 36837709 36940057 37101067 37314165
$$ packed form
2763B7425519J52422K80214K65266J39254J27376K91995K38328J07993J75703
2754B9204070J95966K91091K55678K25301K60574J78113K84695K44435K27939
2745C1367862J16529Q8308K01833J57563J77862K03642K30762K90497J20269J55537
2735C3110664P1057M0133J01202J56994N4154L4272J08470K14380L23052J44832
2725C4359210M2966M8009M212M4871P002M1292O5844N2996R6640P5811R3569J07114
2713C5039536P0667N6503k2167n7536j9440o5795o09J2313J44006Q2332P7486
2702C5317296O6421Q4592q0063O8181P0832j6479j0977R5088R0235M3172J40679
2691C5868977J33851J75545O9991P2553J91856J71212J53724J02348J61010K13098
$$ plain form
2681 37314165 37521087 37715638 38021027 38340709 38659332 38950789 39248416 39490587 39688782
2672 39688782 40048067 40350333 40655052 41036142 41428013 41900843 42327684 42819773 43273894
2663 43273894 43681397 44080110 44444598 44823473 45374422 45984646 46480450 47116558 47817905
2654 47817905 48384284 48900770 49519203 50126879 50786782 51352140 51975666 52655804 53347681
2645 53347681 54055235 54802319 55638385 56464488 57202016 58014315 58882755 59875882 60712484
2636 60712484 61669188 62669905 63671665 64745984 65781214 66887155 68083073 69146522
2628 69146522 70346769 71569927 72700570 73953113 75200492 76507928 77939126 79283244
2620 79283244 80748507 82341437 83738216 85195990 86712874 88245539 89781624 91444328
$$ packed form
2681C7314165K06922J94551L05389L19682L18623K91457K97627K42171J98195
2672C9688782L59285L02266L04719L81090L91871M72830M26841M92089M54121
2663D3273894M07503L98713L64488L78875N50949O10224M95804O36108P01347
2654D7817905N66379N16486O18433O07676O59903N65358O23526O80138O91877
2645E3347681P07554P47084Q36066Q26103P37528Q12299Q68440R93127Q36602
2636F0712484R56704J000717J001760J074319J035230J105941J195918J063449
2628F9146522J200247J223158J130643J252543J247379J307436J431198J344118
2620G9283244J465263J592930J396779J457774J516884J532665J536085J662704
$$ plain form
2612 91444328 93080274 94780120 96416950 98019178 99750906 101341840 102966571 104572987
2604 104572987 106148471 107743959 109420022 111066891 112704760 114245303 115888226 117445452
2596 117445452 119123277 120661876 122060488 123441133 124930528 126409390 127944658 129514995
2588 129514995 131057779 132608838 134027893 135589666 137105237 138662400 140322105 142004782
2580 142004782 143579833 145257572 147033079 148951870 150883241 152810465 154920225 157040651
2572 157040651 159165658 161449320 163719740 166206174 168695285 171344762 174013870 176898571
2564 176898571 179796369 182674643 185749580 188840803 191978369 195247877 198490076 201860827
2556 201860827 205179636 208574347 211944910 215314140 218707589 222175918 225426789 228684523
$$ packed form
2612I1444328J635946J699846J636830J602228J731728J590934J624731J606416
2604A04572987J575484J595488J676063J646869J637869J540543J642923J557226
2596A17445452J677825J538599J398612J380645J489395J478862J535268J570337
2588A29514995J542784J551059J419055J561773J515571J557163J659705J682677
2580A42004782J575051J677739J775507J918791J931371J927224K109760K120426
2572A57040651K125007K283662K270420K486434K489111K649477K669108K884701
2564A76898571K897798K878274L074937L091223L137566L269508L242199L370751
2556B01860827L318809L394711L370563L369230L393449L468329L250871L257734
$$ plain form
2548 228684523 232058576 235352994 238613728 241825375 244961236 248099327 251203614 254155870
2540 254155870 257229621 260204190 262946655 265698930 268448308 271222711 273849361 276500441
2532 276500441 279134007 281746994 284406080 286854736 289450580 292131536 294788941 297353794
2524 297353794 300009720 302591309 305327516 307945754 310714921 313477657 316257869 318882334
2516 318882334 321687670 324371917 326984781 329582125 332222092 334599608 336885575 339134292
2508 339134292 341134752 343030387 344712995 346137343 347209150 348078446 348559170 348810853
2500 348810853 348765049 348168936 347171342 345843883 344203013 342133979 339598401 336780223 333480008
2491 333480008 329849205 325858880 321629715 317115601 312215867 306998554 301630698 295915567
$$ packed form
2548B28684523L374053L294418L260734L211647L135861L138091L104287K952256
2540B54155870L073751K974569K742465K752275K749378K774403K626650K651080
2532B76500441K633566K612987K659086K448656K595844K680956K657405K564853
2524B97353794K655926K581589K736207K618238K769167K762736K780212K624465
2516C18882334K805336K684247K612864K597344K639967K377516K285967K248717
2508C39134292K000460J895635J682608J424348J071807Q69296M80724K51683
2500C48810853m5804n96113r97594j327459j640870k069034k535578k818178l300215
2491C33480008l630803l990325m229165m514114m899734n217313n367856n715131
$$ plain form
2483 295915567 290147578 284221083 278204322 272105611 266085860 259900246 253700533 247527305
2475 247527305 241369865 235359022 229481422 223750427 218128796 212605526 207243680 202093057
2467 202093057 197153198 192290033 187678294 183330199 179135599 174977666 171089789 167362206
2459 167362206 163896868 160536703 157228288 154117072 151130395 148350999 145627490 143016342
2451 143016342 140399747 137884770 135519100 133346952 131189381 129066866 126864148 124827184
2443 124827184 122795116 120787490 118622620 116582104 114715942 112857492 110917781 108995336
2435 108995336 107038301 105198791 103263109 101338237 99420556 97518535 95621203 93733524
2427 93733524 91908927 90113667 88263296 86307351 84510027 82669047 80874594 79070112
$$ packed form
2483B95915567n767989n926495o016761o098711o019751o185614o199713o173228
2475B47527305o157440o010843n877600n730995n621631n523270n361846n150623
2467B02093057m939859m863165m611739m348095m194600m157933l887877l727583
2459A67362206l465338l360165l308415l111216k986677k779396k723509k611148
2451A43016342k616595k514977k365670k172148k157571k122515k202718k036964
2443A24827184k032068k007626k164870k040516j866162j858450j939711j922445
2435A08995336j957035j839510j935682j924872j917681j902021j897332j887679
2427I3733524j824597j795260j850371j955945j797324j840980j794453j804482
$$ plain form
2419 79070112 77382006 75693897 74043039 72377177 70747723 69214824 67635020 65996396
2411 65996396 64469847 63057360 61721333 60359355 59090963 57790846 56543415 55342353
2403 55342353 54139785 52968965 51779202 50778392 49603490 48575867 47727578 46739285
2395 46739285 45862526 45120945 44256952 43434880 42545161 41704106 40921793 40199639 39423423
2386 39423423 38732009 38166800 37544046 36983005 36408224 35774542 35169054 34564263 33952117
2377 33952117 33393433 32785153 32278479 31792513 31301762 30792271 30424280 30014903 29566186
2368 29566186 29087030 28624956 28118864 27732827 27397987 27074532 26646205 26325619 26021073
2359 26021073 25709215 25331598 24986514 24731937 24343350 24032822 23783673 23437994 23171122
$$ packed form
2419G9070112j688106j688109j650858j665862j629454j532899j579804j638624
2411F5996396j526549j412487j336027j361978j268392j300117j247431j201062
2403E5342353j202568j170820j189763j000810j174902j027623q48289r88293
2395D6739285q76759p41581q63993q22072q89719q41055p82313p22154p76216
2386C9423423o91414n65209o22754n61041n74781o33682o05488o04791o12146
2377C3952117n58684o08280n06674m85966m90751n09491l67991m09377m48717
2368B9566186m79156m62074n06092l86037l34840l23455m28327l20586l04546
2359B6021073l11858l77617l45084k54577l88587l10528k49149l45679k66872
$$ plain form
2350 23171122 22832620 22482591 22281498 22013280 21719897 21432373 21166235 20970929 20685638
2341 20685638 20528993 20367427 20107436 19922129 19689793 19499029 19304217 19085650 18882736
2332 18882736 18731996 18518028 18230628 18054441 18061863 17852113 17689930 17586539 17488222 17372778
2322 17372778 17124811 16993042 16912287 16717128 16565998 16592147 16443901 16369832 16324661 16228498
2312 16228498 16149920 15977259 15988755 15905575 15778094 15623651 15539536 15335067 15228913 15122720
2302 15122720 15041645 14950789 14947454 14918587 14893040 14841550 14697999 14520549 14497890 14401295 14384223
2291 14384223 14342905 14329186 14338015 14270819 14160032 14009006 14044770 14033573 13970182 13812816 13739584
2280 13739584 13748529 13771766 13748323 13748026 13651626 13677325 13587830 13575134 13617646 13646865 13483120 13540806
$$ packed form
2350B3171122l38502l50029k01093k68218k93383k87524k66138j95306k85291
2341B0685638j56645j61566k59991j85307k32336j90764j94812k18567k02914
2332A8882736j50740k13968k87400j76187P422k09750j62183j03391r8317j15444
2322A7372778k47967j31769q0755j95159j51130K6149j48246p4069m5171r6163
2312A6228498p8578j72661J1496q3180j27481j54443q4115k04469j06154j06193
2302A5122720q1075r0856l335k8867k5547n1490j43551j77450k2659r6595j7072
2291A4384223m1318j3719Q829o7196j10787j51026L5764j1197o3391j57366p3232
2280A3739584Q945K3237k3443k97r6400K5699q9495j2696M2512K9219j63745N7686
$$ plain form
2268 13540806 13566760 13506116 13591820 13599575 13667294 13659905 13640264 13571138 13603820 13600606 13564148 13632368
2256 13632368 13656622 13643788 13675228 13614071 13645658 13581659 13626302 13674005 13584779 13557986 13582709
2245 13582709 13587635 13652344 13768828 13813538 13831233 13805585 13819119 13867305 13934402 13930855 13852513
2234 13852513 13895864 13922363 14070682 14080483 14053519 14224936 14196309 14345677 14365867 14347403 14471774
2223 14471774 14562089 14734149 14930915 14942312 14985308 15170583 15304968 15343197 15490345 15564161
2213 15564161 15603919 15687586 15896509 16077888 16284560 16451188 16689878 16864035 17014673 17220669
2203 17220669 17453873 17674808 17797951 18023475 18241408 18387576 18513009 18553593 18704954 18796000
2193 18796000 18828796 18854589 18784311 18672600 18527490 18372025 18188247 17946575 17726134 17516518
$$ packed form
2268A3540806K5954o0644Q5704P755O7719p389j9641o9126L2682l214l6458O8220
2256A3632368K4254j2834L1440o1157L1587o3999M4643M7703q9226k6793K4723
2245A3582709M926O4709J16484M4710J7695k5648J3534M8186O7097l547p8342
2234A3852513M3351K6499J48319R801k6964J71417k8627J49368K0190j8464J24371
2223A4471774R0315J72060J96766J1397M2996J85275J34385L8229J47148P3816
2213A5564161L9758Q3667K08923J81379K06672J66628K38690J74157J50638K05996
2203A7220669K33204K20935J23143K25524K17933J46168J25433M0584J51361R1046
2193A8796000L2796K5793p0278j11711j45110j55465j83778k41672k20441k09616
$$ plain form
2183 17516518 17285469 16957079 16804885 16598521 16260892 15994547 15726496 15533473 15249617
2174 15249617 15068907 14774011 14520937 14367351 14260157 13992342 13784233 13605376 13261228
2165 13261228 13009104 12880449 12736818 12578267 12366135 12178043 12000659 11781272 11629721
2156 11629721 11453553 11233563 11143467 11060585 10959172 10823550 10626318 10386327 10107224 10002220
2146 10002220 9947763 9781949 9558601 9420826 9290973 9084082 8967347 8777144 8675486 8496478
2136 8496478 8377121 8258268 8004224 7858432 7776495 7583001 7386762 7417142 7362289 7246637
2126 7246637 7193052 6971830 6917143 6877020 6749309 6688710 6487418 6411048 6274720 6165740
2116 6165740 6190824 6130109 6021178 5895765 5808596 5560437 5533150 5444918 5385726 5383063 5381452
$$ packed form
2183A7516518k31049l28390j52194k06364l37629k66345k68051j93023k83856
2174A5249617j80710k94896k53074j53586j07194k67815k08109j78857l44148
2165A3261228k52124j28655j43631j58551k12132j88092j77384k19387j51551
2156A1629721j76168k19990r0096q2882j01413j35622j97232k39991k79103j05004
2146A0002220n4457j65814k23348j37775j29853k06891j16735j90203j01658j79008
2136H496478j19357j18853k54044j45792q1937j93494j96239L0380n4853j15652
2126G246637n3585k21222n4687m0123j27711o0599k01292p6370j36328j08980
2116F165740K5084o0715j08931j25413q7169k48159k7287q8232n9192k663j611
$$ plain form
2105 5381452 5269227 5273169 5251192 5222206 5191520 5084825 4981439 4806605 4827137 4749385 4799685
2094 4799685 4814069 4730816 4557734 4497824 4517797 4544558 4473635 4349355 4219463 4286508 4335588
2083 4335588 4313202 4214274 4153271 4129424 4057742 4054970 4108867 4060064 4008542 3939153 3900386 3897218
2071 3897218 3885187 3949230 3888886 3860066 3825683 3719485 3646892 3678078 3643363 3742923 3783449
2060 3783449 3735947 3788583 3818194 3759746 3673267 3564370 3679562 3638075 3573628 3628332 3648951
2049 3648951 3522526 3504910 3571608 3538819 3520599 3488490 3429495 3328992 3379021 3306571 3192701
2038 3192701 3197256 3262714 3214188 3258686 3208635 3209537 3191162 3120840 3280207 3258939 3215371 3241907
2026 3241907 3169371 3185655 3115827 3024311 2978667 3068027 3042158 3045642 3153475 3138821 3061647
$$ packed form
2105E381452j12225L942k1977k8986l0686j06695j03386j74834K0532p7752N0300
2094D799685J4384q3253j73082n9910J9973K6761p0923j24280j29892O7045M9080
2083D335588k2386r8928o1003k3847p1682k772N3897m8803n1522o9389l8767l168
2071C897218j2031O4043o0344k8820l4383j06198p2593L1186l4715R9560M0526
2060C783449m7502N2636K9611n8448q6479j08897J15192m1487o4447N4704K0619
2049C648951j26425j7616O6698l2789j8220l2109n8995j00503N0029p2450j13870
2038C192701M555O5458m8526M4498n0051R02j8375p0322J59367k1268m3568K6536
2026C241907p2536J6284o9828r1516m5644Q9360k5869L484J07833j4654p7174
$$ plain form
2015 3061647 2998421 2925161 2916068 2844224 2769564 2811988 2881859 2977660 3002998 2961940 2892256 2827982
2003 2827982 2844529 2807051 2671272 2597666 2613622 2630570 2720066 2881132 2847759 2748733 2739433
1992 2739433 2700912 2727775 2665944 2542518 2525639 2485764 2575575 2607067 2560480 2492909 2477296
1981 2477296 2562259 2561227 2506100 2462440 2389712 2315988 2343474 2276169 2399277 2401562 2387608 2371329
1969 2371329 2371666 2389093 2372600 2328117 2222861 2225379 2163659 2153577 2215675 2267607 2248333 2162554
1957 2162554 2059903 1925130 1873214 1850109 1883459 1928477 1952101 2055896 1974386 1982188 2003042
1946 2003042 2001385 2036451 1954137 1877501 1805646 1725792 1735558 1785685 1807682 1770024 1863015 1939831
1934 1939831 1959522 1872891 1821759 1788718 1796597 1844889 1883158 1791607 1829006 1930816 2021957
$$ packed form
2015C061647o3226p3260r093p1844p4660M2424O9871R5801K5338m1058o9684o4274
2003B827982J6547l7478j35779p3606J5956J6948Q9496J61066l3373r9026r300
1992B739433l8521K6863o1831j23426j6879l9875Q9811L1492m6587o7571j5613
1981B477296Q4963j032n5127m3660p2728p3724K7486o7305J23108K285j3954j6279
1969B371329L37J7427j6493m4483j05256K518o1720j0082O2098N1932j9274q5779
1957B162554j02651j34773n1916k3105L3350M5018K3624J03795q1510P802K0854
1946B003042j657L5066q2314p6636p1855p9854R766N0127K1997l7658R2991P6816
1934A939831J9691q6631n1132l3041P879M8292L8269r1551L7399J01810R1141
$$ plain form
1923 2021957 2025915 2008326 1908380 1911434 1848299 1847843 1828311 1889910 1995283 2130738 2188846 2104277
1911 2104277 2159965 2188191 2141511 2070601 2109361 2134341 2139913 2192448 2235322 2205653 2277671 2254156
1899 2254156 2280453 2354452 2411485 2343711 2306222 2271192 2286001 2368561 2477853 2574790 2595657
1888 2595657 2609517 2550438 2624666 2583548 2516905 2574987 2528401 2467096 2543510 2602739 2792586
1877 2792586 2799792 2817596 2909290 2823902 2852477 2886574 2939231 2935088 2976164 3065993 3236411 3243552
1865 3243552 3256500 3328519 3387117 3371361 3427771 3447267 3418358 3427888 3471466 3488453 3534464 3620786
1853 3620786 3746411 3876830 3959105 3914357 3914739 4014538 4006006 3979414 4063507 4102854 4206850
1842 4206850 4219448 4269057 4301902 4434679 4555574 4569839 4591980 4550876 4643237 4667495 4653860
$$ packed form
1923B021957L958j7589r9946L054o3135m56j9532O1599J05373J35455N8108q4569
1911B104277N5688K8226m6680p0910L8760K4980N572N2535M2874k9669P2018k3515
1899B254156K6297P3999N7033o7774l7489l5030J4809Q2560J09292R6937K0867
1888B595657J3860n9079P4228m1118o6643N8082m6586o1305P6414N9229J89847
1877B792586P206J7804R1694q5388K8575L4097N2657m143M1076Q9829J70418P141
1865C243552J2948P2019N8598j5756N6410J9496k8909R530M3578J6987M6011Q6322
1853C620786J25625J30419Q2275m4748L82R9799q532k6592Q4093L9347J03996
1842D206850J2598M9609L2845J32777J20895J4265K2141m1104R2361K4258j3635
$$ plain form
1831 4653860 4833046 4903115 4950403 5018997 5015239 4945021 4946937 4855306 4838943 4820548 4775634 4791667
1819 4791667 4677624 4656443 4644040 4709227 4548052 4414749 4470624 4426732 4311527 4429528
1809 4429528 4394206 4352923 4325288 4388010 4408110 4324342 4278623 4268247 4293924 4296613 4144258
1798 4144258 4046852 3936636 3867669 3888144 3817556 3782849 3717486 3548427 3449316 3414037 3357607
1787 3357607 3245786 3142783 3093379 3051855 3006248 2867041 2797044 2743734 2688957 2692166 2556352
1776 2556352 2542579 2394076 2352143 2323633 2240387 2171981 2081029 1930806 1775107 1725425 1754075
1765 1754075 1716304 1648960 1716503 1634057 1450583 1324349 1282302 1250432 1212464 1158774 1213506
1754 1213506 1140295 1069757 1059646 1053880 1007211 931819 833001 736982 720471 728097 652034 689590
$$ packed form
1831D653860J79186P0069M7288O8594l758p0218J916r1631j6363j8395m4914J6033
1819D791667j14043k1181j2403O5187j61175j33303N5875m3892j15205J18001
1809D429528l5322m1283k7635O2722K0100q3768m5719j0376K5677K689j52355
1798D144258r7406j10216o8967K0475p0588l4707o5363j69059r9111l5279n6430
1787C357607j11821j03003m9404m1524m5607j39207o9997n3310n4777L209j35814
1776B556352j3773j48503m1933k8510q3246o8406r0952j50223j55699m9682K8650
1765A754075l7771o7344O7543q2446j83474j26234m2047l1870l7968n3690N4732
1754A213506p3211p0538j0111n766m6669p5392r8818r6019j6511P626p6063L7556
$$ plain form
1742 689590 738192 741556 727883 689359 541519 541940 468078 386246 323113 285838 340407 389815
1730 389815 406504 464355 420114 416455 339840 152102 141846 160429 125749 134312 137268 119505
1718 119505 145208 162781 190032 163935 245077 167126 74114 95890 2913 80470 9191 -55571
1706 -55571 -63162 -68586 49047 2469 -140347 -38147 15534 -25444 -118059 -26729 -34876 -38368
1694 -38368 32080 17653 24833 -50951 -140806 -230111 -214011 -176219 -139298 -201484 -144946 -126424
1682 -126424 33367 9149 39381 -27472 -130323 -175689 -85328 -120706 -202522 -160651 -96987
1671 -96987 -76528 -181094 -131512 -49317 -61206 -82523 -113387 -192165 -218814 -158627 -87747 -128994
1659 -128994 -75808 -85498 -58824 -112011 -38173 50982 106004 75802 38324 36150 -30353 74822
$$ packed form
1742F89590M8602L364j3673l8524j47840M21p3862q1832o3133l7275N4569M9408
1730C89815J6689N7851m4241l659p6615j87738j0256J8583l4680Q563K956j7763
1718A19505K5703J7573K7251k6097Q1142p7951r3012K1776r2977P7557p1279o4762
1706e5571p591n424J17633m6578j42816J02200N3681m0978r2615R1330q147l492
1694c8368P0448j4427P180p5784q9855q9305J6100L7792L6921o2186N6538J8522
1682a26424J59791k4218L0232o6853j02851m5366R0361l5378q1816M1871O3664
1671i6987K0459j04566M9582Q2195j1889k1317l0864p8778k6649O0187P0880m1247
1659a28994N3186r690K6674n3187P3838Q9155N5022l0202l7478k174o6503J05175
$$ plain form
1647 74822 -260 -27809 -16562 -26421 21557 -69923 -57076 28720 33811 58083 -4739 123203
1635 123203 30888 -7687 2026 -43821 -133210 -25778 -59916 -38615 -39546 77831 78542 30667
1623 30667 44830 7901 106482 140583 98709 26423 25414 23070 75147 19704 -44617 -67444
1611 -67444 -68408 -98023 -53717 -77155 -41314 -20245 34532 31142 -24414 -32089 29810 -38827 -108828
1598 -108828 -94455 -108320 -60035 20949 -13070 -15440 39126 39024 -105379 -98894 -82596 -56682
1586 -56682 -116277 -140365 -164484 -75007 -134216 -139090 -69991 -31305 -67166 -152538 -162755 -131714
1574 -131714 -84780 -50998 -64619 -63681 -107318 -97545 -104939 -12006 61292 -58235 -146460 -90357
1562 -90357 -38374 61429 -29978 -25783 62782 -117378 -128854 -182701 -201071 -238471 -201579 -275946
$$ packed form
1647G4822p5082k7549J1247r859M7978r1480J2847Q5796N091K4272o2822J27942
1635A23203r2315l8575R713m5847q9389J07432l4138K1301r31J17377P11m7875
1623C0667J4163l6929R8581L4101m1874p2286j009k344N2077n5443o4321k2827
1611f7444r64k9615M4306k3438L5841K1069N4777l390n5556p675O1899o8637p0001
1598a08828J4373j3865M8285Q0984l4019k370N4566j02j44403O485J6298K5914
1586e6682n9595k4088k4119Q9477n9209m874O9099L8686l5861q5372j0217L1041
1574a31714M6934L3782j3621R38m3637R773p394R2933P3298j19527q8225N6103
1562i0357N1983R9803r1407M195Q8565j80160j1476n3847j8370l7400L6892p4367
$$ plain form
1550 -275946 -239130 -91737 -103010 -196686 -143902 -157932 -174794 -221972 -293726 -378805 -375142 -374612
1538 -374612 -411514 -461431 -368801 -286118 -279755 -254545 -256231 -291198 -267819 -276269 -273308 -366237
1526 -366237 -358435 -347368 -437350 -455911 -391143 -329556 -353268 -358371 -417325 -458078 -489051 -546998
1514 -546998 -535101 -366465 -350533 -297068 -374404 -362817 -394376 -434787 -452945 -424796 -456874
1503 -456874 -355779 -325923 -381054 -363737 -265951 -337136 -325626 -258406 -270010 -303754 -465978
1492 -465978 -366006 -314917 -289284 -297144 -176638 -249926 -265627 -236962 -274441 -329775 -340299 -436334
1480 -436334 -401698 -375310 -337421 -318288 -324768 -250666 -217001 -240093 -215469 -212476 -332505 -315493
1468 -315493 -326887 -313976 -266898 -296800 -322372 -270076 -271517 -261947 -358843 -351907 -323517 -324200 -339624
$$ packed form
1550b75946L6816J47393j1273r3676N2784j4030j6862m7178p1754q5079L663N30
1538c74612l6902m9917R2630Q2683O363K5210j686l4967K3379q450K961r2929
1526c66237P802J1067q9982j8561O4768O1587k3712n103n8954m0753l0973n7947
1514e46998J1897J68636J5932N3465p7336J1587l1559m0411j8158K8149l2078
1503d56874J01095K9856n5131J7317R7786p1185J1510O7220j1604l3744j62224
1492d65978R9972N1089K5633p860J20506p3288j5701K8665l7479n5334j0524r6035
1480d36334L4636K6388L7889J9133o480P4102L3665k3092K4624K993j20029J7012
1468c15493j1394J2911M7078k9902k5572N2296j441R570r6896O936K8390o83j5424
$$ plain form
1455 -339624 -294011 -331467 -322978 -352329 -320937 -373006 -456636 -448662 -425688 -482399 -479320 -499723
1443 -499723 -597047 -662306 -587549 -479176 -427714 -364048 -325443 -346164 -490628 -546432 -640121
1432 -640121 -586235 -595354 -702223 -670747 -516343 -553025 -478367 -546006 -487319 -529322 -642007
1421 -642007 -655189 -662342 -722253 -583759 -506264 -587972 -563207 -547246 -587089 -618472 -635505 -589655
1409 -589655 -541533 -476603 -477936 -471629 -527408 -618974 -625212 -588470 -615982 -566771 -645108 -764063
1397 -764063 -734830 -743347 -741819 -609986 -528420 -527998 -589405 -641582 -764778 -789958 -804769 -912211
1385 -912211 -782556 -770525 -809073 -730359 -644059 -557640 -597699 -764287 -764854 -818957 -786070 -757400
1373 -757400 -785606 -819534 -650804 -670176 -686164 -789317 -745676 -817824 -822825 -760447 -786636
$$ packed form
1455c39624M5613l7456Q489k9351L1392n2069q3630P974K2974n6711L079k0403
1443d99723r7324o5259P4757J08373N1462O3666L8605k0721j44464n5804r3689
1432f40121N3886r119j06869L1476J54404l6682P4658o7639N8687m2003j12685
1421f42007j3182p153n9911J38494P7495q1708K4765J5961l9843l1383j7033M5850
1409e89655M8122O4930j333O307n5779r1566o238L6742k7512M9211p8337j18955
1397g64063K9233q517J528J31833Q1566M22o1407n2177j23196k5180j4811j07442
1385i12211J29655J2031l8548P8714Q6300Q6419m0059j66588n67n4103L2887K8670
1373g57400k8206l3928J68730j9372j5988j03153M3641p2148n001O2378k6189
$$ plain form
1362 -786636 -926703 -917453 -867026 -805925 -717807 -732207 -811940 -736563 -673766 -789351 -779213
1351 -779213 -694521 -651725 -711683 -784500 -891147 -913451 -852299 -850589 -831990 -691338 -585331
1340 -585331 -485448 -467003 -564360 -591834 -599646 -706304 -818757 -769273 -816946 -723544 -689731
1329 -689731 -728691 -719815 -648117 -567639 -610762 -676948 -750845 -680761 -652448 -682205 -544905 -609860
1317 -609860 -543821 -481836 -565908 -525585 -574079 -589877 -580423 -607423 -661551 -492753 -465730 -590358
1305 -590358 -579734 -503166 -523842 -537753 -505186 -561601 -701910 -517847 -453177 -479502 -512374
1294 -512374 -392522 -360507 -428264 -466660 -460815 -488174 -481889 -443116 -392636 -379319 -297234 -355360
1282 -355360 -349000 -311036 -427653 -505598 -561465 -503684 -384766 -330211 -216251 -143626 -194614
$$ packed form
1362g86636j40067R250N0427O1101Q8118j4400p9733P5377O2797j15585J0138
1351g79213Q4692M2796n9958p2817j06647k2304O1152J710J8599J40652J06007
1340e85331R9883J8445r7357k7474p812j06658j12453M9484m7673R3402L3813
1329f89731l8960Q876P1698Q0478m3123o6186p3897P0084K8313k9757J37300o4955
1317f09860O6039O1985q4072M0323m8494j5798R454k7000n4128J68798K7023j24628
1305e90358J0624P6568k0676j3911L2567n6415j40309J84063O4670k6325l2872
1294e12374J19852L2015o7757l8396N845k7359O285L8773N0480J3317Q2085n8126
1282c55360O360L7964j16617p7945n5867N7781J18918N4555J13960P2625n0988
$$ plain form
1271 -194614 -270019 -259452 -304145 -297575 -246853 -298801 -241329 -204014 -162290 -126832 -113378 -127705
1259 -127705 -168896 -115696 -234905 -238323 -267851 -305068 -176324 -194035 -195989 -174157 -119288 -190969
1247 -190969 -187149 -147204 -201853 -113530 -37338 -10382 -37965 -154641 -231990 -232536 -84072 -93512
1235 -93512 -96761 -145836 -176617 -224427 -168190 -50607 -106856 -300485 -263374 -282378 -245751 -234019
1223 -234019 -173585 -145172 -167884 -198901 -207503 -91923 -130720 -147462 -188039 -183438 -228792 -211633
1211 -211633 -255132 -273350 -205507 -234097 -262422 -213209 -196220 -152115 -146621 -196373 -213122 -268303
1199 -268303 -96432 -54934 -186920 -177049 -276027 -289116 -282203 -299608 -342903 -322603 -224032 -273878
1187 -273878 -214895 -233214 -182006 -133512 -102363 -102727 -139563 -97521 -116691 -105507 -123245 -128916
$$ packed form
1271a94614p5405J0567m4693O570N0722n1948N7472L7315M1724L5458J3454j4327
1259a27705m1191N3200j19209l418k9528l7217J28744j7711j954K1832N4869p1681
1247a90969L820L9945n4649Q8323P6192K6956k7583j16676p7349n46J48464r440
1235i3512l249m9075l0781m7810N6237J17583n6249j93629L7111j9004L6627J1732
1223b34019O0434K8413k2712l1017q602J15580l8797j6742m0577M601m5354J7159
1211b11633m3499j8218O7843k8590k8325M9213J6989M4105N494m9752j6749n5181
1199b68303J71871M1498j31986R871r8978j3089O913j7405m3295K0300R8571m9846
1187b73878N8983j8319N1208M8494L1149l64l6836M2042j9170J1184j7738n671
$$ plain form
1175 -128916 -177567 -143667 -122118 -146365 -179000 -97218 -156545 -120426 -92611 -184739 -190294 -210918
1163 -210918 -184927 -169115 -171443 -180747 -140229 -187942 -157772 -142538 -139881 -166924 -81828 -90956
1151 -90956 -165666 -210475 -169827 -148554 -145218 -39555 -19027 -41423 -103766 -124023 -80891 -144050
1139 -144050 -191147 -111016 -130919 -171533 -129181 -78284 -61819 -55336 -46036 -49044 -142733 -176978
1127 -176978 -177073 -133859 -78907 47486 -19126 3403 -57590 -134169 -43330 69857 35244 -48647
1115 -48647 -84249 -132617 -130642 -34547 -73459 6318 34906 -12526 33841 18379 -85674 -189275
1103 -189275 -93815 -15347 -276 -26961 128178 147742 85523 30746 99256 834 42022
1092 42022 24420 18535 42537 51952 130767 161541 144980 151483 116359 54228 73516 26369
$$ packed form
1175a28916m8651L3900K1549k4247l2635Q1782n9327L6119K7815r2128n555k0624
1163b10918K5991J5812k328r304M0518m7713L0170J5234K657k7043Q5096r128
1151i0956p4710m4809M0648K1273L336J05663K0528k2396o2343k0257M3132o3159
1139a44050m7097Q0131j9903m0614M2352N0897J6465O483R300l008r3689l4245
1127a76978r5M3214N4952J26393o6612K2529o0993p6579R0839J13187l4613q3891
1115d8647l5602m8368J975R6095l8912P9777K8588m7432M6367j5462j04053j03601
1103a89275R5460P8468J5071k6685J55139J9564o2219n4777O8510r8422M1188
1092D2022j7602n885K4002R415P8815L0774j6561O503l5124o2131J9288m7147
$$ plain form
1080 26369 91677 112091 226336 263715 255865 266146 286658 394063 324602 392330 453970 365755
1068 365755 280325 252844 311206 377696 408323 351371 510957 506088 379606 398034 320294
1057 320294 387710 415326 379164 467530 474750 413989 504330 603438 537719 518973 433595 323418
1045 323418 284031 361103 381797 369744 597878 744149 737157 794557 702140 582193 560955
1034 560955 621706 643765 676327 816254 834660 846245 949911 989921 1022487 1057296 1148747
1023 1148747 1110403 1233352 1378500 1494696 1615064 1680020 1769808 1900459 1938175 1936098 2006923
1012 2006923 2096728 2247307 2343550 2494679 2664029 2820204 2993035 3143831 3317560 3445862
1002 3445862 3460758 3715270 4011331 4293272 4554522 4972582 5388822 5762587 6043683 6408905
$$ packed form
1080B6369O5308K0414J14245L7379p850J0281K0512J07405o9461O7728O1640q8215
1068C65755q5430k7481N8362O6490L0627n6952J59586m869j26482J8428p7740
1057C20294O7416K7616l6162Q8366P220o0761R0341R9108o5719j8746q5378j10177
1045C23418l9387P7072K0694j2053K28134J46271o992N7400r2417j19947k1238
1034E60955O0751K2059L2562J39927J8406J1585J03666M0010L2566L4809R1451
1023A148747l8344J22949J45148J16196J20368O4956Q9788J30651L7716k077P0825
1012B006923Q9805J50579R6243J51129J69350J56175J72831J50796J73729J28302
1002C445862J4896K54512K96061K81941K61250M18060M16240L73765K81096L65222
$$ plain form
992 6408905 6879473 7333709 7755116 8357298 8977543 9760180 10428105 11155588 11950535 12803584
982 12803584 13433216 13932027 14289462 14102297 13568190 12778705 11828885 10702011 9635276
973 9635276 8735417 7944929 7270584 6641262 6126290 5609344 4998665 4636285 4421133 4170087
963 4170087 3955766 3713208 3331208 3179382 3011178 2750681 2574655 2389144 2159001 1971076
953 1971076 1786502 1830114 1729067 1791740 1721879 1576474 1445798 1332211 1270760 1149479
943 1149479 1032420 956086 1049585 969132 911984 904234 921883 821031 763024 733796 668847
932 668847 547508 444587 513346 402586 362683 391364 436160 453507 447191 412389 435523
921 435523 373382 357410 131088 84433 144304 174051 244078 313948 191238 187885 172129 105949
$$ packed form
992F408905M70568M54236M21407O02182O20245P82637O67925P27483P94947Q53049
982A2803584O29632M98811L57435j87165n34107p89485r49820j126874j066735
973I635276q99859p90488o74345o29322n14972n16946o10679l62380k15152k51046
963D170087k14321k42558l82000j51826j68204k60497j76026j85511k30143j87925
953A971076j84574M3612j01047O2673o9861j45405j30676j13587o1451j21281
943A149479j17059p6334R3499q0453n7148p750J7649j00852n8007k9228o4949
932F68847j21339j02921O8759j10760l9903K8681M4796J7347o316l4802K3134
921D35523o2141j5972k26322m6655N9871K9747P0027O9870j22710l353j5756o6180
$$ plain form
909 105949 66193 -17340 -37624 -99928 -128134 -109575 -46851 33305 63239 91279 39955 -64112
897 -64112 -126218 -169540 -153085 -27089 31357 55362 65850 35570 -42732 -10392 -26856 -82291
885 -82291 -73809 -147753 -207611 -334642 -360642 -322888 -231474 -98361 -14499 -55441 21331 -67887
873 -67887 47590 41067 38788 -38672 -32452 -11449 -22322 -72861 -34747 -89048 -190238 -137260
861 -137260 -92912 -118700 -37884 -90736 -47253 -85120 -93040 -21995 -9650 -175636 -199489 -169548
849 -169548 -154653 -24444 -11162 22765 60387 12196 -4428 -12832 -71845 -15689 -50775 -129488
837 -129488 -93664 -119602 -134371 -137455 -164893 -143674 -187620 -168288 -172792 -94065 -50651 -16821
825 -16821 -92465 -152563 -167878 -262387 -123672 -39318 -54771 -125788 -161743 -125324 25033 -5968
$$ packed form
909A05949l9756q3533k0284o2304k8206J8559O2724Q0156K9934K8040n1324j04067
897f4112o2106m3322J6455J25996N8446K4005J0488l0280p8302L2340j6464n5435
885h2291Q482p3944n9858j27031k6000L7754R1414J33113Q3862m0942P6772q9218
873f7887J15477o523k279p7460O220K1003j0873n0539L8114n4301j01190N2978
861a37260M4348k5788Q0816n2852M3483l7867p920P1045J2345j65986k3853K9941
849a69548J4895J30209J3282L3927L7622m8191j6624q404n9013N6156l5086p8713
837a29488L5824k5938j4769l084k7438K1219m3946J9332m504P8727M3414L3830
825a6821p5644o0098j5315r4509J38715Q4354j5453p1017l5955L6419J50357l1001
$$ plain form
813 -5968 -21838 -85154 -225612 -233404 -240401 -149871 -93617 -83729 -61323 -3997 -15620 -2341 -112986
800 -112986 -149821 -259311 -297831 -288517 -259533 -315364 -280813 -167833 -36706 -100070 -155795
789 -155795 -202355 -259012 -253550 -253571 -346159 -246824 -152741 -115928 -218773 -292942 -205046 -171987
777 -171987 -183835 -284993 -245277 -138747 -132507 -212863 -295633 -257140 -187761 -121382 -125921 -195024
765 -195024 -197394 -119035 -267265 -298031 -332011 -361633 -291909 -342262 -391529 -312561 -244372 -262449
753 -262449 -156957 -236387 -240970 -197253 -202537 -253728 -283491 -362428 -361994 -229609 -269741 -249336
741 -249336 -221577 -256996 -238328 -212157 -220555 -294310 -286162 -315741 -340942 -334057 -312251 -257790
729 -257790 -99110 -66498 -209482 -242348 -251102 -251079 -252843 -282855 -249869 -149096 -103649 -170499
$$ packed form
813e968j5870o3316j40458p792o997R0530N6254R888K2406N7326j1623J3279j10645
800a12986l6835j09490l8520R314K8984n5831L4551J12980J31127o3364n5725
789a55795m6560n6657N462k1r2588R9335R4083L6813j02845p4169Q7896L3059
777a71987j1848j01158L9716J06530O240q0356q2770L8493O9379O6379m539o9103
765a95024k370P8359j48230l0766l3980k9622O9724n0353m9267P8968O8189j8077
753b62449J05492p9430m583M3717n284n1191k9763p8937M34J32385m0132K0405
741b49336K7759l5419J8668K6171q398p3755Q148k9579k5201O885K1806N4461
729b57790J58680L2612j42984l2866q754K3j764l0012L2986J00773M5447o6850
$$ plain form
717 -170499 -275739 -285158 -356588 -322043 -285634 -253190 -134804 -167016 -237671 -173188 -14925
706 -14925 -102064 -148152 -185202 -225116 -270789 -414238 -317785 -195747 -183277 -72780 -3484
695 -3484 -56618 -88642 -99396 -135201 -309757 -343438 -293815 -249790 -213407 -141603 -102379 -75137
683 -75137 -99514 -186298 -199771 -193880 -320860 -368446 -237369 -291497 -228235 -147184 -137245 -126098
671 -126098 -62769 -125303 -222179 -356781 -407794 -371512 -288241 -233777 -135720 -110227 -145140 -152087
659 -152087 -216344 -311241 -307321 -381937 -443092 -425001 -276525 -295786 -339358 -278149 -224243 -239961
647 -239961 -316841 -375751 -515432 -497142 -450034 -355472 -428314 -503472 -428493 -387130 -417312 -413591
635 -413591 -442459 -418787 -403865 -368265 -279534 -278726 -343416 -400613 -426563 -445592 -421425 -447921
$$ packed form
717a70499j05240r419p1430L4545L6409L2444J18386l2212p0655O4483J58263
706a4925q7139m6088l7050l9914m5673j43449R6453J22038J2470J10497O9296
695c484n3134l2024j0754l5805j74556l3681M9623M4025L6383P1804L9224K7242
683g5137k4377q6784j3473N891j26980m7586J31077n4128O3262Q1051R939J1147
671a26098O3329o2534r6876j34602n1013L6282Q3271N4464R8057K5493l4913o947
659a52087o4257r4897L920p4616o1155J8091J48476j9261m3572O1209N3906j5718
647b39961p6880n8910j39681J8290M7108R4562p2842p5158P4979M1363l0182L721
635d13591k8868K3672J4922L5600Q8731Q08o4690n7197k5950j9029K4167k6496
$$ plain form
623 -447921 -507901 -476400 -421032 -418212 -347575 -345569 -323025 -354739 -346883 -360874 -389516 -394443 -400344
610 -400344 -367187 -356135 -332443 -360196 -431993 -375971 -368804 -293349 -280952 -300165 -347128 -318678
598 -318678 -324963 -356315 -342261 -355974 -279690 -284906 -302851 -308345 -273206 -337067 -354993 -328984
586 -328984 -288607 -304289 -419836 -419772 -320504 -279032 -247445 -331185 -339806 -304186 -340082 -347005 -305936
573 -305936 -290838 -235605 -345862 -292072 -277564 -394466 -516341 -540539 -493739 -389461 -321152
562 -321152 -358304 -342295 -285296 -290020 -299523 -276649 -192186 -186080 -193617 -286702 -295249 -341593 -304902
549 -304902 -169306 -202644 -171659 -130590 -160599 -195185 -150866 -131087 -122859 -193622 -289571 -220591
537 -220591 -151195 -23015 -28729 -45112 -81726 -258490 -335533 -235086 -194785 -180890 -145670
$$ packed form
623d47921n9980L1501N5368K820P0637K006K2544l1714P856j3991k8642m927n901
610d00344L3157J1052K3692k7753p1797N6022P167P5455J2397j9213m6963K8450
598c18678o285l1352J4054j3713P6284n216j7945n494L5139o3861j7926K6009
586c28984M0377j5682j15547O4R9268M1472L1587q3740q621L5620l5896o923M1069
573c05936J5098N5233j10257N3790J4508j16902j21875k4198M6800J04278O8309
562c21152l7152J6009N6999m724r503K2874Q4463O106p537r3085q547m6344L6691
549c04902J35596l3338L0985M1069l0009l4586M4319J9779Q228p0763r5949O8980
537b20591O9396J28180n714j6383l6614j76764p7043J00447M0301J3895L5220
$$ plain form
526 -145670 -98160 -73628 -100359 -77682 61582 19431 -50408 -115128 -212555 -84889 -67534
515 -67534 -58016 18142 44615 -14833 -33778 -60100 -54925 -43313 -13981 9481 -134 -34228 24191
502 24191 74897 72122 12695 42304 92376 101112 -122695 14198 129823 125587 149729 235550
490 235550 124885 144446 221638 221237 204646 106661 84900 149357 126316 74454 186787 218416
478 218416 212282 280584 273908 288431 240860 238080 188989 182431 245796 146330 233352 221031 278942
465 278942 374377 423957 390004 357723 355816 166101 57956 104642 199218 325896 347785
454 347785 501087 526631 456389 415172 453503 360399 363206 281538 254109 294476 408912 399064
442 399064 442794 524348 477092 397698 350097 281531 310961 273671 262276 362208 359535 469328
$$ packed form
526a45670M7510K4532k6731K2677J39264m2151o9839o4720r7427J27666J7355
515f7534R518P6158K6473n9448j8945k6322N175J1612K9332K3462r615l4094N8419
502B4191N0706k775n9427K9609N0072Q736k23807J36893J15625m236K4142Q5821
490B35550j10665J9561P7192m01j6591r7985k1761O4457k3041n1862J12333L1629
478B18416o134O8302o676J4523m7571k780m9091o558O3365r9466Q7022j2321N7911
465B78942R5435M9580l3953l2281j907j89715j08145M6686R4576J26678K1889
454C47785J53302K5544p0242m1217L8331r3104K807q1668k7429M0367J14436r848
442C99064M3730Q1554m7256p9394m7601o8566K9430l7290j1395R9932k673J09793
$$ plain form
430 469328 457496 401610 412535 452605 424727 383818 327494 348679 339162 337451 397731 415631
418 415631 375370 423691 365658 388733 348899 247949 173858 221708 291180 407673 496722
407 496722 459363 405541 352470 298632 225625 189822 165517 200219 318224 311295 343586 342486
395 342486 295541 268048 261982 283358 242637 270262 187380 181803 254957 386977 306404 304162
383 304162 342103 329025 225590 222798 220536 234843 219385 234913 284829 161809 255494 252415
371 252415 239338 190530 212983 180020 151477 90808 204710 173627 175477 267232 296456 282852
359 282852 260298 200011 145057 160608 99759 146978 214328 316017 441595 319553 223984
348 223984 352524 285465 220871 298556 247508 248226 228084 208552 269556 309442 243972 267097
$$ packed form
430D69328j1832n5886J0925M0070k7878m0909n6324K1185r517j711O0280J7900
418D15631m0261M8321n8033K3075l9834j00950p4091M7850O9472J16493Q9049
407D96722l7359n3822n3071n3838p3007l5803k4305L4702J18005o929L2291j100
395C42486m6945k7493o066K1376m0721K7625q2882n577P3154J32020q0573k242
383C04162L7941j3078j03435k792k262J4307j5458J5528M9916j23020R3685l079
371B52415j3077m8808K2453l2963k8543o0669J13902l1083J850R1755K9224j3604
359B82852k2554o0287n4954J5551o0849M7219O7350J01689J25578j22042r5569
348B23984J28540o7059o4594P7685n1048P18k0142j9532O1004L9886o5470K3125
$$ plain form
336 267097 242811 202692 297068 220893 203289 159638 232263 231201 278334 348092 383150 303606
324 303606 225454 218378 233932 158662 212927 265299 215754 261238 297802 351469 259922 130727
312 130727 66087 110643 170704 188026 178371 197606 258513 308723 285173 276817 326479 260729
300 260729 286928 322164 279335 298907 266614 244557 253216 273026 348711 371683 291698 342821
288 342821 363844 356175 309939 282059 253461 286333 422162 279706 222808 315463 234500 235315
276 235315 310544 278320 323514 297085 273651 295045 418074 386279 331146 262359 333786 327808
264 327808 345014 230131 202634 237370 264216 369915 440703 444605 407620 317870 303418 304307
252 304307 236670 180240 245314 291138 253486 289772 289907 352514 300270 236950 270906 285434
$$ packed form
336B67097k4286m0119R4376p6175j7604m3651P2625j062M7133O9758L5058p9544
324C03606p8152p076J5554p5270N4265N2372m9545M5484L6564N3667r1547j29195
312A30727o4640M4556O0061J7322r655J9235O0907N0210k3550q356M9662o5750
300B60729K6199L5236m2829J9572l2293k2057Q659J9810P5685K2972p9985N1123
288C42821K1023p669m6236k7880k8598L2872J35829j42456n6898R2655q0963Q15
276B35315P5229l2224M5194k6429k3434K1394J23029l1795n5133o8787P1427n978
264C27808J7206j14883k7497L4736K6846J05699P0788L902l6985q9750j4452Q89
252C04307o7637n6430O5074M5824l7652L6286J35O2607n2244o3320L3956J4528
$$ plain form
240 285434 262465 239571 264688 390311 221928 244162 284919 341695 386831 363029 210403
229 210403 254469 287997 257635 217307 219185 247965 247410 290809 269619 277062 257073 192981 229471
216 229471 327551 302431 210057 220826 255528 217050 262480 321021 380461 289416 215128 185754
204 185754 202987 337167 347536 340582 406378 424254 469521 511822 508564 547365 502825 467481
192 467481 489280 495461 477843 570780 557673 602977 536980 611273 648832 633706 609810 588430
180 588430 581583 582504 730445 695326 619626 650630 677728 677154 735076 770470 670337 652313
168 652313 743865 756272 748180 739485 799586 867920 880140 933895 1063730 992501 808240 826297
156 826297 882144 944002 921796 928039 956847 1049716 1047611 1014186 1068387 1060556 1022857 1027796 1022528
$$ packed form
240B85434k2969k2894K5117J25623j68383K2234M0757N6776M5136k3802j52626
229B10403M4066L3528l0362m0328J878K8780n55M3399k1190P443j9989o4092L6490
216B29471R8080k5120r2374J0769L4702l8478M5430N8541N9440r1045p4288k9374
204A85754J7233J34180J0369o954O5796J7876M5267M2301l258L8801m4540l5344
192D67481K1799O181j7618R2937j3107M5304o5997P4293L7559j5126k3896k1380
180E88430o847R21J47941l5119p5700L1004K7098n74N7922L5394j00133j8024
168F52313R1552J2407q092q695O0101O8334J2220N3755J29835p1229j84261J8057
156H26297N5847O1858k2206O243K8808R2869k105l3425N4201p831l7699M939n268
$$ plain form
143 1022528 1028261 1075832 1081949 1189414 1185101 1260932 1275347 1277750 1244512 1210584 1282609 1281993 1195427
130 1195427 1330055 1374550 1383877 1373579 1425625 1485521 1529307 1594267 1602579 1528175 1517899 1463231
118 1463231 1502823 1576434 1677970 1659033 1612345 1693231 1681632 1744353 1756333 1736815 1797689
107 1797689 1867616 1830100 1847745 1940534 1870900 1912235 1927748 1877255 1869586 1881805 1930774 1988639
95 1988639 2002766 2008916 2011781 2047953 2133434 2108223 2101622 2109057 2165870 2171970 2201656 2144952 2183926
82 2183926 2195625 2197972 2290435 2221906 2243166 2222550 2269931 2328569 2331300 2415506 2432312 2418960
70 2418960 2395803 2449997 2429435 2417138 2504026 2495419 2631159 2645180 2606406 2646276 2624260 2694079
58 2694079 2689560 2720538 2738928 2753878 2859259 2843675 2880217 2867988 2911263 2932491 2932749 2911189
$$ packed form
143A022528N733M7571O117J07465m313P5831J4415K403l3238l3928P2025o16q6566
130A195427J34628M4495R327j0298N2046N9896M3786O4960Q312p4404j0276n4668
118A463231L9592P3611J01536j8937m6688Q0886j1599O2721J1980j9518O0874
107A797689O9927l7516J7645R2789o9634M1335J5513n0493p669J2219M8969N7865
95A988639J4127O150K865L6172Q5481k5211o601P435N6813O100K9686n6704L8974
82B183926J1699K347R2463o8529K1260k0616M7381N8638K731Q4206J6806j3352
70B418960k3157N4194k0562j2297Q6888q607J35740J4021l8774L9870k2016O9819
58B694079m519L0978J8390J4950J05381j5584L6542j2229M3275K1228K58k1560
$$ plain form
46 2911189 2907927 2921146 2883106 3016987 3122617 3124362 3122100 3096731 3078520 3108274 3155069 3176831
34 3176831 3237764 3336671 3286318 3270905 3240124 3312201 3303812 3355100 3355439 3400638 3468906 3432270
22 3432270 3372351 3393635 3410757 3440119 3481295 3543217 3541297 3541131 3624009 3669007 3581720 3552610
10 3552610 3575728 3591999 3606547 3595232 3696873 3791851 3765114 3768387 3795627 3811548
0 3811548
$$ packed form
46B911189l262J3219l8040J33881J05630J745k262k5369j8211K9754M6795K1762
34C176831O0933R8907n0353j5413l0781P2077q389N1288L39M5199O8268l6636
22C432270n9919K1284J7122K9362M1176O1922j920j66Q2878M4998q7287k9110
10C552610K3118J6271J4548j1315J01641R4978k6737L273K7240J5921
0C811548
$$ Imaginary data points
##PAGE= N=2
##DATA TABLE= (X++(I..I)), XYDATA
$$ plain form
16383 -6618684 -6531271 -6477925 -6428321 -6488952 -6413144 -6253421 -6110229 -6093051 -6013933 -5951136 -5914374
16372 -5914374 -5892662 -5800988 -5720263 -5708345 -5716288 -5641005 -5593319 -5493452 -5426083 -5282369 -5268293
16361 -5268293 -5203242 -5144152 -5049806 -4955740 -5013984 -5015620 -4940357 -4796476 -4741678 -4703575 -4664786
16350 -4664786 -4546451 -4467049 -4445001 -4404474 -4386516 -4380228 -4246443 -4136892 -4088353 -4075887 -3987481
16339 -3987481 -3975880 -3930989 -3819924 -3742237 -3717513 -3591881 -3535738 -3500736 -3480790 -3436501 -3362083
16328 -3362083 -3288947 -3278354 -3281512 -3242311 -3191213 -3140738 -3082945 -3057911 -3032163 -2910428 -2809952
16317 -2809952 -2761058 -2631186 -2630584 -2663604 -2636564 -2600490 -2513902 -2428152 -2399332 -2419730 -2390004
16306 -2390004 -2344203 -2201951 -2127744 -2090186 -2056748 -1982862 -1973689 -1913974 -1799163 -1809698 -1804479
$$ packed form
16383f618684Q7413N3346M9604o0631P5808J59723J43192J7178P9118O2797L6762
16372e914374K1712R1674Q0725J1918p943P5283M7686R9867O7369J43714J4076
16361e268293O5051N9090R4346R4066n8244j636P5263J43881N4798L8103L8789
16350d664786J18335P9402K2048M0527J7958O288J33785J09551M8539J2466Q8406
16339c987481J1601M4891J11065P7687K4724J25632N6143L5002J9946M4289P4418
16328c362083P3136J0593l158L9201N1098N0475N7793K5034K5748J21735J00476
16317b809952M8894J29872O02l3020K7040L6074Q6588Q5750K8820k0398K9726
16306b390004M5801J42252P4207L7558L3438P3886R173N9715J14811j0535N219
$$ plain form
16295 -1804479 -1655756 -1590179 -1562461 -1536763 -1484110 -1422768 -1503538 -1480641 -1359342 -1323629 -1308658
16284 -1308658 -1258592 -1210508 -1163169 -1147500 -1098800 -970682 -957931 -955323 -950664 -896110 -898820 -836346
16272 -836346 -747165 -741239 -692971 -574271 -504861 -513265 -496515 -456488 -432661 -348174 -285338 -281419
16260 -281419 -187731 -174450 -89429 -66333 -76591 -57353 -78260 24099 153643 119350 148612
16249 148612 219439 290077 399226 403820 350610 362801 423242 404884 419558 473399 447003
16238 447003 474351 536421 568072 689400 665292 711917 759527 703274 799803 871932 813518
16227 813518 792866 878706 934833 973108 946394 982167 1034401 1103992 1120570 1142198 1216128
16216 1216128 1203297 1208161 1177816 1259941 1329583 1370709 1424272 1420052 1392451 1447591 1563186
$$ packed form
16295a804479J48723O5577K7718K5698N2653O1342q0770K2897J21299L5713J4971
16284a308658N0066M8084M7339J5669M8700J28118J2751K608M659N4554k710O2474
16272h36346Q9181N926M8268J18700O9410q404J6750M0027K3827Q4487O2836L919
16260b81419R3688J3281Q5021K3096j0258J9238k0907J02359J29544l4293K9262
16249A48612P0827P0638J09149M594n3210J2191O0441j8358J4674N3841k6396
16238D47003K7348O2070L1651J21328k4108M6625M7610n6253R6529P2129n8414
16227H13518k0652Q5840N6127L8275k6714L5773N2234O9591J6578K1628P3930
16216A216128j2831M864l0345Q2125O9642M1126N3563m220k7601N5140J15595
$$ plain form
16205 1563186 1535765 1580604 1507979 1498876 1530134 1521722 1558979 1577175 1608360 1661616 1749123 1714299
16193 1714299 1669763 1734831 1787338 1747132 1757290 1829554 1724483 1735559 1841378 1783898 1851286
16182 1851286 2023474 2019960 2076594 2120019 2064753 1998961 1947372 1985525 1986087 1948806 2045445 2090725
16170 2090725 1990619 2112942 2102706 2091404 2128756 2040202 1999684 1976305 1987852 2120295 2171866
16159 2171866 2150680 2276672 2265482 2187359 2188414 2157274 2199318 2236649 2209941 2204896 2122596
16148 2122596 2118945 2190344 2229849 2232663 2261641 2308965 2333765 2311311 2298727 2297661 2400090 2453195
16136 2453195 2481214 2451027 2376604 2437078 2446943 2381157 2416793 2353673 2355382 2356228 2388188 2387412
16124 2387412 2407892 2430775 2516505 2473282 2456925 2484655 2354122 2379625 2329318 2367150 2430058
$$ packed form
16205A563186k7421M4839p2625r103L1258q412L7257J8196L1185N3256Q7507l4824
16193A714299m4536O5068N2507m0206J0158P2264j05071J1076J05819n7480O7388
16182A851286J72188l514N6634M3425n5266o5792n1589L8153N62l7281R6639M5280
16170B090725j00106J22323j0236j1302L7352q8554m0518k3379J1547J32443N1571
16159B171866k1186J25992j1190p8123J055l1140M2044L7331k6708n045q2300
16148B122596l651P1399L9505K814K8978M7324K4800k2454j2584j066J02429N3105
16136B453195K8019l0187p4423O0474R865o5786L5636o3120J709Q46L1960p76
16124B387412K0480K2883Q5730m3223j6357K7730j30533K5503n0307L7832O2908
$$ plain form
16113 2430058 2499921 2496661 2596178 2579115 2551495 2467749 2471997 2532564 2592994 2464923 2437318
16102 2437318 2369264 2507720 2587070 2536938 2616456 2642821 2645630 2641515 2583717 2550105 2501586
16091 2501586 2531857 2519718 2542616 2483836 2352474 2400714 2454637 2526518 2578757 2581789 2540839
16080 2540839 2570812 2563223 2636875 2613320 2615055 2572631 2495741 2507196 2630036 2656705 2653161 2680104
16068 2680104 2792668 2798853 2711218 2584634 2547744 2595899 2719751 2662974 2577627 2618641 2747613
16057 2747613 2683333 2673008 2699301 2682254 2611251 2558051 2694729 2735850 2751735 2814245 2793470
16046 2793470 2734388 2734670 2669790 2647440 2703508 2727918 2788515 2832302 2848501 2951881 2904673
16035 2904673 2911759 2927227 2797336 2714790 2651054 2663902 2795300 2751679 2761212 2775667 2814308
$$ packed form
16113B430058O9863l260R9517j7063k7620q3746M248O0567O0430j28071k7605
16102B437318o8054J38456P9350n0132P9518K6365K809m115n7798l3612m8519
16091B501586L0271j2139K2898n8780j31362M8240N3923P1881N2239L032m0950
16080B540839K9973p589P3652k3555J735m2424p6890J1455J22840K6669l544K6943
16068B680104J12564O185q7635j26584l6890M8155J23852n6777q5347M1014J28972
16057B747613o4280j0325K6293j7047p1003n3200J36678M1121J5885O2510k0775
16046B793470n9082K82o4880k2350N6068K4410O0597M3787J6199J03380m7208
16035B904673P086J5468j29891q2546o3736J2848J31398m3621R533J4455L8641
$$ plain form
16024 2814308 2806356 2827678 2890140 2722330 2720112 2765354 2742746 2708072 2733595 2790544 2800295 2775204
16012 2775204 2769448 2801345 2817959 2746431 2682379 2726649 2670694 2658677 2727712 2789490 2800039
16001 2800039 2772623 2874910 2854841 2735559 2592290 2637805 2609507 2696708 2795506 2772792 2732638
15990 2732638 2643257 2652532 2617294 2673777 2769084 2768166 2791815 2823166 2731562 2641081 2599238 2723091
15978 2723091 2680496 2640258 2643792 2670686 2640432 2647477 2672901 2702607 2659296 2689852 2659622 2669113
15966 2669113 2626656 2674015 2675619 2800549 2830156 2675527 2658092 2558198 2586919 2586614 2562328
15955 2562328 2610879 2624770 2702497 2761843 2689638 2639153 2678296 2791390 2762849 2688864 2698565
15944 2698565 2637906 2677198 2718383 2750673 2727036 2754793 2758087 2724855 2663420 2608662 2675239
$$ packed form
16024B814308p952K1322O2462j67810k218M5242k2608l4674K5523N6949R751k5091
16012B775204n756L1897J6614p1528o4052M4270n5955j2017O9035O1778J0549
16001B800039k7416J02287k0069j19282j43269M5515k8298Q7201R8798k2714m0154
15990B732638q9381R275l5238N6483R5307r18K3649L1351r1604r0481m1843J23853
15978B723091m2595m0238L534K6894l0254P045K5424K9706m3311L0556l0230R491
15966B669113m2457M7359J604J24930K9607j54629j7435r9894K8721l05k4286
15955B562328M8551J3891P7727N9346p2205n0485L9143J13094k8541p3985R701
15944B698565o0659L9292M1185L2290k3637K7757L294l3232o1435n4758O6577
$$ plain form
15933 2675239 2623300 2631654 2723664 2825632 2729897 2755769 2748581 2628998 2465236 2494524 2502026
15922 2502026 2513291 2493237 2514204 2686151 2738042 2710518 2729075 2688690 2632959 2506187 2590214
15911 2590214 2573643 2558026 2655736 2626839 2654209 2773068 2714332 2712260 2711750 2712156 2707864 2762803
15899 2762803 2733555 2651481 2665006 2645460 2803022 2786706 2652309 2607580 2692424 2662227 2610842
15888 2610842 2660966 2682313 2661101 2710029 2741938 2756800 2857482 2810123 2730308 2623754 2590629
15877 2590629 2672421 2704298 2711939 2649982 2722583 2701119 2825696 2853386 2805511 2675062 2672619
15866 2672619 2737449 2700869 2600301 2533021 2655481 2755962 2739733 2826818 2799266 2693454
15856 2693454 2743596 2828110 2868214 2792990 2648607 2655016 2738446 2731466 2788299 2712386 2718477 2735474
$$ packed form
15933B675239n1939Q354R2010J01968r5735K5872p188j19583j63762K9288P502
15922B502026J1265k0054K0967J71947N1891k7524J8557m0385n5731j26772Q4027
15911B590214j6571j5617R7710k8897K7370J18859n8736k072n10M06m292N4939
15899B762803k9248q2074J3525j9546J57562j6316j34397m4729Q4844l0197n1385
15888B610842N0124K1347k1212M8928L1909J4862J00682m7359p9815j06554l3125
15877B590629Q1792L1877P641o1957P2601k1464J24577K7690m7875j30449k443
15866B672619O4830l6580j00568o7280J22460J00481j6229Q7085k7552j05812
15856B693454N0142Q4514M0104p5224j44383O409Q3430o980N6833p5913O091J6997
$$ plain form
15844 2735474 2750306 2698518 2718646 2628695 2679291 2631352 2606298 2632999 2668834 2799422 2839071
15833 2839071 2771164 2684130 2730514 2746896 2659915 2647212 2731900 2765187 2729343 2739639 2865204
15822 2865204 2811436 2755713 2694298 2666695 2641379 2831641 2861404 2739221 2705079 2679044 2761257
15811 2761257 2714363 2683039 2673133 2623776 2738769 2691431 2648253 2702816 2786293 2800880 2706208
15800 2706208 2654396 2723703 2768689 2674508 2754374 2753911 2731099 2774806 2850883 2819662 2779634 2757700
$$ packed form
15844B735474J4832n1788K0128q9951N0596m7939k5054K6701L5835J30588L9649
15833B839071o7907q7034M6384J6382q6981j2703Q4688L3287l5844J0296J25565
15822B865204n3768n5723o1415k7603k5316J90262K9763j22183l4142k6035Q2213
15811B761257m6894l1324r906m9357J14993m7338m3178N4563Q3477J4587r4672
15800B706208n1812O9307M4986r4181P9866m63k2812M3707P6077l1221m0028k1934
$$ [...]
##END NTUPLES=NMR SPECTRUM
##END=
