##TITLE=1H_TG-2323-1
 CDCl3,8 sc, 
 30.03.2021
##JCAMPDX= 6.0         $$ Bruker NMR JCAMP-DX V2.0
##DATA TYPE= NMR SPECTRUM
##DATA CLASS= NTUPLES
##ORIGIN= UXNMR, Bruker Analytische Messtechnik GmbH
##OWNER= root
$$ XWIN-NMR		Version 3.5
$$ Tue Mar 30 11:12:56 2021 Russian Standard Time (UT+4h)  she@DPX200
##.OBSERVE FREQUENCY= 200.131506
##.OBSERVE NUCLEUS= ^1H
##.ACQUISITION MODE= SIMULTANEOUS
##.ACQUISITION SCHEME= undefined
##.AVERAGES= 8
##.DIGITISER RES= 18
##SPECTROMETER/DATA SYSTEM= spect
##.PULSE SEQUENCE= zg30
##.SOLVENT NAME= CDCl3
##.SHIFT REFERENCE= (INTERNAL, CDCl3, 0, 15.974)
##AUDIT TRAIL= $$ (NUMBER, WHEN, WHO, WHERE, WHAT)
$$ ##TITLE= Audit trail, XWIN-NMR		Version 3.5
$$ ##JCAMPDX= 5.01
$$ ##ORIGIN= Bruker BioSpin GmbH
$$ ##OWNER= she
$$ F:/spectra/data/she/nmr/H-F/1/pdata/1/auditp.txt
$$ ##AUDIT TRAIL=  $$ (NUMBER, WHEN, WHO, WHERE, WHAT)
(   1,<2021-03-30 11:11:45.95 +0400>,<she>,<DPX200>,
      <created by zg, POWCHK disabled, PULCHK disabled
       configuration hash MD5:
       00 E9 B6 7A A2 85 ED C7 34 08 36 98 17 FE 4E 26
       data hash MD5: 16K
       E5 F3 41 AF 4A 28 70 EB E4 09 05 1E 5D 09 E4 E9>)
(   2,<2021-03-30 11:11:48.28 +0400>,<she>,<DPX200>,
      <Start of raw data processing
       efp BC_mod = 2 LB = 0.24 FT_mod = 6 PKNL = 1 PHC0 = -11119.09 PHC1 = 12.80094 SI = 16K 
       data hash MD5: 16K
       EF 15 0A 94 74 3E 58 1F D7 AD B8 B7 3B B5 81 63>)
(   3,<2021-03-30 11:12:11.81 +0400>,<she>,<DPX200>,
      <pk PHC0 = 9.41194 PHC1 = -12.2 
       data hash MD5: 16K
       03 D2 75 84 62 8C B4 F7 FB C6 18 96 9A 78 57 85>)
(   4,<2021-03-30 11:12:14.87 +0400>,<she>,<DPX200>,
      <abs ABSG = 5 
       data hash MD5: 16K
       3F 37 84 5A D6 A9 DD BF 78 35 0B 09 AE 36 4E 0A>)
$$ ##END=
$$ 
$$ hash MD5
$$ 3C 43 DB 7B 4B 31 56 0C B2 55 1B 3D C5 F7 6C DD
##$RELAX= 
##$RELAX= 
##$RELAX= 
##$RELAX= 
##$RELAX= 
##$RELAX= 
$$ Bruker specific parameters
$$ --------------------------
##$DU= <F:/spectra>
##$EXPNO= 1
##$NAME= <H-F>
##$PROCNO= 1
##$TYPE= <nmr>
##$USER= <she>
##$AMP= (0..31)
100 100 100 100 100 100 100 100 100 100 100 100 100 100 100 100 100 100 
100 100 100 100 100 100 100 100 100 100 100 100 100 100 
##$AQSEQ= 0
##$AQ_mod= 1
##$AUNM= <au_zg>
##$AUTOPOS= <>
##$BF1= 200.13
##$BF2= 200.13
##$BF3= 200.13
##$BF4= 200.13
##$BF5= 200.13
##$BF6= 200.13
##$BF7= 200.13
##$BF8= 200.13
##$BYTORDA= 1
##$CFDGTYP= 0
##$CFRGTYP= 5
##$CHEMSTR= <none>
##$CNST= (0..31)
1 1 145 1 1 1 1 1 1 1 1 1 1 1 1 1 1 1 1 1 1 1 1 1 1 1 1 1 1 1 1 1 
##$CPDPRG= <>
##$CPDPRG1= <>
##$CPDPRG2= <>
##$CPDPRG3= <>
##$CPDPRG4= <mlev>
##$CPDPRG5= <mlev>
##$CPDPRG6= <mlev>
##$CPDPRG7= <mlev>
##$CPDPRG8= <mlev>
##$CPDPRGB= <>
##$CPDPRGT= <>
##$D= (0..31)
0 1.2 0 0 0 0 0 0 0 0.06 0 0.03 0 0 0 0 0.0002 0 0 0 0 0 0 0 0 0 0 0 0 
0 0 0 
##$DATE= 1617088305
##$DBL= (0..7)
120 120 120 120 120 120 120 120 
##$DBP= (0..7)
150 150 150 150 150 150 150 150 
##$DBP07= 0
##$DBPNAM0= <>
##$DBPNAM1= <>
##$DBPNAM2= <>
##$DBPNAM3= <>
##$DBPNAM4= <>
$$ [...]
##$SUBNAM3= <"">
##$SUBNAM4= <"">
##$SUBNAM5= <"">
##$SUBNAM6= <"">
##$SUBNAM7= <"">
##$SUBNAM8= <"">
##$SUBNAM9= <"">
##$SW= 16.9725357007746
##$SWIBOX= (0..15)
0 0 2 0 0 0 0 0 0 0 0 0 0 0 0 0 
##$SW_h= 3396.73913043478
##$TD= 16384
##$TD0= 1
##$TE= 0
##$TE2= 300
##$TE3= 300
##$TEG= 300
##$TL= (0..7)
0 120 120 120 120 120 120 120 
##$TP= (0..7)
150 150 150 150 150 150 150 150 
##$TP07= 0
##$TPNAME0= <>
##$TPNAME1= <>
##$TPNAME2= <>
##$TPNAME3= <>
##$TPNAME4= <>
##$TPNAME5= <>
##$TPNAME6= <>
##$TPNAME7= <>
##$TPOAL= (0..7)
0.5 0.5 0.5 0.5 0.5 0.5 0.5 0.5 
##$TPOFFS= (0..7)
0 0 0 0 0 0 0 0 
##$TUNHIN= 0
##$TUNHOUT= 0
##$TUNXOUT= 0
##$USERA1= <user>
##$USERA2= <user>
##$USERA3= <user>
##$USERA4= <user>
##$USERA5= <user>
##$V9= 5
##$VALIST= <valist>
##$VCLIST= <CCCCCCCCCCCCCCC>
##$VD= 0
##$VDLIST= <DDDDDDDDDDDDDDD>
##$VPLIST= <PPPPPPPPPPPPPPP>
##$VTLIST= <TTTTTTTTTTTTTTT>
##$WBST= 1024
##$WBSW= 4
##$XGAIN= (0..3)
0 0 0 0 
##$XL= 0
##$YL= 0
##$YMAX_a= 144815
##$YMIN_a= -121631
##$ZGOPTNS= <>
##$ZL1= 120
##$ZL2= 120
##$ZL3= 120
##$ZL4= 120
##$ABSF1= 15.97403
##$ABSF2= -0.9986324
##$ABSG= 5
##$ABSL= 3
##$ALPHA= 0
##$AQORDER= 0
##$ASSFAC= 0
##$ASSFACI= 0
##$ASSFACX= 0
##$ASSWID= 0
##$AUNMP= <proc_1d>
##$AZFE= 0.1
##$AZFW= 0.1
##$BCFW= 0
##$BC_mod= 2
##$BYTORDP= 0
##$COROFFS= 0
##$CY= -3
##$DATMOD= 1
##$DC= 0
##$DFILT= <>
##$DTYPP= 0
##$F1P= 0
##$F2P= 0
##$FCOR= 1
##$FTSIZE= 16384
##$FT_mod= 6
##$GAMMA= 0
##$GB= 0
##$INTBC= 1
##$INTSCL= 2.992141e-10
##$ISEN= 128
##$LB= 0.24
##$LEV0= 0
##$LPBIN= 0
##$MAXI= 10000
##$MC2= 0
##$MEAN= 0
##$ME_mod= 0
##$MI= 1.114404
##$NCOEF= 0
##$NC_proc= -9
##$NLEV= 6
##$NOISF1= 3.799351
##$NOISF2= 2.8
##$NSP= 0
##$NTH_PI= 0
##$NZP= 0
##$OFFSET= 15.97403
##$PC= 1
##$PHC0= -11109.68
##$PHC1= 0.6009398
##$PH_mod= 1
##$PKNL= yes
##$PPARMOD= 0
##$PSCAL= 0
##$PSIGN= 0
##$REVERSE= no
##$SF= 200.130007486744
##$SI= 16384
##$SIGF1= 3
##$SIGF2= 2
##$SINO= 5.538805
##$SIOLD= 16384
##$SREGLST= <1H.CDCl3>
##$SSB= 0
##$STSI= 16384
##$STSR= 0
##$SW_p= 3396.73913043479
##$SYMM= 0
##$S_DEV= 0
##$TDeff= 16384
##$TDoff= 0
##$TI= <>
##$TILT= no
##$TM1= 0
##$TM2= 0
##$TOPLEV= 0
##$USERP1= <user>
##$USERP2= <user>
##$USERP3= <user>
##$USERP4= <user>
##$USERP5= <user>
##$WDW= 1
##$XDIM= 16384
##$YMAX_p= 510516828
##$YMIN_p= -3941659
$$ End of Bruker specific parameters
$$ ---------------------------------
##NTUPLES= NMR SPECTRUM
##VAR_NAME=  FREQUENCY,     SPECTRUM/REAL,   SPECTRUM/IMAG
##SYMBOL=    X,             R,               I
##VAR_TYPE=  INDEPENDENT,   DEPENDENT,       DEPENDENT
##VAR_FORM=  AFFN,          ASDF,            ASDF
##VAR_DIM=   16384,         16384,           16384
##UNITS=     HZ,            ARBITRARY UNITS, ARBITRARY UNITS
##FACTOR=    0.207333158178282, 1,           1
##FIRST=     3196.88265163693, 0,            0
##LAST=      -199.856478797863, 0,           0
##MIN=       -199.856478797863, -3941659,    0
##MAX=       3196.88265163693, 510516828,    0
$$ Real data points
##PAGE= N=1
##DATA TABLE= (X++(R..R)), XYDATA
$$ [...]
6480H41581o63114o52324j11929J301560P7167n80645O158j002773N97323O02496
6470D15500l83085m22845P1583r40834j065053K519165J45766J827395n9082k292467
6460a83957j92765M22758O44254o62925M55689J11254R17568j05407j064144j042869
6450g00544K94808L7953J92668O30051o82748j048067P62467R26529m21637J88547
6440A80027K91462r10449L82510J308965P52260j394214r38005Q22025j05276
6431C89305l18449p16191M42368K31611J1981N9760L18123P95031j052535K54957
6421D15961o40784L80070j26400O22695P64588L70654m57780J22930j65973l6475
6411A249486l04042L22261p64863p49499L6282J37808k50832L63500Q59209O89932
$$ y = [841581, 178467, -473857, -585786, 715774, 792941, 212296, 218454, -784319, -186996, 415500, 32415, -390430, -318847, -1259681, -2324734, 194431, 340197, 2167592, 2108510, -183957, -376722, 46036, 690290, 27365, 483054, 594308, 1511876, 1406469, 342325, -700544, -405736, -367783, -175115, 454936, -227812, -1275879, -513412, 413117, -8520, 180027, 471489, -438960, -56450, 1252515, 2004775, 610561, -327444, 494581, 389305, 70856, -645335, -202967, 28644, 40625, 100385, 418508, 1213539, 161004, 415961, -224823, 155247, 28847, 651542, 1416130, 1786784, 1329004, 1451934, 1285961, 1249486, 945444, 1267705, 502842, -246657, -210375, -72567, -323399, 40101, 899310, 1589242]
6401A589242K90672L47146j185224l25221K56517K53646K19197M44408j314756
6392E75627M47689K43773o24534l62269J007146m12830m84124Q74730m61499J96727
6382A000436j436594k56475P88139J578683N222P66784K84790j094775j34447
6373A501763j057277K66440L28034O5286M07970r89516k43003M73474K92164K52795
6363A298130m8361Q50952M357r16792m99837n94788M56983J122767j82756n56195
6353I34460l2198n27268M44626k21698O2821K20401L90472p65690l93002M2000
6343A54924J085968r27306k49069K64438j5527K42442m0833q58405J05861o9706
6333c07213k76925q77500J065155P25772m22623N31975p89333P86242J859013
$$ y = [1589242, 1879914, 2227060, 1041836, 716615, 973132, 1226778, 1445975, 1890383, 575627, 1023316, 1267089, 642555, 280286, 1287432, 874602, 390478, 1265208, 803709, 1000436, -436158, -692633, 95506, 1674189, 1679411, 2446195, 2730985, 1636210, 1501763, 444486, 710926, 1038960, 1104246, 1512216, 522700, 279697, 753171, 1045335, 1298130, 1249769, 2100721, 2105078, 1188286, 688449, 93661, 550644, 1673411, 1490655, 934460, 902262, 374994, 819620, 597922, 660743, 881144, 1271616, 505926, 112924, 154924, 1240892, 313586, 64517, 328955, 313428, 555870, 515037, -343368, -237507, -307213, -584138, -1461638, -396483, 329289, -93334, 438641, -350692, 435550, 2294563]
6324B294563j56679n00625o84509k10611P28894k04913j89879j534701j489269
6315a947729J810321J256m9959L44220J95543p0424K88550m91430J60698J209518
6305A450564n62962o32376l0605P59620J54534P22447K00968j152882M25556j60615
6295A174249k90487j091318k0562J12106N05875K16322l35262O98416Q0108j011381
6285C8066l27867Q38435J121335L72224q47654m47738l1555O93163m52685J33470
6275A089194r3666m24957M9641L11624l50713r63757k61924k42938J196127R32886
6265A241517o60544p37641k54057M37140L70917M17498j136739K4745J57790k75595
6255d14969k83618j83550R90576N77832K79107N71895r59535R9292J4765j26057
$$ y = [2294563, 2137884, 1637259, 952750, 742139, 1471033, 1266120, 1076241, -458460, -1947729, -137408, -136152, -186111, 158109, 353652, 283228, 571778, 80348, 241046, 1450564, 887602, 255226, 224621, 984241, 1138775, 1861222, 2062190, 909308, 1334864, 1174249, 883762, -207556, -228118, -116012, 389863, 606185, 270923, 969339, 1049447, 38066, -289801, 548634, 1669969, 2042193, 1194539, 746801, 715246, 1408409, 955724, 1089194, 995528, 570571, 620212, 931836, 581123, -382634, -644558, -887496, 308631, 1241517, 580973, -156668, -410725, 26415, 397332, 814830, -321909, -297164, -139374, -414969, -698587, -882137, 108439, 686271, 965378, 1537273, 577738, 677030, 691795, 565738]
6245E65738p35586O69436o17969L99283J048454j5838j39558q70320J86786L93210
6235H83636r7455p25274m03655K22877O57245m77278j81669O81898k49058K22178
6225E33445J156793J23213j752496M76727K69867P84517P02038l56738j274527
6216F62839p11951m2332Q55982Q01982P01742N7058j150485k18469L09264K90809
6206A556439p04652q67946L76780q04522o07929J249988J644152j195255J80454
6197H27509J047313L42676k40446p70021m28908k61809J152681o27232Q34805
6188A876568j357923j16863P56539m84226l55452N07459J154891L8744p48555
6179A271182l41886n21586N89920J047804m87690p40502k17898N13346Q67956
$$ y = [565738, -169848, 499588, -118381, 280902, 1329356, 1313518, 1173960, 303640, 490426, 883636, 786181, 60907, -342748, -119871, 537374, 60096, -121573, 560325, 311267, 533445, 1690238, 1813451, 60955, 537682, 807549, 1592066, 2294104, 1937366, 662839, -49112, -91444, 764538, 1566520, 2268262, 2325320, 1174835, 956366, 1265630, 1556439, 851787, -16159, 360621, -443901, -1051830, 198158, 1842310, 647055, 827509, 1874822, 2217498, 1977052, 1207031, 778123, 516314, 1668995, 1041763, 1876568, 518645, 401782, 1158321, 674095, 318643, 826102, 1980993, 2019737, 1271182, 929296, 407710, 997630, 2045434, 1557744, 817242, 599344, 1112690, 1980646]
6170A980646O7160p33757n41281J536142k21366j57949m71888M89459q6627m86257
6160A374282l11229l43427n59986m39801M82661r16203P77584N80768L11180k44787
6150G11042o26210O53087m6392j79003Q02666m49477r52514P47845O14859o95476
6140E80427j7396J323266K00877j407823j853508J445371N84328J303198L93308
6131B552048k111968l85098o7911K38116J211285J179403n96075j735500l67283
6122h2983M45563M18281P9695o44993Q14856k07022j01305k28997J010600l69670
6112A134025K32720k36294M19391K00438N49808m29512r00697j21045q8297O54485
6102A415022q17220J133302m56145M05830N0017j696233J158045J346722L02383
$$ y = [1980646, 2047806, 1314049, 772768, 2308910, 2087544, 1929595, 1457707, 1947166, 1860539, 1374282, 1063053, 719626, 159640, -280161, 202500, -713703, 63881, 644649, 955829, 711042, 84832, 737919, 691527, 512524, 1315190, 865713, -86801, 661044, 1275903, 580427, 563031, 1886297, 2087174, 679351, -1174157, 271214, 855542, 2158740, 2552048, 440080, 54982, -12929, 225187, 1436472, 2615875, 2019800, 284300, -82983, 362580, 780861, 860556, 215563, 1030419, 823397, 722092, 493095, 1503695, 1134025, 1366745, 1130451, 1549842, 1750280, 2300088, 1870576, 969879, 848834, 760537, 1415022, 597802, 1731104, 1274959, 1680789, 1730806, 34573, 1192618, 2539340, 2841723]
6093B841723l1739m29093O16663p89267k67310N92522P08552o65081j047730k85483
6083A243757J477527j8054q02043l21321K51073k38395l30578M77782p81121K62370
6073A220997m36590P47140P71211j76282n83933J91528p65671J532297M47981
6064B948678k85511k028826l6135M16827l89634K73602K37841P9376m91906p64155
6054c9843O4398L35912O77041l17038n47043l82988J81065J464238o508N4530
6044A483764p72766J070248m41027j83763m75218L41541R40360j55847o25541
6035A181751P64049M16908j91356k29458p9990K22688P36762q01948K84288J358857
6025C662551o62211j439563j485210R37741M3399r99763J068282Q06421N3516
$$ y = [2841723, 2809984, 2380891, 2997554, 2208287, 1940977, 2533499, 3242051, 2576970, 1529240, 1243757, 2721284, 2703230, 1901187, 1579866, 1830939, 1592544, 1261966, 1739748, 958627, 1220997, 784407, 1531547, 2302758, 2126476, 1542543, 1734071, 968400, 2500697, 2948678, 2663167, 634341, 598206, 1015033, 625399, 899001, 1136842, 1216218, 724312, -39843, 24555, 360467, 1037508, 720470, 173427, -209561, -28496, 1435742, 1429234, 1483764, 710998, 1781246, 1340219, 1156456, 681238, 1022779, 1963139, 1807292, 1181751, 1945800, 2362708, 2171352, 1941894, 1861904, 2084592, 2821354, 2019406, 2303694, 3662551, 3000340, 1560777, 75567, 1013308, 1056707, 56944, 1125226, 1931647, 1985163]
6016A985163r39731p49551n1408J36990L02378K15318J37191k43358k97360R45966
6006A441598K94672q46783j044585n43307j100471Q47096J369163M93371j830859
5997i20105J73091J637019j041605N5619o69118N20339Q25376l50782l63255K05221
5987G1800L0998o15691k90988K029691J90258j578457O85236r20399l66025J046106
5977B82529p14179p32642j83562L90432j44281J321917J203792r80272J24967
5968E68701l86859J490743j81977j799531J04320Q35223K4665k8017J00397p25938
5958A727P37033Q00434p03931k898J044272q34593o83949L86535k74552m29086
5948D0992J005209j05741M29995n90064p03835M20589Q33257q62410Q1472l78646
$$ y = [1985163, 1045432, 295881, 244473, 381463, 683841, 899159, 1036350, 792992, 495632, 1441598, 1736270, 889487, -155098, -698405, -1798876, -951780, 417383, 910754, -920105, -747014, 890005, -151600, -95981, -765099, -244760, 580616, 229834, -133421, 71800, 102798, -512893, -803881, 1225810, 1416068, -162389, 522847, -397552, -763577, 282529, -431650, -1164292, -1347854, -957422, -1101703, 220214, 1424006, 443734, 568701, 181842, 1672585, 1490608, -308923, -204603, 630620, 655285, 627268, 727665, 1727, 738760, 1539194, 835263, 832365, 1876637, 1042044, 358095, 744630, 470078, 40992, 1046201, 940460, 1370455, 780391, 76556, 497145, 1330402, 467992, 549464, 170818]
5938A70818k76384q9342j35979q77558K4057N94604K4068Q52147L97516o0884
5928F23063l89848j080580J2694O13596M70445l6294O66194K45972o26478o40452
5918a41688l45429M21667l03736k36747L5919M1742l80051m55951R33664M86996
5908E6386R4973P19096k5424J87079j48941o41899q21565J50786O3149N96459
5898B30099l47737K18794K96320j18002m86998o13688j167370L84867j36856j81820
5888a922391J325304q82668K73587R49045N74120R4730k247234J00142J704832
5879c0533q29929L06070L49739n49838m6937N12319M45427k60855j198326o22164
5869a925027P9979J231145k07882k90648J387393j15316J026539n41981j170801
$$ y = [170818, -105566, -194908, -330887, -1208445, -1184388, -589784, -565716, 286431, 683947, 623063, 233215, -847365, -834671, -221075, 249370, 213076, 879270, 1125242, 498764, -141688, -487117, -65450, -369186, -605933, -570014, -528272, -908323, -1364274, -430610, 56386, 151359, 870455, 845031, 1032110, 883169, 241270, -580295, -429509, -366360, 230099, -117638, 101156, 397476, 279474, -207524, -821212, -1988582, -1603715, -1740571, -1922391, -597087, -1479755, -1206168, -257123, 316997, 411727, -1835507, -1735365, -30533, -860462, -554392, -204653, -754491, -801428, -289109, 156318, -104537, -1302863, -1925027, -1845048, -613903, -821785, -1112433, 274960, 159644, 1186183, 644202, -526599]
5860e26599j58519r17664M7246N63336j487036J055343J351866L18338n22521
5851b76210m21855p45957M5149J027829l49483j63747L6692j582J7305q44420
5841a676279J084271P86643J19951p23274M10082m87833L90513J87117n50555
5832d59364n61105K50684J361140l48910M82645m49420r525m99485q4851M09716
5822I1525Q1342M7953j94841m50427r77879Q70268O74878j15444J010983p49755
5812B88603q1286l76155M5372J55401K01920K7584p13346P4356M56098n64584
5802d86037j234598m21608K256754Q05120o5154j044886j7810N73905L3447q75417
5792d76284J17911l95673n8717J352014j92073O04631O79396j880909l94342R33082
$$ y = [-526599, -685118, -1602782, -1555536, -992200, -2479236, -1423893, -72027, 246311, -276210, -698065, -1444022, -1398873, -371044, -720527, -884274, -847582, -849164, -831859, -1676279, -592008, 194635, 314586, -408688, 1394, -486439, -95926, 91191, -459364, -1020469, -769785, 591355, 242445, 725090, 275670, 266145, -233340, -318191, 91525, 172867, 220820, 25979, -424448, -1402327, -532059, 142819, 27375, 1038358, 288603, 207317, -168838, -123466, 31935, 233855, 261439, -451907, -377551, 78547, -486037, -1720635, -2142243, 114511, 919631, 854477, -190409, -208219, 365686, 399133, -476284, -358373, -754046, -812763, 539251, 347178, 951809, 1631205, -249704, -644046, 289036]
5782B89036P0700l32973r21427R41984l09507l94018K76647k79285J399060J13515
5772H53732J18452j293134j033935J223573Q94534j67883j368016j78151P79252
5763a71576m00270j239262O72982J638258L33249j872771k67015M45024m47490
5754a308871J16930K91506J35824j105300M29100L96778p73598L46640J0064j71396
5744a632323L51341J414848J1369l49478r1964p67711j164244J074182J161568
5735G588q74887o74266l59066O13446J38256L60426O16342M72184K73305j137269
5725e63941l27848O25372J369479m71169K32709j18440K63466j25085o06540m01607
5715a23604J95156j488248J76801P72344q35067N09291Q97094n6239K90999l29774
$$ y = [289036, 359736, 26763, -894664, 47320, -262187, -656205, -379558, -658843, 740217, 853732, 972184, -320950, -1354885, -131312, 763222, 595339, -772677, -950828, -171576, -571846, -1811108, -1138126, 500132, 833381, -1039390, -1306405, -861381, -1308871, -1191941, -900435, -764611, -1869911, -1440811, -1044033, -1817631, -1470991, -1460927, -1632323, -1280982, 133866, 145235, -204243, -296207, -1063918, -2228162, -1153980, 7588, -867299, -1541565, -1900631, -1287185, -1148929, -788503, -172161, 300023, 573328, -563941, -891789, -266417, 1103062, 631893, 864602, 746162, 1009628, 884543, 278003, -123604, 71552, -1416696, -1239895, -467551, -1302618, -793327, 103767, 47528, 338527, 8753]
5705H753l63514j001771N82036Q11820j166004P29837J17349l5140k32607Q9066
5695d60175J17152Q5292P56877l67006j104781P17422M43405l44492o2822P39969
5685E20841Q22869r84355n9457k14782R56820N73355j460585J662485j013188
5676H04003j256298O53468k05260m58415p6413J225092Q85703p77341p22497P53766
5666H25808Q94978m11767r94789n42844J099412J345746J014303j063390o39195
5657A528262j58513O32672j92090K16840o29416l60405k50250O12799R8695l91916
5647A106678L17013l77554N7835J174896q38726k28761j646284r78294J262996
5638a50201J209404k98j159733L6007J760498N110K28371N22553j371172p63806
$$ y = [8753, -354761, -1356532, -774496, 37324, -1128680, -398843, -281494, -316634, -549241, -460175, -343023, -257731, 499146, 132140, -972641, -255219, 188186, -156306, -219128, 520841, 1343710, 359355, 299898, 85116, 1041936, 1615291, 154706, 1817191, 804003, -452295, 201173, -4087, -462502, -538915, 686177, 1571880, 794539, 72042, 825808, 1720786, 1309019, 314230, -228614, 870798, 2216544, 3230847, 2167457, 1528262, 1369749, 2002421, 1810331, 2027171, 1397755, 1037350, 787100, 1399899, 1498594, 1106678, 1423691, 1046137, 1103972, 2278868, 1440142, 1211381, -434903, -1413197, -150201, 1059203, 1058905, -100828, -64821, 1695677, 1700787, 1929158, 2451711, 1080539, 316733]
5628C16733N90882m96975r02480P26345L89922J17062m11800N58504o42252L00456
5618E46397l09143J21338k4204J07963n99708l0710L81184k63521o6515L65119
5608B28200P06078r01369L34615L49517k76879O54354L2792R4877q066j13673
5598A100446L76360J75640j005662l01384o62940M25289L619k9571J26064J097025
5588A304886j06504n73265L57485j12545l74396M69898P88408K22040m92987J46443
5578A629463o3070M63032j34942l83722M52712M12402j257921k28133m16835R9283
5568E72269J695700N52590L60230L1687q42098P54490p07792N89588L86311r36599
5558B456376o04246k8904K265556K79112j902495q13799k25568r20542L81712
$$ y = [316733, 907615, 410640, -491840, 234505, 624427, 741489, 329689, 888193, 245941, 546397, 237254, 358592, 334388, 442351, -157357, -188067, 193117, -70404, -136919, 228200, 934278, 32909, 367524, 717041, 440162, 1094516, 1127308, 1222185, 1214119, 1100446, 1476806, 1652446, 646784, 345400, -317540, 107749, 111368, 81797, 207861, 1304886, 1198382, 625117, 982602, 870057, 495661, 965559, 1753967, 1976007, 1483020, 1629463, 1566393, 2029425, 1894483, 1510761, 1963473, 2375875, 1117954, 889821, 472986, 572269, 2267969, 2820559, 3180789, 3212476, 2370378, 3124868, 2417076, 3006664, 3392975, 2456376, 1852130, 1823226, 4088782, 4367894, 2465399, 1651600, 1426032, 505490, 887202]
5549H87202J452820O64964j66753K14735J085458M60294o21894j07277K40412
5540D109961K69485m57749K22593L40449n89034r1453j87068O27007J46181o78085
5530C712287R13563Q0728J29619L9167L09205N2226M18020l67878R2326K43004
5520E622267P28604q5164N17934N46107r31934N88729K47131J546988n93304m95610
5510G691748Q05153Q6934O86822o74075l60655J86280J442299m1767N22676R39993
5500A1285408k58042K52476Q11672j26909Q00152K33152Q54579J164948J173025
5491A6190461J38896M57299J166689J607933J49828O13332M66664J545218J847639
5482B4183959J631429J489934N97498N51702K307152K354873K752720L113180
$$ y = [887202, 2340022, 3004986, 2838233, 3052968, 4138426, 4598720, 3976826, 3869549, 4109961, 4379446, 3921697, 4144290, 4484739, 3895705, 3804252, 3617184, 4244191, 4390372, 3712287, 4625850, 4706578, 4836197, 4875364, 5184569, 5236795, 5654815, 5286937, 5379263, 5622267, 6350871, 6265707, 6783641, 7329748, 6397814, 6986543, 7233674, 8780662, 8187358, 7691748, 8496901, 8583835, 9270657, 8596582, 8235927, 8422207, 9864506, 9822739, 10345415, 11285408, 11027366, 11279842, 12091514, 11964605, 12764757, 12997909, 13852488, 15017436, 16190461, 16329357, 16786656, 17953345, 19561278, 19711106, 20324438, 20791102, 22336320, 24183959, 25815388, 27305322, 27902820, 28454522, 30761674, 33116547, 35869267, 38982447]
5474C8982447L767096K506080L939319L743867M767058M463068N675858O868979
5466G4713772M598112M991902M808540M671475L382154K609089J026566L35947
5458A01137557k165888l060650m403339l846625n573385o322077o685461n989274
5450F3090858n456960m157152m804318m593016l046822k673111k564386r48894
5442C4846199k145766k564971j849343j982400j517739j917294k005093p49530
5434B0114063m49127q94975k68845o67934j317503n81319L50407Q1812j481463
5425A4885116j209240J11153j013110o36094J176798M55414o81306k8905j229343
5416A1830483o08815J487418q03910J24515j366155n65784N31425p43437k005762
$$ y = [38982447, 42749543, 45255623, 49194942, 52938809, 57705867, 62168935, 67844793, 74713772, 79311884, 84303786, 89112326, 93783801, 97165955, 99775044, 100801610, 101137557, 98971669, 95911019, 91507680, 87661055, 82087670, 75765593, 69080132, 63090858, 57633898, 53476746, 48672428, 44079412, 41032590, 38359479, 35795093, 34846199, 32700433, 30135462, 28286119, 26303719, 24785980, 22868686, 20863593, 20114063, 19664936, 18769961, 18501116, 17833182, 16515679, 15934360, 16284767, 16366579, 14885116, 13675876, 13787029, 12773919, 12137825, 13314623, 13770037, 13088731, 13059826, 11830483, 11221668, 12709086, 11905176, 12029691, 10663536, 10097752, 10629177, 9885740, 7879978]
5407G879978P99831p2696q69610j85942p15835P03652O31622q23434J41574J064660
5397H553800L10764q24636j178732j817722M11408R15562K61167J83116o63694
5388F151033L3488m47932n37607m38932m14370k06156j08842K77796K52660p11468
5378C849670O77556P79822o4205p71522M11742q3167k90976M14303k29228q5475
5368D608520o1307j653849l79240R3822M41040J016323j51792N52352M01970j833648
5358C034191j199129J454148j30412O36901j39403j00937m8301o5344p5703p49611
5348B616400O47738p02213j111885N08635J855134o14654j095387J54222J339399
5339C597389K70231J58919n51260r61314m12029M12410n35006Q54042K75916k53342
$$ y = [7879978, 8679809, 8607113, 7737503, 7551561, 6835726, 7539378, 8171000, 7347566, 7489140, 8553800, 8864564, 8039928, 6861196, 5043474, 5454882, 6370444, 6631611, 6814727, 6151033, 6184521, 5736589, 5198982, 4760050, 4345680, 4139524, 4030682, 4308478, 4561138, 3849670, 4527226, 5307048, 5242843, 4471321, 4883063, 4799896, 4508920, 4923223, 4693995, 4608520, 4547213, 2893364, 2514124, 2607946, 3048986, 4065309, 3913517, 4465869, 4867839, 3034191, 1835062, 3289210, 3158798, 3795699, 3656296, 3555359, 3507058, 3441714, 3366011, 2616400, 3264138, 2561925, 1450040, 1958675, 3813809, 3199155, 2103768, 2257990, 3597389, 3867620, 4026539, 3475279, 2513965, 2101936, 2514346, 1979340, 2833382, 3109298, 2855956]
5329B855956k8670p75793o8539q4721q83860J055317N73864r24980L96617p21401
5319A393790l41925J864587l52073k15852M28993L44139j564837J088062Q04198
5310C449082q8924n70404m4146J399532o2591j042798N1649K91836j179476N77554
5300B781314j74418k61922N12235J397410m42366n97747O00129m75409o12541
5291B726685J378470N80023q40377q04000O27657M42839j44636J18846L41605
5282D427112k29401K58401J43415L4136P63829J60808k15106P38648j081252R17943
5272E918533J426617m82696Q0284P47667J04657j12866j78009j56679l15390N8263
5262G090381l60466M33523P37684J227400k2299o26297J22744P85835O44390q80554
$$ y = [2855956, 2827286, 2051493, 1982954, 1898233, 1014373, 2069690, 2643554, 1718574, 2115191, 1393790, 1051865, 2916452, 2564379, 2348527, 2777520, 3121659, 1556822, 2644884, 3449082, 3360158, 2789754, 2745608, 4145140, 4082549, 3039751, 3091400, 3383236, 2203760, 2781314, 2606896, 2344974, 2857209, 4254619, 3812253, 3214506, 3814635, 3339226, 2726685, 4105155, 4685178, 3844801, 3040801, 3668458, 4111297, 3966661, 4085507, 4427112, 4197711, 4456112, 4599527, 4633663, 5397492, 5558300, 5343194, 6081842, 5000590, 5918533, 7345150, 6862454, 6942738, 7690405, 7795062, 7682196, 7504187, 7347508, 7032118, 7090381, 6729915, 7163438, 7901122, 9128522, 9106223, 8479926, 8602670, 9388505, 10032895, 9152341]
5252I152341K94947J29691N44626O37638L49552R04394r8887k18260m7143r31248
5242A0717651j29773Q06406N77245J382668l13014m99796Q23337k62671k19989
5233A2882064R24439J24285m42363O87632m58027L42422n29355j54944k15801
5224A3160352j44743l7473K02354J107117J749473n63037j396269P50456l16151
5215A4512079l29719M95531P31771J439257k069736q92801M90737l53843R03636
5206A4926912J128991l17481k50543o80470M6402o10639p52755J296098j82906
5197A4603609R01173n70671Q68715j065563R33002o40741q23593Q11706l73203
5188A4644434N03718j094162p62343k63095J81997q20027R17551k70806j609684
$$ y = [9152341, 9447288, 9576979, 10121605, 10759243, 11108795, 12013189, 11914302, 11696042, 11648899, 10717651, 10587878, 11394284, 11971529, 13354197, 13041183, 12541387, 13364724, 13102053, 12882064, 13806503, 13930788, 13488425, 14176057, 13718030, 14060452, 13531097, 13376153, 13160352, 13015609, 12978136, 13180490, 14287607, 16037080, 15474043, 14077774, 14828230, 14512079, 14182360, 14677891, 15409662, 16848919, 14779183, 13886382, 14377119, 14023276, 14926912, 16055903, 15738422, 15487879, 14807409, 14853811, 14243172, 13490417, 14786515, 14603609, 15504782, 14934111, 15802826, 14737263, 15670265, 15029524, 14205931, 15017637, 14644434, 15148152, 14053990, 13291647, 13028552, 13210549, 12390522, 13308073, 13037267, 11427583]
5179A1427583j85650J197991j11394j298188l40565j01621O31220l50235k33692
5170A0635449N80692K35115q31586m3524N40279j7650j131716P36955O30447o87949
5160A0646512j67236o71981M96641J25906p7858m65332J08547P21997j57309q37522
5150I722365n44460J62343m17460l53973N09663k66761m86012q17080J206351
5141H714976L93461n41589K54323j61345Q12753l46710j013276m22582q06930
5132F883081K10150J423420p55627j117538K17221M04180R55685m02949j200811
5123F616812M63223J4970J82418L99073n82923L87665J93478o64421R04222K466636
5113A0381153j258055j062181M50319K29019j16756m41622m78087k85518M48313
$$ y = [11427583, 11241933, 12439924, 12328530, 11030342, 10689777, 10588156, 11219376, 10869141, 10635449, 11216141, 11451256, 10619670, 10576146, 11116425, 11098775, 9967059, 10704014, 11334461, 10646512, 10479276, 9807295, 10303936, 10429842, 10351984, 9886652, 9995199, 10717196, 10559887, 9722365, 9177905, 9340248, 8922788, 8568815, 9078478, 8811717, 8325705, 7508625, 8714976, 9108437, 8566848, 8821171, 8659826, 9472579, 9125869, 8112593, 7690011, 6883081, 7093231, 8516651, 7761024, 6643486, 6860707, 7264887, 8220572, 7817623, 6616812, 7080035, 7095005, 7277423, 7676496, 7093573, 7481238, 7674716, 7010295, 7914517, 10381153, 9123098, 8060917, 8511236, 8740255, 8623499, 8181877, 7703790, 7418272, 7866585]
5104G866585K66796M09157j886914n95451K13108K339661m13915j076611J82941
5095G305357k41694O18969o31771o11264J03982m8972J81555O68587k08697l05970
5085F830082l49775J25908R47327N35393j255700R89779k45773n03617j20472
5076F953152L34451l52170r15622n98773r3192N2179R15891J038421P6891r5713
5066G315515n17613J36319q56623q51866Q42697L01671m41897l40319J032610
5057F620494p77088M68370J177437p29788p22150M32944j239830k1848J004026
5048F212567K62977j20326N00880j39292j212211L56951J8168l00106o20254j14923
5038D844431J376869J942525j061561m13061o76590m40983Q9992j96476j26784
$$ y = [7866585, 8133381, 8542538, 6655624, 6060173, 6273281, 8612942, 8199027, 7122416, 7305357, 7063663, 7682632, 7050861, 6439597, 6543579, 6494607, 6676162, 7344749, 7136052, 6830082, 6480307, 6606215, 7553542, 8088935, 6833235, 7823014, 7577241, 7073624, 6953152, 7287603, 6935433, 6019811, 5421038, 5327846, 5380025, 6295916, 7334337, 7411228, 7315515, 6797902, 6934221, 6077598, 5225732, 6068429, 6370100, 5928203, 5587884, 6620494, 5843406, 6311776, 7489213, 6759425, 6037275, 6470219, 5230389, 5208541, 6212567, 6475544, 6355218, 6856098, 6716806, 5504595, 5861546, 5879714, 5579608, 4959354, 4844431, 6221300, 8163825, 7102264, 6689203, 6012613, 5571630, 5661622, 5465146, 5338362]
5029E338362Q81375j208433Q57435q01777P92372p06640O18948l82586j340111
5020D048945K483289p6074j776163M60445N01328m97309o34943j023309Q91923
5011D378132J569461J062349L43656j276736j156465L6112L97936o35781j84021
5002D534643O69345j39997k71448k75399n87900L57785L56784j057574k68436
4993C317803r86472R18852J384556k45366N82948J33406j066698n87868j363625
4984B087536p6238n57649P44387J352810Q64995k74328k23179k67325K36670R0597
4974C978276j1235k2481m50853k98454N65965L56343n22383m88691j07884p77255
4964B221348J328655P78382r67447k20627P47239m24731N4638P40149p62851N95000
$$ y = [5338362, 6219737, 5011304, 5868739, 5066962, 5859334, 5152694, 5771642, 5389056, 4048945, 6532234, 6456160, 4679997, 5140442, 5641770, 5144461, 4509518, 3486209, 4378132, 5947593, 7009942, 7353598, 6076862, 4920397, 4956509, 5354445, 4718664, 4534643, 5203988, 5063991, 4792543, 4517144, 3929244, 4287029, 4643813, 3586239, 3317803, 2331331, 3250183, 4634739, 4389373, 4972321, 5105727, 4039029, 3451161, 2087536, 2011298, 1453649, 2198036, 3550846, 4415841, 4141513, 3918334, 3651009, 3887679, 3978276, 3967041, 3944560, 3493707, 3195253, 3761218, 4117561, 3595178, 3106487, 2998603, 2221348, 3550003, 4328385, 3360938, 3140311, 3887550, 3462819, 3517457, 4257606, 3494755, 4089755]
4954D089755j219837n52120Q69451R00682j011949l23154o0484Q24161K44801
4945C761306Q08441N26008j83256j133168j398079J401828q28940J006645j16878
4936C843907r28654O59388Q24982m28591P59578N28060O8716j457954j39919L85202
4926D114715q33508Q65766R17671p51806j94269P10673l2594J0683J44902J173288
4916F125521M96183n4884K71288N67461N07710j30123N65594Q28684n16365N30197
4906I191266k7811n25438q23002n79594Q0403l01138P15532L34027n83229J51265
4896G632281m17759p50028r7272J28531L80462K50138M55057J241596l76708o8357
4886H377941K87631o56944Q71903o1079n64895M00156N92277M93369o04623J081000
$$ y = [4089755, 2869918, 2317798, 3187249, 4087931, 3075982, 2752828, 2692344, 3516505, 3761306, 4569747, 5095755, 4912499, 3779331, 2381252, 3783080, 2954140, 3960785, 3843907, 2915253, 3574641, 4399623, 3971032, 4730610, 5258670, 5327386, 3869432, 3729513, 4114715, 3281207, 4146973, 5064644, 4312838, 4118569, 4829242, 4796648, 4807331, 4952233, 6125521, 6621704, 6566820, 6838108, 7405569, 7913279, 7783156, 8348750, 9177434, 8661069, 9191266, 9163455, 8638017, 7815015, 7235421, 7315824, 7014686, 7730218, 8064245, 7481016, 7632281, 7214522, 6464494, 6367222, 6495753, 6876215, 7126353, 7581410, 8823006, 8446298, 8377941, 8665572, 8008628, 8880531, 8819452, 8254557, 8654713, 9246990, 9740359, 9135736, 10216736]
4876A0216736P49127q54488O53175M66464q01502N66724k24259L77928O71797
4867A1821702P58649k68180L01851J468958k53488k64914J032805O93332K427954
4858A7718669n47504k78028P20235J244829N47072N4117M21172L33471K189730
4849B2403763M62989M06750J401979J326913J217577J340591J979864K121417
4841C2661843J661409K241514P63152J589317L022252K005849J464845L568199
4833D8978380K756347L129804K793421K383386K767717L010821L354019L121580
4825G2295475K662995L358065K236704J632649K284259L055410L570218L158184
4817I4253959K485159O22802N40640J88754Q08548n01066k272218k043266n057532
$$ y = [10216736, 10965863, 10111375, 10764550, 11231014, 10429512, 10996236, 10771977, 11149905, 11821702, 12580351, 12312171, 12614022, 14082980, 13829492, 13564578, 14597383, 15290715, 17718669, 17171165, 16893137, 17613372, 18858201, 19405273, 19459390, 19880562, 20214033, 22403763, 22866752, 23273502, 24675481, 26002394, 27219971, 28560562, 30540426, 32661843, 34323252, 36564766, 37327918, 38917235, 41939487, 43945336, 45410181, 48978380, 51734727, 54864531, 57657952, 60041338, 62809055, 65819876, 69173895, 72295475, 74958470, 78316535, 80553239, 82185888, 84470147, 87525557, 91095775, 94253959, 96739118, 97361920, 97902560, 98091314, 98899862, 98398796, 96126578, 94083312, 89025780]
4808H9025780l580754l710446n925332m120583m150060m407909m812015l995408
4800E4323273j558889k886018k543674l398010j814050j088235k436576k171140
4792C6426681j577791j043182j823340l81991j99303n82978k697154j347591j397404
4783B5375947p7157p74024j156402p27966m64740m75883j060089N38418q29735
4774B0348369j122969o35053l29601N84493j713538m70659j92603n75710j825572
4765A4067157m46899M74935n47462J33353o77590M2649j006267P37698n34466
4756A2243108m94335K36907M05218L88997j58572o69660n98651p21528o26166
4747A0005318r35545J002926o15420m91829o11219l273O70096l90019O81288k16760
$$ y = [89025780, 85445026, 81734580, 75809248, 71688665, 67538605, 63130696, 58318681, 54323273, 52764384, 49878366, 47334692, 43936682, 42122632, 41034397, 38597821, 36426681, 34848890, 33805708, 31982368, 31600377, 31401074, 30818096, 28120942, 26773351, 25375947, 25298790, 24524766, 23368364, 22640398, 22175658, 21699775, 20639686, 21178104, 20348369, 19225400, 18590347, 18260746, 18845239, 17131701, 16661042, 16468439, 15892729, 14067157, 13620258, 14095193, 13547731, 13681084, 13003494, 13046143, 12039876, 12777574, 12243108, 11748773, 11985680, 12390898, 12779895, 12621323, 11951663, 11353012, 10631484, 10005318, 9069773, 10072699, 9457279, 8965450, 8354231, 8350958, 9021054, 8631035, 9312323, 9095563]
4737I095563o70084K76444n4539m47722Q24493P3854J82118j249855Q14753n31507
4727H313518J01437l37003o57877M18567l54153k17325L18100n07470j29252P32002
4717G680544q52924j242413m91484J149684p65908J259797R48770J5730q12836
4708F888960j225808P80758j072R66770k69029l38885M85279j065977m08409O6144
4698E878731o85999m17072N37478J12697O25009j091524K85054L73999n81873
4689E036500N70827O67573R7148l24544m68385l58535L87474r3298o28721M84867
4679E370906m26352K21893K18505l16445Q40343J6285j719788q85490J515335
4670D835192J624413m91527j125955K181674j107789M9936j037609q88147O88205
$$ y = [9095563, 8425479, 8701923, 8647384, 8199662, 9024155, 9098009, 9280127, 8030272, 8845025, 8313518, 8414955, 8077952, 7420075, 7838642, 7484489, 7267164, 7585264, 7077794, 6948542, 7680544, 6827620, 5585207, 5093723, 6243407, 5477499, 6737296, 7686066, 7701796, 6888960, 5663152, 6443910, 6442838, 7409608, 7140579, 6801694, 7286973, 6220996, 5812587, 5878731, 5192732, 4775660, 5313138, 5425835, 6050844, 4959320, 5244374, 5618373, 5036500, 5607327, 6274900, 6372048, 6047504, 5579119, 5220584, 5608058, 5514760, 4886039, 5370906, 4944554, 5166447, 5384952, 5068507, 5908850, 5925135, 4205347, 3319857, 4835192, 6459605, 5968078, 4842123, 7023797, 5916008, 5965944, 4928335, 4040188, 4728393]
4661D728393o02113r86949K67565J544184J95854m22669m86673q69543j36880
4652C231169J219377n34011N12464P20524m73300j08722k44342j511452J50341
4643B962048L1172j15744J42569J22007K66202O41264k27176r72102q60371K0633
4633B010502M77708N44742j206844o81916J032106J229887R52025j340606l94768
4624B622836n11715l58861J80242Q40075N33809j142929j019409J370394O5792
4615B580234j073498n16526J026015R5081p11810N50345O00387k75812j113135
4606A161281J08918j68696j389739M83442P51015m75956L50289L47959j38728
4597A029785q4266Q80126J588181j168345j188055M90707M42795q18333J53884
$$ y = [4728393, 4126280, 3139331, 3406896, 4951080, 5146934, 4724265, 4237592, 3368049, 3231169, 4450546, 3916535, 4428999, 5149523, 4676223, 4567501, 4323159, 2811707, 2962048, 2993220, 2877476, 3020045, 3142052, 3408254, 4049518, 3822342, 2850240, 1989869, 2010502, 2488210, 3032952, 1826108, 1144192, 2176298, 3406185, 4358210, 3017604, 2622836, 2111121, 1752260, 1932502, 2772577, 3306386, 2163457, 1144048, 2514442, 2580234, 1506736, 990210, 2016225, 2111306, 1399496, 1949841, 2550228, 2274416, 1161281, 1270199, 1101503, -288236, 195206, 946221, 470265, 820554, 1168513, 1029785, 945519, 1825645, 3413826, 2245481, 1057426, 1548133, 1990928, 1172595, 1326479]
4588A326479j89427K01077o35566k02264P50659O09922j227716n99623k19188
4579a85647R19500K76346k49912j21668q04974J295689j75223M52293m35591J83553
4569A154366m35677O27583r333m61360L57681J324919n48575r54708Q49770J58994
4559B063660l61791j005495J90560o40960P36118Q06989j74682n4940K3603J006896
4549B589958K42517q39862r11260M14904q16430K74223j09825o45036l73964J53197
4539b1578J47694K31158J430830p4292k14037m99217J17889L01375j22083j87976
4529A109763J76484L24951J55539L97985j91287Q19666K27557j018681n40200
4520A461777q48697k99042N19537J483885l24422n16908L22698r11665j33695
$$ y = [1326479, 1137052, 1338129, 702563, 500299, 1250958, 1860880, 633164, 33541, -185647, 733853, 1010199, 760287, 638619, -166355, 1129334, 954111, 1406404, 970813, 1154366, 718689, 1346272, 1336939, 875579, 1233260, 2558179, 2009604, 1054896, 1904666, 2063660, 1701869, 696374, 886934, 245974, 982092, 1789081, 1614399, 1559459, 1583062, 2589958, 2832475, 1992613, 1081353, 1496257, 679827, 954050, 844225, 199189, -174775, -21578, 126116, 357274, 1788104, 1713812, 1499775, 1000558, 1118447, 1419822, 1297739, 1109763, 1286247, 1611198, 1766737, 2164722, 1973435, 2793101, 3020658, 2001977, 1461777, 613080, 314038, 833575, 2317460, 1993038, 1476130, 1798828, 887163, 753468]
4511G53468K00812n0140r0696N4396m25794J231248P26604j54886m09908L80974
4501B216078M87602n4282J40181O61292j567748R0244j28630m3181L74221P16966
4491B892743N70517Q7151j79931N38765m23596j7966m50777n93166Q49079p9391
4481C193428P35935N62372r03851N01136p77673L7860L53157P8513k50592j146472
4471B383813J648316q50857j477551M85679J475346m57301L38285j281959N18330
4462B782101N55831m27250o40938j449176N65999K62531m17074M00619o96181
4453I36462j31943K61279j87630j93901J940417K00188k66334K60087q47706p93641
4443A177278L82524N42728O73063J184709m6475r21860j679111N63676J314617
$$ y = [753468, 954280, 904140, 813444, 867840, 442046, 1673294, 2399898, 2245012, 1835104, 2216078, 2703680, 2649398, 2789579, 3450871, 1883123, 1973367, 1844737, 1801556, 2175777, 2892743, 3463260, 3550411, 3370480, 3909245, 3485649, 3467683, 3016906, 2423740, 3272819, 3193428, 3929363, 4491735, 3587884, 4089020, 3311347, 3349207, 3702364, 3780877, 3530285, 2383813, 4032129, 3181272, 1703721, 2189400, 3664746, 3207445, 3545730, 2263771, 2782101, 3337932, 2910682, 2269744, 820568, 1386567, 1649098, 1232024, 1632643, 936462, 804519, 1065798, 878168, 684267, 2624684, 2824872, 2558538, 2818625, 1970919, 1177278, 1559802, 2102530, 2775593, 3960302, 3913827, 2991967, 1312856, 1876532, 3191149]
4434C191149o08377j325403L27313M08907l27635m66954r60122Q70614J09312
4425A218804q69487J387579L65738q38144N20091o86115L18158R57605R56542
4416C330771q7541q14559q66302j83140Q46057R74422J39406J29611M82301j052965
4406B898061p93606M25270J812254p61790m49594j84441P1258N45909n67034P05737
4396C702024j18413j38564p86017R54278n45440l42857Q356o47514O57892K023957
4386D767702O6790j593191L02393L48434N39239j386752q77711O16448j10471
4377B672881O46717O9172j570968r22527O41789o4493o41468R7062J92568J218807
4367B339540J370446K12518r8752J68671j61901r92266n40694Q05349p09p40545
$$ y = [3191149, 2582772, 1257369, 1584682, 1993589, 1665954, 1199000, 238878, 1109492, 1218804, 349317, 1736896, 2102634, 1264490, 1784581, 1098466, 1416624, 2374229, 3330771, 3243230, 2428671, 1562369, 1379229, 2225286, 3199708, 3339114, 3468725, 3951026, 2898061, 2104455, 2529725, 4341979, 3580189, 3130595, 2946154, 3017412, 3563321, 2996287, 3702024, 3583611, 3445047, 2659030, 3613308, 3067868, 2725011, 2733367, 2085853, 2743745, 4767702, 4834492, 3241301, 3543694, 3892128, 4431367, 3044615, 2166904, 2783352, 2672881, 3319598, 3388770, 1817802, 895275, 1537064, 1472571, 831103, 928165, 1120733, 2339540, 3709986, 3922504, 3823752, 3992423, 3830522, 2838256, 2297562, 3102911, 3102202, 2361657]
4357B361657n97138J820132N80258j24651q24323p01440l5967j99891R48500j089524
4347B137613k24842J354637J4219L02422m63511j50748r26031K48891J60851j039157
4337A414344O94280K41198J423186j353308Q52363J489121p72731L99812O3O7717
4327D456045J9969p85127j168850Q98667Q29722N86345K72436j014929o80951
4318C413327r68842P0484O66502n91639J11667R08252m14125k84219l47401m31555
4308B132451J438258q71222q62124O68960R33571o19003O08641o34531o58700
4299B136301M2177P59732k6482n6989l70638Q61919n5220p10363M88131M47404
4289C515972k01325N22280L33689n66173j12044m58138M0557n03222l59792Q70442
$$ y = [2361657, 1764519, 3584651, 4164909, 4040258, 3215935, 2514495, 2478528, 2278637, 3227137, 2137613, 1912771, 3267408, 3281627, 3584049, 3120538, 2969790, 2043759, 2292650, 2453501, 1414344, 2108624, 2349822, 3773008, 2419700, 3272063, 4761184, 3988453, 4388265, 4388328, 4456045, 4476014, 3690887, 2522037, 3420704, 4250426, 4836771, 5109207, 4094278, 3413327, 2444485, 2514969, 3181471, 2589832, 2701499, 3609751, 3195626, 2911407, 2564006, 2132451, 3570709, 2699487, 1837363, 2506323, 3439894, 2820891, 3429532, 2795001, 2136301, 2178478, 2938210, 2911728, 2854739, 2484101, 3346020, 3290800, 2580437, 3068568, 3515972, 3314647, 3836927, 4170616, 3604443, 3492399, 3034261, 3074818, 2571596, 2211804, 3082246]
4279C082246p05840R4129o0083R76823J48137l30246N58015l95741j79517R2719
4269C280642j37932J826078n57702J02456j17292p15148K38450j152335m85060
4260B282157m69544O31657m30140R99845j104474N95888M76952j55359m19166
4251B407816r57233O76455J081993K1005n68551r62521J88972j73530O11244m78784
4241A846866j20286j97277r90615m24960K664416J262551p37719l61437L94785
4232C336324j61281L65462K59673M39731M26858j036112J75115O70153j704208
4223B771715n97720N73031L67306Q24549L83966j180933n09947l03148j58827
4214B169992Q24985j019768m78760J547733J18344j475325K26524Q33622L33112
$$ y = [3082246, 2376406, 2470535, 2410452, 3387275, 3535412, 3205166, 3763181, 3367440, 3187923, 3280642, 3142710, 4968788, 4411086, 4513542, 4396250, 3681102, 3919552, 2767217, 2282157, 1812613, 2444270, 2014130, 3013975, 1909501, 2505389, 2982341, 2826982, 2407816, 1450583, 2127038, 3209031, 3230036, 2661485, 1698964, 1887936, 1714406, 2325650, 1846866, 1726580, 1529303, 538688, 113728, 2778144, 4040695, 3302976, 2941539, 3336324, 3175043, 3540505, 3800178, 4239909, 4666767, 3630655, 3805770, 4475923, 2771715, 2173995, 2747026, 3114332, 3938881, 4322847, 3141914, 2631967, 2328819, 2169992, 2994977, 1975209, 1496449, 3044182, 3162526, 1687201, 1913725, 2747347, 3080459]
4205C080459r78246l01980K90127K21203J385308j44360K37339N79815n01764
4196C867901j15535J26524P9003L32288M20709j522350q85517o26310L74665M37553
4186B488931R6640K77435L05861M10900n81340n85777J08659P8932n38205K07468
4176B269504m36893K09754n22910J219505J60091j23516P20976L24559J263992
4167E085062o29608p78288Q1235J023142p29526n41839m26725O82619N02101k56095
4157D012078O35607n30077N85648j54568P68945l31669M25129r6803o93245l36279
4147D284766J148606R60782L64084J10686L5428J351765p65263j1194l78857m76098
4137F624705L97675K57175n87579J217974O04600L67216j56898k33221p28119
$$ y = [3080459, 2102213, 1800233, 2090360, 2311563, 3696871, 3552511, 3789850, 4369665, 3867901, 3752366, 3878890, 3957893, 4290181, 4710890, 3188540, 2303023, 1676713, 2051378, 2488931, 2585571, 2863006, 3168867, 3579767, 2998427, 2412650, 2521309, 2600241, 2062036, 2269504, 1832611, 2042365, 1519455, 2738960, 2899051, 2775535, 3496511, 3821070, 5085062, 4455454, 3677166, 3758401, 4781543, 4052017, 3510178, 3083453, 3766072, 4268173, 4012078, 4647685, 4117608, 4703256, 4548688, 5317633, 4985964, 5411093, 5314290, 4621045, 4284766, 5433372, 6394154, 6758238, 6868924, 6904352, 8256117, 7490854, 7479660, 7100803, 6624705, 7022380, 7279555, 6691976, 7909950, 8514550, 8881766, 8724868, 8491647, 7763528]
4128G763528L97481Q26729l40944j074127K63502l07341o19777l14476J794175
4119H388750j341434j195978J06574O1667p79943L20902L77549j16888m65176
4110E356023J67235l21773q75175m07801J112902J280401K17934J75697j388884
4101E316559m00472O85345J123296o8150O3128k55680M19821l86170o28380o02238
4091E267059k64804R68709K81529K49803M51738P17420l95051l00803K7625l62979
4081F640246j80523J221152L55615o0798N65523j64656p58953K44044l66179L46132
4071G841603M02841q23361O81243n21486L24949L95328N48331k99149N15128K11367
4061I276794j62803n1962L48082l18595p72691K08005P343k85873Q22411n4695
$$ y = [7763528, 8161009, 8987738, 8646794, 7572667, 7836169, 7528828, 6909051, 6594575, 8388750, 7047316, 5851338, 5957912, 6019579, 5239636, 5560538, 5938087, 5821199, 5356023, 5523258, 5201485, 4326310, 3918509, 5031411, 6311812, 6529746, 6705443, 5316559, 4916087, 5601432, 6724728, 6656578, 6719706, 6464026, 6883847, 6497677, 5869297, 5267059, 5002255, 5970964, 6252493, 6502296, 6954034, 7671454, 7276403, 6975600, 7003225, 6640246, 6459723, 7680875, 8036490, 7975692, 8541215, 8376559, 7617606, 7861650, 7495471, 7841603, 8244444, 7421083, 8102326, 7580840, 7905789, 8301117, 8849448, 8550299, 9065427, 9276794, 9113991, 9062029, 9410111, 9091516, 8318825, 8526830, 8534173, 8248300, 9070711, 9016016]
4051I016016J21941k70790M7133N1226K99976l27569J44742Q7929J59955L32825
4041I663384j167248L56831N60159r99344r07876J453909n50289o17412J227339
4032I019453O00906o6424j301093p03757R99186J431076j09596n8909j426601
4023H384241j020272K031557N58095q77759p1804N36579l82852J061176M92824
4014A0711785q62201M20987k74401L26528n03634J55953J60783J55228Q5689J35559
4004A0512276o72189J84546n69305n82188R98954J9926J298487L53830N33279
3995A2077616M47217j106065K32015O58436j84851J23958l1475O65324Q0309o5967
3985A2896517J514604m87042o20644L30822J728531o66180j79581K018393k10132
$$ y = [9016016, 9137957, 8867167, 8914300, 8965526, 9265502, 8937933, 9082675, 9170604, 9330559, 9663384, 8496136, 8852967, 9413126, 8413782, 7505906, 8959815, 8409526, 7792114, 9019453, 9620359, 9553935, 8252842, 7549085, 8548271, 9979347, 9869751, 9810842, 8384241, 7363969, 9395526, 9953621, 9075862, 9004058, 9540637, 9157785, 10218961, 10711785, 9849584, 10270571, 9996170, 10322698, 9819064, 9975017, 10135800, 10291028, 10376717, 10512276, 9840087, 10024633, 9455328, 8873140, 9872094, 9892020, 11190507, 11544337, 12077616, 12524833, 11418768, 11650783, 12309219, 12124368, 12248326, 12216851, 12882175, 12962484, 12896517, 14411121, 13924079, 13303435, 13634257, 15362788, 14696608, 14517027, 16535420, 16325288]
3976A6325288k42607o32447o73161O91196J547939R06534O74465q16043o16216
3967A7164948R8811J174298J332680O74013l90254K31881Q15186L12999J016440
3958B2431002O6100j042201o9629J690756O64982Q5837O61061M44170j228566
3949B3703512R11066K051204r53576n02905K82344n59329q5326o36808K39126
3940B4449308P05001J98830p0173p67771Q00274j062041m09500P82628J299010
3931B5925566J36453p53108J31997K76872R22008n07219j249397J289439M80892
3922B6653503m58138K34897L72294R23774Q17592N13743M94247k58892O93192
3913B9986212j0948J037306R69988j71036J518886k05804J386292J217160J033359
$$ y = [16325288, 16082681, 15450234, 14777073, 15468269, 17016208, 17922742, 18597207, 17781164, 17164948, 17263759, 18438057, 19770737, 20444750, 20054496, 20286377, 21101563, 21414562, 22431002, 22497102, 21454901, 21385272, 23076028, 23741010, 23826847, 24487908, 24932078, 23703512, 24614578, 26665782, 25712206, 25209301, 25491645, 24932316, 24846990, 24210182, 24449308, 25154309, 25353139, 25282966, 24515195, 25315469, 24253428, 23843928, 24626556, 25925566, 26062019, 25308911, 25440908, 25717780, 26639788, 26132569, 24883172, 26172611, 26653503, 26195365, 26430262, 26802556, 27726330, 28543922, 29057665, 29551912, 29293020, 29986212, 29975264, 31012570, 31982558, 31811522, 33330408, 33124604, 34510896, 35728056, 36761415]
3904C6761415l33664q69050J255846K471311k83305j749109J924993R12192j21402
3895C9969227m04774m64684N83906J618214R92744L09628q44656J73274k1019
3886D1911860N35477P52129k82332r40318k06276R77316j80605P4631j160601
3877D1481281j057803J383588j01594J65269J279705o49342j023327q71977N16549
3868D1122349N67916L26144j76265R64661O08882p0259L3839K473694J50115M50175
3858D6451251M34313q77734J109511J395832J213107K57785J546776O68217K054008
3849E4253066J258922J745770J959993J860398K216400K240766J177511J929238
3841F8642064Q03274L347822L090633K915579L621513J787814L241020L363804
$$ y = [36761415, 36427751, 35558701, 36814547, 39285858, 39002553, 37253444, 39178437, 40090629, 39969227, 39564453, 39099769, 39683675, 41301889, 42294633, 42604261, 41759605, 41932879, 41911860, 42447337, 43199466, 42917134, 41976816, 41770540, 42747856, 42567251, 42641882, 41481281, 40423478, 41807066, 41705472, 41870741, 43150446, 42501104, 41477777, 40605800, 41122349, 41690265, 42016409, 41840144, 42804805, 43413687, 43343428, 43377267, 45850961, 46001076, 46451251, 46885564, 46007830, 47117341, 48513173, 49726280, 49984065, 51530841, 52199058, 54253066, 55511988, 57257758, 59217751, 61078149, 63294549, 65535315, 66712826, 68642064, 69445338, 72793160, 75883793, 78799372, 82420885, 84208699, 87449719, 90813523]
3833I0813523M744166M997397N741917P945053O841828P478104R314291J1495688
3825A49371967J2670207J4211282J9651830K5113451L0591212L3792134L7516746
3818C22918829L7417382L1721776K0883474J203515j8971876l7226063m5550450
3811C12396587m5270106l6556708k7521433j9712942j4174423j1072182r042179
3804A49046614q102840o664949p145761n429642n120217l989053j678459l54754
3796A10560939j673395m66846j489491k126048M05667Q79743K97886m24397L07233
3787A06271291J104394j000677J238069K79693P30543J559030J692492J886480
3779A13761315K368404J404391L978225K133687K142574L150739L480803K886777
$$ y = [90813523, 95557689, 100555086, 106297003, 114242056, 121083884, 128561988, 137876279, 149371967, 162042174, 176253456, 195905286, 221018737, 251609949, 285402083, 322918829, 360336211, 392057987, 412941461, 414144976, 395173100, 357947037, 312396587, 267126481, 230569773, 203048340, 183335398, 169160975, 158088793, 149046614, 140943774, 134278825, 127133064, 121703422, 116583205, 112594152, 110915693, 110560939, 108887544, 108420698, 106931207, 104805159, 105210826, 106090569, 106388455, 105964058, 106271291, 107375685, 106375008, 107613077, 107892770, 108623313, 110182343, 111874835, 113761315, 116129719, 117534110, 121512335, 123646022, 125788596, 128939335, 132420138, 135306915]
3771A35306915L629293M714530M283283M193858M590642M688682M914047N353791
3763A71675041M273643N500081N716573O039112P052072Q082432R099461J1548662
3755B28987077J5055738J7101878K2014868K8192457L1627834L5815222L9622136
3748D18417210L5890724K9880872J4230247k095118j8136809l1703465l9847642
3741D06636019m2901632l8163543k9299213k3819725j9330185j4495180j1957127
3734B26669414r416678q947165n741009o433353o736190n161797l178875m448753
3726A76605594l669542l590916m517453l707819k731192m328455k126685j134990
3718A50798542k148361k770937k538732k629765j116541o06716j284022r29063
$$ y = [135306915, 138936208, 143650738, 147934021, 152127879, 156718521, 161407203, 166321250, 171675041, 175948684, 181448765, 187165338, 193204450, 200256522, 208338954, 217438415, 228987077, 244042815, 261144693, 283159561, 311352018, 342979852, 378795074, 418417210, 454307934, 484188806, 498419053, 496323935, 478187126, 446483661, 406636019, 363734387, 325570844, 296271631, 272451906, 253121721, 238626541, 226669414, 217252736, 208305571, 202564562, 196131209, 189395019, 184233222, 181054347, 176605594, 172936052, 169345136, 164827683, 161119864, 158388672, 154060217, 151933532, 150798542, 148650181, 145879244, 143340512, 140710747, 139594206, 138987490, 137703468, 136774405]
3710A36774405n9677l21087L85892Q80502N96001l5219Q4204L40713N46302k25624
3700A38966412K59101K54840j087382j022081k80366l96389p24834j875848j401649
3691A32691804j903993j310545j154763k079102k306239r87732o95127j044414
3683A21209889j694382n12037m57318o91226k318801j294481J050663n90457q38722
3674A13863128j899984r64560m20290j161658j209076j576939j032650j786614
3666A03811357k779062j946790j6402j183520k704372j272253r85395k544155
3658I0379408j431512l35241k188702j652614n00922p01236j608020j947190J9974
3649H0033945r21764q93575J103798r07631k152894j588857q59195K32226k50612
$$ y = [136774405, 136714728, 136393641, 136779533, 137660035, 138256036, 138220817, 138305021, 138645734, 139192036, 138966412, 139225513, 139480353, 138392971, 137370890, 137090524, 136694135, 135969301, 134093453, 132691804, 130787811, 129477266, 128322503, 126243401, 123937162, 122949430, 122254303, 121209889, 119515507, 119003470, 118546152, 117854926, 115536125, 114241644, 115292307, 114701850, 113863128, 111963144, 110998584, 110578294, 109416636, 108207560, 106630621, 105597971, 103811357, 101032295, 99085505, 99069103, 97885583, 95181211, 93908958, 92923563, 90379408, 88947896, 88612655, 86423953, 84771339, 84270417, 83569181, 81961161, 80013971, 80033945, 79112181, 78218606, 79322404, 78414773, 76261879, 74673022, 73813827, 74046053, 73795441]
3640G3795441k26175j652360j070357j367776j293581K1592q94930k001341k60927
3631F5049586j243724o63999p84298j508905k67307j551602P3162j551301R62086
3622E8513698l8732P92750j743541n70665M16882j045062m39834J55054p06665
3613E5333885M71055M20322O5997l7617q00864r68276p95970N73082n90084j000273
3603E2671257j200375N2912J359578r60172k016175k35034p54076j237229Q17971
3594D8498657j417074j02148O6003n49514k84932l23772l33265J30962J6724j011356
3584D4690285q09395N68353l61369l66176J54768o62491k40287k00736j65920
3575D2607032r62005k27771j83354K851O10695l48920p57390r03708j003939J310509
$$ y = [73795441, 73569266, 71916906, 70846549, 69478773, 68185192, 68206784, 67311854, 65310513, 65049586, 63805862, 63141863, 62357565, 60848660, 60581353, 59029751, 59102913, 57551612, 58513698, 58474966, 59267716, 57524175, 56953510, 57370392, 56325330, 55885496, 56040550, 55333885, 55804940, 56225262, 56291259, 56253642, 55452778, 54484502, 53688532, 54261614, 53671530, 52671257, 51470882, 51523794, 52883372, 51923200, 49907025, 49671991, 48917915, 47680686, 48498657, 47081583, 46979435, 47045438, 46495924, 46210992, 45887220, 45553955, 45684917, 45701641, 44690285, 43880890, 44449243, 44087874, 43721698, 43876466, 43213975, 42973688, 42772952, 42607032, 41645027, 41417256, 41233902, 41236753, 41847448, 41498528, 40741138, 39837430, 38833491, 40144000]
3565D0144000J08899M17957R24954K3597j249978M64082M66342o32237j265686
3556C9401930N67118j93125k87580N55855n32065m83159k44537K48189R0713j58383
3546C8964956n48088N97902N03483j130M66458l38318j283398M01845Q5695o28005
3536C8221400J43567J28705j537253J26549r364N54940R22887n42388l38012M23737
3526C8094768j73847j405104L02942P12232k62340m42647N33054p22957K33261
3517C6869362K18189m94131N63623K50721J87850K18731k73537Q41792J420056
3508C9802656j00701n94650M19599N30476j21453K32360j117427q11147Q99010
3499C9138723Q91635Q88171k238304M47335K54691q69351m62376J273788m51040
$$ y = [40144000, 40252899, 40670856, 41595810, 41619407, 40369429, 40833511, 41299853, 40667616, 39401930, 39969048, 39775923, 39488343, 40044198, 39512133, 39028974, 38784437, 39032626, 39123339, 38964956, 38416868, 39014770, 39518253, 39517123, 39983581, 39645263, 38361865, 38763710, 38849405, 38221400, 38364967, 38493672, 36956419, 37082968, 37073604, 37628544, 38551431, 38009043, 37671031, 38094768, 37920921, 36515817, 36818759, 37530991, 37268651, 36826004, 37359058, 36636101, 36869362, 37087551, 36593420, 37157043, 37407764, 37595614, 37814345, 37540808, 38382600, 39802656, 39701955, 39107305, 39526904, 40057380, 39935927, 40168287, 39050860, 38239713, 39138723, 40030358, 40918529, 38680225, 39127560, 39382251, 38512900, 38050524, 39324312, 38873272]
3490C8873272j26070M82492J79901R6084n5059M36985l47726O44526j667178P15556
3480C9232783J03533J384082J126057n13166Q84000o77235j531384L12292J166415
3471D1487377R6147M94849q09664O50635M64459J045341J620632j02981Q5213
3462D5032008J024846r1254J06490J203179K54433Q93637Q08273J204702J961945
3453E2398259J509956L25029L59683J836957O91432R31775K085907J453802J405859
3444F2998659Q00625K951032K268550Q86792K450777L377501J850302L19756J436979
3435G9340973K729627K229690K542797L200110L458354L642162N533155N352295
3427A08029163K998025N451614N755756P345612Q750807Q222809R618550R624415
$$ y = [38873272, 38747202, 39229694, 39409595, 39505679, 39450620, 39887605, 39539879, 40184405, 38517227, 39232783, 39336316, 40720398, 41846455, 41333289, 42217289, 41540054, 40008670, 40320962, 41487377, 41583524, 42078373, 41268709, 41919344, 42383803, 43429144, 45049776, 44946795, 45032008, 46056854, 45965600, 46072090, 47275269, 47529702, 48423339, 49231612, 50436314, 52398259, 53908215, 54233244, 54592927, 56429884, 57121316, 58053091, 60138998, 61592800, 62998659, 63799284, 66750316, 69018866, 69905658, 72356435, 75733936, 77584238, 77903994, 79340973, 82070600, 84300290, 86843087, 90043197, 93501551, 97143713, 102676868, 108029163, 111027188, 116478802, 122234558, 129580170, 138330977, 146553786, 156172336, 165796751]
3419A65796751J0144050R231672Q938215P696953K060700m116514o676849p961602
3411A85113376r592149j1097910q314628p787992p819991p354689n482071o481752
3403A21182194m720339o046859o253173m727627m988603m280758l195233l061913
3395H3907689k661580k557613l020530j495614k904617j914712j342757j458203
3387F6552063r96626j045095j600677r57401j094594r59437j169102l34021n53722
3378E7841388p61837p42789J58473J79050O35967j269253r40468j68652l09958
3369E4621921M33851r15436n09609j288163j305397J112022m91654m22271m76119
3360E0759145q97950j807542k54245L43280j722066K51341N68326m76402q44902
$$ y = [165796751, 175940801, 185172473, 194110688, 201807641, 203868341, 199751827, 193074978, 185113376, 175521227, 164423317, 156108689, 148320697, 140500706, 133146017, 127663946, 121182194, 116461855, 110414996, 104161823, 99434196, 94445593, 90164835, 86969602, 83907689, 81246109, 78688496, 75667966, 74172352, 71267735, 69353023, 68010266, 66552063, 65555437, 64510342, 62909665, 61952264, 60857670, 59898233, 58729131, 58395110, 57841388, 57079551, 56336762, 56495235, 56674285, 57310252, 56040999, 55100531, 54931879, 54621921, 55055772, 54140336, 53630727, 52342564, 51037167, 52149189, 51657535, 51235264, 50759145, 49861195, 48053653, 47799408, 48142688, 46420622, 46671963, 47240289, 46763887, 45918985]
3351D5918985j94409K78088J914339l33569n65637K98605p30824n30010R9725
3342D6155293p182n43349O02787j121111j284461r1214o26163J055124R57800
3333D5097524r67657q55706p94867j006498m360j30393L85106N78222j361779
3324D0939592j641034j029459J547039j49738p56287o83416N80616J51186r95254
3315C7963245j560317l106K22667J193734K77877M01255N19992n56875J334109
3306C9792581j115512j34724J8403N26958j047457P00401J297260R45823r13549
3297D0070184m46515L15247L38141M79520j253797k04758j1082O82337l87171
3288C9582106m85308M67511k51157j52482J180950O99756j018942R52155n41500
$$ y = [45918985, 45724576, 46002664, 47917003, 47583434, 47017797, 47316402, 46585578, 46055568, 46155293, 46148111, 45604762, 46207549, 45086438, 43801977, 43710763, 43084600, 44139724, 45097524, 44129867, 43274161, 42479294, 41472796, 41468436, 41338043, 41723149, 42301371, 40939592, 39298558, 38269099, 39816138, 39666400, 38910113, 38226697, 38807313, 38958499, 37963245, 36402928, 36399822, 36622489, 37816223, 38094100, 38495355, 39015347, 38458472, 39792581, 38677069, 38542345, 38560748, 39087706, 38040249, 38740650, 40037910, 40983733, 40070184, 39623669, 39938916, 40277057, 40756577, 39502780, 39298022, 39286940, 39969277, 39582106, 39096798, 39564309, 39313152, 39160670, 40341620, 41041376, 40022434, 40974589, 40433089]
3279D0433089J58932j924r70369N12627O29538m4695M1813P22363j81402P42758
3269D2042730M34177n17443J57085K00856L20744r33863J4245J156066K55069
3260D3129666J46791K4534p9205o67017q78288N38746k64205M95902l55290K26285
3250D2317919M94303m56934P46117J355799j42192j81248M35264J087627P17871
3241D6374526q37491O76488p33563J368817P98653p45154J34810J302364P74665
3232D9114115M75500o45224l39096j129530j68182k03689j195098k9711Q27556
3223D6706641K89617p17896l2548l07228j342102K11847J514924P33221m90287
3214D6566189r37625J17977M97234J05678M74195K51101J14620O89302J055819
$$ y = [40433089, 40592021, 40590097, 39619728, 40132355, 40761893, 40717198, 40759011, 41481374, 41299972, 42042730, 42476907, 41959464, 42116549, 42317405, 42638149, 41704286, 41718531, 42874597, 43129666, 43276457, 43300991, 43221786, 42554769, 41676481, 42215227, 41951022, 42446924, 42091634, 42317919, 42812222, 42355288, 43101405, 44457204, 44315012, 44133764, 44569028, 45656655, 46374526, 45537035, 46213523, 45479960, 46848777, 47647430, 46902276, 47037086, 48339450, 49114115, 49589615, 48944391, 48605295, 47475765, 47307583, 47103894, 45908796, 45879085, 46706641, 46996258, 46278362, 46245814, 45938586, 44596484, 44808331, 46323255, 47056476, 46566189, 45628564, 45746541, 46243775, 46349453, 46823648, 47074749, 47189369, 47878671, 48934490]
3205D8934490J55086m0524L90029K45319P50543M4177k63102L04638l16072J776971
3195E1981555K107027J15600K93731J818496J519236J425947J078196j01524M09408
3186F0647672K19145j605573j407758p67407j197530q57785j581092j917728j529155
3177E0002789n03103J23536j420854j026881k85448j69423K25017k47709j546645
3168D5151279l91009J104852r65375j348760o50416J365796j245115q84825M16834
3159D2553261j139508k59026n97981m63341R79586Q24194O7747q37033p64275
3150D0363624m89857Q07356L66546q12436j151921R38395j483924m64519N22582
3141C8595846r50539J004999P2715j32129o31671m08284m22744R58117j091321
$$ y = [48934490, 49089576, 49049052, 49439081, 49684400, 50434943, 50479120, 50216018, 50520656, 50204584, 51981555, 54088582, 54204182, 54497913, 56316409, 57835645, 59261592, 60339788, 60238264, 60647672, 60866817, 59261244, 57853486, 57086079, 55888549, 55030764, 53449672, 51531944, 50002789, 49499686, 49623222, 48202368, 47175487, 46890039, 46720616, 46945633, 46697924, 45151279, 44760270, 45865122, 44899747, 43550987, 42900571, 44266367, 43021252, 42136427, 42553261, 41413753, 41154727, 40556746, 40093405, 41072991, 41897185, 41964932, 41127899, 40363624, 39873767, 40681123, 41047669, 40235233, 39083312, 40021707, 38537783, 38073264, 38595846, 37645307, 38650306, 38723021, 38590892, 37959221, 37550937, 37128193, 38086310, 36994989]
3132C6994989K36071J237563k16250j680937N2894M24680n02751P24973l12372
3123C6958860P26342M84588n86636o87167J589927J303214j53742j170941P43166
3114C9207611J559097k36901J030004N66002p60213J976125J012192R22907J122498
3105D6399322q90533N15189J021788O25616Q14285J169259J801119J84399R99748
3096E2640192J918330J551535J133140K362617J832323J144117K232596J555097
3088F6369947K687937K078931j97062K219741K705498J701011L227709J965662
3080H2759374K548198L316711M979723L900129L457584N350089O419061O720134
3072A19451003O138984P311084Q338804J1000521J4604236J7806222K2940776
$$ y = [36994989, 37231060, 38468623, 38252373, 36571436, 36624330, 37049010, 36546259, 37271232, 36958860, 37685202, 38169790, 37583154, 36895987, 38485914, 39789128, 39635386, 38464445, 39207611, 40766708, 40529807, 41559811, 42125813, 41365600, 43341725, 44353917, 45276824, 46399322, 45508789, 46023978, 47045766, 47671382, 48485667, 49654926, 51456045, 51640444, 52640192, 54558522, 56110057, 57243197, 59605814, 61438137, 62582254, 64814850, 66369947, 69057884, 71136815, 70939753, 73159494, 75864992, 77566003, 80793712, 82759374, 85307572, 88624283, 93604006, 97504135, 100961719, 106311808, 112730869, 119451003, 125589987, 132901071, 141239875, 152240396, 166844632, 184650854, 207591630]
3065B07591630K7109660K6138079K7311524K5645170J9796176K826183k1379753
3058C15038669l9293029m2998723l0659216k0898524j5021022j0785704p620661
3051A47761790n302777m951560m611098m581660k943131k014821j731292j180584
3043A20444867N31037l88248k25110m49767n19971K305435K039361J199572M28617
3034A25365793J360087K153157K794705K218773L092862L670698L319468L589993
3026A47565536M814096M633426O016765M777758M357614K698457L625067K380451
3018A80869170L61191j617512m334340m967134n795372n549030o216821o147726
3010A46602426o109868n537438m324230m543420l711068k925257l850971k950862
$$ y = [207591630, 234701290, 260839369, 288150893, 313796063, 333592239, 336418422, 315038669, 275745640, 232746917, 202087701, 181189177, 166168155, 155382451, 147761790, 142459013, 137507453, 132896355, 128314695, 125371564, 123356743, 121625451, 120444867, 120975904, 120587656, 120362546, 119912779, 119392808, 121698243, 123737604, 124937176, 125365793, 126725880, 128879037, 131673742, 133892515, 136985377, 140656075, 143975543, 147565536, 152379632, 157013058, 163029823, 167807581, 172165195, 174863652, 178488719, 180869170, 181230361, 179612849, 175278509, 170311375, 164516003, 158966973, 152750152, 146602426, 140492558, 134955120, 130630890, 126087470, 122376402, 119451145, 115600174, 112649312]
3002A12649312j665017k456313k454051q02123j639409j584532j586974j645617
2994I8815276j812315k54314j376633j898761j127080j011396p98258q30907K39371
2985H9944983j082260j54564m75110j830212j319261j164418R5236l57776r40607
2976H2716011r25268j900740n69229k40520l49126r14380M34074j17466r45441
2967G7187915m10211q12765o98584j525381m05557J189443O4811r25893l05396
2958G3358382k33807j306682q92961j43053l93034l24796n2808O78450l91609
2949G0298082M88537j246174q11122N57977m31584L98341o45750j241742L9144
2940F7405709M83871n30395l149K980L06085J118351j308343M52481o33586j22829
$$ y = [112649312, 110984295, 108527982, 106073931, 105271808, 103632399, 102047867, 100460893, 98815276, 97002961, 96748647, 95372014, 93473253, 92346173, 91334777, 90536519, 89705612, 89944983, 88862723, 88708159, 88233049, 86402837, 85083576, 83919158, 84014394, 83656618, 82716011, 81790743, 79890003, 79320774, 79080254, 78731128, 77816748, 78250822, 78133356, 77187915, 76777704, 75964939, 75266355, 73740974, 73335417, 74524860, 74589671, 73663778, 73358382, 73124575, 71817893, 70924932, 70781879, 70388845, 70064049, 70011241, 70689691, 70298082, 70786619, 69540445, 68729323, 69287300, 68855716, 69254057, 68608307, 67366565, 67405709, 67889580, 67359185, 67356036, 67359016, 67665101, 68783452, 67475109, 67927590, 67294004, 67171175]
2930F7171175R58609J500660J887669l84383q6832O10731N36335J545631l79148
2921G3360447p36781J184072O98435J061198J551644k59819q7412n46570l70421
2912G5854793J636833M55815j03544O63852J862474J414215k57794P97826J553393
2903H3877863J885823J235481J615562J320627P41238R08941K081548J318544
2895I4985627J058573J749329J069333M46790N87852J654159K566319K026588
2887A06144570J141551R43300K68145J324452O93545R79088P93940N80951Q93235
2878A13762777J132005k96808o32561J16324L72468M79623L33659k95528q07948
2869A14164011m85520n28755m00656J418174n73034j764288r34238k33966l57285
$$ y = [67171175, 68129784, 69630444, 71518113, 71133730, 71046898, 71657629, 72193964, 73739595, 73360447, 72623666, 73807738, 74506173, 75567371, 77119015, 76859196, 76771784, 76225214, 75854793, 77491626, 77947441, 77843897, 78507749, 80370223, 81784438, 81526644, 82324470, 83877863, 85763686, 86999167, 88614729, 89935356, 90676594, 91585535, 93667083, 94985627, 96044200, 97793529, 98862862, 99309652, 99897504, 101551663, 104117982, 106144570, 107286121, 108229421, 108497566, 109822018, 110515563, 111494651, 112288591, 112869542, 113762777, 114894782, 114597974, 113965413, 114081737, 114454205, 114933828, 115267487, 114971959, 114164011, 113678491, 113149736, 112749080, 114167254, 113594220, 111829932, 110895694, 110661728, 110304443]
2860A10304443k059609j7612J3743j758492m72605l68075j529547k127146o09340
2851A01375760q38278j947848r28290L01702m27903r98101j288909j850542Q76163
2842I4273754j517613j957823L08774q96049p31810M79797j099983l36388L66550
2833H8889209p31749K84837J54737J58981M77366N01604O15307O96326J060894
2824I2107512q77384L98562K885796j31045K33882m26163N08921J068847J864928
2815I7633856O31852O77995O13764K040958J205124O69171J149625R52881Q23310
2806A06398536J006570K197323l9281j243771Q91458J362816J172573J317226
2798A13063450R21059k42748K92261R77719J091522J76805o22382j408149r15194
$$ y = [110304443, 108244834, 108227222, 108240965, 106482473, 106009868, 105641793, 104112246, 101985100, 101375760, 100537482, 98589634, 97661344, 97963046, 97535143, 96537042, 95248133, 93397591, 94273754, 92756141, 90798318, 91107092, 90211043, 89479233, 89959030, 88859047, 88522659, 88889209, 88157460, 88442297, 88597034, 88756015, 89233381, 89734985, 90350292, 91046618, 92107512, 91230128, 91628690, 94514486, 94383441, 94617323, 94191160, 94700081, 95768928, 97633856, 98265708, 98943703, 99557467, 101598425, 102803549, 103472720, 104622345, 105575226, 106398536, 107405106, 109602429, 109563148, 108319377, 109210835, 110573651, 111746224, 113063450, 113984509, 113741761, 114034022, 115011741, 116103263, 116280068, 115657686, 114249537, 113334343]
2789A13334343n74975m34007j429899j525484j52297m82025l90762j219797k335656
2780A04789441l87813R75629l58078j048206N17066J357560j594795N75303k80755
2771A04545352J129413m71051J57518P43171k03775n18451R19716O44738p58105
2762A06188526O47736p2129M33189P77646O01815j78352N81327J017200l42334
2753A09654624k62640M71754o15899o55251n65550M08550N15887k04658J66704
2744A08913521m16046Q50706k075675j307446j54265o08137k095795m80847j521045
2735A01104971j715516k18787j008970j571931k14855j022242j298200p90424
2727I3264046j487984J11512j399620o64277r29238k21972k089043j245372l01187
$$ y = [113334343, 112759368, 112325361, 110895462, 109369978, 109217681, 108735656, 108344894, 107125097, 104789441, 104401628, 105377257, 105019179, 103970973, 104488039, 105845599, 104250804, 104826107, 104545352, 105674765, 105203714, 105361232, 106104403, 105900628, 105382177, 106301893, 106946631, 106188526, 106836262, 106764133, 107197322, 107974968, 108576783, 108398431, 108979758, 109996958, 109654624, 109391984, 109863738, 109247839, 108592588, 108027038, 108435588, 108951475, 108746817, 108913521, 108497475, 109348181, 107272506, 105965060, 105810795, 105202658, 103106863, 102626016, 101104971, 99389455, 99170668, 98161698, 96589767, 96374912, 95352670, 94054470, 93264046, 91776062, 91887574, 90487954, 89823677, 88894439, 88672467, 86583424, 85338052, 85036865]
2718H5036865o65329J293107R07201j155823n55590M19023N30815l34242j30320
2709H5345707Q17665J79093O42593q97198K195160L52089R87181P00463l16193
2700I0006560L99858J693689J813787m61282K110145R44587P88310J557888K004255
2691A00857797K025739R05503o89080K130563K849020J670996K677796R59896
2683A13388230J754680K640738K699011J973233J149157K880024K658327K016596
2675A31159996K623322K293408O79343K135898Q79454J775215K038312J110716
2667A44695664J328086J387486J338327P46093o7937l64402J161444O74892q12773
2658A50086880l6622k160999q89500k6071j415925k225846j893388k524211k619259
$$ y = [85036865, 84371536, 85664643, 86571844, 85416021, 84860431, 85279454, 85810269, 85476027, 85345707, 86163372, 86342465, 86985058, 86087860, 88283020, 88635109, 89622290, 90322753, 90006560, 90406418, 92100107, 93913894, 93452612, 95562757, 96507344, 97295654, 98853542, 100857797, 102883536, 103789039, 103099959, 105230522, 108079542, 109750538, 112428334, 113388230, 115142910, 117783648, 120482659, 122455892, 123605049, 126485073, 129143400, 131159996, 133783318, 136076726, 136756069, 138891967, 139771421, 141546636, 143584948, 144695664, 146023750, 147411236, 148749563, 149495656, 149427719, 149063317, 150224761, 150899653, 150086880, 150050258, 147889259, 146999759, 146973688, 145557763, 143331917, 141438529, 138914318, 136295059]
2649A36295059o35482P03851j816694k859174k821998k355079k494904k273208
2641A21742371r45938j994731k410102j790417r01100j584517k625265k425365
2633A07064936k249964j586881o71985o06459k830244k053170j048067j518834
2625I4499332j20940j641622N53932J30128j61680l0972j202392j522119m39665
2616I0064002J816179N27407K95644r11043J95387n54542J530218J363530j203711
2607I3123071Q68300J442203J532368J495511j84184N94831J527239m61876M00959
2598A00338422O56966J759897J112680K390683J596813m79329N324J101262J096722
2589A09579440J455853N58230N7642P45216P63626J745828K66778M08204Q63626
$$ y = [136295059, 135659577, 136363428, 134546734, 131687560, 128865562, 126510483, 124015579, 121742371, 120796433, 118801702, 116391600, 114601183, 113700083, 112115566, 109490301, 107064936, 104814972, 103228091, 102556106, 101949647, 99119403, 97066233, 96018166, 94499332, 94378392, 92736770, 93290702, 93420830, 93259150, 93228178, 92025786, 90503667, 90064002, 91880181, 92407588, 92703232, 91792189, 91987576, 91433034, 92963252, 94326782, 93123071, 93991371, 95433574, 96965942, 98461453, 98277269, 98872100, 100399339, 99937463, 100338422, 100995388, 102755285, 103867965, 106258648, 107855461, 107376132, 107381456, 108482718, 109579440, 111035293, 111593523, 111651165, 112396381, 113160007, 114905835, 115172613, 115580817, 116444443]
2580A16444443L80718J321384K98375j95125m53387J510126J351139J157104R50331
2571A22765108Q93997Q29958M54618K047171K129182j278959O53789J205394J334413
2562A31034671J087437Q75877Q44257P41459L79027R92099J302509j1067J298570
2553A38544839J129431R82458M52121R23303K46317k18764N39697K13379J140082
2544A43952863K046764q9536k46322j165371p88387L49733p9898L99119m5497
2535A44333468l8883j678726r85563j262j135674n99707j132437p01866j013310
2526A37046040p41212j264775j627794n78937o21838l87217j303907k184244j015114
2517A27321002J38336j381931k407114j992175q14376n32400j717286r57525j119526
$$ y = [116444443, 116825161, 118146545, 118444920, 118249795, 117796408, 119306534, 120657673, 121814777, 122765108, 123659105, 124489063, 124943681, 126990852, 129120034, 127841075, 128494864, 129700258, 131034671, 132122108, 132997985, 133842242, 134583701, 134962728, 135954827, 137257336, 137246269, 138544839, 139674270, 140656728, 141108849, 142032152, 142278469, 142059705, 142599402, 142812781, 143952863, 145999627, 145910091, 145663769, 144498398, 143710011, 144059744, 143979846, 144378965, 144333468, 144294585, 142615859, 141630296, 141629034, 140493360, 139893653, 138761216, 138059350, 137046040, 136304828, 135040053, 133412259, 132833322, 132211484, 131824267, 130520360, 128336116, 127321002, 127459338, 126077407, 123670293, 121678118, 120863742, 120331342, 118614056, 117656531, 116537005]
2508A16537005q41384j555289j209677j98590j079697j657580m58692m54527j781963
2499A07299606j175552q09520k4659p63763j246309o25899j43311L08310l56026
2490A02462877j266785J14488R56294L04606l19961k23223l33618M21845P93869
2481A02910392r84838L3184J903412J385795k9597n03785M37444J33086J056005
2472A06341098Q94219p25221j62311M03140O28044M52599J00371k222677j83140
2463A05526122M62896K6313n15538j369312k438530n57329m55185j818375o24793
2454I8236269j485714j412002r45857j303517j055577k113927j764956r39311
2446H7215408j312474j581538j835951q48050j172100j658204M31432r60306k340520
$$ y = [116537005, 115695621, 114140332, 112930655, 112732065, 111652368, 109994788, 109536096, 109081569, 107299606, 106124054, 105314534, 105289875, 104526112, 103279803, 102653904, 102510593, 102818903, 102462877, 101196092, 101310580, 102266874, 102571480, 102251519, 102028296, 101694678, 102116523, 102910392, 101925554, 101958738, 103862150, 105247945, 105218348, 104714563, 105152007, 105285093, 106341098, 107235317, 106510096, 106347785, 106750925, 107378969, 107831568, 107931939, 105709262, 105526122, 105989018, 106015331, 105499793, 104130481, 101691951, 101134622, 100679437, 98861062, 98236269, 96750555, 95338553, 94392696, 93089179, 92033602, 89919675, 88154719, 87215408, 85902934, 84321396, 82485445, 81637395, 80465295, 78807091, 79238523, 78278217, 75937697]
2437G5937697k924470k028974q51513j319061o54628k885m35254p68663j436204
2428F5516045k04466j546292j413271L47537o53263j19426O11536N81707k46597
2419F2873510K40154R06202l54219l97365J72425N18257J304013M9775j36148
2410F5176604Q9459n68618J806980R12765Q5395R00342J682511J952848l85042
2401G1653244l38614L17743O91050J41851J645118M31054j91569l36724N21155
2392G4534308j797706l61641O24785K47428j880627k119879M1092q2090p56300
2383F8449370j204394j167440j567088K23530j694875j344122j907715p90725
2375E8996541j731427k795831j269365j241781j066974j307569l93079j385672
$$ y = [75937697, 73013227, 70984253, 70132740, 68813679, 68159051, 68156166, 67720912, 66952249, 65516045, 65311579, 63765287, 62352016, 62699553, 62046290, 61926864, 62538400, 63120107, 62873510, 63113664, 64019866, 63665647, 63268282, 63440707, 63958964, 65262977, 65312752, 65176604, 65266063, 64697445, 66504425, 67417190, 67502585, 68402927, 70085438, 72038286, 71653244, 71314630, 71632373, 72323423, 72465274, 74110392, 74541446, 74349877, 74013153, 74534308, 72736602, 72374961, 72999746, 73247174, 71366547, 69246668, 69287760, 69205670, 68449370, 67244976, 66077536, 64510448, 64733978, 63039103, 61694981, 59787266, 58996541, 57265114, 54469283, 53199918, 51958137, 50891163, 49583594, 49190515, 47804843]
2367D7804843j530018p67687j581990j292550o27103j45190n15497k232268N22186
2358C9634726p97726m93581j327025M28403m03142m9458o62269o34628M54649
2349C6149949j58555k12283j06999n21634J387572K3857j606389L0585k68286
2340C4717817m10652N17347M30007O62419M22543j004895m56928j324567R87120
2331C4540211N38137r13029j678922r27641O5069j95793o12878j4145n99936j81245
2321C0019828q00783k28497j621373q48601k03294m4577P92573j517355j256620
2312B4291301p35911j394474m23458R9751m9500k42303j95450j041500n54999
2303A9753457K12252j179776j667832k58589o92338p05531m46615Q58555P63955
$$ y = [47804843, 46274825, 45507138, 43925148, 42632598, 42005495, 41860305, 41344808, 39112540, 39634726, 38837000, 38343419, 37016394, 37444797, 37041655, 36992197, 36329928, 35695300, 36149949, 35991394, 35779111, 35672112, 35150478, 36538050, 36561907, 34955518, 34986103, 34717817, 34307165, 34824512, 35254519, 35916938, 36339481, 35334586, 34877658, 33553091, 34540211, 35078348, 34165319, 32486397, 31558756, 31623825, 31428032, 30815154, 30801009, 30201073, 30019828, 29219045, 28990548, 27369175, 26520574, 26317280, 26272703, 27065276, 25547921, 24291301, 23555390, 22160916, 21737458, 21837209, 21787709, 21545406, 21349956, 20308456, 19753457, 19965709, 18785933, 17118101, 16859512, 16167174, 15461643, 15015028, 15873583, 16637538]
2294A6637538M87361j520907M24120K50221j459572r49201L80393j265992j153196
2285A1830765l93682N11181J600169j086873K41044Q57945J04892Q16984k186198
2276A2296227j273686J535405M75953r34673m85571L39435M49273P7198l98292
2267A2081269K13880k41211R61799O51078j342402J1893j092917L63248J316339
2258A2922976j263200q05222L29075R51754o66137L15741M34621J322852M38823
2249A3981283j493024M87889j091905j538893O65209k68218p1067J222526k64305
2240A1629495j161676J8234M38648q76767M81270J231272J086860n24374j183657
2231A1139305J064488R3777k49989P77319P15263r84498o31873m44403J66989
$$ y = [16637538, 17124899, 15603992, 16028112, 16278333, 14818761, 13869560, 14249953, 12983961, 11830765, 11437083, 11948264, 13548433, 12461560, 12702604, 13560549, 13665441, 14482425, 12296227, 11022541, 12557946, 13033899, 12099226, 11613655, 11953090, 12402363, 12479561, 12081269, 12295149, 12053938, 13015737, 13666815, 12324413, 12336306, 11243389, 11606637, 12922976, 11659776, 10854554, 11183629, 12135383, 11469246, 11784987, 12219608, 13542460, 13981283, 12488259, 12976148, 11884243, 10345350, 11010559, 10742341, 10671274, 11893800, 11629495, 10467819, 10486053, 10924701, 10047934, 10529204, 11760476, 12847336, 12322962, 11139305, 12203793, 12297570, 12047581, 12824900, 13540163, 12555665, 11923792, 11479389, 11646378]
2222A1646378p43482J422569N34777p33750l11960J310010K41257J091602o6316
2213A4391085K25888L67387o93753j20753l75558k84463k07825K8267M14588J109193
2203A4854056L02145J27546J42752P19814N06325O18909k35911L85758P67476
2194A8188870J33854L084M16249J147425m45701M25227J069726P08820J629440
2185B3276994J307763J120453J804383P40901J459766K655933K045926J357771
2177C5769890J432222J916916o55862j386661j419991p50553j184170l108340
2169C0613451l019164j351103q24263j272822j080301j296878j296791j266976
2161A9205153K74552k62748j159267p51193j149834j880996K26893L00925j181057
$$ y = [11646378, 10902896, 12325465, 12860242, 12126492, 11814532, 13124542, 13365799, 14457401, 14391085, 14616973, 14984360, 14290607, 14169854, 13794296, 13509833, 13302008, 13330275, 13744863, 14854056, 15156201, 15283747, 15426499, 16146313, 16652638, 17271547, 17035636, 17421394, 18188870, 18322724, 18325808, 18742057, 19889482, 19443781, 19869008, 20938734, 21647554, 23276994, 24584757, 25705210, 27509593, 28250494, 29710260, 32366193, 34412119, 35769890, 37202112, 39119028, 38463166, 37076505, 35656514, 34905961, 33721791, 30613451, 27594287, 26243184, 25418921, 24146099, 23065798, 21768920, 20472129, 19205153, 19479705, 19216957, 18057690, 17306497, 16156663, 14275667, 14502560, 14803485, 13622428]
2152A3622428j059785J348665r58074q71564J54352j447116J59492L47403l3003
2143A1262798o62769l058j455717R22451N04806m60955J805L70766j272156J74045
2133I382016p85118j002930p46777l06094R9033n55857N8767M96265R88886j208407
2123F419784k64207Q23953m98819O46349k55559m96002j383663j78141J141143
2114E954838P64024P86702j221623q65505M70595k34016j014337P99424k07284
2105E232818l61113m90210k19791r18965O80212N76096p48720J183503m82067
2096D451763j186573q98643P72821N81096m89299M64131m76297l57959N74610
2087C435650j44000l88332j20367J243277K74165q36459L0775J28984j169434
$$ y = [13622428, 12562643, 13911308, 12953234, 12081670, 12236022, 10788906, 10948398, 11295801, 11262798, 10600029, 10596971, 9141254, 10063705, 10568511, 10107556, 10109361, 10480127, 9207971, 9382016, 8596898, 7593968, 6847191, 6541097, 6640130, 6084273, 6143040, 6639305, 7628191, 6419784, 6155577, 6979530, 6480711, 7127060, 6871501, 6375499, 4991836, 4813695, 5954838, 6718862, 7505564, 6283941, 5418436, 5889031, 5655015, 4640678, 5440102, 5232818, 4871705, 4381495, 4161704, 3242739, 3922951, 4499047, 3750327, 4933830, 4451763, 3265190, 2366547, 3139368, 3720464, 3231165, 3695296, 3218999, 2861040, 3435650, 3291650, 2903318, 2782951, 4026228, 4300393, 3463934, 3494709, 3623693, 2454259]
2078B454259O52455J74657o41750P06886M82154r66076K42785J072316n45752
2069C631934l16648j667535p43429N30566P75682N97206J2315k63425N0812j50008
2059B457470O9071n67067r23736J051156R97129m18264j088938N18319o97560
2050A397580p10476K264106j740805j229908P78763L49295p01092M70477J03551
2041I81491N0368j86832l08543N94472q5085l22551M33657p82309P99829J308390
2031B482887L13280J40504j359181K22976j180038o80906J685107J37375j70093
2022A591911n89558j156894K80931N34241o99572Q85333Q41085o50735J35032
2013A171774j656722Q50103L37496l19470M48289M48546p7328L70376p79889m38714
$$ y = [2454259, 3106714, 3281371, 2639621, 3346507, 3828661, 2862585, 3105370, 4177686, 3631934, 3315286, 1647751, 904322, 1434888, 2210570, 2807776, 2820091, 2556666, 2607478, 2457470, 2526541, 1959474, 1035738, 2086894, 3084023, 2665759, 1576821, 2095140, 1397580, 687104, 2951210, 1210405, -19503, 759260, 1108555, 407463, 877940, 981491, 1031859, 845027, 536484, 1130956, 1045871, 723320, 1156977, 374668, 1174497, 2482887, 2796167, 2936671, 1577490, 1800466, 620428, -60478, 1624629, 1762004, 1591911, 1002353, -154541, 126390, 660631, -38941, 846392, 1687477, 1036742, 1171774, -484948, 365155, 702651, 383181, 831470, 1280016, 1202688, 1573064, 793175, 354461]
2003C54461J159014j034002P33608k76918p4430Q6930L14426M25049o29760r02340
1993A56038l47311l66808L61064J431258m99787q70313j62225K23600K94913Q05425
1983A025854L62126n31914l60177P80491p04717m95369P17420m75816j47288L94665
1973E65275n34186q16220N23597N04661N69409q79840M99041m74339o52266Q34351
1963A39483K57727k71214L5126p65811Q56327O94534l88580O35403n44209M99655
1953A148441n76376J13719n40485M43454M9411K01211M32503l09141J34508j256320
1943a59075n51669J395713K15983J251919o48152P4367q69657m67471J021701
1934A263659p72059j35590p91617q76851j23478O21211n02614P09216L22786o24140
$$ y = [354461, 1513475, 479473, 1213081, 936163, 861733, 948663, 1263089, 1688138, 1058378, 156038, -191273, -558081, -197017, 1234241, 734454, -135859, -298084, -74484, 220429, 1025854, 1387980, 856066, 495889, 1276380, 571663, 76294, 793714, 317898, 170610, 565275, 31089, -785131, -261534, 243127, 812536, -67304, 431737, -42602, -694868, 139483, 397210, 125996, 161122, -604689, 251638, 946172, 557592, 1192995, 648786, 1148441, 572065, 685784, 145299, 588753, 638164, 839375, 1271878, 962737, 1097245, -159075, -710744, 684969, 900952, 2152871, 1504719, 1579086, 709429, 241958, 1263659, 491600, 356010, -435607, -1312458, -1435936, -814725, -1317339, -608123, -285337, -909477]
1924i09477O24706o609l68785M39365J30444L61416l46606J292087Q66205n90668
1914A492078k4930Q5240m40407M12393j02485O36401m38687l30967Q06458n94482
1904A500612P9819J63139j3806p71296N64686J16877m74230o5872l48732L91159
1894A142356j83921q39029M67476J73582L81277L61824O09737j517351j07584
1885D88367N87393j129943q00685K54711J273841K61883n78640l9648J72487l02790
1875A86976J727257k80414n35529j167252R52019l06806r9991J082200l87322
1866A171138o3811m7997l41736m94565N21801l9438J230580j394037j46219M5588
1856D41304J167593l9618q73660R57540p1134l21182n11906R58201P26617o38861
$$ y = [-909477, -284771, -291380, -660165, -220800, -90356, 271060, -75546, 1216541, 2082746, 1492078, 1467148, 1552388, 1111981, 1524374, 1421889, 2058290, 1619603, 1288636, 2095094, 1500612, 1580431, 1743570, 1729764, 958468, 1523154, 1640031, 1165801, 1099929, 751197, 1142356, 958435, 119406, 586882, 760464, 1141741, 1503565, 2113302, 595951, 488367, 1075760, -54183, -854868, -600157, 673684, 935567, 356927, 317279, 489766, 186976, 1914233, 1633819, 1098290, -68962, 883057, 576251, 476260, 1558460, 1171138, 1107327, 1059330, 717594, 223029, 744830, 705392, 1935972, 541935, 395716, 441304, 1608897, 1569279, 695619, 1653159, 1582025, 1260843, 748937, 1707138, 2433755, 1794894]
1846A794894K85905L24483r5529l74506n09233M08095L05767q05980Q36254P85501
1836B955651M98213n14639j724730P66654k65115q29668l9315J694785R91089
1827C532925p97139p14983N7119J340738l87571j573067R04100J409480j05753
1818C665849o65020l63800n99843J51998L73550n4871m61600k19405M98469P32085
1808C057412j277015j52857m57286J017051P12861m12393j66595j92152j05448
1799B023578j172918N00414J52010J24635J233389L09402K49192M17384p40836
1790C096250N6641n80485l56314M31727j42151k62074L91803j46243k92398J200018
1780C396774P52052Q9108j595293l01561O94259m64337k14819L73886l84760r96794
$$ y = [1794894, 2080799, 2405282, 2309753, 1935247, 1426014, 1834109, 2139876, 1333896, 2170150, 2955651, 3453864, 2939225, 1214495, 1981149, 1716034, 886366, 847051, 2541836, 3532925, 2735786, 2020803, 2077922, 3418660, 3031089, 1458022, 2362122, 3771602, 3665849, 3000829, 2637029, 2037186, 2189184, 2562734, 2507863, 2046263, 1826858, 2325327, 3057412, 1780397, 1627540, 1170254, 2187305, 2900166, 2487773, 2321178, 2129026, 2023578, 850660, 1351074, 1503084, 1627719, 2861108, 3170510, 3419702, 3837086, 3096250, 3152891, 2572406, 2216092, 2647819, 2505668, 2243594, 2635397, 2489154, 2196756, 3396774, 4148826, 4237934, 2642641, 2341080, 3035339, 2571002, 2356183, 2730069, 2345309, 1348515]
1770A348515M11687P21949j092523n51362K18105J134611N09759l7842l31601
1761B331298l71162r75776j89057L0887l32818O1615J296952J513240p39773L50825
1751B976231n31818k19161M10276o47792j437090K4765j497469N23126J048249
1742F49317p55429l04375p3310Q71986m90495K04544k92873l15921k71042j14381
1732h91979o18381L63618O59472l5106o36561l74033Q42087K56273P77351o0346
1722B82395n31495Q220N05934N61380m40194m90638J49411l62287L78258k22577
1712a61593J276221j753528o64571K28550J28674J276539k61801q43237O78690
1703i6056P71174q08647k02568k79222j72067J575044R73596L94704l13351j074194
$$ y = [1348515, 1760202, 2482151, 1389628, 838266, 1056371, 2190982, 2700741, 2662899, 2331298, 1960136, 984360, 795303, 826190, 493372, 554987, 1851939, 3365179, 2625406, 2976231, 2444413, 2225252, 2635528, 1987736, 550646, 575411, -922058, -398932, 649317, -106112, -410487, -483797, 388189, -102306, 102238, -190635, -506556, -777598, -891979, -1510360, -1146742, -487270, -522376, -1158937, -1532970, -690883, -434610, 342741, 282395, -249100, -240880, 265054, 826434, 386240, -104398, 45013, -317274, 60984, -161593, 1114628, -638900, -1303471, -1074921, -946247, 330292, 68491, -774746, -96056, 675118, -133529, -336097, -615319, -787386, 787658, 1761254, 2155958, 1842607, 768413]
1693G68413o54547Q2929J45703n43393P09511K94457j479075m11224J033210M88877
1683D34861j177266J837223K54898j087718j126196J35350k21744n22255j134647
1674b607494M14280J69600Q20594L85972N19916M61228p95620M156j177519r97187
1664b802074j39136M87065N27664J290633m21228M02465r09810L42238R98102
1655b24081k08833k20450N25848n22047J54346p34238Q15671m20453K86866p50382
1645a297753q75271R76353l1624l28470Q2025N05872O07686l7340r41257j706997
1635c046776O05748J838475K24524j882486K12131m85377M74555J79145N59999
1626a320062K81896J311146l69958j451285J8297k72973N71386j11290k92088
$$ y = [768413, 113866, 196795, 342498, -200895, 508616, 803073, -676002, -1087226, -54016, 434861, -742405, 1094818, 1349716, 261998, -864198, -728848, -950592, -1472847, -2607494, -2193214, -2023614, -1203020, -817048, -297132, 164096, -631524, -627368, -1804887, -2802074, -2941210, -2454145, -1926481, -635848, -1057076, -654611, -1564421, -1222183, -224081, -432914, -653364, -127516, -649563, -495217, -1229455, -413784, -834237, -547371, -1297753, -2173024, -1196671, -1228295, -1556765, -1474740, -968868, -361182, -398522, -1339779, -3046776, -2441028, -602553, -378029, -2260515, -2048384, -2533761, -2059206, -1880061, -1320062, -1038166, 272980, -96978, -1548263, -1529966, -1802939, -1231553, -1342843, -1634931]
1617a634931J248396p02568l60886O33754P3293n30870k05112l98221O35921K98979
1607i42245r92881J101907r78549m04658J305619k67579J41375p9751m82472M63599
1597a135635R11354j089034J83449k42503p00104J04845J51586L35868j3855m12641
1587a906670l66434O20743j513687M14874L47980N52551m87521J202073L70140
1578g65951p91025n42539R30110l57239L02784j240610N56672P34195J26934p07332
1568a754001N44065k01165n67045J425168q70563q8351R40378o25282j69204q89288
1558b255288M721N42527J493258K20541j129592R24179n10293q0915j28956l47838
1548a267656J68331o55268K28582n61060l68771J93796R06285N8597m82078J91222
$$ y = [-1634931, -386535, -1089103, -1449989, -816235, -742942, -1273812, -1478924, -1877145, -1241224, -942245, -1935126, -833219, -1811768, -2216426, -910807, -1178386, -1037011, -1116762, -1599234, -1135635, -224281, -1313315, -1129866, -1372369, -2072473, -1967628, -1816042, -1480174, -1494029, -1906670, -2273104, -1652361, -3166048, -2751174, -2403194, -1850643, -2338164, -1136091, -765951, -1556976, -2099515, -1169405, -1526644, -1223860, -2464470, -1907798, -1173603, -1046669, -1754001, -1209936, -1411101, -1978146, -552978, -1423541, -1511892, -571514, -1196796, -1366000, -2255288, -2250567, -1708040, -214782, 5759, -1123833, -199654, -709947, -790862, -919818, -1267656, -1099325, -1754593, -1526011, -2087071, -2455842, -2262046, -1355761, -1297164, -1779242, -1588020]
1538a588020J05400q7183j101647o72368J931390p04533O89965k42520j19937
1529a789453L14062p68642j080255K55168J455130m63020N02116l05848n455r08064
1519b794261J277214J80231j040545J61221J604381K36010k44231r3090r05982
1510a619052O03207M84836O02001n0406j117218J071307L69328j224846q20352
1501a701195O80855O49330o76751j058195q921p01771N48934L90498R30810j094214
1491b040620R94183r21o36422L41395j74173J04110K41879k87193p85752k10664
1481b454178J608894O55728l35600J67600q79586j77641k3053M12682l16357J7583
1471a323928N37828k04425m84772n70529J171128K37187n12810m91398l51074
$$ y = [-1588020, -1482620, -1569803, -2671450, -3343818, -1412428, -2116961, -1426996, -1669516, -1789453, -1475391, -2244033, -3324288, -3069120, -1613990, -2077010, -1574894, -1880742, -1886197, -2794261, -1517047, -1336816, -2377361, -2216140, -611759, -375749, -619980, -713070, -1619052, -1015845, -531009, 70992, 20586, -1096632, -25325, 344003, -880843, -1701195, -1020340, -371010, -1047761, -2105956, -2114877, -2816648, -2267714, -1877216, -946406, -2040620, -1046437, -1047358, -1683780, -1342385, -1516558, -1412448, -1170569, -1457762, -2243514, -2454178, -845284, -189556, -525156, -357556, -1237142, -1414783, -1437836, -1025154, -1341511, -1323928, -786100, -990525, -1475297, -2045826, -874698, -637511, -1150321, -1641719, -1992793]
1462a992793K21248m42136O19612J454063l06767m11576L53572P55161J63404
1453D13788j068234R6107Q1185r68060Q39637p46098o35694N20279J173338J05522
1443a88230j963851Q8146P03707j395868O07947m94116r1521N59701j81411J145592
1433a209904m86402P90097o13141L27371j463073q2014P42740M99405M44914K2118
1423a027889n38426J97259l08438J14616q9724O12667M89536j185049p55385K55330
1413b235503J19918N41928J93790k55755j59617m81810O58712l58305m4393Q032
1403b013003K46797M25779k74428M70068K20822J181664J6848p10657k12807l51689
1393a000606O359J36109K08168J68176Q08313m50131j584294j093494K03343J646889
$$ y = [-1992793, -1771545, -2213681, -1594069, -140006, -446773, -858349, -504777, 250384, 413788, -654446, -558339, -477154, -1445214, -605577, -1351675, -1987369, -1467090, -293752, -188230, -2152081, -2063935, -1360228, -2756096, -2148149, -2642265, -2733786, -2174085, -2355496, -1209904, -1696306, -906209, -1519350, -1191979, -2655052, -2737066, -1994326, -1494921, -1050007, -1027889, -1566315, -1369056, -1677494, -1562878, -1652602, -1039935, -550399, -1735448, -2490833, -2235503, -2115585, -1573657, -1379867, -1635622, -1795239, -2277049, -1618337, -1976642, -2021035, -2013003, -1766206, -1340427, -1614855, -1144787, -923965, 257699, 274547, -436110, -648917, -1000606, -994247, -858138, -649970, -481794, 326519, -123612, -1707906, -2801400, -2598057, -951168]
1383i51168K78310q40139k87063M12265K94763p82440j243536R84047K02992j537677
1373c469646J639295J211243l01346o86464N03059n60591j249962L32194J124801
1364a457417j60901p89367k85393M47829O10634M2049J816193L52217j402120
1355h26276O88849J67905j34148p76254n50995P68922p4861j28617N55602m35202
1345g45075p19911J571261k36041j846226n18256O54910K90991j353806O08271
1336b293882J162969R79443q53982m97308K40366K63644n41493q28390L15317
1327b053316k33685O00213k2942l40705j61161O20767p01502j11488N74513K7624
1317a801682M24427P33529n45205j05579p706K01916Q14199J3990j77256q99392
$$ y = [-951168, -672858, -1512997, -1800060, -1387795, -1093032, -1875472, -3119008, -2134961, -1931969, -3469646, -1830351, -619108, -920454, -1606918, -1103859, -1664450, -2914412, -2582218, -1457417, -1618318, -2407685, -2693078, -2245249, -1634615, -1592566, 223627, 575844, -826276, -137427, 30478, -103670, -879924, -1430919, -661997, -736858, -865475, -309873, -745075, -1464986, 106275, -129766, -1975992, -2494248, -1839338, -1548347, -2902153, -2293882, -1130913, -151470, -1005452, -1502760, -1262394, -998750, -1540243, -2368633, -2053316, -2287001, -1686788, -1709730, -2050435, -2211596, -1590829, -2292331, -2403819, -1829306, -1801682, -1377255, -643726, -1188931, -1294510, -1302216, -1100300, -286101, -272111, -449367, -1348759]
1307a348759q73674r62991J70448J399586J319212k99946o09951r65540j5869
1298b187484N28121O36121O26094j000283P98979n1607N28384j221909n40441
1289a884025l28466k99462J873746O04415R92053j450951N1589L57898j234594
1280a317797M52286M91786j58567O1016K99930j18138M53613M40193o84393J7166
1270f2905p67092k23871P37778J67608M44341o90507p81546l74040o9294K03834
1260a415694M62657K045366M65333k7092o62318j067036m99043O52431J544984
1251A499588m68958r43520J21066n62164J335137J261337P66027n43797j155252
1242A309464p60076m81160J134964L56705n29592j511148N66798m05337l5963
$$ y = [-1348759, -2222433, -3185424, -3014976, -1615390, -296178, -596124, -1206075, -2171615, -2187484, -1659363, -1023242, -397148, -1397431, -598452, -650059, -121675, -1343584, -1884025, -2212491, -2511953, -638207, -33792, 958261, -492690, -441101, -83203, -1317797, -865511, -373725, -532292, -471276, -171346, -289484, 164129, 604322, -80071, -62905, -829997, -1053868, -316090, -148482, 295859, -394648, -1176194, -1550234, -1619528, -1415694, -953037, 1092329, 1557662, 1530570, 868252, -198784, -697827, -45396, 1499588, 1030630, 87110, 208176, -353988, 981149, 2242486, 3008513, 2464716, 1309464, 549388, 68228, 1203192, 1559897, 1030305, -480843, 85955, -319382, -355345]
1233c55345l72760k61802J259923r6132O59519n15893J41484q56832k96838n0388
1223g45064M80767R74287q10120o49666J127585Q15557n45691Q03718j005265
1214D46108m9562k28630r5914M22389j190803o25495M90676O38148j69995k43956
1204f07034J257903J9590p33376m42108L52122k21671L59037N40922r40085K92686
1194a22014Q61226J6463r29561l68140m31595R72777P10100N96886p47865r47914
1184c89637J210634j397688O25112O71713j641110J18019L85121K32270Q7652
1175i7914m38125Q87140O90550k6720R00961n53432j466968k89769J441988R19125
1165A966836j596914j359936J322863J064676l72936l90668P24525K16427n23946
$$ y = [-355345, -728105, -989907, 270016, 173884, 833403, 317510, 458994, -397838, -694676, -745064, -264297, 709990, -100130, -749796, 377789, 1193346, 647655, 1451373, 446108, 396546, 167916, 72002, 494391, -696412, -1321907, -831231, -193083, -363078, -607034, 650869, 670459, -62917, -505025, -152903, -374574, -15537, 525385, -414700, -122014, 739212, 755675, -173886, -542026, -973621, -844, 709256, 1306142, 558277, -389637, 820997, -576691, 48421, 720134, -920976, -802957, -417836, -185566, -97914, -536039, 351101, 1041651, 1014931, 1915892, 1362460, -104508, -394277, 1047711, 1966836, 369922, -990014, 332849, 1397525, 1024589, 633921, 1358446, 1574873, 1050927]
1156A050927P04684J43651q03264m30821l22700j2076K94418Q21976o55854n4202
1146G36739q48235L0472Q96962K4318R33388k3692R5601m86416K74082k36976
1136A396243N6616p49032P77513l41838J008481Q74877j047148O98496p57513
1127A916695k99419j07593L64586M56349n52652J68666j33267M54177P98225J6811
1117C082578j52793j7365k92096O22518Q5543N26611P16059j044995K11639n2052
1107C685647r05734N99737K31844k79416n85089M63875M09167j001936k64277
1098B353818k97025J400104m65268p11651p3190j76393J051898P71092m00276
1089C453109L13894o53507Q65182m33214J0845N53964l50810M71270J270579l12952
$$ y = [1050927, 1755611, 1899262, 1095998, 665177, 342477, 330401, 624819, 1446795, 790941, 736739, -111496, -81024, 815938, 840256, 1773644, 1749952, 1845553, 1359137, 1633219, 1396243, 1452859, 703827, 1481340, 1139502, 2147983, 3022860, 1975712, 2674208, 1916695, 1617276, 1509683, 1874269, 2330618, 1777966, 1946632, 1813365, 2267542, 3065767, 3082578, 2929785, 2912420, 2620324, 3242842, 3328385, 3854996, 4571055, 3526060, 3737699, 3685647, 2779913, 3379650, 3611494, 3332078, 2746989, 3210864, 3620031, 2618095, 2353818, 2056793, 3456897, 2991629, 2279978, 2206788, 2030395, 3082293, 3853385, 3453109, 3767003, 3113496, 3978678, 3545464, 3556309, 4110273, 3759463, 4230733, 5501312, 5188360]
$$ [...]
##END NTUPLES=NMR SPECTRUM
##END=
