##TITLE=1H_TG-2317
 CDCl3,8 sc, 
 12.02.2021
##JCAMPDX= 6.0         $$ Bruker NMR JCAMP-DX V2.0
##DATA TYPE= NMR SPECTRUM
##DATA CLASS= NTUPLES
##ORIGIN= UXNMR, Bruker Analytische Messtechnik GmbH
##OWNER= root
$$ XWIN-NMR		Version 3.5
$$ Fri Feb 12 10:30:47 2021 Russian Standard Time (UT+4h)  she@DPX200
##.OBSERVE FREQUENCY= 200.1315066352
##.OBSERVE NUCLEUS= ^1H
##.ACQUISITION MODE= SIMULTANEOUS
##.ACQUISITION SCHEME= undefined
##.AVERAGES= 8
##.DIGITISER RES= 18
##SPECTROMETER/DATA SYSTEM= spect
##.PULSE SEQUENCE= zg30
##.SOLVENT NAME= CDCl3
##.SHIFT REFERENCE= (INTERNAL, CDCl3, 0, 15.9792)
##AUDIT TRAIL= $$ (NUMBER, WHEN, WHO, WHERE, WHAT)
$$ ##TITLE= Audit trail, XWIN-NMR		Version 3.5
$$ ##JCAMPDX= 5.01
$$ ##ORIGIN= Bruker BioSpin GmbH
$$ ##OWNER= she
$$ F:/spectra/data/she/nmr/H-F/1/pdata/1/auditp.txt
$$ ##AUDIT TRAIL=  $$ (NUMBER, WHEN, WHO, WHERE, WHAT)
(   1,<2021-02-12 10:29:11.43 +0400>,<she>,<DPX200>,
      <created by zg, POWCHK disabled, PULCHK disabled
       configuration hash MD5:
       00 E9 B6 7A A2 85 ED C7 34 08 36 98 17 FE 4E 26
       data hash MD5: 16K
       2A AB 01 70 BC 8A EF 5D 79 C8 76 17 72 12 D9 E8>)
(   2,<2021-02-12 10:29:13.93 +0400>,<she>,<DPX200>,
      <Start of raw data processing
       efp BC_mod = 2 LB = 0.24 FT_mod = 6 PKNL = 1 PHC0 = -10758.94 PHC1 = 14.80094 SI = 16K 
       data hash MD5: 16K
       CA D5 0A EA A3 A2 12 CF 23 6D 82 1C 68 E7 7D 31>)
(   3,<2021-02-12 10:29:38.90 +0400>,<she>,<DPX200>,
      <pk PHC0 = -1.416155 PHC1 = 0 
       data hash MD5: 16K
       D5 7C 17 01 D1 03 85 8B 16 39 B1 E5 D7 71 29 3C>)
(   4,<2021-02-12 10:29:41.50 +0400>,<she>,<DPX200>,
      <abs ABSG = 5 
       data hash MD5: 16K
       47 9A 7D F9 BA 66 93 0A F0 19 5C BD 03 36 17 0E>)
(   5,<2021-02-12 10:30:12.62 +0400>,<she>,<DPX200>,
      <pk PHC0 = -4.732124 PHC1 = 4.399998 
       data hash MD5: 16K
       1D A0 A4 0D 21 5B 24 BE E7 E8 D8 1E A1 4A 82 4A>)
(   6,<2021-02-12 10:30:16.57 +0400>,<she>,<DPX200>,
      <abs ABSG = 5 
       data hash MD5: 16K
       6A E8 5C F4 92 D8 19 73 FF 31 0B AB 6F 8B 72 69>)
$$ ##END=
$$ 
$$ hash MD5
$$ 42 C4 47 D8 7A AC 27 0D 7A 67 F8 24 FE 73 45 8C
##$RELAX= 
##$RELAX= 
##$RELAX= 
##$RELAX= 
##$RELAX= 
##$RELAX= 
$$ Bruker specific parameters
$$ --------------------------
##$DU= <F:/spectra>
##$EXPNO= 1
##$NAME= <H-F>
##$PROCNO= 1
##$TYPE= <nmr>
##$USER= <she>
##$AMP= (0..31)
100 100 100 100 100 100 100 100 100 100 100 100 100 100 100 100 100 100 
100 100 100 100 100 100 100 100 100 100 100 100 100 100 
##$AQSEQ= 0
##$AQ_mod= 1
##$AUNM= <au_zg>
##$AUTOPOS= <>
##$BF1= 200.13
##$BF2= 200.13
##$BF3= 200.13
##$BF4= 200.13
##$BF5= 200.13
##$BF6= 200.13
##$BF7= 200.13
##$BF8= 200.13
##$BYTORDA= 1
##$CFDGTYP= 0
##$CFRGTYP= 5
##$CHEMSTR= <none>
##$CNST= (0..31)
1 1 145 1 1 1 1 1 1 1 1 1 1 1 1 1 1 1 1 1 1 1 1 1 1 1 1 1 1 1 1 1 
##$CPDPRG= <>
##$CPDPRG1= <>
##$CPDPRG2= <>
##$CPDPRG3= <>
##$CPDPRG4= <mlev>
##$CPDPRG5= <mlev>
##$CPDPRG6= <mlev>
##$CPDPRG7= <mlev>
##$CPDPRG8= <mlev>
$$ [...]
##$SUBNAM3= <"">
##$SUBNAM4= <"">
##$SUBNAM5= <"">
##$SUBNAM6= <"">
##$SUBNAM7= <"">
##$SUBNAM8= <"">
##$SUBNAM9= <"">
##$SW= 16.9725356469052
##$SWIBOX= (0..15)
0 0 2 0 0 0 0 0 0 0 0 0 0 0 0 0 
##$SW_h= 3396.73913043478
##$TD= 16384
##$TD0= 1
##$TE= 0
##$TE2= 300
##$TE3= 300
##$TEG= 300
##$TL= (0..7)
0 120 120 120 120 120 120 120 
##$TP= (0..7)
150 150 150 150 150 150 150 150 
##$TP07= 0
##$TPNAME0= <>
##$TPNAME1= <>
##$TPNAME2= <>
##$TPNAME3= <>
##$TPNAME4= <>
##$TPNAME5= <>
##$TPNAME6= <>
##$TPNAME7= <>
##$TPOAL= (0..7)
0.5 0.5 0.5 0.5 0.5 0.5 0.5 0.5 
##$TPOFFS= (0..7)
0 0 0 0 0 0 0 0 
##$TUNHIN= 0
##$TUNHOUT= 0
##$TUNXOUT= 0
##$USERA1= <user>
##$USERA2= <user>
##$USERA3= <user>
##$USERA4= <user>
##$USERA5= <user>
##$V9= 5
##$VALIST= <valist>
##$VCLIST= <CCCCCCCCCCCCCCC>
##$VD= 0
##$VDLIST= <DDDDDDDDDDDDDDD>
##$VPLIST= <PPPPPPPPPPPPPPP>
##$VTLIST= <TTTTTTTTTTTTTTT>
##$WBST= 1024
##$WBSW= 4
##$XGAIN= (0..3)
0 0 0 0 
##$XL= 0
##$YL= 0
##$YMAX_a= 81295
##$YMIN_a= -26275
##$ZGOPTNS= <>
##$ZL1= 120
##$ZL2= 120
##$ZL3= 120
##$ZL4= 120
##$ABSF1= 15.97921
##$ABSF2= -0.9934521
##$ABSG= 5
##$ABSL= 3
##$ALPHA= 0
##$AQORDER= 0
##$ASSFAC= 0
##$ASSFACI= 0
##$ASSFACX= 0
##$ASSWID= 0
##$AUNMP= <proc_1d>
##$AZFE= 0.1
##$AZFW= 0.1
##$BCFW= 0
##$BC_mod= 2
##$BYTORDP= 0
##$COROFFS= 0
##$CY= -3
##$DATMOD= 1
##$DC= 0
##$DFILT= <>
##$DTYPP= 0
##$F1P= 0
##$F2P= 0
##$FCOR= 1
##$FTSIZE= 16384
##$FT_mod= 6
##$GAMMA= 0
##$GB= 0
##$INTBC= 1
##$INTSCL= 2.992141e-10
##$ISEN= 128
##$LB= 0.24
##$LEV0= 0
##$LPBIN= 0
##$MAXI= 10000
##$MC2= 0
##$MEAN= 0
##$ME_mod= 0
##$MI= 1.114404
##$NCOEF= 0
##$NC_proc= -11
##$NLEV= 6
##$NOISF1= 3.799351
##$NOISF2= 2.8
##$NSP= 0
##$NTH_PI= 0
##$NZP= 0
##$OFFSET= 15.97921
##$PC= 1
##$PHC0= -10765.09
##$PHC1= 19.20094
##$PH_mod= 1
##$PKNL= yes
##$PPARMOD= 0
##$PSCAL= 0
##$PSIGN= 0
##$REVERSE= no
##$SF= 200.130007085707
##$SI= 16384
##$SIGF1= 3
##$SIGF2= 2
##$SINO= 5.538805
##$SIOLD= 16384
##$SREGLST= <1H.CDCl3>
##$SSB= 0
##$STSI= 16384
##$STSR= 0
##$SW_p= 3396.73913043478
##$SYMM= 0
##$S_DEV= 0
##$TDeff= 16384
##$TDoff= 0
##$TI= <>
##$TILT= no
##$TM1= 0
##$TM2= 0
##$TOPLEV= 0
##$USERP1= <user>
##$USERP2= <user>
##$USERP3= <user>
##$USERP4= <user>
##$USERP5= <user>
##$WDW= 1
##$XDIM= 16384
##$YMAX_p= 397813045
##$YMIN_p= -19847020
$$ End of Bruker specific parameters
$$ ---------------------------------
##NTUPLES= NMR SPECTRUM
##VAR_NAME=  FREQUENCY,     SPECTRUM/REAL,   SPECTRUM/IMAG
##SYMBOL=    X,             R,               I
##VAR_TYPE=  INDEPENDENT,   DEPENDENT,       DEPENDENT
##VAR_FORM=  AFFN,          ASDF,            ASDF
##VAR_DIM=   16384,         16384,           16384
##UNITS=     HZ,            ARBITRARY UNITS, ARBITRARY UNITS
##FACTOR=    0.207333158178281, 1,           1
##FIRST=     3197.91939049146, 0,            0
##LAST=      -198.819739943324, 0,           0
##MIN=       -198.819739943324, -19847020,   0
##MAX=       3197.91939049146, 397813045,    0
$$ Real data points
##PAGE= N=1
##DATA TABLE= (X++(R..R)), XYDATA
$$ [...]
5560c388836k98074M95447j65784L374148J621428m290557J132582M13462l407008
5551d513192N928528m973558j206475O817943n98460k41536M337662j903611l539550
5542A07751l921540N068729Q27936n766328O5793k08624l288663L630177K269815
5533a214954L507634K315950N52427n150979M9405k77455m780315n19560M142195
5524a375652K929447K94016N272885n237637j086206O580509o461392p680287
5516f764317L780824r51147k43460P863520l73228q36284M822841m177063J25682
5507C247368j31627j362126P404412l668670q137266L760822j210690J321795
5499A224018L386517j825872L24591L165474k280024l595194k273444k346715
$$ plain form
5560 -3388836 -3686910 -3191463 -3357247 16901 1638329 -2652228 -1519646 -1106184 -4513192
5551 -4513192 1415336 -3558222 -4764697 2053246 1454786 1213250 5550912 3647301 107751
5542 107751 -3813789 1254940 2082876 -3683452 -3617659 -3826283 -7114946 -3484769 -1214954
5533 -1214954 2292680 4608630 5161057 10078 59483 -217972 -4998287 -5517847 -1375652
5524 -1375652 1553795 1847811 7120696 1883059 796853 7377362 915970 -6764317
5516 -6764317 -2983493 -3934640 -4178100 3685420 3312192 2475908 7298749 3121686 3247368
5507 3247368 3115741 1753615 9158027 5489357 -2647909 1112913 -97777 1224018
5499 1224018 4610535 2784663 3109254 6274728 3994704 399510 -1873934 -4220649
5491d220649J559961l03452K258748L680727k456470L54901L461793j427271Q71777
5482C780065m882776j812770J845373j511215N370593J090948l561769L17032
5474F35481O200676O4461p01066Q01306R05965K191244j423965j611361m605871
5465B456870j439243L440753J707728n25375o08382K099461k988290R16470K550700
5456G610692q5198L90500N674418K3978m319657K277109l861524n303673p98842
5447A607803L6247m560545L206694L982174K718458K973491J717119m743307M662698
5438A1600832M064992o009226J089418O67284m173562N026658M34626o686741
5430F014281J40386N075159O42723m158692J658385k606780l358559N164582o86361
$$ plain form
5491 -4220649 -2660688 -2964140 -705392 2975335 518865 873766 4335559 2908288 3780065
5482 3780065 -1102711 -2915481 -1070108 -2581323 2789270 3880218 318449 635481
5474 635481 6836157 6900618 6199552 7000858 7906823 10098067 8674102 7062741 2456870
5465 2456870 1017627 4458380 6166108 5640733 5032351 7131812 4143522 5059992 7610692
5456 7610692 7525494 7915994 13590412 13614390 9294733 11571842 7710318 2406645 1607803
5447 1607803 1644050 -2916495 290199 4272373 6990831 9964322 11681441 6938134 11600832
5438 11600832 15665824 9656598 10746016 11413300 7239738 12266396 12701022 6014281
5430 6014281 6154667 11229826 11872549 7713857 9372242 6765462 3406903 8571485 7885124
5421G885124o358067J720960K387960M564687M75366l225439k828129L546371
5413H168833K749940j960609m564320K716203j341488L637131N412993m901081
5405I917602m980693K787046J768630j27508L511208o435137m527291K248520
5397D162377J123840k38765J016219n918828L83257N430475j141074K132993j050686
5388E899808k952234K017562M397572K828657j761001Q89178K296702p29598o81716
5379A2204930m626061o619560n119283k05051L729617K579343K473767K364697
5371F782399j120933O870371M066040m544291m084449L42764J054601L461001
5363A2827503k562937m011434N55343j935787n95088P71169n306720K779588N051563
$$ plain form
5421 7885124 1527057 3248017 5635977 10200664 10676030 7450591 4622462 8168833
5413 8168833 10918773 8958164 4393844 7110047 5768559 9405690 14818683 9917602
5405 9917602 4936909 7723955 9492585 9365077 12876285 6441148 1913857 4162377
5397 4162377 5286217 5047452 6063671 144843 528100 5958575 4817501 6950494 5899808
5388 5899808 2947574 4965136 9362708 12191365 10430364 11319542 13616244 12886646 12204930
5379 12204930 7578869 959309 -4159974 -4365025 -635408 1943935 4417702 6782399
5371 6782399 5661466 12531837 16597877 12053586 7969137 8311901 9366502 12827503
5363 12827503 10264566 6253132 6808475 4872688 4277600 5048769 -257951 2521637 7573200
5354G573200j520785L523919j791216k422669k104017n680650L140366J518141
5346B236289j940460J832785J163406j404644j28092J351481j686226l340199
5338a915660M351352O371165K177631L01896o609926J96424q56379Q57892J955059
5329F829454L51231l174351L636074K072390R41371j826310j648682j53654M699156
5320A1726679L968378o411504l223015j688856J03163N205124p172380o373760
5312c866171P209433M588523L372709n363264m546730j023887K072354J443888
5304C886855l86093m716713J339756M810944N094944r10826o380653k706502o94544
5295f62832P318456j150670n454396o93678P318922M213927p16999m743801k647845
$$ plain form
5354 7573200 6052415 9576334 7785118 5362449 3258432 -2422218 718148 2236289
5346 2236289 295829 2128614 3292020 1887376 1759284 3110765 1424539 -1915660
5338 -1915660 2435692 8806857 10984488 11286384 4676458 4872882 4016503 4874395 6829454
5329 6829454 7180685 4006334 7642408 9714798 10656169 8829859 7181177 7027523 11726679
5320 11726679 15695057 9283553 6060538 4371682 4474845 9679969 2507589 -3866171
5312 -3866171 3343262 7931785 11304494 5941230 1394500 370613 2442967 3886855
5304 3886855 3500762 -1215951 123805 4934749 10029693 9118867 2738214 31712 -662832
5295 -662832 6655624 5504954 50558 -643120 6675802 10889729 10172730 5428929 2781084
5286B781084l216908M782979J146015l50729k831762l797714K208813N793635
5278F515413k987956j766175J657068K369707O793455L909471n018042r664068
5270A808873L352960k035861k596947R44306p578022O60845O767430O466617L672394
5261A1462595m443040p13513M31449M936879n29618k058672n856641J207055M243115
5252H679609l501933K112738o62511m640874K558694L579733k633953k532303
5244B959200n328681J757399P012522k224701j682636m316661J146018J815470
5236A137930M273663K332311m226429k95429J842382K656880k306691J67550k257695
5227C324472k156302P640230p74424p926860J397348R827701r46524K677599l112035
$$ plain form
5286 2781084 -435824 4347155 5493170 5142441 2310679 -1487035 721778 6515413
5278 6515413 3527457 1761282 3418350 5788057 12581512 16490983 11472941 1808873
5270 1808873 5161833 3125972 529025 1473331 -6104691 -5443846 1323584 7790201 11462595
5261 11462595 7019555 6306042 6737491 11674370 11144752 9086080 3229439 4436494 8679609
5252 8679609 5177676 7290414 6627903 1987029 4545723 8125456 5491503 2959200
5244 2959200 -2369481 -612082 6400440 4175739 2493103 -1823558 -677540 1137930
5236 1137930 5411593 7743904 3517475 3222046 5064428 7721308 5414617 5582167 3324472
5227 3324472 1168170 8808400 8033976 107116 1504464 11332165 10385641 13063240 9951205
5218I951205o002626L543461k446278k335077j114184K335190O715616j832092
5210H815215R65965L253987l287173o07336K555382o501342o66831M473624n172583
5201C828908O9442J203898k394069P3653N175803J567688K003860L39978p65924
5192A1103237J70118l445965P08104Q72883M49877L86442J43193J913586j095414
5183A1206061j221830n964n846229j63701N043125k028778j035622J662114l795639
5174C813537R1787O343364l428832l849654L440246P225530J845644j499001k423569
5165A1559052K33923j333461N09681O2424l973994k841201J934899J205381j55789
5156G200915l96131L67525K732950j330762L500896K046691j18906Q16865K814994
$$ plain form
5218 9951205 3948579 7492040 5045762 2710685 1596501 3931691 10647307 8815215
5210 8815215 9781180 13035167 9747994 9140658 11696040 5194698 4527867 9001491 3828908
5201 3828908 3898350 5102248 2708179 2781832 7957635 9525323 11529183 11869161 11103237
5192 11103237 11273355 7827390 8535494 9408377 9858254 10244696 10387889 12301475 11206061
5183 11206061 9984231 9978267 4132038 3968337 9011462 6982684 5947062 7609176 3813537
5174 3813537 3905324 10248688 6819856 2970202 6410448 13635978 15481622 13982621 11559052
5165 11559052 11792975 10459514 10969195 11031619 7057625 4216424 6151323 7356704 7200915
5156 7200915 6804784 7172309 9905259 8574497 12075393 14122084 14003178 14820043 17635037
5147A7635037j128668o863370M35182j309489p949870K194284M900020J972664
5139I885790J545467L708240k426659J866057j84992l827398j794480k047961
5131F724064k839493L139665N181129k642400K245716K114577k426340O18684
5123A2115602J242744J310545k316760m92705M672935m91338l2479m32161k842195
5114A2734188l278188O459663j327893j005106J176143r29315J706984K782374
5106A8318850L15641m531774j583761N81186K787983K567453O02511o29532l968408
5097A4460149j747158J494115j488246k495897M163244N989917l39328L23783
5089B0360579o96016l449830j733904j300306r69903l4334J981986j320133L234454
$$ plain form
5147 17635037 16506369 9642999 10078181 8768692 818822 3013106 7913126 9885790
5139 9885790 11431257 15139497 12712838 14578895 14393903 10566505 8772025 6724064
5131 6724064 3884571 7024236 12205365 9562965 11808681 13923258 11496918 12115602
5123 12115602 13358346 14668891 12352131 11859426 16532361 16041023 16008544 15576383 12734188
5114 12734188 9456000 15915663 14587770 13582664 14758807 13829492 15536476 18318850
5106 18318850 18634491 14102717 12518956 13100142 15888125 18455578 19058089 18428557 14460149
5097 14460149 12712991 14207106 12718860 10222963 14386207 20376124 20036796 20360579
5089 20360579 19664563 16214733 14480829 13180523 12210620 12176286 14158272 12838139 16072593
5080A6072593n14533L718740J695184J559379k664246n728557k54961j058854
5072A2824745L286648n03687K398065K637099K767740K031759m839250L221436
5064B3824555J055057l447562M439517j689804l296575J762203N02875m763752
5056A8386514J194409K879996k247338M183388L043616N00529k718643n34908
5048B4687563j496794K427577o90625k050963j905767J479985q62958j273382
5040B0314636O845785l508703M843391j4283l160248M338917k490023n877829
5032B1291643o49334L347707L744717N017982J531371k975988l899145l269577
5024B4139376L773855K113619j395256P07086m28335K586866J768982n312500
$$ plain form
5080 16072593 15558060 19276800 20971984 22531363 19867117 14138560 13883599 12824745
5072 12824745 16111393 15607706 18005771 20642870 23410610 25442369 20603119 23824555
5064 23824555 24879612 21432050 25871567 24181763 20885188 22647391 23150266 18386514
5056 18386514 19580923 22460919 20213581 24396969 27440585 27941114 25222471 24687563
5048 24687563 23190769 25618346 24927721 22876758 20970991 22450976 21588018 20314636
5040 20314636 27160421 23651718 28495109 28480826 25320578 29659495 27169472 21291643
5032 21291643 20642309 23990016 27734733 32752715 34284086 31308098 27408953 24139376
5024 24139376 27913231 30026850 28631594 29338680 28910345 31497211 33266193 27953693
5016B7953693j991736n74195P568028L108461p271939j080693L655373m000364
5008B7366628L873169K233019p081351m76409O993377l280522O81434P613462
5000C7922807k317005N750525L310297q699562J052709K776092K912779k886963
4992C9821679J790767l969603J621407P295236k483900k395636n239975K528241
4984C8968216M309184J157046l36517k161500k412946k251584l41556j916850
4976C5013493j132708M522128L685833N410034k638436p404742N167773L913193
4968D6536568k901051N328783m682843J456562M244398l090617k713070l171144
4960D1007586L74102L806882J134055N23608p38490n98113J412453Q056166k890634
$$ plain form
5016 27953693 25961957 25387762 32955790 36064251 28792312 27711619 31366992 27366628
5008 27366628 31239797 33472816 26391465 25915056 32908433 29627911 30309345 37922807
5000 37922807 35605802 41356327 44666624 35967062 37019771 39795863 42708642 39821679
4992 39821679 41612446 37642843 39264250 46559486 44075586 41679950 36439975 38968216
4984 38968216 43277400 44434446 44097929 41936429 39523483 37271899 36930343 35013493
4976 35013493 33880785 38402913 42088746 47498780 44860344 37455602 42623375 46536568
4968 46536568 43635517 48964300 44281457 45738019 49982417 46891800 44178730 41007586
4960 41007586 41381688 45188570 46322625 46846233 46107743 45509630 46922083 54978249 52087615
4951E2087615Q67548J578662n843734R70976J610640l035092k507869M085005
4943D9813751P325118R87532L87114l102800o916640K163559O591677j269651
4935E5979660r64663j77291k115638M650826N866572j739804L199886L928145
4927F8627693l541309L664635k318087m648439l991669J025671M720988M440091
4919F7979574L17692l393563j778395N380305n129j476395j059711m331536L485118
4910F5117960K614394K176634k920012l957625M49453N573569K077515n146025
4902F5985863M081849k836330K836033L244791q78105K383824r37646L42M001234
4893G7881855q58007l168058n279332O22024M178331K476366M200254j851998
$$ plain form
4951 52087615 52955163 54533825 48690091 49661067 51271707 48236615 45728746 49813751
4943 49813751 57138869 58126401 58513515 55410715 48494075 50657634 57249311 55979660
4935 55979660 55014997 54837706 52722068 57372894 63239466 61499662 64699548 68627693
4927 68627693 65086384 68751019 66432932 61784493 57792824 58818495 63539483 67979574
4919 67979574 68297266 64903703 63125308 68505613 68500484 67024089 65964378 61632842 65117960
4910 65117960 67732354 69908988 66988976 63031351 63480804 69054373 71131888 65985863
4902 65985863 70067712 67231382 70067415 73312206 72434101 74817925 73880279 73880621 77881855
4893 77881855 77023848 73855790 68576458 69198482 73376813 75853179 80053433 78201435
4885G8201435l166597N781718J398452n91136M687826L047629q3948j865809m364840
4876H3044730n456521M198603L488107n15216j961266j059672j787696P86046
4868H0737115O578710j647296L47292R244623J1031J276508j805418r519742j796019
4859H3426804K038417L185182L885285K017516p756919Q49038O295469l392477
4851I0548315L034298j253344j548428K774330J433963k72283k948979l746088
4843H8021784M079193l152590M303119M257870n644261k995791P635322L724862
4835A00229508R48069j333666o314469k118275L142053N69557L501515j244446
4827I7379846q12279J542631K755622k783419o496693J64615l940753K554763
$$ plain form
4885 78201435 75034838 80816556 82215008 81623872 86311698 89359327 89275379 87409570 83044730
4876 83044730 77588209 81786812 85274919 84759703 82798437 81738765 79951069 80737115
4868 80737115 87315825 85668529 86015821 95260444 95271475 96547983 94742565 85222823 83426804
4859 83426804 85465221 88650403 92535688 94553204 86796285 87645323 93940792 90548315
4851 90548315 93582613 92329269 90780841 93555171 94989134 94716851 91767872 88021784
4843 88021784 92100977 88948387 93251506 97509376 91865115 88869324 96504646 100229508
4835 100229508 101177577 99843911 93529442 91411167 94553220 95122777 98624292 97379846
4827 97379846 96567567 98110198 100865820 98082401 91585708 91750323 87809570 90364333
4819I0364333N005383k971614j491492J404505J370129L585018M342005l586593
4811I8021674j865174L132674j469725O749292l343257q437621R64480K215464
4803I5967807l542280J168119q07575j384567J906252K692863L338742l956836
4795I5382525l556625m40525j958550L288234k523358l440344p785108J749593
4787H0715842L362866J082117R96778j510920m670734J15267O213828O57188j790510
4778H5171722J071078J895277k280699j783462n071030k527307P266863M017024
4770H7759466k93062k337829j636755k200192J659782L571983l281521K150513
4762H5392385o3504j251600k879446n064090k482637m217K59370j916412k764542
$$ plain form
4819 90364333 95369716 92398102 90906610 92311115 93681244 97266262 101608267 98021674
4811 98021674 96156500 99289174 97819449 104568741 101225484 92787863 93752343 95967807
4803 95967807 92425527 93593646 92786071 91401504 93307756 96000619 99339361 95382525
4795 95382525 91825900 91385375 89426825 92715059 90191701 86751357 78966249 80715842
4787 80715842 84078708 85160825 86157603 84646683 79975949 80091216 86305044 86962232 85171722
4778 85171722 86242800 88138077 85857378 84073916 79002886 76475579 83742442 87759466
4770 87759466 87466404 85128575 83491820 81291628 82951410 86523393 83241872 85392385
4762 85392385 85328881 84077281 81197835 76133745 73651108 73646891 73906261 71989849 69225307
4753F9225307j231712k566486O968142J370333p51243k641863L033902L143787
4745G6550167j599283J139665k750081J127367m62754k909180M311133J41446
4737G5548480m353088J351837j497470o42017J908475m995482m205573L685165
4729F6800327K284217K741520J997889m026470l254335K159646J690504m029395
4721F6363903o096614j408074k783579K507961K574389n53821m29895K084044
4713F2258314l754028P39118l877095l815173O915625N488664K418279k358928
4705F4014776j0223011Q270740M082023l309283L890637m065896j143540L744450
4697F5260896n369464k594041k719890N631115M240940k215067m878694K111605
$$ plain form
4753 69225307 67993595 65427109 72395251 73765584 73014341 70372478 73406380 76550167
4745 76550167 74950884 76090549 73340468 74467835 74005081 71095901 75407034 75548480
4737 75548480 71195392 72547229 71049759 70407742 72316217 67320735 63115162 66800327
4729 66800327 69084544 71826064 73823953 69797483 66543148 68702794 70393298 66363903
4721 66363903 60267289 58859215 56075636 58583597 61157986 60604165 60174270 62258314
4713 62258314 58504286 59243404 55366309 51551136 58466761 63955425 66373704 64014776
4705 64014776 53791765 62062505 66144528 62835245 66725882 62659986 61516446 65260896
4697 65260896 59891432 57297391 54577501 60208616 64449556 62234489 57355795 59467400
4689E9467400O022208o85113l672092j0495430q5496l567191N257976L653972
4681E5896234j642505L614440R627166k322148k971282m208955p853322L649834
4673E3789462L648251R72454l118317l616618M615477K795781r58094l518709
4665E4609687J230474q73699K000969J821529m126983n398555L773281N930510
4657E8967213k482638p46600M702616k150378m99056k001896k777047p165457
4649D5846757j320874N926227k631528L939784L911423n511728r27723K115827
4641E1348165M475165K388958K572545J175035l891702n407020r85741j035576
4633E0639829l427985l39590M435340j016166J133247j72659n211926P055906
$$ plain form
4689 59467400 65489608 64804495 61132403 50636973 50551477 46984286 52242262 55896234
4681 55896234 54253729 57868169 67495335 65173187 62201905 57992950 50139628 53789462
4673 53789462 57437713 58410167 55291850 51675232 56290709 59086490 58128396 54609687
4665 54609687 55840161 54966462 56967431 58788960 54661977 49263422 53036703 58967213
4657 58967213 56484575 55737975 60440591 58290213 57791157 55789261 53012214 45846757
4649 45846757 44525883 50452110 47820582 51760366 55671789 50160061 49232338 51348165
4641 51348165 55823330 58212288 60784833 61959868 58068166 52661146 51675405 50639829
4633 50639829 47211844 46872254 51307594 50291428 51424675 51252016 46040090 53095996
4625E3095996p98117J026118J36269m630197Q36116L305294K438210o33665l594457
4616E1181567o33015p65262l83388l738438j629975Q569627M914264m761650l999063
4607D8754667J733540o540318m338135Q653226m981555K312456R589382O26242
4599E5809505J141672k322202j686178q103598l264162J0046621J93568l029042
4591D8786184p71730J416560Q63204l913493j524461j687439L602105N144799
4583E1915729K893546l126554n911019L439936J464727K540114j578840n110631
4575D6527008J423057J846983j238250j660899l293409L947763K226987l429154
4567D6350086p79973j084557j425776n58273M902506k969864L59789L606183l245064
$$ plain form
4625 53095996 52297879 53323997 53460266 48830069 49666185 52971479 55409689 54776024 51181567
4616 51181567 50548552 49783290 49399902 45661464 44031489 52601116 57515380 52753730 48754667
4607 48754667 50488207 43947889 39609754 48262980 43281425 45593881 55183263 55809505
4599 55809505 56951177 54628975 52942797 44839199 41575037 51621658 51815226 48786184
4591 48786184 48014454 49431014 50294218 46380725 44856264 43168825 46770930 51915729
4583 51915729 54809275 51682721 45771702 49211638 50676365 53216479 51637639 46527008
4575 46527008 47950065 49797048 48558798 46897899 43604490 47552253 49779240 46350086
4567 46350086 45570113 44485556 43059780 42501507 47404013 44434149 44793938 48400121 45155057
4558D5155057R68527n161124L022251J220348M080789L634420n080896o97528
4550D7141844r268K08353l55240m848298l29245M88816Q01772K204678n170537
4541D0132875m931446L786510J374140K865312N452473k379274m560215M712201
4533D6452576L08937p68354K5153n352080K87518K392177K121894P94988n240839
4524D1021970J467421J183948P35761M77213n216619K146501K466124K902159
4516D7184478m537451L590928k160184k354594M538609j167486j0454882K15408
4508C4854826O071718k740646Q62741j623117k554920K371011N04887j457690
4500C6288810K106882K604551J012594j931063k162538k366929o911606M832677
$$ plain form
4558 45155057 46123584 40962460 43984711 45205059 49285848 52920268 47839372 47141844
4550 47141844 47132576 47340929 46985689 42137391 41808146 42296962 43098734 45303412 40132875
4541 40132875 35201429 38987939 40362079 43227391 48679864 46300590 41740375 46452576
4533 46452576 46761513 45993159 46018312 40666232 40953750 43345927 45467821 46262809 41021970
4524 41021970 42489391 43673339 44409100 44886313 39669694 41816195 44282319 47184478
4516 47184478 42647027 46237955 44077771 41723177 46261786 45094300 34639418 34854826
4508 34854826 40926544 38185898 39048639 37425522 34870602 37241613 37746500 36288810
4500 36288810 38395692 41000243 42012837 40081774 37919236 35552307 28640701 33473378
4492C3473378N106643k318036N456707K18038m435356J110101L136412O96564
4484D2444451k209278J206038j692990r14648m8579j328443K06121L338249L976523
4475D4977444m281444j181179j372083k453464K012588J54267k091999m172450
4467C1591680L296165M225999l34672j794437j992148l586233K033314J647291
4459C5086959J120658K4444o499335L054540P611245m140388n59174K477597l748033
4450C4428513N167506M201433j0623154n488516K658704J748713N038121m517306
4442C2614014n823902L514358N065926L061457n65796j276440l000803j704248
4434C1884566K492019m057171n630338P33384K604371J664272J117919O35748
$$ plain form
4492 33473378 38580021 36261985 41718692 41936730 37501374 38611475 41747887 42444451
4484 42444451 40235173 41441211 39748221 38833573 38784994 37456551 37662672 41000921 44977444
4475 44977444 40696000 39514821 38142738 35689274 37701862 37856129 35764130 31591680
4467 31591680 34887845 39113844 38779172 36984735 34992587 31406354 33439668 35086959
4459 35086959 36207617 36232061 29732726 32787266 40398511 36258123 35698949 38176546 34428513
4450 34428513 39596019 43797452 33174298 27685782 30344486 32093199 37131320 32614014
4442 32614014 26790112 30304470 35370396 38431853 37866057 36589617 33588814 31884566
4434 31884566 34376585 30319414 24689076 25422460 28026831 29691103 30809022 31444770
4426C1444770n893729Q35737N968883K035466K073455l84575j527074k870791
4418C1682142N965381k599169l260525L099174l09476K309511o59426m396335
4410C1831277k125869l662570L30288K394054j605672r27118M226154K582154
4402C3042698o24858J81789J624219m732464j834904N687456m68177m885450J902476
4393B9892785K468231o38796R95181o141940R04210q98868k587694N587074n363653
4384B4216530l771978J0543825L856385P86358M6869K976694m771530K301307
4376C6184460N653000n945969p436097P27023M460581p248318p19281L125036
4368B8800435k890307Q158314M574320m740455n433655k121406N659102l122726
$$ plain form
4426 31444770 25551041 26386778 32355661 34391127 36464582 36080007 34552933 31682142
4418 31682142 37647523 35048354 31787829 34887003 34577527 36887038 36227612 31831277
4410 31831277 29705408 26042838 26373126 28767180 27161508 26234390 30460544 33042698
4402 33042698 32417840 32599629 34223848 29491384 27656480 33343936 32875759 27990309 29892785
4393 29892785 32361016 31722220 32717401 26575461 27479671 26580803 23993109 29580183 24216530
4384 24216530 20444552 30988377 34844762 35631120 35677989 38654683 33883153 36184460
4376 36184460 41837460 35891491 28455394 29182417 33642998 26394680 25675399 28800435
4368 28800435 25910128 34068442 38642762 33902307 28468652 26347246 32006348 28883622
4360B8883622k662329Q2259j099626J803005L670540j267630l646729l661776
4352B2101336M796254k510174N72335M268441q33831j033423L427900j452497
4344B9336341m219922N094923O2037p051848N254885K950556l536851n43574q08595
4335B6537952k523942j328812K315103R11884N009375L230038p6183K070161q608389
4326B7537187o519890K061565k957309N40165R32499K071660M78884K043427K600248
4317B8788436J068793l203130P25982J808931j339435L663700k431880m931080
4309B4150317j234690k378105k668535L955817M091863m855220J052437L93453
4301B2507337M601650J564403m708681n139919j824513P172064K279899K203181
$$ plain form
4360 28883622 26221293 26303552 25203926 27006931 30677471 29409841 25763112 22101336
4352 22101336 26897590 24387416 24959751 29228192 28394361 27360938 30788838 29336341
4344 29336341 25116419 30211342 30273379 23221531 28476416 31426972 27890121 27346547 26537952
4335 26537952 24014010 22685198 25000301 25912185 30921560 34151598 34075415 36145576 27537187
4326 27537187 21017297 23078862 20121553 20661718 21594217 23665877 24144761 26188188 28788436
4317 28788436 29857229 26654099 27380081 29189012 27849577 31513277 29081397 24150317
4309 24150317 22915627 20537522 17868987 21824804 25916667 21061447 22113884 22507337
4301 22507337 27108987 28673390 23964709 18824790 17000277 24172341 26452240 28655421
4293B8655421j550341p445260L279703j892136p12736p32647p47953K471538J012530
4284B2338119N468201R34139k954795L62428N714349P83468j836020o428565k967778
4275B1413546Q62392O11895L200172K834479j655161l72455P545328l382081k996494
4266B8061621J785569p471398j934316L594964m638123j791725q25N372677L179602
4257B6158046k98245J543121L751912Q91844K237873M75293j2159576o090590
4249A6509678R73306q32027l140588P91559L482833J060798N816653N830437k293351
4240B8199298l509525j123413J560j293214m99140k346651K833782L62139N985388
4231B8610224p09507n071625O774937J299173k737885Q76188j48645l617691L010313
$$ plain form
4293 28655421 27105080 19659820 22939523 21047387 20334651 19602004 18854051 21325589 22338119
4284 22338119 27806320 28740459 25785664 26148092 31862441 32645909 30809889 24381324 21413546
4275 21413546 22275938 22887833 26088005 28922484 27267323 26894868 34440196 31058115 28061621
4266 28061621 29847190 22375792 20441476 24036440 19398317 17606592 17605767 22978444 26158046
4257 26158046 25859801 27402922 31154834 32046678 34284551 34759844 22600268 16509678
4249 16509678 17482984 16650957 13510369 14301928 17784761 18845559 24662212 30492649 28199298
4240 28199298 24689773 23566360 23567920 22274706 21775566 19428915 22262697 22624836 28610224
4231 28610224 27900717 22829092 29604029 30903202 28165317 29041505 28892860 25275169 28285482
4222B8285482p08407l990289m764415J426902P421548k122650O579926j604686
4214C0523411r626049r91209L003637J433534k279902K294424P47666n83106P21377
4205B5243783K878848k495775l737614J456933J467488j551238l215475K899666
4197B2946616l656287j481985P805684l32332o511256L523949L280380j909693
4189B3665076M077027J574274q708037j02320J566301n640405n26717K040476
4181A7945675K363258N727236K285386r78841K97606n434083o021388n74036M521233
4172B0132046j395388N639227N992013q062498L019990K555845j29252r39041
4164B6812942k014642K234366l876883J911241k62736p451149J441913N256483
$$ plain form
4222 28285482 27577075 23586786 18822371 20249273 27670821 25548171 32128097 30523411
4214 30523411 20897362 19906153 22909790 24343324 22063422 24357846 25105512 24522406 25243783
4205 25243783 28122631 25626856 21889242 23346175 24813663 23262425 20046950 22946616
4197 22946616 19290329 17808344 25614028 25281696 18770440 22294389 25574769 23665076
4189 23665076 27742103 29316377 20608340 20506020 22072321 16431916 15905199 17945675
4181 17945675 20308933 26036169 28321555 27342714 27640320 22206237 16184849 15610813 20132046
4172 20132046 18736658 24375885 30367898 22305400 25325390 27881235 27751983 26812942
4164 26812942 24798300 27032666 23155783 25067024 24804288 17353139 18795052 24051535
4156B4051535K166556K569367j290931l318900j150445K157156j01834L30427
4148B5412931n21159o431591m420716L896389L546880J108181K423823J955696
4140B6970434n932186M997413K643021o385511k16085J267270m784954K482673
4132B1042075P15596j252246j018838O28711M297487K017588k56306j273520m71017
4123B4429530Q36709q36786j005885m505900k843092K785108M120268K425934
4115B5405886k867738l221967K089769j78696j70010J923794l822509J136927
4107B0295456k42625K190148j820886J839825N404471J986524j945531O8526n279779
4098B2496129n180650j42228N132195K097703M97410O55691J47904O06835M147137
$$ plain form
4156 24051535 26218091 28787458 27496527 24177627 23027182 25184338 25082504 25412931
4148 25412931 24891772 18460181 14039465 17935854 21482734 22590915 25014738 26970434
4140 26970434 21038248 26035661 28678682 22293171 22077086 23344356 18559402 21042075
4132 21042075 21757671 20505425 19486587 20115298 24412785 26430373 26174067 24900547 24429530
4123 24429530 25266239 24429453 23423568 18917668 16074576 18859684 22979952 25405886
4115 25405886 22538148 19316181 21405950 21227254 21057244 22981038 19158529 20295456
4107 20295456 20052831 22242979 20422093 22261918 27666389 29652913 27707382 27775908 22496129
4098 22496129 17315479 17173251 22305446 24403149 24900559 25556250 25704154 26310989 30458126
4089C0458126j513339J28310l567017l979912J200345K052520k025948m866371
4081A7886714L017274M392547r47898n00984n919384j131171N075478p05130k321618
4072A8845828r64615k521957P63178L128702J706666k924399M892704N665236
4064B8591343n430038R54371o29459j242517K257977M841270o614763m117427
4056A8610757N713701J050380K011728J433347j661640n77334o56743L713810
4048B9638006n552613o01078N830151J555887O53681l108675m662739k904940
4040B0847680M60936N79717P81047K033907k044305j018673j684264o19088l047286
4031A6289671N755803J397838J053238M785828J093164l862081n12301j668917
$$ plain form
4089 30458126 28944787 29073097 25506080 21526168 22726513 24779033 22753085 17886714
4081 17886714 20903988 25296535 24348637 23847653 17928269 16797098 21872576 21167446 18845828
4072 18845828 17881213 15359256 16122434 19251136 20957802 18033403 22926107 28591343
4064 28591343 23161305 24115676 23486217 22243700 24501677 29342947 22728184 18610757
4056 18610757 24324458 25374838 27386566 28819913 27158273 26580939 25924196 29638006
4048 29638006 24085393 23484315 29314466 30870353 31524034 28415359 23752620 20847680
4040 20847680 21308616 21888333 22669380 24703287 22658982 21640309 19956045 19336957 16289671
4031 16289671 22045474 23443312 24496550 29282378 30375542 26513461 26001160 24332243
4023B4332243k907159O071294j392104m93431L101614l336176M109598k372042
4015B7113837J242874J254280k423134K522902j356948k24319k816983R74375
4007B6286884q072154P174548m13580l706749Q582218n61481k953999m00013j562638
3998B4373036K233528K203695n437327K708579j473963M68994M071264l051604
3990B6096202n026497J86984Q181199k212785J713484l325245l398033J1790397
3982C4005706M736595k224898o491598m142412K893365L783682q87182n641167
3974B6032091J184736l775983Q39499K736191l292446m043192L920878M089001
3966B7690775n23886K047111n661106J675596N983647L6484k408734K537005j401704
$$ plain form
4023 24332243 21425084 27496378 26104274 25610843 28712457 25376281 29485879 27113837
4015 27113837 28356711 29610991 27187857 29710759 28353811 28129492 25312509 26286884
4007 26286884 18214730 25389278 24975698 21268949 29851167 29289686 26335687 25935674 24373036
3998 24373036 26606564 28810259 23372932 26081511 24607548 25076542 29147806 26096202
3990 26096202 21069705 21256689 29437888 27225103 28938587 25613342 22215309 34005706
3982 34005706 38742301 36517403 30025805 25883393 28776758 32560440 31673258 26032091
3974 26032091 27216827 23440844 24280343 27016534 23724088 19680896 23601774 27690775
3966 27690775 27166889 29214000 23552894 25228490 31212137 31248621 28839887 31376892 29975188
3957B9975188j515203R576917m651734n435646J214019j153289M944846j312326
3949C1642772K683222m36704k879794j189438J360164o867326J09039M406372
3941B8828307j978966M970978O60898j517423J471350q10043k120022Q7798K032514
3932C1625391n130565M928890P3424L71280K956994K569718J71464j123355K126744
3923C8569985Q13634l040174k269433l205616N786636N830250m535009K214624
3915D0164897L65457J0322N331503J33027l208647J129238k871057L505496o018386
3906C8541850j259014m337840m167790N901875M583185j903853k106313O306032
3898D1558132p72432n088272J577036k484012P55781k216411Q615626m176673
$$ plain form
3957 29975188 28459985 38036902 33385168 27949522 29163541 28010252 32955098 31642772
3949 31642772 34325994 33889290 31009496 29820058 31180222 24312896 24421935 28828307
3941 28828307 26849341 31820319 32481217 30963794 32435144 31625101 29505079 29592877 31625391
3932 31625391 26494826 31423716 31497140 31868420 34825414 37395132 37566596 36443241 38569985
3923 38569985 39383619 36343445 34074012 30868396 36655032 42485282 37950273 40164897
3915 40164897 40530354 40540676 45872179 46005206 42796559 43925797 41054740 44560236 38541850
3906 38541850 37282836 32944996 28777206 34679081 39262266 37358413 35252100 41558132
3898 41558132 40785700 35697428 37274464 34790452 35546233 33329822 41945448 37768775
3890C7768775Q89976L802780K94166k325662j504018O43812m43692j635665L271327
3881D0761799Q431684n36596J950708K564042p347588m505990O83173N73741n31491
3872D2043482N57020R56141M111651L501740m37242J164789o075463p05092J203323
3863D6320349o97459K384930m23839K582296M652441k448680q04706j528604J088274
3854E1125002L550003L868444o43835O98197n59293k83258k027970J63931L189177
3845E9080398J59418j527835N526190k250352l119081K857176n2783l675984j435843
3836E5561304K120497N842816k259432L96371K985476l27280p522637K183028
3828E8980143L266798m942160J313041j169022J645872k402423o23078P219828
$$ plain form
3890 37768775 38658751 42461531 42755697 40430035 38926017 39569829 39126137 37490472 40761799
3881 40761799 49193483 48656887 50607595 53171637 45824049 41318059 42001232 42574973 42043482
3872 42043482 42600502 43556643 47668294 51170034 50732792 51897581 45822118 45117026 46320349
3863 46320349 45622890 48007820 47583981 50166277 54818718 52370038 51565332 50036728 51125002
3854 51125002 54675005 58543449 57899614 58597811 58038518 57755260 55727290 55891221 59080398
3845 59080398 59239816 57711981 63238171 60987819 57868738 60725914 60673131 56997147 55561304
3836 55561304 57681801 63524617 61265185 61661556 64647032 64319752 56797115 58980143
3828 58980143 62246941 57304781 58617822 57448800 59094672 56692249 56069171 63288999
3820F3288999l851155J861899Q045177m5696J44291N59031l502485j896849K353411
3811F6956623K434977m616354L926263j966711l66798N675166l496854k602431
3803F5943881P574000q75118q428145k823069M32176L320984O178815J594043
3795G2917567j445394K143408p03674N233879j55384k724145k576586k622411
3787G0067260p97089k470043K842663J957469j117780P342276J069815r0183L22525
3778G9126913k98352k28678j831058n161221J143361j38360M897291J170147J532107
3769H0212150J45069J945148L801191J473494k190732k024842M209775k423565
3761H5147688L65051l820118n298191J862152J185784M915598K97190J74261j022170
$$ plain form
3820 63288999 59437844 61299743 69344920 69299224 69443515 70002546 66500061 64603212 66956623
3811 66956623 69391600 64775246 68701509 66734798 66368000 72043166 68546312 65943881
3803 65943881 73517881 72642763 64214618 61391549 61823725 65144709 71323524 72917567
3795 72917567 71472173 73615581 72911907 78145786 77990402 75266257 72689671 70067260
3787 70067260 69270171 66800128 69642791 71600260 70482480 77824756 78894571 78804388 79126913
3778 79126913 78828561 78599883 76768825 71607604 72750965 72612605 77509896 78680043 80212150
3769 80212150 80357219 82302367 86103558 87577052 85386320 83361478 87571253 85147688
3761 85147688 85512739 81692621 76394430 78256582 79442366 84357964 84655154 84829415 83807245
3752H3807245k396821K370590o58411k772458j054811o2749O178583M648315m399495
3743H5659988M307196J233078o131177J739144M98611q540458J939644N431863
3735H6137889m468938R41378m471062P74627M607000j742743R489803J249365
3727I2517319j076235O11031m177073j728021m097549J084557N493411j581290
3719H7046150K149150K011916m94006N105538L479127q735685K116269R30965
3711I3609424m917302J752104n460101n314750K103335K586176M719870J262827
3703I0341583O22659P986581k512501m750665J434278k755734n480125K76186
3695H5162262j360761K865859j570631l415563M117106N699973l702232N318501
$$ plain form
3752 83807245 81410424 83781014 83122603 80350145 79295334 79232585 85411168 90059483 85659988
3743 85659988 89967184 91200262 85069085 86808229 87306840 78766382 80706026 86137889
3735 86137889 81668951 82610329 78139267 78913894 83520894 81778151 91267954 92517319
3727 92517319 91441084 92052115 87875042 86147021 82049472 83134029 88627440 87046150
3719 87046150 89195300 91207216 90713210 95818748 99297875 90562190 92678459 93609424
3711 93609424 88692122 90444226 84984125 79669375 81772710 84358886 89078756 90341583
3703 90341583 90964242 98950823 96438322 91687657 93121935 90366201 84886076 85162262
3695 85162262 83801501 86667360 85096729 81681166 85798272 91498245 87796013 93114514
3687I3114514l244856j315769K944738o09161J679238j861103l051973l111462
3679H4544166J991345j496803j085689M186697M836754L348532J817378m053013
3671I4089367m829605j465275P10651J62194K6865k473967K310839J690788l00150
3662H9921707k868411L373594J074910K861942J173321k411694j666200m013602
3654H7445567J286314n76759m667999L558903K624463N589528M401444o02760
3646I9058701l43269K352624j918700l923947K422126k222514J157196K615858
3638I9198075o928111m22933p11065o245454J875638J550101j296485L741790
3630I0761556l134802K290332L686940O114641j535977l891121l35000q25325
$$ plain form
3687 93114514 89869658 88553889 91498627 90889466 92568704 90707601 87655628 84544166
3679 84544166 86535511 85038708 83953019 88139716 92976470 96325002 98142380 94089367
3671 94089367 89259762 87794487 88505138 88667332 88694197 86220230 88531069 90221857 89921707
3662 89921707 87053296 90426890 91501800 94363742 95537063 93125369 91459169 87445567
3654 87445567 88731881 88155122 83487123 87046026 89670489 95260017 99661461 99058701
3646 99058701 98715432 101068056 99149356 95225409 97647535 95425021 96582217 99198075
3638 99198075 92269964 91847031 91135966 84890512 86766150 88316251 87019766 90761556
3630 90761556 87626754 89917086 93604026 99718667 98182690 94291569 93956569 93131244
3622I3131244L390737k045068l168846l999301j093497K559121k449075L150194
3614H9475509M79009K22192O738881l566199j897128M221499J589996n691898
3606I1571861L337646M170274m515086N128794N506304m500415K230076k932945
3598I9996509l057155j620982K913432k519576j154232m625614N613324K145067
3590I7690773l744188M835015N25165Q8508N583192K287824r318728k332766j90283
3581I5424512L846219J369931l434833j360564j386615K691426L607614j341954
3573I9415736Q81533N393058M23982Q21384K38539n786347l69898K506412l154943
3564A00369456J914890m001284P15680Q193087K716920q5187J589223l298877
$$ plain form
3622 93131244 96521981 94476913 91308067 87308766 86215269 88774390 86325315 89475509
3614 89475509 89954518 90176710 96915591 93349392 91452264 95673763 97263759 91571861
3606 91571861 94909507 99079781 94564695 99693489 105199793 100699378 102929454 99996509
3598 99996509 96939354 95318372 98231804 95712228 94557996 89932382 95545706 97690773
3590 97690773 93946585 98781600 99306765 99395273 104978465 107266289 97947561 95614795 95424512
3581 95424512 99270731 100640662 97205829 95845265 94458650 97150076 100757690 99415736
3573 99415736 100297269 105690327 106114309 106935693 107174232 101387885 101017987 103524399 100369456
3564 100369456 102284346 98283062 98998742 107191829 109908749 109823562 111412785 108113908
3556A08113908p421629J242028M04916l72222m512186J489132N123748k91970
3548A03775725j184148k678497p68427K552476K045083M408729L15198n34564
3540A07931575J743808p54601J701041N305646p429924K232461K446367p9333
3532A13097040K393331k696297m300457k012700J771866L456888K987057O82326
3524A15379054K002747L25263K774776l873676l383849L261000K189025n254052
3516A13420288J849469k144406l548394L913613J125755n34288K837813l41869
3508A16577981M05181K246003k037091k913965J880667J656640J136010Q56828
3500A19808254j62168k295253M105329K131227l767777l6599m22690j850540n06734
$$ plain form
3556 108113908 100692279 101934307 102339223 101967001 97454815 98943947 104067695 103775725
3548 103775725 102591577 99913080 99144653 101697129 103742212 108150941 108466139 107931575
3540 107931575 109675383 108920782 110621823 115927469 108497545 110730006 113176373 113097040
3532 113097040 115490371 112794074 108493617 106480917 108252783 111709671 114696728 115379054
3524 115379054 117381801 117707064 120481840 116608164 113224315 116485315 118674340 113420288
3516 113420288 115269757 113125351 109576957 113490570 114616325 114082037 116919850 116577981
3508 116577981 116983162 119229165 117192074 114278109 116158776 117815416 118951426 119808254
3500 119808254 119646086 117350833 121456162 123587389 119819612 119783013 119360323 117509783 117003049
3491A17003049L124236L6803N159590j796891l089356N641785J279545J078723
3483A28437484J889373j874252l217069l037135J3681j453234J265857k102128
3475A19922577m89398M414872K551341k528789m52412K840232J472420M460393
3467A32191236k24621p514391M108801P037548J665387l643945m803274l412993
3459A25403748L472454J731797l07481K471467j635690N038903J450650J610748
3451A39236596j140846k63196J601762k655202J046547k465920J585194N16787
3443A37461722j156326j005333j100936M456704l538255r12427M285682o41863
3435A37848968j395948n87893l894495N34632K951822r00410J594918K227855
$$ plain form
3491 117003049 120127285 120164088 125323678 123526787 120437431 126079216 127358761 128437484
3483 128437484 130326857 128452605 125235536 122198401 122212082 120758848 122024705 119922577
3475 119922577 119433179 123848051 126399392 123870603 123418191 126258423 127730843 132191236
3467 132191236 131966615 124452224 128561025 135598573 137263960 133620015 128816741 125403748
3459 125403748 128876202 130607999 130300518 132771985 131136295 136175198 137625848 139236596
3451 139236596 138095750 137832554 139434316 136779114 137825661 135359741 136944935 137461722
3443 137461722 136305396 135300063 134199127 138655831 135117576 134205149 138490831 137848968
3435 137848968 136453020 135865127 131970632 132505264 135457086 134556676 136151594 138379449
3427A38379449k870994P069916M204508o171153R1698L821733j108005P128669
3419A50545821L22574o017001L044971J221352L117332m563298m155377l89068
3411A43127306O4869M793874L305254j630326l849035M457245K209460j509457
3403A50969190j887898j665593J105989L050951j242742l149488r91777l59563
3395A45829069K885131N085312P20031k288480k198195M416325J275863M78213
3387A56203269m106461J239894K328990l617940P469762K90026j965591l88362
3379A57453587K026305k568541L184045K820015L72878j909616n676933k830712
3371A52871028k947243k844018O505113M181783l527078j930174O061532j940305
$$ plain form
3427 138379449 135508455 142578371 146782879 140611726 140703424 144525157 143417152 150545821
3419 150545821 150868395 144851394 147896365 149117717 152235049 147671751 143516374 143127306
3411 143127306 143192175 147986049 151291303 149660977 145811942 150269187 152478647 150969190
3403 150969190 149081292 147415699 148521688 151572639 150329897 147180409 146188632 145829069
3395 145829069 148714200 153799512 154519543 152231063 150032868 154449193 155725056 156203269
3387 156203269 152096808 153336702 155665692 152047752 159517514 159807540 157841949 157453587
3379 157453587 159479892 156911351 160095396 162915411 163288289 161378673 155701740 152871028
3371 152871028 149923785 147079767 153584880 157766663 154239585 152309411 158370943 156430638
3363A56430638r48986N10594R48920k668874K250363J313358o332098M625024
3355A56128939M911662l181725K814933k487995n236520M039345O47874P56751
3347A58393264J890305l39913L783962Q65486q268749J341343r02701N401272
3339A62164269q3301m149442j499989l991731L131445L052396r48694J519771
3331A59194724J081206M01861P473280L34436j1678279K902972J110296l156014
3323A57664482J68344J316614j304105M811219L674710m244972l448923K773947
3315A61411316J003438P65841O815681k932234n10344L093574p087338L552476
3307A66112410J008767k49957K769420R49872m656211L542423k000059l372824
$$ plain form
3363 156430638 155481652 155992246 156941166 154272292 156522655 157836013 151503915 156128939
3355 156128939 161040601 157858876 160673809 158185814 152949294 156988639 157636513 158393264
3347 158393264 160283569 159943656 163727618 164593104 156324355 157665698 156762997 162164269
3339 162164269 162080968 157931526 156431537 152439806 155571251 158623647 157674953 159194724
3331 159194724 160275930 160677791 168151071 168485507 156807228 159710200 160820496 157664482
3323 157664482 157832826 159149440 157845335 162656554 166331264 162086292 158637369 161411316
3315 161411316 162414754 163180595 169996276 167064042 166553698 169647272 162559934 166112410
3307 166112410 167121177 166871220 169640640 170590512 165934301 169476724 167476665 164103841
3299A64103841M870923M8300l839816k05241N232221j498472J541828P81001K185821
3290A73220406q55152o0503K27599M734614J682736K300352L53422k723625K964949
3281A81844798n5983p452687M591283P389026k29573K585255K684634l812054
3273A87544699l85788O18750J303002o57807M173529M176526k585286j377750
3265A92809875O89818l658840j752297M998759K307718o06746J396595N548045
3257B01732927Q169428j664530p711016N8902M755242j716320K246347N451226
3249B11322206o161523j164994J0497670M58547l514987Q27896L765821L841609
3241B19872245M113794L121937l358310n80924J456847M739750n93749j351962
$$ plain form
3299 164103841 168974764 169023064 165183248 164978007 170210228 168711756 170253584 171034585 173220406
3290 173220406 172365254 172304751 172532350 177266964 178949700 181250052 181603474 178879849 181844798
3281 181844798 181788815 174336128 178927411 186316437 186086864 188672119 191356753 187544699
3273 187544699 187158911 187777661 189080663 188422856 192596385 196772911 194187625 192809875
3265 192809875 193499693 189840853 188088556 193087315 195395033 194788287 196184882 201732927
3257 201732927 209902355 208237825 200526809 200585711 205340953 203624633 205870980 211322206
3249 211322206 205160683 203995689 214493359 214951906 211436919 212264815 216030636 219872245
3241 219872245 223986039 227107976 223749666 223168742 224625589 229365339 228771590 227419628
3233B27419628L162863K021879M967055M570515p834633l953684m77773K604999
3225B32480849J767074O058285L701763K577099j954772K106706L306180M387607
3217B54430791p15062r35784M390109R29516O439200m689915R34762O6093R06742
3208B61756452N815153N589158l596390L202231J1016712o235100k603041L70082
3200B75315257k601116N264561J0030526J951408k473718K653771N57878Q016450
3192B98715017J855782j097966j359175L57227K455800J322074M195584j210459
3184C05233884j489274O732178M307744j28825K894386P456481k773789L210134
3176C25442919L782820m501338k419348K32951N440620N670777Q314686k162096
$$ plain form
3233 227419628 230582491 232604370 237571425 242141940 234307307 230353623 229875850 232480849
3225 232480849 234247923 240306208 244007971 246585070 244630298 246737004 250043184 254430791
3217 254430791 253715729 252779945 257170054 258099570 264538770 259848855 260783617 260849710 261756452
3208 261756452 267571605 273160763 269564373 272766604 283783316 277548216 274945175 275315257
3200 275315257 272714141 277978702 288009228 289960636 287486918 290140689 290698567 298715017
3192 298715017 300570799 299472833 298113658 298470885 300926685 302248759 306444343 305233884
3184 305233884 303744610 310476788 314784532 314655707 317550093 325006574 322232785 325442919
3176 325442919 329225739 324724401 322305053 322538004 327978624 333649401 341964087 339801991
3168C39801991j064209N688180L430170N30461J95131P65279o33625L130513j326082
3159C50517809R55210L707924j16933O702797O89398k641321M118106L105918
3151C67038908j377516J699579n35148o181436R55347K727661J904809N882630
3143C72114834k263239L308161L750055M932457j0546n785629l48809k27714M60884
3134C75930454N796585k335885l134383j499400P108108N943418J576009j474497
3126C87910409K696282K199118l451271K576915j56733l056357n06355L397223
3118C91609231K455598q31291n98305N100931P6881l196332K600153o425312j492802
3109C89298752K82717n09062N299090j629530L222622k023721l780851K391948
$$ plain form
3168 339801991 338737782 344425962 347856132 348386593 348581724 349347003 348713378 351843891 350517809
3159 350517809 351473019 355180943 355064010 361766807 362456205 359814884 363932990 367038908
3151 367038908 365661392 367360971 366825823 360644387 361599734 364327395 366232204 372114834
3143 372114834 369851595 373159756 376909811 381842268 381831722 376046093 375697284 375469570 375930454
3134 375930454 381727039 379391154 376256771 374757371 381865479 387808897 389384906 387910409
3126 387910409 390606691 392805809 389354538 391931453 391774720 388718363 388212008 391609231
3118 391609231 394064829 393233538 392635233 397736164 397813045 394616713 397216866 390791554 389298752
3109 389298752 389581469 389072407 394371497 392741967 395964589 393940868 390160017 392551965
3101C92551965M524957j713903o79700j00950j784464N77022k192255j271490
3093C89911182m776168n174154M800883K24210n576305j414078L264272R35812
3085C82195654k732369m171334l116354K385244O11306p57447k36862n584920
3077C68592918J41189k318366R89509o223561l231278J021238n890041m686205
3069C48395403l293157l955275o28372L21784l136007L104851p432506p113771
3061C26262950J772769m241062m194074K47356l890371m807685l101606k893778
3053C05154499n893341l498716j070265n916703m179789J404195J075614r077548
3045B77997946l740156K03367m729187l112900k273150n909563o635832J867849
$$ plain form
3101 392551965 397076922 395363019 394683319 394582369 392797905 393374927 391182672 389911182
3093 389911182 385135014 379960860 384761743 384985953 379409648 377995570 381259842 382195654
3085 382195654 379463285 375291951 372175597 374560841 375172147 374414700 374177838 368592918
3077 368592918 368734107 366415741 367405250 361181689 357950411 358971649 353081608 348395403
3069 348395403 345102246 341146971 340518599 340840383 337704376 340809227 333376721 326262950
3061 326262950 328035719 323794657 319600583 319847939 315957568 311149883 308048277 305154499
3053 305154499 299261158 295762442 294692177 288775474 284595685 285999880 287075494 277997946
3045 277997946 274257790 274461157 269731970 266619070 264345920 258436357 251800525 253668374
3037B53668374L672036k487046n671621l889520l802682k403220l559911k771439
3029B32754971m898634m038948j177698j823185l853771m181400k772845K958882
3021B12967372q64948n561486j150481l828451q53175K58412n751439n077949
3013A90137855J320628k313900J648324J279180j986045l825027L50303k371674
3005A84239644m202624o086992j680415q492510O95242R047596m944041j64731
2997A68411169j152858j866569K197120p91361l763794j109357m259811o22466
2989A57042073K860058q301961j919489J184212q358021M284830L572822m520859
2981A45843665P35639J33655m090345k437490m641114L49975j585025J767701
$$ plain form
3037 253668374 257340410 254853364 249181743 245292223 241489541 239086321 235526410 232754971
3029 232754971 227856337 223817389 222639691 220816506 216962735 212781335 210008490 212967372
3021 212967372 212102424 206540938 205390457 201562006 200708831 200967243 195215804 190137855
3013 190137855 191458483 189144583 190792907 192072087 190086042 186261015 186611318 184239644
3005 184239644 180037020 173950028 172269613 163777103 164472345 173519941 168575900 168411169
2997 168411169 167258311 165391742 167588862 166797501 163033707 161924350 157664539 157042073
2989 157042073 159902131 151600170 149680681 150864893 142506872 146791702 150364524 145843665
2981 145843665 146579304 146712959 142622614 140185124 135544010 135893985 134308960 136076661
2973A36076661N343987n840762j21252l341639m3535j550896n564182O50030l352835
2964A22255577J028063j046833j989661Q15973l886212m140105L10881n45020
2956A12802663j70049M653173m244696j156790R456918j408523j318003n970066
2948A12644627l627585K181183L027913n000616k734040j740854K156930K770869
2940A09678427n29170J907665l47602k635510N023430m292717m123631k45794
2932A04435098l412053L283983J459651p234413M3659L222454K806531L763002
2924A08367912m986204q345727o793539M699501O128985j663291o553518l975652
2916H6878467M424670O437074K690039j839481l661523j190708N472594O7544
$$ plain form
2973 136076661 141420648 135579886 135458634 132116995 132073460 130522564 124958382 125608412 122255577
2964 122255577 123283640 122236807 120247146 121063119 117176907 113036802 113347683 112802663
2956 112802663 112632614 117285787 113041091 111884301 121341219 119932696 118614693 112644627
2948 112644627 109017042 111198225 114226138 109225522 106491482 104750628 106907558 109678427
2940 109678427 109149257 111056922 110709320 108073810 113097240 108804523 104680892 104435098
2932 104435098 101023045 104307028 105766679 98532266 98575925 101798379 104604910 108367912
2924 108367912 103381708 95035981 88242442 92941943 99070928 97407637 90854119 86878467
2916 86878467 91303137 97740211 100430250 98590769 94929246 93738538 99211132 99278676
2908I9278676p289696p902946K458295N006930K486964J232026l120619J505916
2900I3655546M609163l775415j341271l600647r326480J514285L616772L225638
2892H8577591l235082k377023N68188M599886L912764K750848l861538o449446
2884H4486188k634492J441876m552264n032538l186579J697297M217031L714989
2876H0151508K537472n509393m476660P012849R24145L064956j944840m696674
2868G7063363j862073n46102J295357m529252l486853K015761Q54218K996358
2860G3800777L148157k801615l222535L820521K089550m689135l12358L230842
2852G5064204L117962L57731J091815J951135m955153k463287L129253M19555
$$ plain form
2908 99278676 91988980 84086034 86544329 91551259 94038223 95270249 92149630 93655546
2900 93655546 98264709 94489294 93148023 89547376 80220896 81735181 85351953 88577591
2892 88577591 85342509 82965486 83533674 88133560 92046324 94797172 90935634 84486188
2884 84486188 81851696 83293572 78741308 73708770 70522191 72219488 76436519 80151508
2876 80151508 82688980 77179587 72702927 79715776 80639921 83704877 81760037 77063363
2868 77063363 75201290 74655188 75950545 71421293 67934440 69950201 70804419 73800777
2860 73800777 76948934 74147319 70924784 74745305 76834855 72145720 71833362 75064204
2852 75064204 78182166 78539897 79631712 81582847 76627694 74164407 77293660 77713215
2844G7713215m074633J469474j211745l908782Q52312l52408j920317m739896
2836F3827220L265694Q83454K508854j895753n670408m05070j123470K86300l790637
2827E7886184k575368N97490N484125k223201M12148j684237k469191L729073
2819E9157023J027848l927965o24902K853669L11485M747761N42748m676445j620816
2810E7790406k14373j844548j784343l241009L991687M763967j590547n65815
2802E7305425O45591k582531l84358l93156j648729L28414m273242r14698k212348
2793D5870368l52234J303000M449031N165699L54731J806052q271944K223418
2785E2548121j07536q317326j000184K091420J62878j144328O058394q77544l549910
$$ plain form
2844 77713215 73638582 75108056 73896311 69987529 70839841 70487433 68567116 63827220
2836 63827220 67092914 67976368 70485222 68589469 62919061 62513991 61390521 61676821 57886184
2827 57886184 55310816 55908306 61392431 59169230 59581378 57897141 55427950 59157023
2819 59157023 60184871 56256906 55632004 58485673 58797158 63544919 64087667 59411222 57790406
2810 57790406 57576033 55731485 53947142 50706133 54697820 59461787 57871240 57305425
2802 57305425 57951016 55368485 54984127 54590971 52942242 53270656 48997414 48082716 45870368
2793 45870368 45518134 46821134 51270165 56435864 56790595 58596647 50324703 52548121
2785 52548121 52440585 44123259 43123075 45214495 45377373 44233045 50291439 49413895 45863985
2776D5863985N719342k89151O24265n106212o91679N145697o53515l899553j398239
2767D5314940o404136o56305O653179J693577n173797J980047R43433k139549
2759D2211389N03661m852389j0396853L7442N7858M069533L620805k471478K144514
2750C4924482K382533R12784m081920O761637l197637l671520M510820k285545
2742C6255634m367747o562741L336858L044780o20479P176012L151570o103223
2734C5310664K434890M554600n052639k904843j452825k662394j743846M684119
2726C3167726O128957m365087n614292l478139L842048O10315R36549k032541
2718B9195536m622912n72553L836764K514875o202580M259604N89433j070119
$$ plain form
2776 45863985 51583327 51294176 51918441 46812229 46120550 51266247 50612732 46713179 45314940
2767 45314940 38910804 38254499 44907678 46601255 41427458 43407505 44350938 42211389
2759 42211389 42715050 37862661 27465808 27503250 27561108 31630641 35251446 32779968 34924482
2750 34924482 37307015 38219799 34137879 40899516 37701879 34030359 38541179 36255634
2742 36255634 31887887 25325146 28662004 31706784 31086305 38262317 41413887 35310664
2734 35310664 37745554 42300154 37247515 34342672 32889847 30227453 28483607 33167726
2726 33167726 39296683 34931596 29317304 25839165 29681213 30291528 31228077 29195536
2718 29195536 24572624 24000071 27836835 30351710 24149130 28408734 28998167 27928048
2710B7928048L622153l669586J30297J731553J206865O042429n232507o465339
2702B5293913O18982k959439N01781O561189n398962k724848N317760k273124
2694B4937252J103834o2339j901572j668740j627516P767100Q49558l936458k149035
2685B3312084J427751n682797l88905M3024m417165K516206K454021j57020L83112
2676A9490311N300900J450298N98904l107233k492790K919810j196533L479207
2668B6442874o802097n331342K931164M847391K326939p0642l854274m346682
2660A6143331Q197315j305325j376004L920485q200350q07802Q69909j044992
2652A6396567k786905L387999L327672K316024L079586k374833o208102o765931
$$ plain form
2710 27928048 31550201 27880615 28010912 29742465 30949330 36991759 31759252 25293913
2702 25293913 25912895 22953456 23455237 30016426 24617464 21892616 27210376 24937252
2694 24937252 26041086 25978747 24077175 22408435 20780919 28548019 29397577 25461119 23312084
2685 23312084 24739835 19057038 18668133 18711157 14293992 16810198 19264219 19107199 19490311
2676 19490311 24791211 26241509 26840413 23733180 21240390 24160200 22963667 26442874
2668 26442874 19640777 14309435 17240599 22087990 24414929 24344287 20490013 16143331
2660 16143331 24340646 23035321 21659317 25579802 17379452 16571650 17441559 16396567
2652 16396567 13609662 16997661 20325333 22641357 25720943 23346110 17138008 10372077
2644A0372077N867321N431435k211079m634241n889526K521084J986546K252556
2636A5696173R57543k833482k884068N407146N266429m340485l7033j934538k59960
2627A5037725N34175k9240l20769r442181J320738N115413q90291o43259j57069
2618A0525242N77143K708908N429336k385088k291495o36212o585j41656n853503
2609G926090J668907J032251j901646L061747K161582j378096r68272J984053
2601A3586616K547366k290p470641j69481l01558N357231K849806m255630j102075
2592A1039344j267022p00301k040446k478622N69481r24086P235453k042489J754054
2583A1145366L91r1265O72754K508415M620374r884869l581541O849246R60342
$$ plain form
2644 10372077 16239398 21670833 19459754 14825513 8935987 11457071 13443617 15696173
2636 15696173 16653716 13820234 10936166 16343312 21609741 17269256 17232223 15297685 15037725
2627 15037725 15571900 15542660 15221891 5779710 7100448 12215861 11325570 10682311 10525242
2618 10525242 11102385 13811293 19240629 16855541 14564046 13927834 13921249 13779593 7926090
2609 7926090 9594997 10627248 8725602 11787349 13948931 12570835 11602563 13586616
2601 13586616 16133982 16131692 8661051 8491570 8190012 13547243 16397049 12141419 11039344
2592 11039344 9772322 9072021 7031575 4552953 5122434 4198348 11433801 9391312 11145366
2583 11145366 11145757 11054492 11727246 14235661 18856035 8971166 5389625 12238871 13199213
2574A3199213l121117J61101o400870J145788N568839l41879o08031m779146K190991
2565G014889N616122l442649o784672J826172k177348K628606Q378249j88066
2557A2871303k525448m204941j160551K262357j361892L968683l372682m465618
2549B011211O618815L210777j611234k430838l80597l968162K270947o46509m180181
2540H94229N548997K689450j488689M134687J170835k310753k352106k738807
2532E547843k513142K976686K181030p07510K20057m870972j775961K172070j625860
2523A604241j94811N187336o404355o66882j513791R66949N40284K35282K430644
2514B184897j344584N604254K36798k65146l568630M556560L236948m481724o106424
$$ plain form
2574 13199213 10078096 10239197 3838327 4984115 10552954 10211075 9603044 4823898 7014889
2565 7014889 12631011 9188362 2403690 4229862 2052514 4681120 13059369 12871303
2557 12871303 10345855 6140914 4980363 7242720 5880828 9849511 6476829 2011211
2549 2011211 8630026 11840803 10229569 7798731 7418134 3449972 5720919 5074410 894229
2540 894229 6443226 9132676 7643987 11778674 12949509 10638756 8286650 5547843
2532 5547843 3034701 6011387 8192417 7484907 7704964 2833992 1058031 3230101 1604241
2523 1604241 1409430 6596766 192411 -474471 -1988262 -1021313 -481029 -245747 2184897
2514 2184897 840313 6444567 6681365 6416219 2847589 7404149 10641097 6159373 52949
2505E2949k179691K03157j865385M837477K791943k088847M692715L679169k475964
2496G647523j997226p79225k008651j09134J6930j155834j181733l178942M125173
2487A378881j386177m741494O623586R62898j770319L547670K904390o731517
2479G87918n00328J203775k883291O68471K69365L198622R50322l411402L268260
2470C551712J509588k899668o15528K016077J570820M762700q88674l174246l254037
2461B578744K557649L810625m735380R68190m071243p77230N507773k261040l040730
2452E37358l451605o16367J268988J405356k866294k07449p74178L34313L685237
2443f84641K808598j122669n938240J345907L718912J130748M319281j750298
$$ plain form
2505 52949 -2126742 -1923585 -3788970 1048507 3840450 1751603 6444318 10123487 7647523
2496 7647523 5650297 4871072 2862421 2753287 2770217 1614383 432650 -2746292 1378881
2487 1378881 -7296 -4748790 1874796 2837694 1067375 4615045 7519435 787918
2479 787918 287590 1491365 -1391926 -723455 -454090 2744532 3694854 283452 3551712
2470 3551712 5061300 2161632 1546104 3562181 5133001 9895701 9007027 5832781 2578744
2461 2578744 5136393 8947018 4211638 5179828 1108585 331355 5839128 3578088 537358
2452 537358 -2914247 -3530614 -2261626 -856270 -3722564 -3930013 -4704191 -4369878 -684641
2443 -684641 2123957 1001288 -4936952 -3591045 127867 1258615 5577896 3827598
2435C827598l224924j55875J565270r03102j996914j840537P95169Q858624j814263
2426E111046j981723j882489J560204K365372j051712J179548o477880j552174
2418b729808R12246l928176k281887K680671j8307P435202L848160k383027m78643
2409C056431K26039K57643L015552n303484o564934J730363k145058K543007M205097
2400A020656k050362m87559K233333J59702j068003K327138K04515m288796L701347
2391A751971k584667o021626k83053k524250r18084Q292105J02803j121414J484892
2382a821323j894459J116439L352844k015674k521963n03958J586116P10932O55678
2373a335368l83659L73480j335225P452274m125462l500459L072336L80344O85389
$$ plain form
2435 3827598 602674 446799 2012069 1108967 -887947 -2728484 -1933315 6925309 5111046
2426 5111046 3129323 1246834 2807038 5172410 4120698 5300246 -1177634 -2729808
2418 -2729808 -1817562 -5745738 -8027625 -5346954 -5365261 2069941 5918101 3535074 3056431
2409 3056431 3282470 3540113 6555665 1252181 -5312753 -3582390 -5727448 -3184441 1020656
2400 1020656 -1029706 -1517265 716068 875770 -192233 2134905 2339420 -1949376 1751971
2391 1751971 -832696 -6854322 -7137375 -9661625 -10579709 -2287604 -2184801 -3306215 -1821323
2382 -1821323 -3715782 -2599343 753501 -1262173 -3784136 -4288094 -2701978 -1991046 -1335368
2373 -1335368 -1719027 -1345547 -2680772 4771502 646040 -2854419 217917 598261 1283650
2364A283650L545892m389287j0049522J255179Q515328o21648K138941r77844
2356G00689o186523J639498K547810j146749l103536j347780J567052N760130
2348D30591j439139P47705j267595m232922L571751O315468m715223p031564J773981
2339e846947M939872M678979j286367l013777k792152j832039L794607j871898
2331c229722k435734k840838K767278L767846n1859K953648l530281k931440O425739
2322H94637K16910l616010R83049m974615m093870K333349j030961J431330R62000
2313f894181J838131O614363j565539l311860M38644l448872j448251K003473
2305e774092J210380L855818L650104j178321L798257o073674q53691o81018j854971
$$ plain form
2364 1283650 4829542 440255 -9609267 -8354088 161240 -460408 1678533 700689
2356 700689 -5485834 -3846336 -1298526 -2445275 -5548811 -6896591 -5329539 430591
2348 430591 -1008548 -260843 -1528438 -5761360 -2189609 4125859 -589364 -7620928 -5846947
2339 -5846947 -907075 3771904 2485537 -528240 -3320392 -5152431 -1357824 -3229722
2331 -3229722 -5665456 -8506294 -5739016 -1971170 -2023029 930619 -2599662 -5531102 894637
2322 894637 1111547 -2504463 -1521414 -6496029 -10589899 -8256550 -9287511 -7856181 -6894181
2313 -6894181 -5056050 1558313 -7226 -3319086 -2880442 -6329314 -7777565 -5774092
2305 -5774092 -4563712 -707894 2942210 1763889 5562146 -511528 -1365219 -2046237 -3901208
2296c901208N073966j656453O86357j00402p68204m35893K134547k665469j662397
2287c295156J20316j07724L920444l066169n06001m188978l440404O891286j062143
2278d734529M162916K10970o361436O517940J891338j936650J607842o950536
2270e592145M305401R074462m227662k359346n854576k67669P439896m605901
2262b087540j171766k293564o956129P404178Q087801l900282J47807J610360
2254H40865k489174O280468l082432k295509n481084l664504N557409J87586l505836
2245g652211J84504O12217J713745K434860P12363J196823n486943J072377L530795
2236a681470l183345J914880K379053K91712o11232r38150M504859k247500m288348
$$ plain form
2296 -3901208 1172758 -483695 202662 102260 -665944 -1101837 1032710 -1632759 -3295156
2287 -3295156 -3174840 -3282564 637880 -2428289 -2934290 -7123268 -10563672 -3672386 -4734529
2278 -4734529 -571613 -360643 -6722079 -204139 1687199 -249451 1358391 -5592145
2270 -5592145 -1286744 7787718 3560056 1200710 -4653866 -4921535 2518361 -2087540
2262 -2087540 -3259306 -5552870 -12508999 -5104821 2982980 -917302 -769495 840865
2254 840865 -1648309 4632159 1549727 -745782 -6226866 -9891370 -4333961 -4146375 -7652211
2245 -7652211 -7467707 -6855490 -5141745 -2706885 -1994522 -797699 -6284642 -5212265 -1681470
2236 -1681470 -4864815 -2949935 -570882 -279170 -890402 -1828552 2676307 428807 -3859541
2227c859541L721610J71597k944586M190709J825155p313359l187563j153828
2219h549806L111678N651836L774809L88560j96467J162429k024411k805719l579047
2210c066138m282530m54227N89038p79214Q90557J482914o439089M804808O596319
2201f57562K329047Q40684j679997O55662k41795j236468k728240k574732o688639
2192a1982040N022907M746517k436689j308615q88200M717643L342937k327794
2184a113334K220512l465621K370885K162640j988039k161311n80689k200017
2176d754974K43094Q00262q397013j368992L168842K297577Q149183M856636J816910
2167F811525K764103m626910k128397N90287l268796l134230K059639j134905
$$ plain form
2227 -3859541 -137931 33666 -2910920 1279789 3104944 -4208415 -7395978 -8549806
2219 -8549806 -5438128 213708 3988517 4377077 4180610 5343039 3318628 512909 -3066138
2210 -3066138 -7348668 -7802895 -7213857 -7993071 -7102514 -5619600 -12058689 -7253881 -657562
2201 -657562 1671485 2512169 832172 1487834 1246039 9571 -2718669 -5293401 -11982040
2192 -11982040 -6959133 -2212616 -4649305 -5957920 -6846120 -2128477 1214460 -1113334
2184 -1113334 1107178 -2358443 12442 2175082 187043 -1974268 -2554957 -4754974
2176 -4754974 -4511880 -3711618 -12108631 -13477623 -10308781 -8011204 137979 4994615 6811525
2167 6811525 9575628 4948718 2820321 3410608 141812 -2992418 -932779 -2067684
2159b067684n221592k273107L278065p32648J462175Q904298J399429m90434L374031
2150G632533j975933l081141O29982l376251j338802m613194m167235J696628
2142h593413k622211O661445N957666m801828P282187k324071q547022J893526
2134e093721l636769m372784K247180j532415K065530O165165O15803j905442
2126e447453m761685M460252O735897N322384j078618p882845J062853k78222
2118a867437k874978j67872O48751n572601L799080Q226634k327354n354514k019287
2109g509578L214348J276027m717123R16176l347509P31879R667918N739631p387216
2100a415447j597115J358819R17010N33542j040939k932927n602452L301976M287678
$$ plain form
2159 -2067684 -7289276 -9562383 -6284318 -7016966 -5554791 3349507 4748936 4258502 7632533
2150 7632533 5656600 2575459 3205441 -170810 -1509612 -6122806 -10290041 -8593413
2142 -8593413 -11215624 -4554179 1403487 -3398341 3883846 1559775 -6987247 -5093721
2134 -5093721 -8730490 -13103274 -10856094 -12388509 -10322979 -4157814 -3542011 -5447453
2126 -5447453 -10209138 -5748886 987011 6309395 5230777 -2652068 -1589215 -1867437
2118 -1867437 -4742415 -4910287 -4261536 -9834137 -6035057 2191577 -135777 -5490291 -7509578
2109 -7509578 -4295230 -3019203 -7736326 -6820150 -10167659 -9435780 232138 5971769 -1415447
2100 -1415447 -3012562 -1653743 -736733 -203191 -1244130 -4177057 -9779509 -6477533 -2189855
2091b189855j920592K747496j348422m582097L944396K173955l417115J826116
2083b766118J295911l28124M74124l033173N958688k608042J623192Q39618P64254
2074B220330l826344o861059j896460p14403l883212J417684K957756k021070
2066a2606778j158161j544973J606068M704301j61648K78477j025237K660400
2058g247551J293011K002673J99994j332066L446087l204284j475982M763534
2050a554584N65872l443871L585507j661900n535372J1602148l711040m777698
2042d930938O429966k520656m107725L542961J003278m025674j636668m2489L198860
2033c089085j540286k92936k804794K21637N300446m61111L432362l541392m992230
$$ plain form
2091 -2189855 -4110447 -1362951 -2711373 -7293470 -3349074 -1175119 -4592234 -2766118
2083 -2766118 -1470207 -1798331 -1324207 -4357380 1601308 -1006734 616458 1456076 2220330
2074 2220330 -1606014 -8467073 -10363533 -11077936 -14961148 -13543464 -10585708 -12606778
2066 -12606778 -13764939 -15309912 -13703844 -8999543 -9161191 -8882714 -9907951 -7247551
2058 -7247551 -5954540 -3951867 -3751873 -5083939 -1637852 -4842136 -6318118 -1554584
2050 -1554584 -988712 -4432583 -847076 -2508976 -8044348 3557800 -153240 -4930938
2042 -4930938 1499028 -1021628 -5129353 -1586392 -583114 -4608788 -6245456 -6287945 -3089085
2033 -3089085 -4629371 -4922307 -7727101 -7505464 -2205018 -2666129 766233 -2775159 -7767389
2024g767389j768329L016228j571509j642780O555600m949373K562652J889880
2016c675020j612620N41278J911743K883928P4967J45753Q08507m135804j901861
2007d959129J459715l141574q003248J268288l87948l354944J2420483O498867
1999A800510n081992K63266j33864k950622J233469n086159k412722K748823L362590
1990f256701N934830m896851k272866k74176p94075L835202k590704j522284j67214
1981i004839M900531L15625N417314m536378n947152O279853l029264L967471
1973a636839P197060l391659k693048J807584m620853n797376k104581L568315
1965g671397m01908j914766M756011j169455o525658O723193M336700j089623
$$ plain form
2024 -7767389 -9535718 -6519490 -8090999 -9733779 -3178179 -8127552 -5564900 -3675020
2016 -3675020 -5287640 -4746362 -2834619 49309 124276 270029 1078536 -3057268 -4959129
2007 -4959129 -3499414 -6640988 -14644236 -13375948 -13763896 -17118840 -4698357 1800510
1999 1800510 -3281482 -3018216 -3152080 -6102702 -4869233 -9955392 -12368114 -9619291 -6256701
1990 -6256701 -321871 -5218722 -7491588 -7765764 -8559839 -4724637 -7315341 -8837625 -9004839
1981 -9004839 -4104308 -3788683 1628631 -2907747 -8854899 -2575046 -5604310 -1636839
1973 -1636839 5560221 2168562 -524486 1283098 -3337755 -9135131 -11239712 -7671397
1965 -7671397 -8073305 -9988071 -5232060 -6401515 -12927173 -6203980 -1867280 -2956903
1957b956903l576564q26980l822601m32975M130248M047375J139709n174915J614665
1948e858941l09732K370519P216302m266966m45194P68075J619314o864704l638530
1939i409857J807834J480268O685410l20476l719583j151177J556744J375943
1931a694894n55737k637324p088179k818153n56819K357121K184580j036901J70381
1922a1675925M89963M963027j394858k57687R41790M524729l281032l05485k385244
1913h380722J720568P542689p05078K840643k990434q217820N13676M035788J316408
1904b324282k735827l48800M716857j135560j187849Q04615N00075k049325L679786
1895h0310p98086o294472k297586l175773J520661J188223J996942j064806m325646
$$ plain form
1957 -2956903 -6533467 -7360447 -11183048 -11616023 -7485775 -3438400 -2298691 -7473606 -5858941
1948 -5858941 -6168673 -3798154 3418148 -848818 -1294012 -525937 1093377 -5771327 -9409857
1939 -9409857 -7602023 -6121755 563655 243179 -3476404 -4627581 -3070837 -1694894
1931 -1694894 -2250631 -4887955 -11976134 -14794287 -15351106 -12993985 -10809405 -11846306 -11675925
1922 -11675925 -11185962 -6222935 -7617793 -7875480 -6933690 -2408961 -5689993 -5995478 -8380722
1913 -8380722 -6660154 882535 177457 3018100 27666 -8190154 -7676478 -3640690 -2324282
1904 -2324282 -5060109 -5408909 -692052 -1827612 -3015461 -2210846 -1710771 -3760096 -80310
1895 -80310 -878396 -7172868 -9470454 -12646227 -11125566 -9937343 -7940401 -9005207 -13330853
1886a3330853K360025K314756k661041M504388K73971N57438j975212p076841
1878a5033369P615125L035983j51976L570464j399710n628091P639302K143244
1870A790972p801382K778902K607041q05325M80723k247516m853693k193780O298656
1861c945402N747549l567590j968151l260181l644690N809518J082781m969319
1853h715485l296155m86326K033295N400004N31044l195598l251985K892517O944380
1844a144309L097435p103263m220323R874914k999930J652706J822258n717108
1836d737620k561153R334739K203772o157202r33074k715325k265775Q457549
1828F25911L20428o710033j317233j707898J113004K428899l893372J029461L859135
$$ plain form
1886 -13330853 -10970828 -8656072 -11317113 -6812725 -6538754 -5981316 -7956528 -15033369
1878 -15033369 -7418244 -4382261 -4534237 -963773 -2363483 -7991574 -352272 1790972
1870 1790972 -6010410 -3231508 -624467 -1429792 -949069 -3196585 -8050278 -10244058 -3945402
1861 -3945402 1802147 -1765443 -3733594 -6993775 -10638465 -4828947 -3746166 -8715485
1853 -8715485 -12011640 -12497966 -10464671 -5064667 -4533623 -7729221 -10981206 -8088689 -1144309
1844 -1144309 1953126 -5150137 -9370460 504454 -2495476 -842770 979488 -4737620
1836 -4737620 -7298773 2035966 4239738 -1917464 -2850538 -5565863 -7831638 625911
1828 625911 946339 -5763694 -7080927 -8788825 -7675821 -5246922 -9140294 -8110833 -4251698
1819d251698j166924k51910K260954o177578m269676M857823K075787n6371j530763
1810h510356k483617J849410L573248O41296l954038l33649J813141L98064Q76342
1801f130159j788011k925050L571728N800965k047040n19953l52784l81578J998632
1792b773250M28724j262952m347032O92720P616839k170267l187147l196669k860563
1783a1059597J954334O498501Q84556l033627j272286M287923K521129l449343
1775b668410j248994m569843L495174L490954J206613k846378k342306q7549J803159
1766c767580K176162p118328L162518J77990l882941N617165M941737m740950
1758c434227j730102m157972k941962J539667L226462L277057o208863J126526
$$ plain form
1819 -4251698 -5418622 -5670532 -3409578 -9587156 -13856832 -8999009 -6923222 -6979593 -8510356
1810 -8510356 -10993973 -9144563 -5571315 -4930019 -8884057 -9217706 -7404565 -7006501 -6130159
1801 -6130159 -7918170 -10843220 -7271492 -1470527 -3517567 -4037520 -4390304 -4771882 -2773250
1792 -2773250 -2344526 -3607478 -7954510 -7261790 355049 -1815218 -5002365 -8199034 -11059597
1783 -11059597 -9105263 -2606762 -1722206 -4755833 -6028119 -1740196 780933 -2668410
1775 -2668410 -3917404 -8487247 -4992073 -1501119 -294506 -3140884 -5483190 -5570739 -3767580
1766 -3767580 -1591418 -8709746 -5547228 -5369238 -9252179 -3635014 1306723 -3434227
1758 -3434227 -5164329 -9322301 -12264263 -10724596 -7498134 -4221077 -10429940 -9303414
1750i303414O866134r53739J961625j152022m928559L689113J855870n423854
1742g388846R47928j598005q36212N541745j158112n308092P89883O40490L332148
1733e037073J476725r88468k744239J669312L598272J204716k466298m935422
1725h222475k137106J033769K333098J1257J386400J859539m68467O185410p308032
1716e326607o531867K396352q52558N164873M271265j907662N26200L966354n362391
1707c656041k438083m740430K27507L971617J181564o18814m70725n50948K430104
1698d664249J087670l901160l844900K631419J409012L605374K796510m568747
1690e449071l402022j702180p34828p59744k453380m84585L326953P501465j353360
$$ plain form
1750 -9303414 -2437280 -3391019 -1429394 -2581416 -7509975 -3820862 -1964992 -7388846
1742 -7388846 -6440918 -8038923 -8875135 -3333390 -4491502 -9799594 -9009711 -8369221 -5037073
1733 -5037073 -3560348 -4548816 -7293055 -5623743 -2025471 -820755 -3287053 -8222475
1725 -8222475 -10359581 -9325812 -6992714 -6981457 -5595057 -3735518 -4203985 1981425 -5326607
1716 -5326607 -11858474 -9462122 -10314680 -5149807 -878542 -2786204 -2260004 1706350 -3656041
1707 -3656041 -6094124 -10834554 -10607047 -6635430 -5453866 -6072680 -6543405 -7094353 -4664249
1698 -4664249 -3576579 -7477739 -11322639 -8691220 -7282208 -3676834 -880324 -5449071
1690 -5449071 -8851093 -10553273 -11288101 -12047845 -14501225 -14985810 -11658857 -4157392 -5510752
1681e510752J551670O26348k609234M228862k571814J423457P04329j466134M700338
1672A077070r47405l864604R5905j980765p93699L188570q24535l866728L473994
1663d442197Q82458n217280m0909J840104J720371L166724K71432L161020n6194
1654A285529m381531l296861m742947k365825P52976q16724K731309M086801P21429
1645f025844k54385K279003J87636k28323L65464m299051K377061M648954j177231
1636b126716k591801J854388j856846m196787K688946M797818m823084J4963P92974
1627e446145R43804p15104m790090J114239M21860Q31346N478427K64077k542604
1618d440190N470620J279384m860789l378361o810970q78762K59378N173196M370063
$$ plain form
1681 -5510752 -3959082 -3332734 -5941968 -1713106 -4284920 -2861463 -2157134 -3623268 1077070
1672 1077070 129665 -3734939 -3639034 -5619799 -6413498 -3224928 -4049463 -7916191 -4442197
1663 -4442197 -3559739 -8777019 -8817928 -6977824 -5257453 -2090729 -1819297 1341723 1285529
1654 1285529 -3096002 -6392863 -11135810 -13501635 -12748659 -13565383 -10834074 -6747273 -6025844
1645 -6025844 -6280229 -4001226 -3813590 -4041913 -3676449 -7975500 -5598439 -949485 -2126716
1636 -2126716 -4718517 -2864129 -4720975 -8917762 -6228816 -1430998 -6254082 -6239119 -5446145
1627 -5446145 -4502341 -5217445 -10007535 -8893296 -8471436 -7640090 -2161663 -1897586 -4440190
1618 -4440190 1030430 2309814 -2550975 -5929336 -12740306 -13619068 -13359690 -8186494 -3816431
1609c816431l457711N39224N965230O67127j148082L11244o291154j71640K582079
1600d820114j821136l222278m475676P322053K866724J268203R04451m020691
1592e998464J688348N009858K86472l508782j70707l608129M987832k601627l917625
1583g832824J207662n112415j030612K133655m133181Q421894O11444o039892
1575a1774269L615747n0348l6298N862466j893403l144709N20173o40058M757906
1566b782793m63603l948556K79515M896860m207457k724283L044009j886901M343417
1557c449792J784397M286766o398886o74227P80681n261840L185017k108026L423228
1548d432682N31608l455086J364917n385177j413176M809899K626364L870497
$$ plain form
1609 -3816431 -7274142 -6734918 -769688 -102561 -1250643 -939399 -7230553 -7402193 -4820114
1600 -4820114 -6641250 -9863528 -14339204 -7017151 -4150427 -2882224 -1977773 -5998464
1592 -5998464 -4310116 699742 986214 -2522568 -2693275 -6301404 -1313572 -3915199 -7832824
1583 -7832824 -6625162 -11737577 -12768189 -10634534 -14767715 -6345821 -5734377 -11774269
1575 -11774269 -8158522 -8208870 -8245168 -2382702 -4276105 -7420814 -6900641 -7540699 -2782793
1566 -2782793 -3246396 -7194952 -6915437 -2018577 -6226034 -8950317 -5906308 -7793209 -3449792
1557 -3449792 -1665395 2621371 -3777515 -4451742 -3671061 -8932901 -5747884 -7855910 -4432682
1548 -4432682 -3901074 -7356160 -5991243 -11376420 -12789596 -7979697 -5353333 -1482836
1540a482836J199880m832222j370866J689393l24463J749288p6759p04218L316670
1531h36133p7554j184258M9043m110659K531387J335393k166308O27992q122951
1522a1954048L215699O533111o259926L126472j593021j627849L028856J093135
1514d437571J446803l019717K208702K371463M761l290498l587876J846732m414078
1505a0871279L862312M706709K007193m110832L004190K102210l121433N38968
1497a881962K950694r05057j53702Q79315p499795l770793k625040j321804L606944
1488a0721200K915376M292675K716706P68949K954634k638309j881237J004097
1480e88309K002299n661762k309328k411112L341368K79879P6274K637557O04206
$$ plain form
1540 -1482836 -282956 -5115178 -6486044 -4796651 -5121114 -3371826 -3448585 -4152803 -836133
1531 -836133 -913687 -2097945 -2048902 -6159561 -3628174 -2292781 -4459089 -3831097 -11954048
1522 -11954048 -8738349 -2205238 -8465164 -5338692 -6931713 -8559562 -5530706 -4437571
1514 -4437571 -2990768 -6010485 -3801783 -1430320 -1425559 -4716057 -8303933 -6457201 -10871279
1505 -10871279 -7008967 -2302258 -295065 -4405897 -1401707 700503 -2420930 -1881962
1497 -1881962 1068732 163675 9973 889288 -6610507 -10381300 -13006340 -14328144 -10721200
1488 -10721200 -7805824 -3513149 -796443 -27494 2927140 288831 -1592406 -588309
1480 -588309 1413990 -4247772 -6557100 -8968212 -5626844 -5346965 -5270691 -2633134 -2028928
1471b028928N003497K798678l19915k501213k987109l098712l133960Q93575j743588
1462g117675K00260O27861p04591N756015M75464L163761K330511l744509l7086
1453I50011r17234p812293j871574K097395O91656J25324l823261l91077j036708
1444a1987761M316080j17770J919130M294311K020436L232093m262790L572121
1436B985850l133762k295731J109853n828667J627637J460237k409534M410884
1428b073233L644332j221595K697118K583519l142857j659372j333980O14904
1420A08836K66497j776689k364718K151190j775908J956377j275514o228350M262961
1411d675318K070029j72445K55398l877227Q000877P81528m201112k724106j696818
$$ plain form
1471 -2028928 2974569 5773247 5453332 2952119 -34990 -3133702 -6267662 -5374087 -7117675
1462 -7117675 -6917415 -6289554 -6994145 -1238130 -762666 2401095 4731606 987097 950011
1453 950011 32777 -7779516 -9651090 -7553695 -6862039 -6736715 -10559976 -10951053 -11987761
1444 -11987761 -7671681 -7789451 -5870321 -1576010 444426 3676519 -586271 2985850
1436 2985850 -147912 -2443643 -1333790 -7162457 -5534820 -4074583 -6484117 -2073233
1428 -2073233 1571099 349504 3046622 5630141 2487284 827912 -506068 108836
1420 108836 375333 -1401356 -3766074 -1614884 -3390792 -1434415 -2709929 -8938279 -4675318
1411 -4675318 -2605289 -2777734 -2522336 -6399563 1601314 2382842 -1818270 -4542376 -6239194
1402f239194j311781M615684M987388m536392j850866m74017J405973l585850
1394f989055J940187k122250K612548N513017o6996J890057p268134l885267J989003
1385f386890j33115j179620P81292k614243L962183L135415m253622L262403J871024
1376a555173O735003K096451o389102n518167J742304K474052o84126K286680
1368A187922n416931R97677L587605K968203n6568k911592J349658j046382K040258
1359B699850k57372o580243m078474j203456K852853K593926m636337L837240
1351d772013L903070l502790M49250L924869m138973L851516K234456j878076
1343G1309J5762n202832j055589M526951O33031L239900K507894m151779N378361
$$ plain form
1402 -6239194 -7550975 -2935291 2052097 -2484295 -4335161 -4809178 -3403205 -6989055
1394 -6989055 -5048868 -7171118 -4558570 954447 887451 2777508 -4490626 -8375893 -6386890
1385 -6386890 -6520005 -7699625 -6918333 -9532576 -5570393 -2434978 -6688600 -3426197 -1555173
1376 -1555173 5179830 7276281 887179 -4630988 -2888684 -414632 -1098758 1187922
1368 1187922 -4229009 -3231332 356273 3324476 3267908 356316 1705974 659592 2699850
1359 2699850 2442478 -4137765 -8216239 -9419695 -6566842 -3972916 -8609253 -4772013
1351 -4772013 -868943 -4371733 -3922483 2386 -4136587 -285071 1949385 71309
1343 71309 87071 -5115761 -6171350 -1644399 -1011368 2228532 4736426 584647 5963008
1334E963008k131047o306182M551330l455856q06747q12440K297759k249697j728555
1325d678427L985181K829233m685646n62064L659434o407963k090127J786017
1317f164362n52047l802140N888924P137801l26852K016485k44533q00383j53746
1308B999147K667431m370639m87478J433747J818338O650898m899668p048191
1300a236415J766823K390141K84441M209905m303332q620949N486129M227410
1292D204153j164368K403052r00164n053809L950576L009290r811595m181942
1284g544807J35238M279330K265261o19374p583876m556820O827050J0488189
1276C690191k356492l26011K005703j525252N079378K170117m007957l73527q4243
$$ plain form
1334 5963008 3831961 -2474221 2077109 -1378747 -2185494 -2997934 -700175 -2949872 -4678427
1325 -4678427 -693246 2135987 -2549659 -3111723 547711 -5860252 -7950379 -6164362
1317 -6164362 -6716409 -10518549 -4629625 2508176 2181324 4197809 3953276 3152893 2999147
1308 2999147 5666578 1295939 808461 2242208 4060546 10711444 5811776 -1236415
1300 -1236415 530408 2920549 3204990 7414895 3111563 -5509386 -23257 4204153
1292 4204153 3039785 5442837 4542673 -511136 3439440 6448730 -3362865 -7544807
1284 -7544807 -7409569 -3130239 -864978 -1484352 -9068228 -13625048 -6797998 3690191
1276 3690191 1333699 1007688 3013391 1488139 6567517 8737634 4729677 4356150 4271907
1267D271907K5095J893938K679458l233205j949862K456833q19756M514499m965680
1258D873227L63544k650812o714042L596859J716174l628561j271498n05371N76951
1249c643529L836028j101452O302084J398880p494575M988678L180125k380407
1241E085832J240626k628177r224724R55673N128307J353622Q976820n516740
1233E371239j330952K866451j170763J712497K139387m262798N544829p52551
1225A0117339k463968k333212n017664k741355P611759K511476l853626k598008
1217A232741l744809M88668M500485L147357k481161J504701j138009q5713N19457
1208C943717K336808j129944Q97674K204857J026465K780194o193275l869780
$$ plain form
1267 4271907 4297002 6190940 8870398 5637193 3687331 6144164 5324408 9838907 4873227
1258 4873227 5236771 2585959 -4128083 -531224 1184950 -2443611 -3715109 -4220480 -3643529
1249 -3643529 192499 -908953 5393131 6792011 -702564 4286114 7466239 5085832
1241 5085832 6326458 3698281 -5526443 -4570770 557537 1911159 10887979 5371239
1233 5371239 4040287 6906738 5735975 7448472 9587859 5325061 10869890 10117339
1225 10117339 7653371 5320159 302495 -2438860 5172899 7684375 3830749 1232741
1217 1232741 -2512068 -2023400 2477085 5624442 3143281 4647982 3509973 3424260 3943717
1208 3943717 6280525 5150581 6048255 8253112 9279577 12059771 5866496 1996716
1200A996716K793798Q67312j463587K525143R42597p300724P947367J596955j822875
1191H082702L975215P95891k956205J531902L111650j258168k123512o088833
1183E070642N088505Q70556j904013j952627l043841K360060o92985K148764K081226
1174A0026287k582811j870648J976355l441279K014344M177390j240952K523665
1166A1582351K412872m777642M019986K188945k88502n894958Q15949M199273
1158A4258274J617255K562643l683784o41971J253903J853137Q08902j406046
1150A6622313K53214J164780J625834N47257m154913q449322J826119J582458
1142A1017740N00097N608348L499197o715781M936933P592639j356899P74382
$$ plain form
1200 1996716 4790514 5657826 4194239 6719382 7661979 361255 8308622 9905577 8082702
1191 8082702 12057917 12853808 9897603 11429505 14541155 13282987 11159475 5070642
1183 5070642 10159147 11029703 9125690 7173063 4129222 6489282 5796297 7945061 10026287
1174 10026287 7443476 5572828 7549183 4107904 6122248 10299638 9058686 11582351
1166 11582351 13995223 9217581 13237567 15426512 15138010 9243052 10059001 14258274
1158 14258274 15875529 18438172 14754388 14112417 15366320 17219457 18028359 16622313
1150 16622313 16875527 18040307 19666141 20213398 16058485 7609163 9435282 11017740
1142 11017740 11517837 17126185 20625382 13909601 18846534 26439173 25082274 25856656
1134B5856656n601994n647197J583532L957397J66579k907087M967946L475361
1126B5851193J243556M17364n040708o245836q80830M476211K823193O618639
1118B9262782j031889q142373N500287J510175r07505K530246m720000M15276
1110B4416999M373098l568230j264437L229846J516430L507381n58911K501017
1102C4153193l254894O168183R800778q408088o778328J775464n377590J278411
1094B9357129J902255j6351L425335P191325M105295K82797l464860M704409J589967
1085D9077301o381047k13241k415617l000039O049823k98331L359904J913881
1077D8092634m755181J218703Q71231p18071K298760N584766j815891J273877
$$ plain form
1134 25856656 20254662 14607465 16190997 20148394 20314973 17407886 22375832 25851193
1126 25851193 27094749 27512113 22471405 16225569 15344739 19820950 22644143 29262782
1118 29262782 28230893 20088520 25588807 27098982 26191477 28721723 24001723 24416999
1110 24416999 28790097 25221867 23957430 27187276 28703706 32211087 31652176 34153193
1102 34153193 30898299 37066482 46867260 38459172 31680844 33456308 28078718 29357129
1094 29357129 31259384 31243033 34668368 41859693 45964988 46247785 42782925 47487334 49077301
1085 49077301 42696254 42483013 40067396 37067357 43117180 42818849 46178753 48092634
1077 48092634 43337453 44556156 45427387 44709316 47008076 52592842 50776951 52050828
1069E2050828L413018n340739k293871M578520N193081K051809r11635l684780
1061E5056231q036975N458062N406869J268746O91198J768940l134241J750009
1053F0228839J0212444l640503j746220K622566J999369P23721k593272j463111
1045F6343833R501195L933928O872185L224102o809240n138596N429981j285762
1037H2071626k425531N077699m868781K626347R259542O15127m55044N005987
1029I6906972K282103k84325J857013r86815q95537J0437232j25581j217006O65456
1020A08639512L13630M608027R47441k762800M565820J887839n820842O806901
1012A19185528K171281L691067O887744m110786l819749l491946L030419J541713
$$ plain form
1069 52050828 55463846 50123107 47829236 52407756 57600837 59652646 58741011 55056231
1061 55056231 47019256 52477318 57884187 59152933 59844131 61613071 58478830 60228839
1053 60228839 70441283 66800780 65054560 67677126 69676495 70400216 67806944 66343833
1045 66343833 75845028 79778956 86651141 89875243 83066003 77927407 83357388 82071626
1037 82071626 79646095 84723794 79855013 82481360 91740902 92356029 91900985 96906972
1029 96906972 99189075 98904750 100761763 99774948 98879411 109316643 109191062 107974056 108639512
1020 108639512 108953142 113561169 114508610 111745810 116311630 118199469 112378627 119185528
1012 119185528 121356809 125047876 131935620 127824834 124005085 120513139 123543558 125085271
1004A25085271L516029J374131K27776K933964K955607L10949p549721L541548
996A32395554J639591L350090m66600m147909K888798l384545M060438K70747
988A36606164p34225j356370K720720L339236o18454J542148j535449J744059
980A41707829o288070k434626L166692o094185K997512J491765k567161o35438
972A31344318o799080M68820M717516n199126j498545r2625m799096M023116m20425
963A21744873j805960m417078k561788l010251J186391k029042o012930L448665
955A06542880J339567k984434k00384n426549j960803o926003K603475N799980
947I8787729m005974n78041k042413m999017k205007L016076n180737j620241
$$ plain form
1004 125085271 128601300 129975431 130203207 133137171 136092778 136403727 128854006 132395554
996 132395554 134035145 137385235 136918635 132770726 135659524 132274979 136335417 136606164
988 136606164 135871939 134515569 137236289 140575525 139957071 141499219 139963770 141707829
980 141707829 135419759 132985133 136151825 130057640 133055152 134546917 131979756 131344318
972 131344318 124545238 125014058 129731574 124532448 123033903 122941278 118142182 122165298 121744873
963 121744873 119938913 115521835 112960047 109949796 111136187 109107145 103094215 106542880
955 106542880 107882447 104898013 104697629 99271080 97310277 90384274 92987749 98787729
947 98787729 94781755 94203714 92161301 87162284 84957277 87973353 82792616 81172375
939H1172375K03521M82218n644091L066513q212899k834906L471319j626135N348596
930G5426511k324442o909076L304919l525998L080095J140831r570210m020027
922E6602603M48195m079611L280527L750826p292098L499060O694705j258107
914F1646100o624810l852432k222498k550270J507773L114678l774266j268798
906D5975477Q680761j360913l818394k685916l592910M23611l595480K672027
898D2698263m489627n914923J091544J251754n31922l80651N189647J540718K035602
889D2490405P66661m524279m414173j226132k071538k027989K847864k460191
881B9380628k841288K588973K905016K634788r24864j058126K677894j971357
$$ plain form
939 81172375 81375896 81858114 76214023 79280536 71067637 68232731 71704050 70077915 75426511
930 75426511 73102069 66192993 69497912 65971914 69052009 70192840 60622630 56602603
922 56602603 57050798 52971187 56251714 60002540 52710442 56209502 62904207 61646100
914 61646100 55021290 51168858 48946360 46396090 47903863 51018541 47244275 45975477
906 45975477 54656238 53295325 49476931 46791015 43198105 43621716 40026236 42698263
898 42698263 38208636 32293713 33385257 34637011 34105089 33724438 38914085 40454803 42490405
889 42490405 43257066 38732787 34318614 33092482 31020944 28992955 31840819 29380628
881 29380628 26539340 29128313 32033329 34668117 33743253 32685127 35363021 33391664
873C3391664p122840k376782P03738q810676P141483M462102l058142j308381
865B3022166Q298508r84308l933120P98707n580771n028459j457483M166107k753672
856A6547675j740465M242821n06239O872709L990976l184218m453782K0094N907875
847B7697446m484586o840378l702291O675584L530473k883348N76930j685411
839A8884419m299125Q590648M733733j1199852J22673J609624n355762k108055
831A0978303o05751k137914o2364P888197j058921j829812m711379M72505L991240
822A2924104J860906P42908k258757j434740N07165M593054m324152l895049L361331
813A2076770m55375k68701M470174n043851l788130q42785M321146L311587r14746
$$ plain form
873 33391664 26268824 23892042 24595780 15785104 22926587 27388689 24330547 23022166
865 23022166 31320674 30336366 26403246 27201953 21621182 16592723 15135240 19301347 16547675
856 16547675 14807210 19050031 18543792 25416501 29407477 26223259 21769477 21789571 27697446
847 27697446 23212860 16372482 12670191 19345775 22876248 19992900 20569830 18884419
839 18884419 14585294 23175942 27909675 16709823 16832496 18442120 13086358 10978303
831 10978303 10372552 8234638 8172274 16060471 15001550 13171738 8460359 8932864 12924104
822 12924104 14785010 15527918 13269161 11834421 12341586 16934640 12610488 8715439 12076770
813 12076770 11621395 11352694 15822868 10779017 6990887 6148102 10469248 13780835 12866089
804A2866089K83975J271509n86406k031582l638248k931056L270865Q11451J693726
795A1010323N192773R70118m42106k111903n042465J327844M151674o830089l398970
786D827199J938511j600678n50855N813477J862664l636639J298722k02167j4509
777I735725L365757q41817j684001k43360L286222r719754n525822N347998K081072
768E802020L16628k221231K358869r53179J212581K106367o041201k351808L349649
759C578695J834472N830213j001581j758226O42835k697720n29536L007509n6210
750H850451j83949p52963p29724k12354L45792j708429J445208j187720l64857
741E501455M008466J813951n002907m278127J484190J938220j410301L075269
$$ plain form
804 12866089 13150064 14421573 13835167 11803585 8165337 5234281 8505146 9316597 11010323
795 11010323 16203096 17173214 16731108 14619205 9576740 10904584 15056258 8226169 4827199
786 4827199 6765710 5165032 4614177 10427654 12290318 8653679 9952401 9750234 9735725
777 9735725 13101482 12259665 10575664 10332304 13618526 3898772 -1627050 3720948 5802020
768 5802020 6118648 3897417 6256286 5303107 6515688 8622055 2580854 229046 3578695
759 3578695 5413167 11243380 10241799 8483573 9126408 6428688 5899152 8906661 8850451
750 8850451 8666502 7913539 7183815 6971461 7317253 5608824 7054032 5866312 5501455
741 5501455 9509921 11323872 6320965 2042838 3527028 5465248 4054947 7130216
733G130216l773725K584180R210992m673982l678564J393595o214589R98357j364631
724A611849m973067P98845L893765J301043M939566k901171n311136J852183J334886
715B546763M796337j241235j516912K707749J410313N702252m906700q365507
707A133060K985840q61747M343880J492243l159188k869918M38562J585442j866018
698C222156j045229j646643J967380L372084J277692P92457j751300n582664p92079
689a86146K570209L274694o328910k711833M128035l461854R625645k70061m858769
680A781010J862726J641665K404000k779627k489653r56378j95938J311147K860568
671E439520L477628o485530K92871J640493k790914P28729j074499m038868L079822
$$ plain form
733 7130216 3356491 5940671 15151663 10477681 6799117 8192712 1978123 2976480 1611849
724 1611849 -3361218 -2562373 1331392 2632435 7572001 4670830 -640306 1211877 2546763
715 2546763 7343100 6101865 4584953 7292702 8703015 14405267 9498567 1133060
707 1133060 4118900 3257153 7601033 9093276 5934088 3064170 3502732 5088174 3222156
698 3222156 2176927 530284 2497664 5869748 7147440 7939897 6188597 605933 -186146
689 -186146 2384063 5658757 -670153 -3381986 746049 -2715805 6909840 6639779 1781010
680 1781010 3643736 5285401 7689401 4909774 2420121 1463743 1267805 2578952 5439520
671 5439520 8917148 2431618 2724489 4364982 1574068 2302797 1228298 -2810570 269252
662B69252j604883L662186m67811k436236M069738K211024J692028j498149n528012
653C69137N009563k240384o077660M413500J337956k155369J513377J972161k835570
644A306711L265825k143217k557883L879308K862752K326602n201017q47041k282269
635F09771l534186K014850J119568K0648n211473M105286K779039k402911k197783
626b697191N537403l371069k635381N903135j241132m455683L959117j261996
618b62797L032466M036657p701617P39232K896195n65554l48064J239476j085259
609A980735k678639L684200L231792m936149P33503k114561K041008K460073N30771
600D932733l347081m024545K148451k106828L141599j57335n048982M436516j334543
$$ plain form
662 269252 -1335631 2326555 1858744 -577492 3492246 5703270 7395298 5897149 369137
653 369137 5378700 3138316 -2939344 1474156 2812112 656743 2170120 4142281 1306711
644 1306711 4572536 2429319 -128564 3750744 6613496 8940098 3739081 2892040 609771
635 609771 -2924415 -909565 210003 230651 -4980822 -875536 1903503 -499408 -2697191
626 -2697191 2840212 -530857 -3166238 2736897 1495765 -2959918 999199 -262797
618 -262797 2769669 6806326 -895291 -156059 2740136 2174582 1826518 3065994 1980735
609 1980735 -697904 2986296 6218088 1281939 2015442 -99119 1941889 4401962 4932733
600 4932733 1585652 -2438893 -290442 -2397270 744329 586994 -4461988 -25472 -1360015
591a360015L026362M958169l496432k70982r79919p28199M19119k590199l012798
582d034894N657693m214035K117878O403383j621852J66367J530129n001204m89327
$$ plain form
591 -1360015 1666347 6624516 3128084 2857102 1877183 1148984 1568103 -1022096 -4034894
582 -4034894 1622799 -2591236 -473358 5930025 4308173 4474540 6004669 1003465 514138
$$ [...]
##END NTUPLES=NMR SPECTRUM
##END=
