##TITLE=1H_TG-2316
 DMSO,8 sc, 
 10.02.2021
##JCAMPDX= 6.0         $$ Bruker NMR JCAMP-DX V2.0
##DATA TYPE= NMR SPECTRUM
##DATA CLASS= NTUPLES
##ORIGIN= UXNMR, Bruker Analytische Messtechnik GmbH
##OWNER= root
$$ XWIN-NMR		Version 3.5
$$ Wed Feb 10 10:25:13 2021 Russian Standard Time (UT+4h)  she@DPX200
##.OBSERVE FREQUENCY= 200.1315066352
##.OBSERVE NUCLEUS= ^1H
##.ACQUISITION MODE= SIMULTANEOUS
##.ACQUISITION SCHEME= undefined
##.AVERAGES= 8
##.DIGITISER RES= 18
##SPECTROMETER/DATA SYSTEM= spect
##.PULSE SEQUENCE= zg30
##.SOLVENT NAME= DMSO
##.SHIFT REFERENCE= (INTERNAL, DMSO, 0, 16.0445)
##AUDIT TRAIL= $$ (NUMBER, WHEN, WHO, WHERE, WHAT)
$$ ##TITLE= Audit trail, XWIN-NMR		Version 3.5
$$ ##JCAMPDX= 5.01
$$ ##ORIGIN= Bruker BioSpin GmbH
$$ ##OWNER= she
$$ F:/spectra/data/she/nmr/H-F/1/pdata/1/auditp.txt
$$ ##AUDIT TRAIL=  $$ (NUMBER, WHEN, WHO, WHERE, WHAT)
(   1,<2021-02-10 10:23:38.48 +0400>,<she>,<DPX200>,
      <created by zg, POWCHK disabled, PULCHK disabled
       configuration hash MD5:
       00 E9 B6 7A A2 85 ED C7 34 08 36 98 17 FE 4E 26
       data hash MD5: 16K
       6F 22 B4 2A 35 CE 36 46 6E A2 B9 93 75 5E FC EC>)
(   2,<2021-02-10 10:23:41.01 +0400>,<she>,<DPX200>,
      <Start of raw data processing
       efp BC_mod = 2 LB = 0.24 FT_mod = 6 PKNL = 1 PHC0 = -10763.7 PHC1 = 20.40094 SI = 16K 
       data hash MD5: 16K
       AF EE 55 28 8E 05 73 BF AA E5 65 72 7D E1 FE 34>)
(   3,<2021-02-10 10:23:59.06 +0400>,<she>,<DPX200>,
      <pk PHC0 = 2.842011 PHC1 = -8 
       data hash MD5: 16K
       4E AB 40 85 3A FF 5F 4E 04 0D 9B AE 70 7A 14 C0>)
(   4,<2021-02-10 10:24:02.10 +0400>,<she>,<DPX200>,
      <abs ABSG = 5 
       data hash MD5: 16K
       6C 6E 74 DE 89 02 16 CD 92 50 E0 FF 9F B9 27 0B>)
(   5,<2021-02-10 10:24:38.50 +0400>,<she>,<DPX200>,
      <pk PHC0 = 19.41567 PHC1 = -26.59999 
       data hash MD5: 16K
       4A 04 07 1F 99 2D B9 C9 1F 03 0D 73 A5 0C D6 B7>)
(   6,<2021-02-10 10:24:42.35 +0400>,<she>,<DPX200>,
      <abs ABSG = 5 
       data hash MD5: 16K
       EA 83 AF 35 09 E9 85 19 21 B6 CC B4 19 F0 EA 10>)
$$ ##END=
$$ 
$$ hash MD5
$$ 5A A3 ED 42 B1 38 F4 1E 26 E9 2E D2 54 BE 93 27
##$RELAX= 
##$RELAX= 
##$RELAX= 
##$RELAX= 
##$RELAX= 
##$RELAX= 
$$ Bruker specific parameters
$$ --------------------------
##$DU= <F:/spectra>
##$EXPNO= 1
##$NAME= <H-F>
##$PROCNO= 1
##$TYPE= <nmr>
##$USER= <she>
##$AMP= (0..31)
100 100 100 100 100 100 100 100 100 100 100 100 100 100 100 100 100 100 
100 100 100 100 100 100 100 100 100 100 100 100 100 100 
##$AQSEQ= 0
##$AQ_mod= 1
##$AUNM= <au_zg>
##$AUTOPOS= <>
##$BF1= 200.13
##$BF2= 200.13
##$BF3= 200.13
##$BF4= 200.13
##$BF5= 200.13
##$BF6= 200.13
##$BF7= 200.13
##$BF8= 200.13
##$BYTORDA= 1
##$CFDGTYP= 0
##$CFRGTYP= 5
##$CHEMSTR= <none>
##$CNST= (0..31)
1 1 145 1 1 1 1 1 1 1 1 1 1 1 1 1 1 1 1 1 1 1 1 1 1 1 1 1 1 1 1 1 
##$CPDPRG= <>
##$CPDPRG1= <>
##$CPDPRG2= <>
##$CPDPRG3= <>
##$CPDPRG4= <mlev>
##$CPDPRG5= <mlev>
##$CPDPRG6= <mlev>
##$CPDPRG7= <mlev>
##$CPDPRG8= <mlev>
$$ [...]
##$SUBNAM3= <"">
##$SUBNAM4= <"">
##$SUBNAM5= <"">
##$SUBNAM6= <"">
##$SUBNAM7= <"">
##$SUBNAM8= <"">
##$SUBNAM9= <"">
##$SW= 16.9725356469052
##$SWIBOX= (0..15)
0 0 2 0 0 0 0 0 0 0 0 0 0 0 0 0 
##$SW_h= 3396.73913043478
##$TD= 16384
##$TD0= 1
##$TE= 0
##$TE2= 300
##$TE3= 300
##$TEG= 300
##$TL= (0..7)
0 120 120 120 120 120 120 120 
##$TP= (0..7)
150 150 150 150 150 150 150 150 
##$TP07= 0
##$TPNAME0= <>
##$TPNAME1= <>
##$TPNAME2= <>
##$TPNAME3= <>
##$TPNAME4= <>
##$TPNAME5= <>
##$TPNAME6= <>
##$TPNAME7= <>
##$TPOAL= (0..7)
0.5 0.5 0.5 0.5 0.5 0.5 0.5 0.5 
##$TPOFFS= (0..7)
0 0 0 0 0 0 0 0 
##$TUNHIN= 0
##$TUNHOUT= 0
##$TUNXOUT= 0
##$USERA1= <user>
##$USERA2= <user>
##$USERA3= <user>
##$USERA4= <user>
##$USERA5= <user>
##$V9= 5
##$VALIST= <valist>
##$VCLIST= <CCCCCCCCCCCCCCC>
##$VD= 0
##$VDLIST= <DDDDDDDDDDDDDDD>
##$VPLIST= <PPPPPPPPPPPPPPP>
##$VTLIST= <TTTTTTTTTTTTTTT>
##$WBST= 1024
##$WBSW= 4
##$XGAIN= (0..3)
0 0 0 0 
##$XL= 0
##$YL= 0
##$YMAX_a= 421838
##$YMIN_a= -302762
##$ZGOPTNS= <>
##$ZL1= 120
##$ZL2= 120
##$ZL3= 120
##$ZL4= 120
##$ABSF1= 16.04447
##$ABSF2= -0.928194
##$ABSG= 5
##$ABSL= 3
##$ALPHA= 0
##$AQORDER= 0
##$ASSFAC= 0
##$ASSFACI= 0
##$ASSFACX= 0
##$ASSWID= 0
##$AUNMP= <proc_1d>
##$AZFE= 0.1
##$AZFW= 0.1
##$BCFW= 0
##$BC_mod= 2
##$BYTORDP= 0
##$COROFFS= 0
##$CY= -3
##$DATMOD= 1
##$DC= 0
##$DFILT= <>
##$DTYPP= 0
##$F1P= 0
##$F2P= 0
##$FCOR= 1
##$FTSIZE= 16384
##$FT_mod= 6
##$GAMMA= 0
##$GB= 0
##$INTBC= 1
##$INTSCL= 2.992141e-10
##$ISEN= 128
##$LB= 0.24
##$LEV0= 0
##$LPBIN= 0
##$MAXI= 10000
##$MC2= 0
##$MEAN= 0
##$ME_mod= 0
##$MI= 1.114404
##$NCOEF= 0
##$NC_proc= -6
##$NLEV= 6
##$NOISF1= 3.799351
##$NOISF2= 2.8
##$NSP= 0
##$NTH_PI= 0
##$NZP= 0
##$OFFSET= 16.04447
##$PC= 1
##$PHC0= -10741.44
##$PHC1= -14.19905
##$PH_mod= 1
##$PKNL= yes
##$PPARMOD= 0
##$PSCAL= 0
##$PSIGN= 0
##$REVERSE= no
##$SF= 200.12999402449
##$SI= 16384
##$SIGF1= 3
##$SIGF2= 2
##$SINO= 5.538805
##$SIOLD= 16384
##$SREGLST= <1H.CDCl3>
##$SSB= 0
##$STSI= 16384
##$STSR= 0
##$SW_p= 3396.73913043478
##$SYMM= 0
##$S_DEV= 0
##$TDeff= 16384
##$TDoff= 0
##$TI= <>
##$TILT= no
##$TM1= 0
##$TM2= 0
##$TOPLEV= 0
##$USERP1= <user>
##$USERP2= <user>
##$USERP3= <user>
##$USERP4= <user>
##$USERP5= <user>
##$WDW= 1
##$XDIM= 16384
##$YMAX_p= 504492017
##$YMIN_p= -872297
$$ End of Bruker specific parameters
$$ ---------------------------------
##NTUPLES= NMR SPECTRUM
##VAR_NAME=  FREQUENCY,     SPECTRUM/REAL,   SPECTRUM/IMAG
##SYMBOL=    X,             R,               I
##VAR_TYPE=  INDEPENDENT,   DEPENDENT,       DEPENDENT
##VAR_FORM=  AFFN,          ASDF,            ASDF
##VAR_DIM=   16384,         16384,           16384
##UNITS=     HZ,            ARBITRARY UNITS, ARBITRARY UNITS
##FACTOR=    0.207333158178281, 1,           1
##FIRST=     3210.97965187925, 0,            0
##LAST=      -185.759478555527, 0,           0
##MIN=       -185.759478555527, -872297,     0
##MAX=       3210.97965187925, 504492017,    0
$$ Real data points
##PAGE= N=1
##DATA TABLE= (X++(R..R)), XYDATA
$$ [...]
7291E89556J29120o6853n3200j56440J98243q5308k27093M585L91217J53103r9464
$$ 589556 718676 651823 598623 442183 640426 555118 328025 332610 723827 876930 777466
7280G77466l2308m3587M0082P0395k46759l10489j00149N7880M53241j72672l090
$$ 777466 745158 701571 741653 812048 565289 254800 154651 212531 665772 493100 490010
7269D90010j03720J41770N682k18297J0570J51356L2205j51024j18027K78159
$$ 490010 386290 528060 533742 315445 326015 477371 509576 358552 240525 518684
7259E18684K13755j30364q9821q2867K4138M527R6496k0587q5748k9916l4921
$$ 518684 732439 602075 512254 429387 453525 458052 554548 533961 448213 418297 383376
7248C83376J72845L8103l8784k24968q1690P531n010q4799k05940J34159K53003
$$ 383376 556221 594324 555540 330572 248882 256413 251403 166604 -39336 94823 347826
7237C47826r4833R4020J08688k3128l00977N6672R5034J41710R901K043n4870
$$ 347826 252993 347013 455701 432573 131596 188268 283302 425012 434913 436956 382086
7226C82086J7403L9485r1142O6545J6532j39977r3725J4780J21759K9601j81126
$$ 382086 399489 438974 347832 414377 430909 290932 197207 211987 333746 363347 182221
7215A82221J38178Q365O2621l19390r5688L15503l4580j90542J13814J24633j04880
$$ 182221 320399 328764 391385 71995 -23693 291810 257230 66688 180502 305135 200255
7204B00255r2843k3631O3751R6369J7625p0945M5483o0469J82566r3107J21600
$$ 200255 107412 83781 147532 243901 261526 190581 236064 175595 358161 265054 386654
7193C86654j67406j62297K69521j03962J46647k15141J62296o7707k05214Q4768
$$ 386654 219248 56951 326472 222510 369157 154016 316312 248605 43391 128159
7183A28159J31454k74518J44626j3663r704J30294l07823J46734K80992j48442
$$ 128159 259613 -14905 129721 116058 106354 236648 -71175 75559 356551 208109
7173B08109k58193J23472P3041K307j29653o6458q9505J06350R2437j13126J60350
$$ 208109 -50084 73388 146429 148736 19083 -47375 -136880 -30530 61907 -51219 109131
7162A09131M511J41220p2801m4991r7529j04907K78547q1673K70080j46673k33100
$$ 109131 113642 254862 182061 137070 39541 -65366 213181 131508 401588 254915 21815
7151B1815r86L4078j28471r9991J98653J83334j12791j14115j33900J93228P0495
$$ 21815 20829 54907 -73564 -173555 25098 208432 95641 -18474 -152374 40854 111349
7140A11349k57019K59205p8806k4551j30485J08544J68971m0698j14420k2140
$$ 111349 -145670 113535 34729 10178 -120307 -11763 157208 116510 2090 -20050
7130b0050K42801k29150j80198L53638o2548j30634k20110o3279K70047p7899
$$ -20050 222751 -6399 -186597 167041 104493 -26141 -246251 -309530 -39483 -117382
7120a17382K5792l905L4218R2950l86580N02772O439l58582J01176L9327J96372
$$ -117382 -91590 -95495 -61277 31673 -354907 147865 154304 -204278 -103102 -63775 132597
7109A32597r2586j97318J88830N7817j15266j44730L3920J30831l1620r9444N9750
$$ 132597 40011 -157307 31523 89340 -25926 -170656 -136736 -5905 -37525 -136969 -77219
7098g7219l5875R4951l61143L9900M7895m3983J30290k2381n1477J38579k2478
$$ -77219 -113094 -18143 -379286 -339386 -291491 -335474 -205184 -227565 -279042 -140463 -162941
7087a62941O2890N9429o7945j09580j1755K51205k89310K33644p8760N9660j79332
$$ -162941 -100051 -40622 -108567 -218147 -229902 21303 -268007 -34363 -113123 -53463 -232795
7076b32795j25794o6346L43807n8932r9253j1725J19619j48224j58577K07123
$$ -232795 -358589 -424935 -81128 -140060 -239313 -251038 -131419 -279643 -438220 -231097
7066b31097k09434J99100n6041n3704J83621j15807p8475J20901J95787k52907
$$ -231097 -440531 -241431 -297472 -351176 -167555 -283362 -361837 -240936 -45149 -298056
7056b98056n5617K15659n1567j67970q5537K42246L87810k13366k11858r4352
$$ -298056 -353673 -138014 -189581 -357551 -443088 -200842 186968 -26398 -238256 -332608
7046c32608K4910K45372k63897j6022O0104J14659J8725m2080J10072j15888l9585
$$ -332608 -307698 -62326 -326223 -342245 -282141 -167482 -148757 -190837 -80765 -196653 -236238
7035b36238j80024p3765J79123r0q8612J31718M47J10812k43020K2790K82310
$$ -236238 -416262 -490027 -310904 -310994 -399606 -267888 -267441 -156629 -399649 -376859 -94549
7024i4549j39727p9836n486L26278K4424k55422j20196J72511q2679J35669r0166
$$ -94549 -234276 -314112 -319598 6680 31104 -224318 -344514 -172003 -254682 -119013 -209179
7013b09179j20396k6577j06868K49367k12285K94210j08629r0441L38487j42362
$$ -209179 -329575 -356152 -463020 -213653 -425938 -131728 -240357 -330798 7689 -134673
7003a34673j80813p5080n0396J54983J77811j15974q7375l9464J06270k07410
$$ -134673 -315486 -390566 -440962 -285979 -108168 -224142 -311517 -350981 -244711 -452121
6993d52121O955P269K26929J77232l13234N7544q5936J79950j42736K43136P0418
$$ -452121 -445166 -437897 -210968 -33736 -346970 -289426 -375362 -195412 -338148 -95012 -24594
6982b4594k93014R6937r2698J89270p0573k52293k3442K79392N1723r0488k45999
$$ -24594 -317608 -220671 -313369 -124099 -194672 -446965 -470407 -191015 -139292 -229780 -475779
6971d75779O5463K403K29032J24908k23068k6731L9612J92114j13490k37808M9984
$$ -475779 -410316 -407913 -178881 -53973 -277041 -303772 -264160 -72046 -185536 -423344 -373360
6960c73360L35271r9106k88323J49536m9840J3544N779Q3114J88029j50024n1006
$$ -373360 -38089 -137195 -425518 -275982 -325822 -312278 -306499 -223385 -35356 -185380 -236386
6949b36386K8110Q5355r8784j25102K42011q3568Q939q65j3369P5557o0403J01086
$$ -236386 -208276 -122921 -221705 -346807 -104796 -188364 -179425 -180290 -193659 -118102 -178505 -77419
6937g7419o09l27956Q509K57762M7529j86708m7043M0400n2239K3473j35048Q6509
$$ -77419 -78028 -405984 -397475 -139713 -92184 -278892 -325935 -285535 -337774 -314301 -449349 -362840
6925c62840M2687j60573K43269K07663k48787n4956O6526J59391J8356k12671
$$ -362840 -320153 -480726 -237457 -29794 -278581 -333537 -267011 -107620 -89264 -301935
6915c01935N4757R7397M65n3320J6472J38297J96094l25920p5038l5459o9271
$$ -301935 -247178 -149781 -149316 -202636 -186164 -47867 148227 -177693 -252731 -288190 -357461
6904c57461L816j1354O6735J22748M0564j85496l4245O0404j00876o4065O6322
$$ -357461 -353645 -364999 -298264 -175516 -134952 -320448 -354693 -294289 -395165 -459230 -392908
6893c92908L7370J50320k19687J8318J15539R1149R8893j81627j2457N4952j53970
$$ -392908 -355538 -205218 -424905 -406587 -291048 -199899 -101006 -282633 -295090 -240138 -394108
6882c94108m534L6630L11456k31652L0686j9267j2222J15912j86904q7659K16036
$$ -394108 -398642 -362012 -50556 -282208 -251522 -270789 -283011 -167099 -354003 -441662 -225626
6871b25626j39088%J19066R9458L9276k73601K01800R0783k00317p170N7289J1702
$$ -225626 -364714 -364714 -245648 -146190 -106914 -380515 -178715 -87932 -288249 -295419 -238130 -226428
6859b26428j21724N7948J17406L9480j30123n3204j7678J32870r3079j38483J76152
$$ -226428 -348152 -290204 -172798 -133318 -263441 -316645 -334323 -201453 -294532 -433015 -256863
6848b56863N6499J50879j84938J4909O5704l0333J01242k67768p0706J15820m7109
$$ -256863 -200364 -49485 -234423 -219514 -153810 -184143 -82901 -350669 -421375 -305555 -352664
6837c52664K11726K1961K4566Q6835k40565r6960K4755L8786K66434j21147J05033
$$ -352664 -140938 -118977 -94411 -7576 -248141 -345101 -320346 -281560 -15126 -136273 -31240
6826c1240j24569p0465o0407P7814r5333J62270k9183J17500r5295k27012o7987
$$ -31240 -155809 -226274 -286681 -208867 -304200 -141930 -171113 -53613 -148908 -375920 -443907
6815d43907M0114K61777R6321j24632Q3024j15713j17581Q976l1614L25124j8233
$$ -443907 -403793 -142016 -45695 -170327 -87303 -203016 -320597 -311621 -343235 -18111 -36344
6804c6344j74353Q1419m3157L5679J2049l7199Q5904J0321K0061j32415n2473
$$ -36344 -210697 -129278 -172435 -136756 -124707 -161906 -76002 -65681 -45620 -178035 -230508
6793b30508p6813K6875K5193J3763l6431Q9301K3552j3016N2650m5331j52176
$$ -230508 -307321 -280446 -255253 -241490 -277921 -188620 -165068 -178084 -125434 -170765 -322941
6782c22941J18481K6034j02986J25250l457O7850R1397m39847l5686J58053m6436
$$ -322941 -204460 -178426 -281412 -156162 -159619 -91769 -372 -440219 -475905 -317852 -364288
6771c64288J19484J39317j52447K017n8511M4327K39145k11926k589K81499K996
$$ -364288 -244804 -105487 -257934 -255917 -314428 -270101 -30956 -242882 -245471 36028 39024
6760C9024o8064j12345K5630k01396K48428l5143J48644J66514l61222k92003
$$ 39024 -29040 -141385 -115755 -317151 -68723 -103866 44778 211292 -149930 -441933
6750d41933J14327J03345P6650J50555j69236K97265q6404k08138o8391J19866
$$ -441933 -327606 -224261 -147611 2944 -166292 130973 44569 -163569 -231960 -112094
6740a12094j79919J62576J27460o220J45248j07564J57483j6631k00371l6653
$$ -112094 -292013 -129437 -1977 -8197 137051 29487 186970 170339 -30032 -66685
6730f6685J45036K5986k72430p4119M0377J45339K78358k12338J1213L8599l4612
$$ -66685 78351 104337 -168093 -242212 -201835 -56496 221862 9524 20737 59336 24724
6719B4724l6547J7341n8466j83111K55623J56338m7873J51032l82041j5096Q1674
$$ 24724 -11823 5518 -52948 -236059 19564 175902 128029 279061 -102980 -118076 -36402
6708c6402J30401J81761k04387o5883J06959N8292J15713R340j0588q1922j19634
$$ -36402 93999 275760 71373 5490 112449 170741 286454 295794 285206 203284 83650
6697H3650J97183j35802P3104q2383K1997N3101j91075O279R9426J32006j4925
$$ 83650 280833 145031 218135 135752 157749 210850 19775 26054 125480 257486 242561
6686B42561j92712k67607M907M7854K71784J08677J63663J16332p8987N6665j41149
$$ 242561 49849 -217758 -212851 -164997 106787 215464 379127 495459 416472 473137 331988
6675C31988o7554M8202l8084J46739j1041q3624l4614k84376K22617j3306M2300
$$ 331988 264434 312636 274552 421291 410250 326626 292012 7636 230253 216947 259247
6664B59247O8011j09044p9610M9833J6464J50518M8878N6415j16568O1003J70568
$$ 259247 327258 218214 138604 188437 204901 355419 404297 460712 344144 405147 575715
6653E75715k44402m9395L0169l3931K16966J73150j52472j6741k3929J25285j56736
$$ 575715 331313 281918 312087 278156 495122 668272 515800 499059 475130 600415 443679
6642D43679M8423K58k10719L15971o0114L6551J61691q1106j9122j3763J0271
$$ 443679 492102 492360 281641 597612 537498 574049 735740 654634 635512 621749 632020
6631F32020J60804k28140p3032R7964P2804P674j12407J04067K03600j68056p8166
$$ 632020 792824 564684 491652 589616 662420 670094 557687 661754 865354 697298 619132
6620F19132j01903J63307k0823j18474J05704j63758J10472J42979J15073q1206
$$ 619132 517229 680536 659713 541239 646943 483185 593657 736636 851709 770503
6610G70503k44802r9110J56063R6887M0308j75472J42385P9214k77385j45911
$$ 770503 525701 426591 582654 679541 719849 544377 686762 765976 488591 342680
6600C42680J01651m5004J71681o1079r8205r4371N4016J00370m2394K35224n4631
$$ 342680 444331 399327 571008 509929 411724 317353 371369 471739 429345 664569 609938
6589F09938K62068j89914j39013p2020j49222l4380Q4486Q1019J06805q1979k11474
$$ 609938 872006 682092 543079 471059 321837 287457 371943 452962 559767 477788 266314
6578B66314J62832l7125J36812k58568R1543o795J63291J63345l07642J53559
$$ 266314 429146 392021 528833 270265 361808 355013 518304 681649 374007 527566
6568E27566R8764O0631o8836k27640J64914R4725r497N9746k05104J20463P4241
$$ 527566 626330 686961 618125 390485 555399 650124 640627 700373 495269 615732 689973
6557F89973K5110J19216j97857j18402k1437M6845R8449j25234J82670N8031J68489
$$ 689973 715083 834299 636442 518040 496603 543448 641897 516663 699333 757364 925853
6546I25853J00532n2334m6401p2352l5255j8924o4484J39820Q8205l7128P6343
$$ 925853 1026385 974051 927650 855298 820043 801119 736635 876455 964660 927532 1003875
6535A003875L8145m4010j25162K83638J09643j80669q9734J8640J08876K48183
$$ 1003875 1042020 998010 872848 1156486 1266129 1085460 995726 1014366 1123242 1371425
6525A371425l24450L00863M9292R7831L7698k70505R4637m8530K26212m3067Q739
$$ 1371425 1046975 1347838 1397130 1494961 1532659 1262154 1356791 1308261 1534473 1491406 1500145
6514A500145J99998K9485j25379J63501j14779J86764k5558K9326O0480J38475
$$ 1500145 1700143 1729628 1604249 1767750 1652971 1839735 1814177 1843503 1903983 2042458
6504B042458J08260n7399M47419q1036P786L5739K26004l3832J33726M223L4786
$$ 2042458 2150718 2093319 2540738 2459702 2467488 2503227 2729231 2695399 2829125 2833348 2868134
6493B868134o450O6322K19018J47639Q2289q7542J78209J66381J59712o8508M2400
$$ 2868134 2861684 2928006 3147024 3294663 3376952 3289410 3467619 3634000 3793712 3725204 3767604
6482C767604J98471j80524o1641j16434J30190l38241k17070j02895J5571L08463
$$ 3767604 3966075 3785551 3723910 3607476 3737666 3399425 3182355 3079460 3095031 3403494
6472C403494j89762o3175k11579j97822l26488N8686Q8139k4391j91314J14921
$$ 3403494 3213732 3150557 2938978 2741156 2414668 2473354 2561493 2537102 2345788 2460709
6462B460709R4296q2203l25057l67970K97062K9842q8446n2134L1330K909j28956
$$ 2460709 2555005 2472802 2147745 1779775 2076837 2106679 2018233 1966099 1997429 2000338 1871382
6451A871382M7301k8640j50054J6135o1199r2439j74094j52930L19600L7670P8531
$$ 1871382 1918683 1890043 1739989 1756124 1694925 1602486 1428392 1275462 1595062 1632732 1711263
6440A711263o7775q9822O4539p232N984l18900k21825J23084N9242J82848k82999
$$ 1711263 1643488 1553666 1618205 1610973 1616957 1298057 1076232 1199316 1258558 1441406 1158407
6429A158407j65256L35646j67325N6464k9629j86221l4900Q7787J27933j43077
$$ 1158407 993151 1328797 1161472 1217936 1188307 1002086 967186 1054973 1182906 1039829
6419A039829R9711m211k26449J50759p0772m9544J18975l53601J99765J22933
$$ 1039829 1139540 1135329 908880 1059639 988867 939323 1058298 704697 904462 1027395
6409A027395j04480k91003N5280J61967J16045l04787j79601K49428R2289l42816
$$ 1027395 922915 631912 687192 849159 965204 660417 480816 730244 822533 479717
6399D79717J67913J30867q4750J45551j01088J00128j99354N594J27313J8818
$$ 479717 647630 778497 693747 839298 738210 838338 638984 644578 771891 790709
6389G90709P669k65238M344M4046j60775M345l25J10800J89637k1483K06344l56869
$$ 790709 798378 533140 537484 581530 420755 425100 424775 535575 725212 703729 910073 553204
6377E53204j87317L26213q3144J95593j18297J27827L538k06381M5242J08303
$$ 553204 365887 692100 608956 804549 686252 814079 817617 611236 656478 764781
6367G64781N7119p4996k38622J96896J31523k27152j93864J46533K33936j80213
$$ 764781 821900 746904 508282 705178 836701 609549 415685 562218 796154 615941
6357F15941j7247M5225n5864J41471j90927O2264k446K193R194K0217k9539p340
$$ 615941 598694 643919 588055 729526 538599 600863 598417 600610 609804 630021 600482 593142
6345E93142N2792n908n8173j18080q8069l5527P6480J54373k1677k24740K39881
$$ 593142 645934 640026 581853 463773 375704 340177 416657 571030 549353 324613 564494
6334E64494J5576M3992K0803j20558l586L4306j33876j06311K06630j56125J23981
$$ 564494 580070 624062 644865 524307 520721 555027 421151 314840 521470 365345 489326
6323D89326J66725K88937j49563k90525J72349k6671k28126J08079n426j25374
$$ 489326 656051 944988 795425 504900 677249 650578 422452 530531 525105 399731
6313C99731K14884k3992l099l28851J29044J65197m9671L5547p5392J05711o3488
$$ 399731 614615 590623 587524 258673 387717 552914 503243 538790 463398 569109 505621
6302E05621O9237J02514J00395j70102j15161M3002J53870j29985k09477K45279
$$ 505621 574858 677372 777767 607665 492504 535506 689376 559391 349914 595193
6292E95193R1951J70052j48601j93068M2155K63393q5535k25988k33302J75771
$$ 595193 687144 857196 708595 515527 557682 821075 735540 509552 276250 452021
6282D52021K16763l7559P3817q1207J69862k7941p1115j9335j08838m5220k1795
$$ 452021 668784 631225 705042 623835 793697 765756 694641 675306 566468 521248 499453
6271D99453L38684Q0621j79171m2815j4890J27415n545k70107J68495q9646R9184
$$ 499453 838137 918758 739587 696772 681882 809297 803752 533645 702140 612494 711678
6260G11678K7408k23314K35019J53267o9789P5071K53906k54211j63079K9025
$$ 711678 739086 515772 750791 904058 834269 909340 1163246 909035 745956 774981
6250G74981R8762K06412M0377j03638J73246K49152r4251k88289O1732J57704
$$ 774981 873743 1080155 1120532 1016894 1190140 1439292 1345041 1056752 1118484 1276188
6240A276188K7260j88947p7524J67332J55253L7399j4983J20712J24895m6740
$$ 1276188 1303448 1114501 1036977 1204309 1359562 1396961 1381978 1502690 1627585 1580845
6230A580845j2854R8849j4339r3488J12999K74070J98397m6719j09881J16742
$$ 1580845 1567991 1666840 1652501 1559013 1672012 1946082 2144479 2097760 1987879 2104621
6220B104621n4340o8525p0599q6283K53794J11179J68J61467K27291j33628j21535
$$ 2104621 2050281 1981756 1911157 1824874 2078668 2189847 2190015 2351482 2578773 2445145 2323610
6209B323610K24530j71950J21L7779o8008K79481J46029j13733n7644J40297l8600
$$ 2323610 2548140 2376190 2376311 2414090 2346082 2625563 2771592 2657859 2600215 2740512 2701912
6198B701912M673o943m7683K5523J54468q5485K30611J53423P8314K22997k34753
$$ 2701912 2706585 2699642 2651959 2677482 2831950 2746465 2977076 3130499 3208813 3431810 3197057
6187C197057Q1554p9148K02115j5519L54709Q0187K393L89394j90910J28604J24082
$$ 3197057 3278611 3199463 3401578 3386059 3740768 3820955 3823348 4212742 4021832 4150436 4274518
6176D274518j89713Q4381J55759J5173K5725p1038Q4490j40636J71967L5164k72227
$$ 4274518 4084805 4169186 4324945 4340118 4365843 4294805 4379295 4238659 4410626 4445790 4173563
6165D173563J24510j61429j65531j94377k01027P1513m2358j17987m4905L7828
$$ 4173563 4298073 4136644 3971113 3776736 3575709 3647222 3604864 3486877 3441972 3479800
6155C479800R3540l28204l1796J71956j72591k72835j69346K73566k9720j72799
$$ 3479800 3573340 3245136 3213340 3385296 3212705 2939870 2770524 3044090 3014370 2841571
6145B841571q503J961j04423k02762j52335O2693L4459o9289j86429K14484Q7767
$$ 2841571 2833068 2835029 2730606 2527844 2375509 2438202 2472661 2403372 2216943 2431427 2519194
6134B519194n08534Q4569K16526k44799j7222j3288n6083o2981P7568l0371m8984
$$ 2519194 2010660 2095229 2311755 2066956 2049734 2036446 1980363 1917382 1994950 1964579 1915595
6123A915595P7833L5492n9711j3181l04381R480J88222j49914J03642j69233J36138
$$ 1915595 1993428 2028920 1969209 1956028 1651647 1661127 1849349 1699435 1803077 1633844 1769982
6112A769982j67618m8048K2972j84991N2566Q6826J2795J52135p5273j4240k03277
$$ 1769982 1602364 1554316 1577288 1392297 1444863 1531689 1544484 1696619 1621346 1607106 1403829
6101A403829K9467J74823r0772J13736o9550Q9751j94055j18150J04457q1898
$$ 1403829 1433296 1608119 1517347 1631083 1561533 1651284 1457229 1339079 1443536 1361638
6091A361638K27045k42833j92006K79875j96383J00239m5286j93776K30606Q7976
$$ 1361638 1588683 1345850 1153844 1433719 1237336 1337575 1292289 1098513 1329119 1417095
6081A417095j4028j15296L8631o8169k43836J14027N9535J0329j9952j57468N7070
$$ 1417095 1403067 1287771 1326402 1258233 1014397 1128424 1187959 1198288 1178336 1020868 1077938
6070A077938n435J12086l8191k46162p096M6250M1528R3625m6807K8978k3792
$$ 1077938 1072503 1184589 1146398 900236 893140 939390 980918 1074543 1027736 1056714 1032922
6059A032922l8886j00110K8987J26689k26909o2699n9892q3070Q2407m273J34998
$$ 1032922 994036 893926 922913 1049602 822693 759994 700102 617032 699439 695166 830164
6048H30164n7360n5537R2254j24338j69168o6262j06410K59884L50299J24760
$$ 830164 772804 717267 809521 685183 516015 449753 343343 603227 953526 1078286
6038A078286j68366k32767l2407p9731L84574Q9915k94616j28021k2735K6886
$$ 1078286 909920 677153 644746 565015 949589 1039504 744888 616867 594132 621018
6028F21018M6153M408J33712j91944j45762o6440L73574o9756l13790l0633L77648
$$ 621018 667171 671579 805291 613347 467585 401145 774719 704963 391173 360540 738188
6017G38188R0635j07255M7719J46626j17841k29783m916J91839k1087M6371m6159
$$ 738188 828823 721568 769287 915913 798072 568289 563373 755212 734125 780496 734337
6006G34337J2472K28525k40207j65081Q6184L9352k78533J47764L04188L8761
$$ 734337 746809 975334 735127 570046 656230 695582 417049 564813 869001 907762
5996I07762j64829l58224J80318J49896J15124j13954q7094J9648O4451O928q2157
$$ 907762 742933 384709 565027 714923 830047 716093 628999 648647 713098 720026 637869
5985F37869J33500j94766J66138J05135M662j00053J47662k41248k83834M36538
$$ 637869 771369 576603 742741 847876 852538 752485 900147 658899 375065 811603
5975H11603p3292J77383J28296j38596p8906J12314J1975q2653m5913p148L77099
$$ 811603 738311 915694 1043990 905394 826488 938802 950777 868124 822211 815063 1192162
5964A192162j60027L3612q9192L86425m3494k17913L8994N4250k7618k64723J02949
$$ 1192162 1032135 1065747 976555 1362980 1319486 1101573 1140567 1194817 1167199 902476 1005425
5953A005425J11442J76597R4878J18810j19664L0449r1265j04944K45782j41298
$$ 1005425 1116867 1293464 1388342 1507152 1387488 1417937 1326672 1221728 1467510 1326212
5943A326212l3508K11556J91034j36902k02493K1957q845j11815N440J02849k5011
$$ 1326212 1292704 1504260 1695294 1558392 1355899 1377856 1369011 1257196 1262636 1365485 1340474
5932A340474J12730N1892j32465J74795R2738l28k57183J11892k17106J54694
$$ 1340474 1453204 1505096 1372631 1547426 1640164 1639836 1382653 1494545 1277439 1432133
5922A432133J50038j78048O9013L24185J03127j21714j97677m2698J48767j96412
$$ 1432133 1582171 1404123 1473136 1797321 1900448 1778734 1581057 1538359 1687126 1490714
5912A490714P5660N7628K42450O4295k97423J47860O8934K27464n4332m43809
$$ 1490714 1566374 1624002 1866452 1930747 1633324 1781184 1850118 2077582 2023250 1579441
5902A579441L22816J4230j0310L9918q0009l6137K18076k25491J07387K59136
$$ 1579441 1902257 1916487 1906177 1946095 1866086 1829949 2048025 1822534 1929921 2189057
5892B189057j97830j03975O0074K33714j70209J62058j46892N8383O0670j45749
$$ 2189057 1991227 1887252 1947326 2181040 2010831 2172889 2025997 2084380 2145050 1999301
5882A999301j65470K50133M497j04954J79560o3598K95864J00924k84146r1647
$$ 1999301 1833831 2083964 2088461 1983507 2163067 2099469 2395333 2496257 2212111 2120464
5872B120464M6023j53706O0372q5659J60275O5711p6522L4762J33188k1368k49836
$$ 2120464 2166487 2012781 2073153 1987494 2147769 2213480 2136958 2171720 2304908 2283540 2033704
5861B033704J07533J42048j50392N8029k17623N8915J89314j20381n8505L303
$$ 2033704 2141237 2283285 2132893 2190922 1973299 2032214 2221528 2101147 2042642 2045945
5851B045945J08547j32319k66260K1871L7417R3607L7313k20675K61490j31871
$$ 2045945 2154492 2022173 1755913 1777784 1815201 1908808 1946121 1725446 1986936 1855065
5841A855065o0562L4744k01202K3860q1891J26044P581O7545j51621J03813j05571
$$ 1855065 1794503 1829247 1628045 1651905 1570014 1696058 1703639 1771184 1619563 1723376 1617805
5830A617805L1030k4254j17575o5034J515N0255J73878j9122k05659k80382K04231
$$ 1617805 1648835 1624581 1507006 1441972 1443487 1493742 1667620 1648498 1442839 1162457 1366688
5819A366688j39622K9173j18434j6757L92797j40597l79752N1813K27705R4104
$$ 1366688 1227066 1256239 1137805 1121048 1513845 1373248 993496 1045309 1273014 1367118
5809A367118p2898l08139P0817k5489j08682j0145M25675j59104r3074r9458j44293
$$ 1367118 1294220 986081 1056898 1031409 922727 912582 1338257 1179153 1086079 986621 842328
5798H42328K60663l22119j85092K49823J37296m736o9509k8481L612J18806j36920
$$ 842328 1102991 780872 595780 845603 982899 978163 908654 880173 883785 1002591 865671
5787H65671j4647Q7045j69398j36593J30521l5923l0710l7154q623M5274o2665
$$ 865671 851024 938069 768671 632078 762599 726676 695966 658812 650189 695463 632798
5776F32798r7505q434J26649N4515k91877N982K87260J12460j01710j13479k0416
$$ 632798 535293 526859 653508 708023 416146 422128 709388 821848 720138 606659 586243
5765E86243M1419l2175P9352m6042m7603o3687J39209J22332j52371k3967j92618
$$ 586243 627662 595487 674839 628797 581194 517507 656716 779048 626677 602710 410092
5754D10092k70635N2202K04820N9069r2754j16722j2417L59541J62317k98892
$$ 410092 139457 191659 396479 455548 362794 246072 233655 593196 755513 456621
5744D56621J2069M7885k2225j19478j51941J66593l3419p3624k518N375J87995
$$ 456621 468690 516575 494350 374872 222931 389524 356105 282481 279963 285338 473333
5733D73333k17782r6235P9671j93371K68366O7701K5621O6846l6495k06079L4453
$$ 473333 255551 159316 238987 45616 313982 381683 407304 474150 437655 231576 266029
5722B66029K49463l8761j43465p0225r4239K24602m2981j90623O0608j1131J77182
$$ 266029 515492 476731 333266 263041 168802 393404 350423 159800 220408 209277 386459
5711C86459k4916L6597j28010o1205O219n419J42956m0371j1609j9066r5014M8692
$$ 386459 361543 398140 270130 208925 215144 209725 352681 312310 300701 281635 186621 235313
5699B35313K44980j03026o0720J64455j04880j27855J82600k7186k19422L5749
$$ 235313 480293 377267 316547 481002 376122 248267 430867 403681 184259 220008
5689B20008q9001J52445J32270m8097j33504J1289j3841j25003K11363J38278
$$ 220008 131007 283452 415722 367625 234121 245410 231569 106566 317929 456207
5679D56207j61942J20598k04581j03152M17677j30128O2719l52910j7466K37658
$$ 456207 294265 414863 210282 107130 524807 394679 457398 104488 87022 324680
5669C24680r1398O6414n1064J02195J75050o9216N4062J1543k13293k5200q6290
$$ 324680 233282 299696 248632 350827 525877 456661 510723 522266 308973 283773 197483
5658A97483K68603j81687M861J08977k29311J00640j8236J21501n8493j82550
$$ 197483 466086 284399 289260 398237 168926 269566 251330 372831 314338 131788
5648A31788l2540O9096R5232J11479p0886J507J3418l6579K80722n0541j26980
$$ 131788 99248 168344 263576 375055 304169 305676 319094 282515 563237 512696 385716
5637C85716l07517J25554K4636P8935K06514j65816j68320J19778j35940L4209
$$ 385716 78199 203753 228389 307324 513838 348022 179702 299480 163540 197749
5627A97749J84153j37625j1339r148l9876L24860J60605j74925k40378J47880
$$ 197749 381902 244277 232938 223790 183914 508774 669379 494454 254076 401956
5617D01956J93904m6476J01670j44796J0474k67774p8162J30381R2394K103l18202
$$ 401956 595860 549384 651054 506258 516732 248958 170796 301177 393571 395674 77472
5606G7472J01403K12519l7474k68n0548J834J14751m4630j6760o8471j7504k3685
$$ 77472 178875 391394 353920 353652 303104 304938 419689 375059 358299 289828 272324 248639
5594B48639L850J62486J2573O6067j26680R4450m344j28972J62902n8755p5917
$$ 248639 252489 414975 427548 493615 366935 461385 457041 328069 490971 432216 356299
5583C56299j12829j04429J67300K21996q9395j497N8741J22011j21152K09586
$$ 356299 243470 139041 306341 528337 438942 437445 496186 618197 497045 706631
5573G06631j04489j37506K0596p7306J88339l0999q0537l9436K0468k09861J00519
$$ 706631 602142 464636 485232 407926 596265 565266 484729 445293 465761 255900 356419
5562C56419J06213k6506M9399q401J97591q4631M4421N2058l03663J52312K04590
$$ 356419 462632 436126 485525 477124 674715 590084 634505 686563 382900 535212 739802
5551G39802n0661q963J0526K44279K9055k16553K4314k09632K60674j26866r3560
$$ 739802 689141 680178 690704 934983 964038 747485 771799 562167 822841 695975 602415
5540F02415J93500P198R9560k19024K08180R619k19803K46156m4433j09731K0454
$$ 602415 795915 803113 902673 683649 891829 901448 681645 927801 883368 773637 794091
5529G94091r6381K38131J47617k52727k732K1027M5536J1319m1417J06582j16694
$$ 794091 697710 935841 1083458 830731 827999 849026 894562 905881 864464 971046 854352
5518H54352J26315J66744j73652R8732j13599J93273P8401o1329K66163m7328
$$ 854352 980667 1147411 973759 1072491 958892 1152165 1230566 1169237 1435400 1388072
5508A388072k05900q330N4957J83044q4000j69994J93454Q7980j09554j04513
$$ 1388072 1182172 1173842 1228799 1411843 1327843 1157849 1351303 1439283 1329729 1225216
5498A225216J27143Q1795J07851K00012k22183O323K39323J23176j08188O131
$$ 1225216 1352359 1434154 1542005 1742017 1519834 1526157 1765480 1888656 1780468 1786599
5488A786599J03558K19033L5305l03104J22993J81907q4831J38222K70800l0656
$$ 1786599 1890157 2109190 2144495 1841391 1964384 2146291 2061460 2199682 2470482 2439826
5478B439826K6912k2182M622J89620M0215r8375J02655M24745J43783n9041q3339
$$ 2439826 2466738 2444556 2449178 2638798 2679013 2580638 2683293 3108038 3251821 3192780 3109441
5467C109441K16683K65544J53815L134j22230J84045J00503R3151O8314L42276
$$ 3109441 3326124 3591668 3745483 3748617 3626387 3810432 3910935 4004086 4072400 4414676
5457D414676J85070j26199K07722K22281J64017O583M9056J54019J56358O1921
$$ 4414676 4599746 4473547 4681269 4903550 5067567 5074150 5123206 5277225 5433583 5495504
5447E495504p2578K48396J49962J05920k65034R6758p1718o7830P825j6775j64219
$$ 5495504 5422926 5671322 5821284 5927204 5662170 5758928 5687210 5619380 5627205 5610430 5446211
5436E446211j10163J19623J2591p7030O4940j59371j56400K91476k54148L7266
$$ 5446211 5336048 5455671 5468262 5391232 5456172 5296801 5140401 5431877 5177729 5214995
5426E214995r9229k32329O7771P2024J33310k41756J39199j6232m7988k2464m41462
$$ 5214995 5115766 4883437 4951208 5023232 5156542 4914786 5053985 5037753 4989765 4967301 4525839
5415D525839J68229k3633k42757l3605j12662Q2738n4m32868P640L6875K7011
$$ 4525839 4694068 4670435 4427678 4394073 4281411 4364149 4364095 3931227 3938867 3975742 4002753
5404D002753m15769n8376K58729q7394j55296k29798J61553L25009n1115l52699
$$ 4002753 3586984 3528608 3787337 3699943 3544647 3314849 3476402 3801411 3750296 3397597
5394C397597k7478j04433l39090j56812k1713O2263j2243k9599J08729l0099k22402
$$ 3397597 3370119 3265686 2926596 2769784 2748071 2810334 2798091 2768492 2877221 2847122 2624720
5383B624720j21143J6273q828l46759j2268K12786m7p954j03197l7638j05618
$$ 2624720 2503577 2519850 2511022 2164263 2151995 2364781 2364734 2356780 2253583 2215945 2110327
5372B110327P8161L1307n1617l00858o7582K4620R4197n7919l2423j8685J84073
$$ 2110327 2188488 2219795 2168178 1867320 1799738 1824358 1918555 1860636 1828213 1809528 1993601
5361A993601j692j95974l7802k25393k7373r7967K71926O0444j71228q903p4958
$$ 1993601 1991909 1795935 1758133 1532740 1505367 1407400 1679326 1739770 1568542 1559639 1484681
5350A484681J82013m6115j49649j5959K93336j106k43781r4125J74770j009P0055
$$ 1484681 1666694 1620579 1470930 1454971 1748307 1747201 1503420 1409295 1584065 1583056 1653111
5339A653111j49184j27034L67676j42711k44651j18632K43491J33146j44515K38456
$$ 1653111 1503927 1376893 1744569 1601858 1357207 1238575 1482066 1615212 1470697 1709153
5329A709153M2489j97266q8293L5666J39301k2597j60226j37475K7722J60030
$$ 1709153 1751642 1554376 1466083 1501749 1641050 1618453 1458227 1320752 1348474 1508504
5319A508504M707P8783J41180j59641Q2273j64022n1371J18510r1310J28211k20197
$$ 1508504 1513211 1591994 1733174 1573533 1655806 1491784 1440413 1558923 1467613 1595824 1375627
5308A375627P2068K85926j30180n0003m6914k1471J45977j20164j67928r1618
$$ 1375627 1447695 1733621 1603441 1553438 1506524 1485053 1631030 1510866 1342938 1251320
5298A251320J36932M5598j59868M66014j56611l20164L8978j54429J28601r6052
$$ 1251320 1388252 1433850 1273982 1739996 1583385 1263221 1302199 1147770 1276371 1180319
5288A180319k1763J05332K5366k2387j61247J39414K49022n6672r4708L3591J0434
$$ 1180319 1158556 1263888 1289254 1266867 1105620 1245034 1494056 1437384 1342676 1376267 1386701
5277A386701Q4271l24152J34253j2868K36889m247k77086J76678J7836l43715
$$ 1386701 1470972 1146820 1281073 1268205 1505094 1500847 1223761 1400439 1418275 1074560
5267A074560N2964J66070L3776j25962k5971J19602j89747J53890N411m8106J11072
$$ 1074560 1127524 1293594 1327370 1201408 1175437 1295039 1105292 1259182 1264593 1216487 1327559
5256A327559j26494K41403K1070j00321j09245n7144K52846j67081l7814M2260
$$ 1327559 1201065 1442468 1463538 1363217 1253972 1196828 1449674 1282593 1244779 1287039
5246A287039J11925j63847q6439p0753J55509K53954k25647k51285K77919J69240
$$ 1287039 1398964 1235117 1148678 1077925 1233434 1487388 1261741 1010456 1288375 1457615
5236A457615k11189j16404m9713J1388K6536R2230k34981O8791J00227j55157
$$ 1457615 1246426 1130022 1080309 1091697 1118233 1210463 975482 1044273 1144500 989343
5226I89343J94652J16882j00684j75047P7839j16413K0100J20522k8447J5914
$$ 989343 1183995 1300877 1200193 1025146 1102985 986572 1006672 1127194 1098747 1114661
5216A114661j72978Q6666N3709k40616R3010p4582J69810q6900n5685J36578M393
$$ 1114661 941683 1028349 1082058 841442 934452 859870 1029680 942780 887095 1023673 1028066
5205A028066J81792l27598L8271Q1017k08394K40329L069L8721J28474n0381N1762
$$ 1028066 1209858 882260 920531 1001548 793154 1033483 1036552 1075273 1203747 1153366 1205128
5194A205128l09010J25594j02559j5105R8735j34905J09434J0755J58253J6431
$$ 1205128 896118 1021712 919153 904048 1002783 867878 977312 988067 1146320 1162751
5184A162751k23463N3002k49985J05840J78652O7320J34464k61124K45323j35885
$$ 1162751 939288 992290 742305 848145 1026797 1094117 1228581 967457 1212780 1076895
5174A076895J37231m5898l33685K76817K6522o4483K4161Q718N096J32797k6792
$$ 1076895 1214126 1168228 834543 1111360 1137882 1073399 1097560 1106278 1111374 1244171 1217379
5163A217379n1048j68594m4844o603m058o523L2561K05790k4051M2723r1140N3147
$$ 1217379 1166331 997737 952893 946290 942232 935709 968270 1174060 1150009 1192732 1101592 1154739
5151A154739l9051J98835m16740r4564Q8961j25740L22599j33777K00144J72768
$$ 1154739 1115688 1314523 897783 803219 892180 766440 1089039 955262 1155406 1328174
5141A328174k29375l1618K9015J75104j589j18933K27q2654K51824K7144l8752
$$ 1328174 1098799 1067181 1096196 1271300 1269711 1150778 1151005 1068351 1320175 1347319 1308567
5130A308567K90835l81026m5542K18200l3609j16310q5535J78918P6860N3194
$$ 1308567 1599402 1218376 1172834 1391034 1357425 1241115 1155580 1334498 1411358 1464552
5120A464552j46934Q9842M1368l3443j06739Q245k21617j32407J67291O1769J66216
$$ 1464552 1317618 1407460 1448828 1415385 1308646 1316891 1095274 962867 1130158 1191927 1358143
5109A358143R0029J82816r5703j00718m8909K5263J64233j47465K7932J11911
$$ 1358143 1448172 1630988 1535285 1434567 1385658 1410921 1575154 1427689 1455621 1567532
5099A567532M5106M5179M0375m444p9754q3812K916r4095r7492R9280J1570l3782
$$ 1567532 1612638 1657817 1698192 1693748 1613994 1530182 1533098 1439003 1341511 1440791 1452361 1418579
5087A418579r289K87105J2278k04186j55045q4422K48952J97811j78747L3807
$$ 1418579 1409290 1696395 1708673 1504487 1349442 1265020 1513972 1711783 1533036 1566843
5077A566843j6163R6532o3716O3181L2114j00716J77647M5111l5315r1942N0648
$$ 1566843 1550680 1647212 1583496 1646677 1678791 1578075 1755722 1800833 1765518 1673576 1724224
5066A724224J3339Q55L3100J20984j18521P9404j22957j87271J06602q2573K72180
$$ 1724224 1737563 1738418 1771518 1892502 1773981 1853385 1730428 1543157 1649759 1567186 1839366
5055A839366N0893p0493k08145P993L20339n7978L3371P8941p5464j61288M0490
$$ 1839366 1890259 1819766 1611621 1619614 1939953 1881975 1915346 1994287 1918823 1757535 1798025
5044A798025K3021J77968l10345j37074J31206L93439K3785k83656J5807J10513
$$ 1798025 1821046 1999014 1688669 1551595 1682801 2076240 2100025 1816369 1832176 1942689
5034A942689J18564M5413n3913m3436K2926J76337J49171j69752K70381n6789
$$ 1942689 2061253 2106666 2052753 2009317 2032243 2208580 2357751 2187999 2458380 2401591
5024B401591n3111P8243j49600k6280j35056J00844O7798j72885N5900N6156K68454
$$ 2401591 2348480 2426723 2277123 2250843 2115787 2216631 2284429 2111544 2167444 2223600 2492054
5013B492054R4217m96592L07303M1857r989J76023q802N1091K6163J60646Q1904
$$ 2492054 2586271 2089679 2396982 2438839 2428850 2604873 2596071 2647162 2673325 2833971 2915875
5002B915875p1722j77611m2112L73816J43142j76563K7897K47266J37429j21319
$$ 2915875 2844153 2666542 2624430 2998246 3141388 2964825 2992722 3239988 3377417 3256098
4992C256098l7305M3248m6684J42346j31742j69515J3304J71979K55578j25025
$$ 3256098 3218793 3262041 3215357 3357703 3225961 3056446 3069750 3241729 3497307 3372282
4982C372282J21041K22413Q8830j46898J9608l2188K11301j73679j4861K42874
$$ 3372282 3493323 3715736 3804566 3657668 3677276 3645088 3856389 3682710 3667849 3910723
4972C910723J33778j04638Q359L77986n3919J25656p0351Q059m9324O5533J63851
$$ 3910723 4044501 3939863 3948222 4326208 4272289 4397945 4327594 4335653 4286329 4351862 4515713
4961D515713L06064J16137k0555L35720M6875J8717m72706K05573J98412O9340
$$ 4515713 4821777 4937914 4917359 5253079 5299954 5318671 4845965 5051538 5249950 5319290
4951E319290J09439l6790L46527K60291L8302q9158O9214K35565r2934j56512
$$ 5319290 5428729 5391939 5738466 5998757 6037059 5947901 6017115 6252680 6159746 6003234
4941F003234K44898K55527K72191J33108N7607L7347M8506M3602j89189k6206
$$ 6003234 6248132 6503659 6775850 6908958 6966565 7003912 7052418 7096020 6906831 6880625
4931F880625J14474Q9278J17546m0522L5389O1744j3314k95295l1294p3503J04017
$$ 6880625 6995099 7084377 7201923 7161401 7196790 7258534 7245220 6949925 6918631 6845128 6949145
4920F949145m273k19724N2168n2708J18008k04327j60830j93689j13675n5013
$$ 6949145 6944872 6725148 6777316 6724608 6842616 6638289 6477459 6283770 6170095 6115082
4910F115082j05263K1677J92990q1320k10925j50299Q2699p0414k22819L4675
$$ 6115082 6009819 6031496 6224486 6143166 5932241 5781942 5864641 5794227 5571408 5606083
4900E606083j18695L8495N636q8425K06771l7315q6984N0027K58700O2937n07721
$$ 5606083 5487388 5525883 5531519 5443094 5649865 5612550 5525566 5575593 5834293 5897230 5389509
4889E389509n5534Q3193K31794j47060j28177L17415m4593k13467o753L8688j84123
$$ 5389509 5333975 5417168 5648962 5501902 5373725 5691140 5646547 5433080 5426327 5465015 5280892
4878E280892j71341J00654J77478Q9870j04740q6436L24039l52799q2259k09942
$$ 5280892 5109551 5210205 5387683 5477553 5372813 5286377 5610416 5257617 5175358 4965416
4868D965416l4606J58520r4663J06232J310K57912j7434n547O1279k6842k7455
$$ 4965416 4930810 5089330 4994667 5100899 5102209 5360121 5342687 5337140 5398419 5371577 5344122
4857E344122j03539j46987M7674O5020P4139j4400J26420k59155O9952J74540
$$ 5344122 5240583 5093596 5141270 5206290 5280429 5266029 5392449 5133294 5203246 5377786
4847E377786j79660n9917k09553J95942K67534l7911N5787N7626J73028j59403
$$ 5377786 5198126 5138209 4928656 5124598 5392132 5354221 5410008 5467634 5640662 5481259
4837E481259j05280K75106K8800q565l85699J76661N40394q6692n1580N3302J76535
$$ 5481259 5375979 5651085 5679885 5671320 5285621 5462282 6002676 5915984 5864404 5917706 6094241
4826F094241K16257k12399Q0279j79148J28705J02021K17110M48353q9525o1739
$$ 6094241 6310498 6098099 6178378 5999230 6127935 6229956 6447066 6895419 6805894 6744155
4816F744155q5473P8584k95624N6046J68678K46482L7256L7109Q8523J81227R7312
$$ 6744155 6658682 6737266 6441642 6497688 6666366 6912848 6950104 6987213 7075736 7256963 7354275
4805G354275p7291q51R7562K4530N1532J04506P8248L65075n6528J96682J13804
$$ 7354275 7276984 7276133 7373695 7398225 7449757 7554263 7632511 7997586 7941058 8137740 8251544
4794H251544K70592P673k52565P3914m934L20277k5416J04603L18081r307J9976
$$ 8251544 8522136 8529809 8277244 8351158 8346224 8666501 8641085 8745688 9063769 9054462 9074438
4783I074438J38018p2084K01144n2620M36856P3404j08316L10738L06663J29885
$$ 9074438 9212456 9140372 9341516 9288896 9725752 9799156 9690840 10001578 10308241 10438126
4773A0438126p3017k4403K23878L04989l3890M0024J38054J7347K50575K14226
$$ 10438126 10365109 10340706 10564584 10869573 10835683 10875707 11013761 11031108 11281683 11495909
4763A1495909Q6092P1949P9611K27649K4688m5209K064K40686J66561L17164J80728
$$ 11495909 11582001 11653950 11733561 11961210 11985898 11940689 11942753 12183439 12350000 12667164 12847892
4752A2847892L9646K52340K53033j4301R0097J04468M14169R9458O3823J07721
$$ 12847892 12887538 13139878 13392911 13378610 13468707 13573175 13987344 14086802 14150625 14258346
4742A4258346J18771J51596r8551K59042k66380P2356K25850L2436o9338k28255
$$ 14258346 14377117 14528713 14430162 14689204 14422824 14495180 14721030 14753466 14684128 14455873
4732A4455873N5694K01537k45537n0489J14885j78410o4146l38978O3743l75j5691
$$ 14455873 14511567 14713104 14467567 14417078 14531963 14353553 14289407 13950429 14014172 14013797 13998106
4721A3998106k38812K30802o0021l31940j56235l32725k6830k10087k30540j3905
$$ 13998106 13759294 13990096 13930075 13598135 13441900 13109175 13082345 12872258 12641718 12627813
4711A2627813j19799q642o8949j96004J05343l3750l42610r4510O7550k06579
$$ 12627813 12508014 12499372 12430423 12234419 12339762 12306012 11963402 11868892 11936442 11729863
4701A1729863j65460q3371M700m0824k77406j82229p6663N6836k11675k28623
$$ 11729863 11564403 11481032 11485732 11444908 11167502 10985273 10908610 10965446 10753771 10525148
4691A0525148j551j41492J13881j57182M2545Q4502m72641J772l06431q575j20295
$$ 10525148 10523597 10382105 10495986 10338804 10381349 10465851 9993210 9994982 9688551 9679976 9559681
4680I559681k19599O1808q7631k6969n582k84425j54734q1351j87005r2960k5800
$$ 9559681 9340082 9401890 9314259 9287290 9281708 8997283 8842549 8761198 8574193 8481233 8455433
4669H455433j65871n3819o926n2354J96839j21675j16348o3943p8016j31705j35731
$$ 8455433 8289562 8235743 8228817 8176463 8373302 8251627 8135279 8071336 7993320 7861615 7725884
4658G725884J7840P1002J39994k56135r136P8487m04199K74919k39144j94833
$$ 7725884 7743724 7814726 7954720 7698585 7689449 7767936 7363737 7638656 7399512 7204679
4648G204679R5195j66737L8970O744M2523O470j4052j41503j15163J01590j59631
$$ 7204679 7299874 7133137 7172107 7178851 7221374 7227844 7213792 7072289 6957126 7058716 6899085
4637F899085k67916J89329r9532J00932j93473K2318K39457l50579J70917n2218
$$ 6899085 6631169 6820498 6720966 6821898 6628425 6650743 6890200 6539621 6710538 6658320
4627F658320J19657M5148r0837J17805O9384N02j09683o8484O7363q1468R3681
$$ 6658320 6777977 6823125 6732288 6850093 6919477 6919979 6810296 6741812 6809175 6727707 6821388
4616F821388p5267J4987j13085q5686o8234k40857K58995J18726j20021k3166
$$ 6821388 6746121 6761108 6648023 6562337 6494103 6253246 6512241 6630967 6510946 6487780
4606F487780Q9089J24235q225l2505j187n2776L4815j26123J29457K04698j50019
$$ 6487780 6576869 6701104 6692879 6660374 6659187 6606411 6641226 6515103 6644560 6849258 6699239
4595F699239p455J66294J67410j09173k76389J64419N2960M349l241j26710J24365
$$ 6699239 6691784 6858078 7025488 6916315 6639926 6804345 6857305 6861654 6858413 6731703 6856068
4584F856068K32907j81860l7651L27862k5062O3785p7756J30553J47509L6398
$$ 6856068 7088975 6907115 6869464 7197326 7172264 7236049 7158293 7288846 7436355 7472753
4574G472753O5188Q5486J53138J9425o3453j40846L4448R6314M0475k21635R5853
$$ 7472753 7537941 7623427 7776565 7795990 7732537 7591691 7626139 7722453 7762928 7541293 7637146
4563G637146K29749J62104j25445P8873K51322p4020m1734J3945K83483m5152
$$ 7637146 7866895 8028999 7903554 7982427 8233749 8159729 8117995 8131940 8415423 8370271
4553H370271M0329P6415J63970L544J37000j25885K73997J10931q8681j18617
$$ 8370271 8410600 8487015 8650985 8654529 8791529 8665644 8939641 9050572 8961891 8843274
4543H843274q7859J74210J78790K43274q8484J34100L05339j66869r278J09231
$$ 8843274 8755415 8929625 9108415 9351689 9263205 9397305 9702644 9535775 9526497 9635728
4533I635728Q3724R7905j24509Q4405K32653K36278l9920J45252K6415Q3482J34591
$$ 9635728 9719452 9817357 9692848 9777253 10009906 10246184 10206264 10351516 10377931 10461413 10596004
4522A0596004L7092J52777P8362M4647M87247K67210j65950J63193O2293K04504
$$ 10596004 10633096 10785873 10864235 10908882 11396129 11663339 11497389 11660582 11722875 11927379
4512A1927379J56044k3661O3836R0578J89902P8865K90250L9058J57580J27565
$$ 11927379 12083423 12059762 12123598 12214176 12404078 12482943 12773193 12812251 12969831 13097396
4502A3097396k3634m9352K02448L52854k4565J20940J20814J68844J29092n530
$$ 13097396 13073762 13024410 13226858 13579712 13555147 13676087 13796901 13965745 14094837 14089307
4492A4089307K19501j11324J87835l6029J5932J62106J39218n2691p6303p2579
$$ 14089307 14308808 14197484 14385319 14349290 14365222 14527328 14666546 14613855 14537552 14464973
4482A4464973K64265k4081o1194o9338K0088M82952r9094K2951Q7838L8793m8798
$$ 14464973 14729238 14705157 14643963 14574625 14594713 15077665 14978571 15001522 15089360 15128153 15079355
4471A5079355K08343K28813l09672k1798K99310N5771M428J03724O7665L88513
$$ 15079355 15287698 15516511 15206839 15185041 15484351 15540122 15544550 15648274 15715939 16104452
4461A6104452O459J1946j10112J74943K32472j54652J35642J36361L94249Q6400
$$ 16104452 16110911 16122857 16012745 16187688 16420160 16265508 16401150 16537511 16931760 17018160
4451A7018160m3513m1540K69789n3571J99241J96077L06160J52288j90977M06913
$$ 17018160 16974647 16933107 17202896 17149325 17348566 17544643 17850803 18003091 17812114 18219027
4441A8219027J47983n9774J46485K1564M22406K87981J5254J71613J94389M39267
$$ 18219027 18367010 18307236 18453721 18475285 18897691 19185672 19200926 19372539 19566928 20006195
4431B0006195N5728O1994M33940j7674K32232K23973O363M66477J36282K99956
$$ 20006195 20061923 20123917 20557857 20540183 20772415 20996388 21002751 21469228 21605510 21905466
4421B1905466J62830K75865M68074J77787K86217L49621J16831K14865K42561
$$ 21905466 22068296 22344161 22812235 22990022 23276239 23625860 23742691 23957556 24200117
4412B4200117O31837L25006K99555K75617L24645P09079K13738L74014N72077
$$ 24200117 24831954 25156960 25456515 25732132 26056777 26765856 26979594 27353608 27925685
4403B7925685O33625M89299j7549M36181P99709N14436O25913M59115P83254O55145
$$ 27925685 28559310 29048609 29031060 29467241 30266950 30781386 31407299 31866414 32649668 33304813
4393C3304813N78567O92020P58320P61657Q66148Q33218R47329J147105R17035
$$ 33304813 33883380 34575400 35333720 36095377 36961525 37794743 38742072 39889177 40806212
4384D0806212R33793P49826R66547J054437Q94337Q66552J002987J160575J015951
$$ 40806212 41740005 42489831 43456378 44510815 45405152 46271704 47274691 48435266 49451217
4375D9451217R11681J099298J379100J122155J046753J128249J188924J267496
$$ 49451217 50362898 51462196 52841296 53963451 55010204 56138453 57327377 58594873
4367E8594873J547668J302352J356212J799421J548836J620608J818240J662905
$$ 58594873 60142541 61444893 62801105 64600526 66149362 67769970 69588210 71251115
4359G1251115J689922J680108K067932J895037K127103K230118K099678K440589
$$ 71251115 72941037 74621145 76689077 78584114 80711217 82941335 85041013 87481602
4351H7481602K580113K389030K687216K834743K933982L258414L378150L662767
$$ 87481602 90061715 92450745 95137961 97972704 100906686 104165100 107543250 111206017
4343A11206017L845773L942540M154749M396985M632424N090249N226744N790867
$$ 111206017 115051790 118994330 123149079 127546064 132178488 137268737 142495481 148286348
4335A48286348N967768O132626O684790P220374P516395P656363Q530634Q890000
$$ 148286348 154254116 160386742 167071532 174291906 181808301 189464664 197995298 206885298
4327B06885298R233233R991037J0522539J0821978J1780975J2416989J3190499
$$ 206885298 216118531 226109568 236632107 247454085 259235060 271652049 284842548
4320B84842548J3802341J4205809J4428866J5272830J6010947J5674912J6099682
$$ 284842548 298644889 312850698 327279564 342552394 358563341 374238253 390337935
4313C90337935J6082234J5632048J5148051J4497560J3469542J1851322R986053
$$ 390337935 406420169 422052217 437200268 451697828 465167370 477018692 487004745
4306D87004745Q114386N668693L353800L50393k746715n015085p714250j0505563
$$ 487004745 495119131 500787824 504141624 504492017 501745302 496730217 489015967 478510404
4298D78510404j2626626j4342733j5457759j6544163j7080733j7494513j7502464
$$ 478510404 465883778 451541045 436083286 419539123 402458390 384963877 367461413
4291C67461413j6457051j6269983j6079985j5112370j4279881j3591673j2742855
$$ 367461413 351004362 334734379 318654394 303542024 289262143 275670470 262927615
4284B62927615j2242335j1606046j0901308j0187889r644469r174263q649783
$$ 262927615 250685280 239079234 228177926 217990037 208345568 199171305 190521522
4277A90521522q029723p591092p169832o613858o318126n936897n596297n324909
$$ 190521522 182491799 174900707 167730875 161117017 154798891 148861994 143265697 137940788
4269A37940788m925911m396209m754906l939103l647791l885466l515989l152163
$$ 137940788 133014877 128618668 123863762 119924659 116276868 112391402 108875413 105723250
4261A05723250l050232l109406l016559k937158k932144k512991k446263k703770
$$ 105723250 102673018 99563612 96547053 93609895 90677751 88164760 85718497 83014727
4253H3014727k191354k170469k319567k078604k062732j686077j925585k055491
$$ 83014727 80823373 78652904 76333337 74254733 72192001 70505924 68580339 66524848
4245F6524848j678141j482942j632851j618769j842215j112336j301666j462132
$$ 66524848 64846707 63363765 61730914 60112145 58269930 57157594 55855928 54393796
4237E4393796j126474j397912j367646j256281j218769r80502j044548r26878
$$ 54393796 53267322 51869410 50501764 49245483 48026714 47046212 46001664 45074786
4229D5074786j125144q28528q39614j158741q13006p82498p86323r28155q19503
$$ 45074786 43949642 43121114 42281500 41122759 40309753 39527255 38740932 37812777 36993274
4220C6993274n93678n53193o15799n96318q70993k41987m51898o74169o63094
$$ 36993274 36399596 35846403 35230604 34634286 33763293 33521306 33069408 32395239 31732145
4211C1732145n28600l83253m69105m75907m51666n87542j85251n47671o35581
$$ 31732145 31203545 30820292 30351187 29875280 29423614 28836072 28650821 28103150 27467569
4202B7467569l54338n36384l25483l70899n29741k56641l80317k20249l01050
$$ 27467569 27113231 26576847 26251364 25880465 25350724 25094083 24713766 24493517 24192467
4193B4192467o26361j81370n23748l65706l05295l55651m9614m02626m54791k65048
$$ 24192467 23566106 23384736 22860988 22495282 22189987 21834336 21784722 21382096 20927305 20662257
4183B0662257j24228l17493m52543m73482j48868r9923l79594l25239j46441m56536
$$ 20662257 20538029 20220536 19767993 19294511 19145643 19045720 18666126 18340887 18194446 17737910
4173A7737910p276k35023k91119l73359l03275o9502q6298l04050n94420J93005
$$ 17737910 17730634 17495611 17204492 16831133 16527858 16458356 16372058 16068008 15473588 15666593
4163A5666593r0147k79358k59057m22018r0057j12041m11063k40526r8474k163
$$ 15666593 15576446 15297088 15038031 14616013 14525956 14413915 14002852 13762326 13663852 13661689
4153A3661689j45916j49201p7501l40601N5043m18621n8281L8199k75974M3361
$$ 13661689 13515773 13366572 13289071 12948470 13003513 12584892 12526611 12564810 12288836 12332197
4143A2332197l8970o4752n9755m80115r0854O5810j93569k24446j00403L413k99030
$$ 12332197 12293227 12228475 12168720 11688605 11597751 11663561 11469992 11245546 11145143 11148556 10849526
4132A0849526j89396q441k0867k9849k91603j31151Q129j89506k77229n9724R0320
$$ 10849526 10660130 10651689 10630822 10600973 10309370 10178219 10186348 9996842 9719613 9659889 9750209
4121I750209l09806l155k02924J04741l18267M3253j54443K4896m7096k53538
$$ 9750209 9440403 9437248 9234324 9339065 9020798 9064051 8909608 8934504 8887408 8633870
4111H633870j41635j38078J27330k23087j39648R7752j34602j65463L2306m12460
$$ 8633870 8492235 8354157 8481487 8258400 8118752 8216504 8081902 7916439 7948745 7536285
4101G536285K02844N2393k28251M9737j3006R0836j20981j26269q5276j65518
$$ 7536285 7739129 7791522 7563271 7613008 7600002 7690838 7569857 7443588 7358312 7192794
4091G192794r6611j21574O635j50458P2755J17511k05858O976k50257K20041j7861
$$ 7192794 7096183 6974609 6981244 6830786 6903541 7021052 6815194 6822170 6571913 6791954 6774093
4080F774093j83148j91967r0431K37894k70669N55j28710q6221K53145l2908l22128
$$ 6774093 6590945 6398978 6308547 6546441 6275772 6276327 6147617 6061396 6314541 6281633 5959505
4069E959505r4071j66889N0229L332o8445j01100P4816J16029k69783k13668k214
$$ 5959505 5865434 5698545 5748774 5752106 5683661 5582561 5657377 5773406 5503623 5289955 5287741
4058E287741L632m4598M4884k29262M9589M4762k65207J36066J14177J18344l04423
$$ 5287741 5291373 5246775 5291659 5062397 5111986 5156748 4891541 5027607 5141784 5260128 4955705
4047D955705k03443J96736l3554J8129k35231n8025J16710K00576j22093k33921
$$ 4955705 4752262 4948998 4915444 4933573 4698342 4640317 4757027 4957603 4835510 4601589
4037D601589J12847Q7803l54845K41835k73820j12468J91618k3898J92698j39863
$$ 4601589 4714436 4802239 4447394 4689229 4415409 4302941 4494559 4470661 4663359 4523496
4027D523496j56375p5650J41621r6129k23388r6845K50498r8122j58016P2538
$$ 4523496 4367121 4291471 4433092 4336963 4113575 4016730 4267228 4169106 4011090 4083628
4017D083628K2624L8078j7558Q0324o6938q1096k12855J54591l6118j01755j106
$$ 4083628 4106252 4144330 4126772 4207096 4140158 4059062 3846207 4000798 3964680 3862925 3861819
4006C861819j11354J39872j5570j16753j03402o1522P7827K42036k05490k13909
$$ 3861819 3750465 3890337 3874767 3758014 3654612 3593090 3670917 3912953 3707463 3493554
3996C493554n785j8879n5685j62504J11095p3571O0292J13322J8753M7711l93166
$$ 3493554 3487769 3468890 3413205 3250701 3361796 3288225 3348517 3461839 3480592 3528303 3135137
3985C135137n3298N2746j1607j78202n2517J14655J24066k24649J18239o3807
$$ 3135137 3081839 3134585 3122978 2944776 2892259 3006914 3130980 2906331 3024570 2960763
3975B960763j32237k5361K08310j03940k47658J94214k6746L18678Q2983m69247
$$ 2960763 2828526 2803165 3011475 2907535 2659877 2854091 2827345 3146023 3229006 2759759
3965B759759J64158N7651m3661J3810m46905j59J25955J36472p7220j63991k4360
$$ 2759759 2923917 2981568 2937907 2951717 2504812 2504653 2630608 2767080 2689860 2525869 2501509
3954B501509K10736k1480j30206j04400k02855K06041R9378k4395j44393K85071
$$ 2501509 2712245 2690765 2560559 2456159 2253304 2459345 2558723 2534328 2389935 2675006
3944B675006L9241k36653J73706m9289j6193J05629k17121l1334Q3395m9228M9683
$$ 2675006 2714247 2477594 2651300 2602011 2585818 2691447 2474326 2442992 2526387 2477159 2526842
3933B526842j36333K52625j28030k09011j15993J8681L86934j50342l3944p9535
$$ 2526842 2390509 2643134 2515104 2306093 2190100 2208781 2595715 2445373 2411429 2331894
3923B331894J55214K29063j53148J6336o9438l0780O5496j23536j23307q5094
$$ 2331894 2487108 2716171 2563023 2579359 2509921 2479141 2544637 2421101 2297794 2212700
3913B212700J65650O4735j17849J31439P223R3184J90500j27198o7760L4432J13572
$$ 2212700 2378350 2443085 2325236 2456675 2463898 2557082 2747582 2620384 2552624 2587056 2700628
3902B700628l4541J38488J46561k94313K77663p1494k1277m7014q8506k11524
$$ 2700628 2666087 2804575 2951136 2656823 2934486 2862992 2841715 2794701 2706195 2494671
3892B494671K09479R0168M1509n9876J0407J07678q6527J62756m3591n6869l6434
$$ 2494671 2704150 2794318 2835827 2775951 2786358 2894036 2807509 2970265 2926674 2869805 2833371
3881B833371m385J40360m7018k1867l8883J82179J13864p8834m6588J82963J19442
$$ 2833371 2828986 2969346 2922328 2900461 2861578 3043757 3157621 3078787 3032199 3215162 3334604
3870C334604k10798o3637J60913J90323n0081j36408r1181J97773P4362j81145
$$ 3334604 3123806 3060169 3221082 3411405 3361324 3224916 3133735 3331508 3405870 3224725
3860C224725J15735J51959k39053r787L20304K6497j24642j35564o4609K11064
$$ 3224725 3340460 3492419 3253366 3243579 3563883 3590380 3465738 3330174 3265565 3476629
3850C476629N973P1450k37530K22821J20566R0904k35830k3616J15994J88934
$$ 3476629 3482602 3554052 3316522 3539343 3659909 3750813 3514983 3491367 3607361 3796295
3840C796295l0277n2176k20325K42647J0834r5467M3259r0205L78072K534p8864
$$ 3796295 3766018 3713842 3493517 3736164 3746998 3651531 3694790 3604585 3982657 3985191 3906327
3829C906327M8230k7260P9857J03747j35010J05062P9978k24270M8480L8239n1889
$$ 3906327 3954557 3927297 4007154 4110901 3975891 4080953 4160931 3936661 3985141 4023380 3971491
3818C971491J06120O6178l0425O6290J49091j3017o632j50989J62059O8671J19000
$$ 3971491 4077611 4143789 4113364 4179654 4328745 4315728 4309096 4158107 4320166 4388837 4507837
3807D507837j02261J28392O5899k2891l5417j8538J78200j75985R8597K32438
$$ 4507837 4405576 4533968 4599867 4576976 4541559 4523021 4701221 4525236 4623833 4856271
3797D856271j13338L6600J18157Q4601j73863M3223l5216K04087K65301k04921
$$ 4856271 4742933 4779533 4897690 4982291 4808428 4851651 4816435 5020522 5285823 5080902
3787E080902p2653K18862K2759m192j08901M8133K78695P6531r9482o3654K01489
$$ 5080902 5008249 5227111 5249870 5245678 5136777 5184910 5463605 5540136 5440654 5377000 5578489
3776E578489J67443j97594N8826M17425Q0365j13419n328K07651K35012n3924
$$ 5578489 5745932 5548338 5607164 6024589 6104954 5991535 5986207 6193858 6428870 6374946
3766F374946j20800K25653J63638J32958p0221R2067J69861j31650J58985P5128
$$ 6374946 6254146 6479799 6643437 6776395 6706174 6798241 6968102 6836452 6995437 7070565
3756G070565J31721K30881K12109K13821J21580K99765P6231J45130L37765l0804
$$ 7070565 7202286 7433167 7645276 7859097 7980677 8280442 8356673 8501803 8839568 8808764
3746H808764J7935M12939J23927K71528K00148K61635L02490K25789N01668K29597
$$ 8808764 8826699 9239638 9363565 9635093 9835241 10096876 10399366 10625155 11126823 11356420
3736A1356420N16400M17807K36116M28341M82277M58825M93880K81038N98758
$$ 11356420 11872820 12290627 12526743 12955084 13437361 13896186 14390066 14671104 15269862
3727A5269862N47268K82172M94282Q5382M60606J64633L5991J27835j87115J7004
$$ 15269862 15817130 16099302 16593584 16678966 17139572 17304205 17340196 17468031 17280916 17297920
3717A7297920p2841p4633k24306j42140j7437m94217l81368n5402k17301L8044
$$ 17297920 17225079 17150446 16926140 16784000 16766563 16272346 15890978 15835576 15618275 15656319
3707A5656319j70600o9802J64304R2821j2806l07299L24531o0638o9435L36365
$$ 15656319 15485719 15415917 15580221 15673042 15660236 15352937 15677468 15616830 15547395 15883760
3697A5883760J18343K6853N0164J60006J31937J08957q2845j7868p6561J36943
$$ 15883760 16002103 16028956 16079120 16239126 16371063 16480020 16397175 16379307 16302746 16439689
3687A6439689k27763m9386J31807k6315m9051r1960l3618k13956J34625k24506
$$ 16439689 16211926 16162540 16294347 16268032 16218981 16127021 16093403 15879447 16014072 15789566
3677A5789566j88562j8840j10520k03987l2907j32940k1294j11858k73346K00193
$$ 15789566 15601004 15582164 15471644 15267657 15234750 15101810 15080516 14968658 14695312 14895505
3667A4895505K429j91057k36185J58983O4911k34331k69689p0586L15788j37218
$$ 14895505 14897934 14706877 14470692 14629675 14694586 14460255 14190566 14119980 14435768 14298550
3657A4298550k38391K94134J15622J93887p3893l18244L30661J98373N5171j41899
$$ 14298550 14060159 14354293 14469915 14663802 14589909 14271665 14602326 14800699 14855870 14713971
3647A4713971L09415K19408o3636Q1739o2342J83235K65979j64665k2554Q7560
$$ 14713971 15023386 15242794 15179158 15260897 15198555 15381790 15647769 15483104 15460550 15548110
3637A5548110J94892j70193K6100K57828k0712J95484k20287j59659L7473r5051
$$ 15548110 15743002 15572809 15598909 15856737 15836025 16031509 15811222 15651563 15689036 15593985
3627A5593985J78237k96959O1511J00641K1616J48874l91620k12453k79146J28581
$$ 15593985 15772222 15475263 15536774 15637415 15659031 15807905 15416285 15203832 14924686 15053267
3617A5053267j21001L3439l85924l08245J96185J36930j45819M2498J97615K7690
$$ 15053267 14932266 14965705 14579781 14271536 14467721 14604651 14458832 14501330 14698945 14726635
3607A4726635q8705l96593M3792K19098l8956m4817R9394K18518K02146j20887
$$ 14726635 14637930 14241337 14285129 14504227 14465271 14420454 14519848 14738366 14940512 14819625
3597A4819625q8227J18827m7039N8195j22597J86470L24597K52507K05570o740
$$ 14819625 14731398 14850225 14803186 14861381 14738784 14925254 15249851 15502358 15707928 15701188
3587A5701188N61302K24784q4955K70387J04294O15676K61170K10893K53656L12240
$$ 15701188 16262490 16487274 16402319 16672706 16777000 17392676 17653846 17864739 18118395 18430635
3577A8430635M08882J25437K56246j72408j33107Q006k00798l31091l23416j7757
$$ 18430635 18839517 18964954 19221200 19048792 18915685 18923691 18722893 18391802 18068386 18050629
3567A8050629l11275l60928j41989o60779n07749m96952k66643j27834p46006
$$ 18050629 17739354 17378426 17236437 16575658 16067909 15570957 15304314 15176480 14430474
3558A4430474k39761j11013j11454k25369m48820j01136l45718k52658m04628
$$ 14430474 14190713 14079700 13968246 13742877 13294057 13192921 12847203 12594545 12189917
3549A2189917O5161l27886k21673P9226n1570j49349q4205k34818l09120N3478
$$ 12189917 12255078 11927192 11705519 11784745 11733175 11583826 11499621 11264803 10955683 11009161
3539A1009161k95966q3277L8136j2016K27j10671j83240j27284L3845k73819n4242
$$ 11009161 10713195 10629918 10668054 10656038 10656265 10545594 10362354 10235070 10268915 9995096 9940854
3528I940854q2501R7836j92647Q3849l681j01713L431j5078J04943l42394O0139
$$ 9940854 9858353 9956189 9763542 9847391 9843710 9741997 9745428 9730350 9835293 9492899 9553038
3517I553038n1797k47398k0423J2685j07691m761m9899p2110O7799j66676m17362
$$ 9553038 9501241 9253843 9233420 9246105 9138414 9133653 9083754 9011644 9079443 8912767 8495405
3506H495405M0179J10863l9741j76631k9634J93618K02103j07856k53206j70739
$$ 8495405 8535584 8646447 8606706 8430075 8400441 8594059 8796162 8688306 8435100 8264361
3496H264361J57870J23154r5516j28867J39514J41220N0391j87316j50016L6088
$$ 8264361 8422231 8545385 8449869 8321002 8460516 8601736 8652127 8464811 8314795 8350883
3486H350883N5321p8001j40832L2615J33773j26996M4635J23630k07669J79034
$$ 8350883 8406204 8328203 8187371 8219986 8353759 8226763 8271398 8395028 8187359 8366393
3476H366393J51407J3454j35693l2015J2266M658J67974j75738K0682K13360j6244
$$ 8366393 8517800 8531254 8395561 8363546 8375812 8380470 8548444 8372706 8393388 8606748 8590504
3465H590504k53393J19305J10064J34927k29706j27776L21186J86988n0933l70615
$$ 8590504 8337111 8456416 8566480 8701407 8471701 8343925 8665111 8852099 8801166 8430551
3455H430551J72043M25690j9084k3083O6311K31230O2762o4571J13477j19815
$$ 8430551 8602594 9028284 9009200 8986117 9052428 9283658 9346420 9281849 9395326 9275511
3445I275511K23521Q5958L9388K1282j6838L30444m7849q5454J55877j23984L88232
$$ 9275511 9499032 9584990 9624378 9645660 9628822 9959266 9911417 9825963 9981840 9857856 10246088
3434A0246088j06951J7438K32271J51167J31245J22085J93406J3533K35207L13798
$$ 10246088 10139137 10156575 10388846 10540013 10671258 10793343 10986749 11000282 11235489 11549287
3424A1549287j19161K04819J48384O7104K21434Q0125K36275j4326J82235K77165
$$ 11549287 11430126 11634945 11783329 11850433 12071867 12151992 12388267 12373941 12556176 12833341
3414A2833341k7704J46035J38275K85099J97718J39900L24141L85392M49326j38041
$$ 12833341 12805637 12951672 13089947 13375046 13572764 13712664 14036805 14422197 14871523 14733482
3404A4733482L63705M36302K41278K46039L62565L70260L24224L94013M45293
$$ 14733482 15097187 15533489 15774767 16020806 16383371 16753631 17077855 17471868 17917161
3395A7917161M48641O55531M93785N03261N20903M62209O70341N36924P37874
$$ 17917161 18365802 19021333 19515118 20018379 20539282 21001491 21671832 22208756 22946630
3386B2946630P67116P52643J085932P46708P92148J084558Q87604Q98511J019374
$$ 22946630 23713746 24466389 25552321 26299029 27091177 28175735 29063339 29961850 30981224
3377C0981224R22894Q52153J192776J032534Q18254R94646J013211N64304O38520
$$ 30981224 31904118 32756271 33949047 34981581 35799835 36794481 37807692 38371996 39010516
3368C9010516Q11170O61671P66348M47886J64487L99465K67507Q6003M23982K23535
$$ 39010516 39821686 40483357 41249705 41697591 41862078 42261543 42529050 42615053 43039035 43262570
3358D3262570k02302l67572k26651l70595o01764l21119p88679p52548n64032
$$ 43262570 43060268 42692696 42466045 42095450 41493686 41172567 40383888 39631340 39067308
3349C9067308p23864p60824j146740r64528r10475j015109j090643q48460p95869
$$ 39067308 38343444 37582620 36435880 35471352 34560877 33545768 32455125 31606665 30810796
3340C0810796r82686r84520j009239o21565q45895q48259p81589q11700q10166
$$ 30810796 29828110 28843590 27834351 27212786 26366891 25518632 24737043 23925343 23115177
3331B3115177o75823o75478o42513m24794m65226m49614j56206m55606n47638
$$ 23115177 22439354 21763876 21121363 20696569 20231343 19781729 19625523 19169917 18622279
3322A8622279m78327l03935m8684j89522k83409j52523j04435n1458m18276r4236
$$ 18622279 18143952 17840017 17791333 17601811 17318402 17165879 17061444 17009986 16591710 16497474
3312A6497474m383j59087j81146j78475J89639K4595k20504j70391j02710K3755
$$ 16497474 16493091 16334004 16152858 15974383 16164022 16188617 15968113 15797722 15695012 15718767
3302A5718767m0070k41644J77640J87724M6919J2053K29858m2966Q4194K35247
$$ 15718767 15678697 15437053 15614693 15802417 15849336 15861389 16091247 16048281 16132475 16367722
3292A6367722k09465J34977K17619J29651J19600L27595k4912L58457L34665J10203
$$ 16367722 16158257 16293234 16510853 16640504 16760104 17087699 17062787 17421244 17755909 17866112
3282A7866112J48428q5135L08322K86136L99270K18320K88880N957K60506K83594
$$ 17866112 18014540 17929405 18237727 18523863 18923133 19141453 19430333 19436290 19696796 19980390
3272A9980390o1398K988Q8342J8896J69642K37615M150M7915N8918l29554J373
$$ 19980390 19918992 19921980 20010322 20029218 20198860 20436475 20440625 20488540 20547458 20217904 20219277
3261B0219277J04659k15977N8089R8119l55649O8912m5915j84627M5971j73051
$$ 20219277 20323936 20107959 20166048 20264167 19908518 19977430 19931515 19746888 19792859 19619808
3251A9619808j66757n3736l06289k35430j42004j70467l11166l34224k8310q4441
$$ 19619808 19453051 19399315 19093026 18857596 18715592 18545125 18233959 17899735 17871425 17786984
3241A7786984m07884n35812k26517n4020l61746q6990k98141k59983j97805l34708
$$ 17786984 17379100 16843288 16616771 16562751 16201005 16114015 15815874 15555891 15358086 15023378
3231A5023378k15822k65797l00961m26650k5746q0570l45413j92159k39020l11731
$$ 15023378 14807556 14541759 14240798 13814148 13788402 13707832 13362419 13170260 12931240 12619509
3221A2619509j82439m14432k42750J98431j21660j85812l13286n8128j98552k48256
$$ 12619509 12437070 12022638 11779888 11978319 11856659 11670847 11357561 11299433 11100881 10852625
3211A0852625Q883k75044K4461k40809j17388j9993j79155l34494o7452L3143
$$ 10852625 10861508 10586464 10610925 10370116 10252728 10232735 10053580 9719086 9651634 9684777
3201I684777j57550j66578k23891p2169k39582j51665J42942j5609j70353j4948
$$ 9684777 9527227 9360649 9136758 9064589 8825007 8673342 8816284 8800675 8630322 8615374
3191H615374m3018j42790j8967j81857o5943K1313J03287l06710o5556m8164r1571
$$ 8615374 8572356 8429566 8410599 8228742 8162799 8184112 8287399 7980689 7915133 7866969 7775398
3180G775398L13464k19153J7661L0437k1567p9523r5759J11969k06608j18645
$$ 7775398 8088862 7869709 7887370 7917807 7896240 7816717 7720958 7832927 7626319 7507674
3170G507674k792J70757L6528k0916l545J8305k79676N1280O1635J51426K24093
$$ 7507674 7504882 7675639 7712167 7691251 7687706 7706011 7426335 7477615 7539250 7690676 7914769
3159G914769j5472j9891j9748r1302J03319J44849N488j85974L6535K62313l9629
$$ 7914769 7899297 7879406 7859658 7768356 7871675 8016524 8022012 7836038 7872573 8134886 8095257
3148H095257K9265J77238k47673J25770K48214q1598j0950j12752J58792j21957
$$ 8095257 8124522 8301760 8054087 8179857 8428071 8346473 8335523 8222771 8381563 8259606
3138H259606k7946J59513O9682K34857k06763K0729m0711o7530k00078j32370
$$ 8259606 8231660 8391173 8460855 8695712 8488949 8509678 8468967 8401437 8201359 8068989
3128H068989K55949J76530k03111J64776o213N1856J98332j14263J93061J75856
$$ 8068989 8324938 8501468 8298357 8463133 8456920 8508776 8707108 8592845 8785906 8961762
3118H961762L4758n3868q1389L05M3180J0671J50363M6079K03714K31638K6383
$$ 8961762 8996520 8942652 8861263 8861568 8904748 8915419 9065782 9111861 9315575 9547213 9573596
3107I573596K4939O0032Q1448N2510K16143K17749p7248R3507J32398N9230J10259
$$ 9573596 9598535 9658567 9740015 9792525 10008668 10226417 10149169 10242676 10375074 10434304 10544563
3096A0544563J38475R1834K65152j40269R3685N0905K42999J06825N9408L15060
$$ 10544563 10683038 10774872 11040024 10899755 10993440 11044345 11287344 11394169 11453577 11768637
3086A1768637m3173R1852K04501k02881j77635J32643J26739L7105J51100J40330
$$ 11768637 11725464 11817316 12021817 11818936 11641301 11773944 11900683 11937788 12088888 12229218
3076A2229218J52699n2185L50j17715J07248l8815j6425o4687K69956L4272Q0360
$$ 12229218 12381917 12329732 12330082 12212367 12319615 12280800 12264375 12199688 12469644 12503916 12584276
3065A2584276O0535K96253L23774j72892L91477p7013J10252L34797n7651L08455
$$ 12584276 12644811 12941064 13264838 13091946 13483423 13406410 13516662 13851459 13793808 14102263
3055A4102263J17906K06460K89660L46694M51708K2671K30708J72174L11703O18614
$$ 14102263 14220169 14426629 14716289 15062983 15514691 15537362 15768070 15940244 16251947 16870561
3045A6870561K54974N16917M21314M95039N33103K56652P42092N34289L26046
$$ 16870561 17125535 17642452 18063766 18558805 19091908 19348560 20090652 20624941 20950987
3036B0950987M68960N35334P53317L09553N21404O50551O32014N30108M41039
$$ 20950987 21419947 21955281 22708598 23018151 23539555 24190106 24822120 25352228 25793267
3027B5793267K90063K62098J49580j40854J01487J93747j5671j05106k83216j79222
$$ 25793267 26083330 26345428 26495008 26354154 26455641 26649388 26633717 26528611 26245395 26066173
3017B6066173j01645l76827l67747n20504j43812l74963l42735k30589k16575
$$ 26066173 25964528 25587701 25219954 24699450 24555638 24180675 23837940 23607351 23390776
3008B3390776j72273k82911p5440j12510r1537k22693j83731R9976M3505j49912
$$ 23390776 23218503 22935592 22860152 22747642 22656105 22433412 22249681 22349657 22393162 22243250
2998B2243250k52593J88859m0192l5755J16378J07591j39065k30772j20260K63830
$$ 22243250 21990657 22179516 22139324 22103569 22219947 22327538 22188473 21957701 21837441 22101271
2988B2101271p6248K00482J30467Q684k791J10512r55j23488j09592J02156J68870
$$ 22101271 22025023 22225505 22355972 22364656 22361865 22472377 22471422 22347934 22238342 22340498 22509368
2977B2509368K61511k6821K59590K39077k19651p111p6334j6865p4724r3258j09036
$$ 22509368 22770879 22744058 23003648 23242725 23023074 23015963 22939629 22922764 22848040 22754782 22645746
2966B2645746l35583k51456j35059l74210m52799k67591n44160j98862k98633
$$ 22645746 22310163 22058707 21923648 21549438 21096639 20829048 20284888 20086026 19787393
2957A9787393l90440m60358n73446l91923m61602l27005o66057l53242k99963
$$ 19787393 19396953 18936595 18363149 17971226 17509624 17182619 16516562 16163320 15863357
2948A5863357l62223m25545m42872l53349k89549l70745k02859k24270l27611
$$ 15863357 15501134 15075589 14632717 14279368 13989819 13619074 13416215 13191945 12864334
2939A2864334j40879m29781k63254k03915k90345j93499l81829R141m82600n8499
$$ 12864334 12723455 12293674 12030420 11826505 11536160 11342661 10960832 10969973 10487373 10428874
2929A0428874j85372l036N2710m21964r1105k38192j20593l38553l22373r9944
$$ 10428874 10243502 10240466 10293176 9871212 9780107 9541915 9421322 9082769 8760396 8660452
2919H660452j61566k39220J59653j40335n351l65475j60897J07332l1394j04961
$$ 8660452 8498886 8259666 8419319 8278984 8273633 7908158 7747261 7854593 7823199 7718238
2909G718238l79454Q4984k87629m3355q5755l1570k9920k0878K4036j55117K2344
$$ 7718238 7338784 7423768 7136139 7092784 7007029 6975459 6945539 6924661 6948697 6793580 6815924
2898F815924j89609n9917n5529J22417R2654q8662J27754J417j12252Q9331q7105
$$ 6815924 6626315 6566398 6510869 6633286 6725940 6637278 6765032 6766449 6654197 6743528 6656423
2887F656423r6882J1021J9357J13010l81042M1500n0145J160J52021m97713J45543
$$ 6656423 6559541 6570562 6589919 6702929 6321887 6363387 6313242 6314402 6466423 5968710 6114253
2876F114253k48731n3796j24113j64270J63076j40991J9049j69641P4195o8663
$$ 6114253 5865522 5811726 5687613 5523343 5686419 5545428 5564477 5394836 5469031 5400368
2866E400368l4645l11745Q7843j34353j20989k62065Q5721l2816j36103n7137
$$ 5400368 5365723 5053978 5141821 5007468 4886479 4624414 4710135 4677319 4541216 4484079
2856D484079k0242l5698l63840L9052J0394l8380l33571r3269J33187j47874k03836
$$ 4484079 4463837 4428139 4064299 4103351 4113745 4075365 3741794 3648525 3781712 3633838 3430002
2845C430002j76292L5288J2929j74776r2143M0140P0501j56778k8427j1637q4881
$$ 3430002 3253710 3288998 3301927 3127151 3035008 3075148 3145649 2988871 2960444 2948807 2863926
2834B863926M1029j95611L6425K4258k86293m0056r844o5422K14469j44868P7904
$$ 2863926 2904955 2709344 2745769 2770027 2483734 2443678 2433834 2368412 2582881 2438013 2515917
2823B515917j55190Q0571j82111L3763J2577q3923j05603q7576j2291j3714l1994
$$ 2515917 2360727 2441298 2259187 2292950 2305527 2221604 2116001 2028425 2016134 2002420 1970426
2812A970426j65625J38065k84755L1875p1333M8684L8445j9343j54256k4319J7178
$$ 1970426 1804801 1942866 1658111 1689986 1618653 1667337 1705782 1686439 1532183 1507864 1525042
2801A525042J11191K8869o7240j87175M7955J14151o8387j71805K1400K0367m4371
$$ 1525042 1636233 1665102 1597862 1410687 1458642 1572793 1504406 1332601 1354001 1374368 1329997
2790A329997j45461J24823J5766j84315m8654J19798J07347j58371p4873K97J17912
$$ 1329997 1184536 1309359 1325125 1140810 1092156 1211954 1319301 1160930 1086057 1086354 1204266
2779A204266k3490l01676J49015L07678o6478k94207m8821j8180o892j81996j16774
$$ 1204266 1180776 879100 1028115 1335793 1269315 975108 926287 908107 901215 719219 602445
2768F02445J08771K73678k40543l6884J83082r0441j03111Q3647k0114J11280
$$ 602445 711216 984894 744351 707467 890549 800108 696997 780644 760530 871810
2758H71810j00542j79172R6740n6693K20291j63965K5858j22811k13214R1173
$$ 871810 771268 592096 688836 632143 852434 688469 714327 591516 378302 469475
2748D69475Q7071j42583m5606L7396J90301j68494j37575Q5565j53606K74523
$$ 469475 556546 413963 368357 405753 596054 427560 289985 375550 221944 496467
2738D96467k60635J60761l9059j21245K00124l53400J47561J86179r7473l1880
$$ 496467 235832 396593 357534 236289 436413 83013 230574 416753 319280 287400
2728B87400k69336O1548k7583O0495l1999r679J90654j16610J4994J11989k51867
$$ 287400 18064 79612 52029 112524 80525 70846 261500 144890 159884 271873 20006
2717B0006J99152m7115R3238n8604j59488K15095n6845J31935l65350K9170K80814
$$ 20006 219158 172043 265281 206677 47189 262284 205439 337374 -27976 1194 282008
2706B82008k19543j70206M834o4491K01947q2095n2456J88322j07736o8709N1867
$$ 282008 62465 -107741 -102907 -167398 34549 -47546 -100002 88320 -19416 -88125 -36258
2695c6258K38076j56635q1793K56038j90314M1221o5718l1711J78625j80781j61431
$$ -36258 201818 45183 -36610 219428 29114 70335 4617 -27094 151531 -29250 -190681
2684a90681K67438j67854K3515J00455J8915k09187j54885K36107j41690K22941
$$ -190681 76757 -91097 -67582 32873 51788 -157399 -312284 -76177 -217867 5074
2674E074l549j26216K37245l05387q0744M2746J3919M2995m3732J30129K55005
$$ 5074 1525 -124691 112554 -192833 -273577 -230831 -216912 -173917 -217649 -87520 167485
2663A67485k34504J63743l15963k6659N8007L0230O0862k18019J35203K5772j40015
$$ 167485 -67019 96724 -219239 -245898 -187891 -157661 -96799 -314818 -179615 -153843 -293858
2652b93858Q4989Q2537J545R722k2457k0880p4690k0959k45214L49367J8258j45527
$$ -293858 -208869 -126332 -124787 -115065 -137522 -158402 -233092 -254051 -499265 -149898 -131640 -277167
2640b77167L14702J5241j44267m06688J53734q69n7532J26934J42097l0303m0610
$$ -277167 37535 52776 -91491 -498179 -344445 -345314 -402846 -275912 -133815 -164118 -204728
2629b04728R2802M0887j50255l3190R9666P8965O7401m10975J34607m3851j33365
$$ -204728 -111926 -71039 -221294 -254484 -154818 -75853 -8452 -419427 -284820 -328671 -462036
2618d62036J25027J8007K26990J13356k13063k48486K84697J61446j99977j33316
$$ -462036 -337009 -319002 -92012 21344 -191719 -440205 -155508 5938 -194039 -327355
2608c27355P0315J88340M0156p5679o7074L1050j62436j43660P0544J8430j6157
$$ -327355 -257040 -68700 -28544 -104223 -171297 -140247 -302683 -446343 -375799 -357369 -373526
2597c73526n9923m6794L26122k01370j79161K46677o4443O5748M3545O9377l5764
$$ -373526 -433449 -480243 -154121 -355491 -534652 -287975 -352418 -286670 -243125 -173748 -209512
2586b09512k78626J05950m6127K98610o9838N9301k03647j09167k09245J8325
$$ -209512 -488138 -382188 -428315 -129705 -199543 -140242 -343889 -453056 -662301 -643976
2576f43976J51902o854J62289J58881k53593L1709J22888l3469K295k53259K66538
$$ -643976 -492074 -498928 -336639 -177758 -431351 -399642 -276754 -310223 -307928 -561187 -294649
2565b94649M9265K0486n6889k97615M2486J01971J24159M4157j80534k30814N8727
$$ -294649 -245384 -224898 -281787 -579402 -536916 -434945 -310786 -266629 -447163 -677977 -619250
2554f19250J44498n0702O3726m302J17972Q8413j89393J23667K6556P249J2184
$$ -619250 -474752 -525454 -461728 -466030 -348058 -259645 -449038 -325371 -298815 -291566 -279382
2543b79382j48199J68276m6924l8866m5448m3803R3112J34800j9097k18147K5059
$$ -279382 -427581 -259305 -306229 -345095 -390543 -434346 -341234 -206434 -225531 -443678 -418619
2532d18619K410k06849p1979K18572k9463j83179Q0067L5561J85152K21359j69399
$$ -418619 -416209 -623058 -695037 -476465 -505928 -689107 -609040 -573479 -388327 -166968 -336367
2521c36367j01386p8053M7511K19264M5815j7864k20701o9948J67072R9345k56211
$$ -336367 -437753 -515806 -468295 -249031 -203216 -221080 -441781 -511729 -344657 -245312 -501523
2510e01523j16921J35615p3335J35522q6911k99903K76632K02645j54689J08176
$$ -501523 -618444 -482829 -556164 -420642 -507553 -807456 -530824 -328179 -482868 -374692
2500c74692P2870J79225m5470k34533k06663q0943K45622j52586J71995J15220
$$ -374692 -301822 -122597 -168067 -402600 -609263 -690206 -444584 -597170 -425175 -309955
2490c09955j5409k9966j27666N5614J4420j26011J5636r3792M6311L5546p2606
$$ -309955 -325364 -355330 -482996 -427382 -412962 -538973 -523337 -617129 -570818 -535272 -607878
2479f07878j2569K09266K69764j58675n5230Q4922j78449m2910k96879q3659K05672
$$ -607878 -620447 -411181 -141417 -300092 -355322 -270400 -448849 -491759 -788638 -872297 -666625
2468f66625J00267o3594K7811K17455k05646q1807J81614q9609P8803N7350k7260
$$ -666625 -566358 -629952 -602141 -384686 -590332 -672139 -490525 -580134 -501331 -443981 -471241
2457d71241M6158O2165J03249o2590j71306k8062K32348J0380l1477j80655j06567
$$ -471241 -425083 -362918 -259669 -322259 -493565 -521627 -289279 -278899 -310376 -491031 -597598
2446e97598J18012n3264J17054J95098k2535k78368L4973P8544k63538l9727N6534
$$ -597598 -479586 -532850 -415796 -220698 -243233 -521601 -486628 -408084 -671622 -711349 -654815
2435f54815K23175M4706K3525o088Q322J0157k3334k14721J74731N4482j67330
$$ -654815 -431640 -386934 -363409 -369497 -361175 -351018 -374352 -589073 -414342 -359860 -527190
2424e27190N9040k06428J80475n1115M228j21515K85343J04955k42827q9692J83683
$$ -527190 -468150 -674578 -494103 -545218 -540990 -662505 -377162 -272207 -515034 -604726 -421043
2413d21043P8669l40543Q6052J51635K10482J04222l29919O4737J03144k87554
$$ -421043 -342374 -682917 -596865 -445230 -234748 -130526 -460445 -395708 -292564 -580118
2403e80118l7994p72k0031P8917J06940N7505r2426P9120J06878J14080Q1925
$$ -580118 -618112 -618884 -638915 -559998 -453058 -395553 -487979 -408859 -301981 -187901 -105976
2392a05976l24779L8654K1413k9272l9915k36144K33422K49015l1548k57598R5352
$$ -105976 -430755 -392101 -370688 -399960 -439875 -676019 -442597 -193582 -225130 -482728 -387376
2381c87376J1635n0784n6094n9781K5070K28354j78815j05503M43543r1453j63480
$$ -387376 -375741 -426525 -482619 -542400 -517330 -288976 -467791 -573294 -129751 -221204 -384684
2370c84684l0567J96080q8797j65307K529J59544q9990o4494J3663K76623n8409
$$ -384684 -415251 -219171 -307968 -473275 -470746 -311202 -401192 -465686 -452023 -175400 -233809
2359b33809l56144k8366M7736J12213J14671j02306K4130P5648j20297J38519
$$ -233809 -589953 -618319 -570583 -458370 -343699 -446005 -421875 -346227 -466524 -328005
2349c28005J80902j0063j07219K744j18586N8332J64177k54388j07566R3527J12118
$$ -328005 -147103 -157166 -264385 -261641 -380227 -321895 -157718 -412106 -519672 -426145 -314027
2338c14027j35440J80973o0257j31686J59503j29916O1109J50926k44696J00856
$$ -314027 -449467 -268494 -328751 -460437 -300934 -430850 -369741 -218815 -463511 -362655
2328c62655J12237r629j76134L7387M2430j03885j3150R8242J29149M3442j73154
$$ -362655 -250418 -260047 -436181 -398794 -356364 -460249 -473399 -375157 -246008 -202566 -375720
2317c75720M6241J0037l7894O8272q5761j4175L6561J31108Q5786q1087Q71j37511
$$ -375720 -329479 -319442 -357336 -289064 -374825 -389000 -352439 -221331 -135545 -216632 -215761 -353272
2305c53272J6395J47836m7319J31019k47806j75663J82995Q3876K7207j02853
$$ -353272 -336877 -189041 -236360 -105341 -353147 -528810 -345815 -261939 -234732 -337585
2295c37585j23541o4193J43360q0684M9132j37333K60729K2465M3790J46687j67145
$$ -337585 -461126 -525319 -381959 -462643 -413511 -550844 -290115 -267650 -223860 -77173 -244318
2284b44318j4478O1307J99011k14609J3495j29477Q6372l4926J51600p9511Q3180
$$ -244318 -258796 -197489 1522 -213087 -199592 -329069 -242697 -277623 -126023 -205534 -122354
2273a22354M7714J5600j73673j17715m0834K30357p8796j14845m5907J10783Q9272
$$ -122354 -74640 -59040 -232713 -350428 -391262 -160905 -239701 -354546 -400453 -289670 -200398
2262b00398N6622k4824Q9450j63466M1745J06226p7708q6401k9837M4731m4774
$$ -200398 -143776 -168600 -79150 -242616 -200871 -94645 -172353 -258754 -288591 -243860 -288634
2251b88634J06264M038k2441J5133J70977N8595l04766Q4691J47132R1048j68304
$$ -288634 -182370 -178332 -200773 -185640 -14663 43932 -260834 -176143 -29011 62037 -106267
2240a06267j76996L17262R775k00531j58182J00670l8277j77061j0661L50314
$$ -106267 -283263 33999 43774 -156757 -314939 -214269 -252546 -429607 -440268 -89954
2230h9954J26956j8106k20455J95241J43493l41062J99862k86946J86616J08384
$$ -89954 37002 18896 -201559 -6318 137175 -203887 -4025 -290971 -104355 4029
2220D029k88518K73298r8414J74574p0262n1189R7560O6930j91937Q1336P818
$$ 4029 -284489 -11191 -109605 64969 -5293 -56482 41078 108008 -83929 -2593 5225
2209E225L37250k20182j82566m0038J25967J64463k99178J85669j2255J33281
$$ 5225 342475 122293 -60273 -100311 25656 190119 -109059 76610 64355 197636
2199A97636r0133j31384P5779R5451l7666p8046P555J17173J4683k0814j91079
$$ 197636 107503 -23881 51898 147349 109683 31637 39192 156365 171048 150234 -40845
2188d0845n2356K40444j6741N1801k8232R6583K9494k55117K12493J32968p2850
$$ -40845 -93201 147243 130502 182303 154071 250654 280148 25031 237524 370492 297642
2177B97642l77953J17732L05341j0128j32583k9104K10653k89180J12461o8468
$$ 297642 -80311 37421 342762 332634 200051 170947 381600 92420 204881 136413
2167A36413K67462O8648m11785P5903L63251l13826n9920Q7066k7317K51585m2548
$$ 136413 403875 472523 60738 136641 499892 186066 126146 213212 185895 437480 394932
2156C94932P4230J7307R5292j99268P2690o0460J96385L1478l04970Q454J20327
$$ 394932 469162 486469 581761 382493 455183 394723 591108 622586 317616 326070 446397
2145D46397R1781j84030K10079J83933L4650m8729k784p0793R3540j94480r278
$$ 446397 538178 354148 564227 748160 782810 734081 731297 660504 754044 559564 550286
2134E50286J54766O6246M6426k8221K3399j81023J00548J11606J0289p0031r2479
$$ 550286 705052 771298 817724 789503 812902 631879 732427 844033 854322 784291 691812
2123F91812J01533K12078n5383m7905j78712L9163k1300m2394K55859L5824j31002
$$ 691812 793345 1005423 950040 902135 723423 762586 741286 698892 954751 990575 859573
2112H59573K71655q781m4373j67581j7847k0580m53876J47586J05887m1444O5888
$$ 859573 1131228 1122447 1078074 910493 892646 872066 418190 565776 671663 630219 696107
2101F96107q9203p1924o3813k07858J73903q1933O2905l2585M5797K64097r1667
$$ 696107 606904 534980 471167 263309 437212 355279 418184 385599 431396 695493 603826
2090F03826j06926m3972o9350K4943N1452j64357l7724l8773J63866M782N3168
$$ 603826 496900 452928 383578 408521 459973 295616 257892 219119 382985 387767 440935
2079D40935r1417q993j16661j26097L1867K8336J94814j55930J25330J65063n5745
$$ 440935 349518 340525 223864 97767 129634 157970 352784 196854 322184 487247 431502
2068D31502n2660j28325q2489j09432J0746O2582j5275P0033O36J60202j29098
$$ 431502 378842 250517 168028 58596 69342 131924 116649 186682 187318 347520 218422
2057B18422P6690P097j02379k93819L12456N9608j64256J09992Q0278O7221L7014
$$ 218422 295112 302209 199830 -93989 218467 278075 113819 223811 304089 371310 408324
2046D08324q6005m2785K48305m19761k7244p6914R1409j79680K92083J79940k21130
$$ 408324 322319 279534 527839 108078 80834 3920 95329 -84351 207732 387672 166542
2035A66542j120l4696M0681j17122N1163q1946R2608J4677n4452k40460K8707
$$ 166542 165422 130726 171407 54285 105448 23502 116110 130787 76335 -164125 -135418
2024a35418K25690M4147l250r9266j790o2513n8460l73761J10980L74654j740
$$ -135418 90272 134419 131169 31903 30113 -32400 -90860 -464621 -353641 21013 19273
2013A9273Q2036n5757J03048j02718o2690Q2970k26122J98426K7953o0510J629
$$ 19273 101309 45552 148600 45882 -16808 66162 -159960 38466 66419 5909 7538
2002G538n7621m2976J51835j85676J9374p2780J20503q8398j52543L31468j6361
$$ 7538 -50083 -93059 58776 -126900 -107526 -180306 -59803 -148201 -300744 30724 14363
1991A4363j03563q4799j26450J25900J03976k9887j38117k02309J75351j18948
$$ 14363 -89200 -173999 -300449 -174549 -70573 -100460 -238577 -440886 -265535 -384483
1981c84483P679K23050j61898L01022J27191j39037j15440l9569q9763j62495
$$ -384483 -376804 -153754 -315652 -14630 112561 -26476 -141916 -181485 -271248 -433743
1971d33743K18895J11211j77243j32845j07935K16513j8314N9673J52287n7588
$$ -433743 -214848 -103637 -280880 -413725 -521660 -305147 -323461 -263788 -111501 -169089
1961a69089K60042m20480l2725J63023k3408K12150Q4819j4421j20584j01388
$$ -169089 90953 -329527 -362252 -199229 -222637 -10487 74332 59911 -60673 -162061
1951a62061J72876n06916j00552O5157O1081J24948K30015r820r9647J39037J43753
$$ -162061 10815 -496101 -596653 -531496 -470415 -345467 -115452 -125272 -224919 -85882 57871
1940E7871m0901m6146l72925m4001K93851l3060j6327l5382N5601o2356J11743
$$ 57871 16970 -29176 -402101 -446102 -152251 -185311 -201638 -237020 -181419 -243775 -132032
1929a32032J1966k57371M9976r3757k19457J60237Q6563J10061N9902P2820o5331
$$ -132032 -120066 -377437 -327461 -421218 -640675 -480438 -393875 -283814 -223912 -151092 -216423
1918b16423n6720N6923o3967K2186N963j90729m6606K39974P1898k29352k01630
$$ -216423 -273143 -216220 -280187 -258001 -252038 -442767 -489373 -249399 -177501 -406853 -608483
1907f08483J55645Q7451K0339J72594j58272j93363K173J78662M0731J8551O1369
$$ -608483 -452838 -365387 -345048 -172454 -330726 -524089 -521916 -343254 -302523 -283972 -222603
1896b22603L3022o8385J32095k02431p992k26421j99733K19970l495J49706n5706
$$ -222603 -189581 -257966 -125871 -328302 -336294 -562715 -762448 -542478 -545973 -396267 -451973
1885d51973Q2578p9947j06417K66993P867j36501O3592k55408K25016k7088j01703
$$ -451973 -369395 -449342 -555759 -288766 -280899 -417400 -353808 -609216 -384200 -411288 -512991
1874e12991J15941j6303M4765m0429J91045j09434L5189m0725q9557r1528J61604
$$ -512991 -397050 -413353 -368588 -409017 -217972 -327406 -292217 -332942 -422499 -514027 -352423
1863c52423J57173j75169j37178n1884L52196n4404k1049m3131j69240q3247L9542
$$ -352423 -195250 -370419 -507597 -559481 -207285 -261689 -282738 -325869 -495109 -578356 -538814
1852e38814p662K02955n1343N0926J44414r5265K77554j69268N0107m00575M6312
$$ -538814 -546476 -343521 -394864 -343938 -199524 -294789 -17235 -186503 -136396 -536971 -490659
1841d90659L39817k17492R9325l6799K91766r0802j05366J2673k5128k0387k12081
$$ -490659 -150842 -368334 -269009 -305808 -14042 -104844 -210210 -197537 -222665 -243052 -455133
1830d55133n0262K88101N7931j99623K53967j03797j04284m5453K97072k57176
$$ -455133 -505395 -217294 -159363 -358986 -105019 -208816 -313100 -358553 -61481 -318657
1820c18657r4620j72321J46555L03428K8400P2541k38597K17514k46492j18024
$$ -318657 -413277 -585598 -439043 -135615 -107215 -34674 -273271 -55757 -302249 -420273
1810d20273J13069m7346R5058k6743Q0295K04943J75077L375m13141j13711K85175
$$ -420273 -307204 -354550 -259492 -286235 -205940 -997 174080 177455 -235686 -349397 -64222
1799f4222n0631J58738k47523J6656J16549r5121K47887l3532Q1135o6464j96727
$$ -64222 -114853 43885 -203638 -186982 -70433 -165554 82333 48801 129936 63472 -133255
1788a33255R7521J45014k74819K73641J32185j02960n1990J5225M1359j55595
$$ -133255 -35734 109280 -165539 108102 240287 137327 85337 100562 141921 -13674
1778a3674N2468k3486J42761J91092j65199J06567J40072k67405P0018K08093
$$ -13674 38794 15308 158069 349161 183962 290529 430601 163196 233214 441307
1768D41307J03925k30678m8298J75504r5025m5425Q4580J36874j51054o7158k4700
$$ 441307 545232 314554 266256 441760 346735 301310 385890 522764 371710 304552 279852
1757B79852J0843J58212j77062J12188J33014r2272J13801j9372K9367j32022
$$ 279852 290695 448907 271845 384033 517047 424775 538576 519204 548571 416549
1747D16549M7713K67269k67354J0253o3010N2729N3149J30332n2653j10591P5582
$$ 416549 464262 731531 464177 474430 411420 464149 517298 647630 594977 484386 559968
1736E59968j46583J07657o5127K6772K51268l5199k31175Q4541J12458R5737j72220
$$ 559968 413385 521042 455915 482687 733955 698756 467581 552122 664580 760317 588097
1725E88097k20085K59762k18135L3872K52177Q4091k34285k606O4316j30691M6352
$$ 588097 368012 627774 409639 443511 695688 779779 545494 542888 607204 476513 522865
1714E22865l13540L0403R8824Q9801k15139L71004O3531j73749k4684j29996R2183
$$ 522865 209325 239728 338552 428353 213214 584218 647749 474000 449316 319320 411503
1703D11503n2035K8956Q7337N4505Q4020j01899j63011R3954o8305k00443l9566
$$ 411503 359468 388424 475761 530266 614286 512387 349376 443330 375025 174582 135016
1692A35016K02016p980j70041k4652K8419K04021j58414k21927J08311j72160
$$ 135016 337032 329052 159011 134359 162778 366799 208385 -13542 94769 -77391
1682g7391j0431K81999j09195M9387o2704J56904R7620k61445P7803J47767j15813
$$ -77391 -87822 194177 84982 134369 71665 228569 326189 64744 142547 290314 174501
1671A74501j18985j32506J28760O0856o0867L5663P7234j58517j97161m0035M13343
$$ 174501 55516 -76990 51770 112626 51759 87422 164656 6139 -191022 -231057 182286
1660A82286j16391q0990K85849j9264q7286r0844p0075j63514Q4199j02456J05467
$$ 182286 65895 -15095 270754 251490 164204 73360 3285 -160229 -76030 -178486 -73019
1649g3019O6910O0472j17619m9485K53778r1264J8347j94882l0291R7161j50335
$$ -73019 -6109 54363 -63256 -112741 141037 49773 68120 -126762 -157053 -59892 -210227
1638b10227J24664K33137n513O9966j69880r3314J19048j75296k64604N3554K84264
$$ -210227 -85563 147574 142061 212027 42147 -51167 67881 -107415 -372019 -318465 -34201
1627c4201K4609m379N159J08823o9483j78153j40403K51455n4810l6606p8891
$$ -34201 -9592 -13971 -8812 100011 30528 -147625 -288028 -36573 -91383 -127989 -206880
1616b06880m8204K14424p0601j54935K03134j58884j50204J36182K15263j15523
$$ -206880 -255084 -40660 -111261 -266196 -63062 -221946 -372150 -235968 -20705 -136228
1606a36228j37767L0576K2300P340o2213M3567K23944j30981k84087K35200J04232
$$ -136228 -273995 -243419 -221119 -213779 -275992 -232425 -8481 -139462 -423549 -188349 -84117
1595h4117r1537N6611o7291Q9204k85590K80557J7653l961j62457p4973J89770
$$ -84117 -175654 -119043 -186334 -97130 -382720 -102163 -84510 -88471 -250928 -325901 -136131
1584a36131K8387K4375n0130J338j49804l5887L3494J35040m5280L9104j46599
$$ -136131 -107744 -83369 -133499 -132161 -281965 -317852 -284358 -149318 -194598 -155494 -302093
1573c02093j27312J7910k0833J49099j52633J78080K46479k26164O9927n0899
$$ -302093 -429405 -411495 -432328 -283229 -435862 -257782 -11303 -237467 -167540 -218439
1563b18439J18996j14728j2031R1943J17835j61210m16564J61933K93606m8660
$$ -218439 -99443 -214171 -226202 -134259 -16424 -177634 -594198 -432265 -138659 -187319
1553a87319l8800N307J43346k6593j85179J06941j74805l3099K7676n3150K84918
$$ -187319 -226119 -220812 -77466 -104059 -289238 -182297 -357102 -390201 -362525 -415675 -130757
1542a30757j97069J12164J0170r4303M8652k45078K15321J22633j88089j80254
$$ -130757 -327826 -215662 -205492 -299795 -251143 -496221 -280900 -158267 -346356 -526610
1532e26610J88991J19962j17839j08208J1760J42980P5827J3459r7649J32890
$$ -526610 -337619 -217657 -335496 -443704 -431944 -288964 -213137 -199678 -297327 -164437
1522a64437m9167q8247J16411P6332j20343N1049j22317J1785j43060L472n6087
$$ -164437 -213604 -301851 -185440 -109108 -229451 -178402 -300719 -288934 -431994 -428522 -484609
1511d84609J95420P3458j79819K98717l4525k9405J4942l03370J79734L58483
$$ -484609 -289189 -215731 -395550 -96833 -131358 -160763 -145821 -449191 -269457 89026
1501H9026m1777j49582l0247J91328j27938j99314J93070k7668j9101l96761n5043
$$ 89026 47249 -102333 -132580 58748 -69190 -268504 -75434 -103102 -122203 -518964 -574007
1490e74007M30060j40234j00269J76011J81881k14786j57014J75343N9809k42792
$$ -574007 -143947 -284181 -384450 -208439 -26558 -241344 -398358 -223015 -163206 -405998
1480d05998j66283M67175L0693r385k22310M6918J23165j22240N2546p6411N469
$$ -405998 -572281 -105106 -74413 -83798 -306108 -259190 -136025 -258265 -205719 -282130 -276661
1469b76661p6378N9006J40638N4228j58832P4929n4646K512Q9547L5879q8167
$$ -276661 -353039 -294033 -153395 -99167 -257999 -183070 -237716 -235204 -145657 -109778 -197945
1458a97945j0392M274n3472M82K97945r1894k11478J47084Q8717j39256q623k63186
$$ -197945 -208337 -204063 -257535 -257053 40892 -51002 -262480 -115396 -26679 -165935 -174558 -437744
1446d37744J15415J98168j76621l7779K26411J52243l42665J18143L1135j5353
$$ -437744 -322329 -124161 -300782 -338561 -112150 40093 -302572 -184429 -153294 -168647
1436a68647o8336j84323J31651J9187j48654k6424J97782J0723O7285j84724J60241
$$ -168647 -236983 -421306 -289655 -270468 -419122 -445546 -247764 -237041 -169756 -354480 -194239
1425a94239j21080j23746J89806n2044o8152j76510L41857K13315r9199j64777
$$ -194239 -315319 -439065 -249259 -301303 -369455 -545965 -204108 9207 -89992 -254769
1415b54769p5729J80805K80534k66578l26818J09964R2211J22494o3986P0006
$$ -254769 -330498 -149693 130841 -135737 -462555 -352591 -260380 -137886 -201872 -131866
1405a31866J0495M89p3299p1467M1004k6241j18051m8224J84926p8340j53682
$$ -131866 -121371 -120882 -194181 -265648 -224644 -250885 -368936 -417160 -232234 -310574 -464256
1394d64256J60858K11576k58530o400J44213L820r0369L5553M4093M655J35153
$$ -464256 -303398 -91822 -350352 -356752 -212539 -208719 -299088 -263535 -219442 -214787 -79634
1383g9634k68448p465J08497j32811N1886R3375O2002p2140l4854m0903Q8469
$$ -79634 -348082 -355547 -247050 -379861 -327975 -234600 -172598 -244738 -279592 -320495 -232026
1372b32026k6696p6647J52221j34353q163J36895m3542j71504N6988o1182J92599
$$ -232026 -258722 -335369 -183148 -317501 -325664 -188769 -232311 -403815 -346827 -408009 -215410
1361b15410L6169l26983J41698J01179J2668N3301Q682j41294J05143J66197P0548
$$ -215410 -179241 -506224 -364526 -263347 -250679 -197378 -188696 -329990 -224847 -58650 11898
1350A1898p8903k7356R8792k13782K40527j07066k70586l377J31313N0339k85562
$$ 11898 -67005 -94361 4431 -209351 31176 -75890 -346476 -349853 -218540 -168201 -453763
$$ [...]
##END NTUPLES=NMR SPECTRUM
##END=
