##TITLE=1H_TG-2316-2
 CDCl3,8 sc, 
 11.02.2021
##JCAMPDX= 6.0         $$ Bruker NMR JCAMP-DX V2.0
##DATA TYPE= NMR SPECTRUM
##DATA CLASS= NTUPLES
##ORIGIN= UXNMR, Bruker Analytische Messtechnik GmbH
##OWNER= root
$$ XWIN-NMR		Version 3.5
$$ Thu Feb 11 10:30:47 2021 Russian Standard Time (UT+4h)  she@DPX200
##.OBSERVE FREQUENCY= 200.1315066352
##.OBSERVE NUCLEUS= ^1H
##.ACQUISITION MODE= SIMULTANEOUS
##.ACQUISITION SCHEME= undefined
##.AVERAGES= 8
##.DIGITISER RES= 18
##SPECTROMETER/DATA SYSTEM= spect
##.PULSE SEQUENCE= zg30
##.SOLVENT NAME= CDCl3
##.SHIFT REFERENCE= (INTERNAL, CDCl3, 0, 16.0341)
##AUDIT TRAIL= $$ (NUMBER, WHEN, WHO, WHERE, WHAT)
$$ ##TITLE= Audit trail, XWIN-NMR		Version 3.5
$$ ##JCAMPDX= 5.01
$$ ##ORIGIN= Bruker BioSpin GmbH
$$ ##OWNER= she
$$ F:/spectra/data/she/nmr/H-F/1/pdata/1/auditp.txt
$$ ##AUDIT TRAIL=  $$ (NUMBER, WHEN, WHO, WHERE, WHAT)
(   1,<2021-02-11 10:29:32.03 +0400>,<she>,<DPX200>,
      <created by zg, POWCHK disabled, PULCHK disabled
       configuration hash MD5:
       00 E9 B6 7A A2 85 ED C7 34 08 36 98 17 FE 4E 26
       data hash MD5: 16K
       C2 94 5B 4A 7C A6 8F F7 91 40 BE 38 B2 29 8A 57>)
(   2,<2021-02-11 10:29:34.50 +0400>,<she>,<DPX200>,
      <Start of raw data processing
       efp BC_mod = 2 LB = 0.24 FT_mod = 6 PKNL = 1 PHC0 = -10758.82 PHC1 = 11.80095 SI = 16K 
       data hash MD5: 16K
       35 F4 96 29 28 9C 9B 9E D4 5F D4 08 97 62 52 B6>)
(   3,<2021-02-11 10:29:52.17 +0400>,<she>,<DPX200>,
      <pk PHC0 = -1.47034 PHC1 = 4.400001 
       data hash MD5: 16K
       FC 1D BA 12 1B DD 02 1D 1D D8 FB 24 1C 59 26 4C>)
(   4,<2021-02-11 10:29:55.18 +0400>,<she>,<DPX200>,
      <abs ABSG = 5 
       data hash MD5: 16K
       9D 29 6E A2 12 70 34 98 80 07 CA 4C 34 59 37 37>)
$$ ##END=
$$ 
$$ hash MD5
$$ 8C A2 89 66 5B A0 D5 99 E1 F1 8E F8 F0 48 9D A5
##$RELAX= 
##$RELAX= 
##$RELAX= 
##$RELAX= 
##$RELAX= 
##$RELAX= 
$$ Bruker specific parameters
$$ --------------------------
##$DU= <F:/spectra>
##$EXPNO= 1
##$NAME= <H-F>
##$PROCNO= 1
##$TYPE= <nmr>
##$USER= <she>
##$AMP= (0..31)
100 100 100 100 100 100 100 100 100 100 100 100 100 100 100 100 100 100 
100 100 100 100 100 100 100 100 100 100 100 100 100 100 
##$AQSEQ= 0
##$AQ_mod= 1
##$AUNM= <au_zg>
##$AUTOPOS= <>
##$BF1= 200.13
##$BF2= 200.13
##$BF3= 200.13
##$BF4= 200.13
##$BF5= 200.13
##$BF6= 200.13
##$BF7= 200.13
##$BF8= 200.13
##$BYTORDA= 1
##$CFDGTYP= 0
##$CFRGTYP= 5
##$CHEMSTR= <none>
##$CNST= (0..31)
1 1 145 1 1 1 1 1 1 1 1 1 1 1 1 1 1 1 1 1 1 1 1 1 1 1 1 1 1 1 1 1 
##$CPDPRG= <>
##$CPDPRG1= <>
##$CPDPRG2= <>
##$CPDPRG3= <>
##$CPDPRG4= <mlev>
##$CPDPRG5= <mlev>
##$CPDPRG6= <mlev>
##$CPDPRG7= <mlev>
##$CPDPRG8= <mlev>
##$CPDPRGB= <>
##$CPDPRGT= <>
##$D= (0..31)
0 1.2 0 0 0 0 0 0 0 0.06 0 0.03 0 0 0 0 0.0002 0 0 0 0 0 0 0 0 0 0 0 0 
0 0 0 
##$DATE= 1613024971
##$DBL= (0..7)
120 120 120 120 120 120 120 120 
##$DBP= (0..7)
150 150 150 150 150 150 150 150 
##$DBP07= 0
##$DBPNAM0= <>
##$DBPNAM1= <>
##$DBPNAM2= <>
##$DBPNAM3= <>
##$DBPNAM4= <>
$$ [...]
##$SUBNAM3= <"">
##$SUBNAM4= <"">
##$SUBNAM5= <"">
##$SUBNAM6= <"">
##$SUBNAM7= <"">
##$SUBNAM8= <"">
##$SUBNAM9= <"">
##$SW= 16.9725356469052
##$SWIBOX= (0..15)
0 0 2 0 0 0 0 0 0 0 0 0 0 0 0 0 
##$SW_h= 3396.73913043478
##$TD= 16384
##$TD0= 1
##$TE= 0
##$TE2= 300
##$TE3= 300
##$TEG= 300
##$TL= (0..7)
0 120 120 120 120 120 120 120 
##$TP= (0..7)
150 150 150 150 150 150 150 150 
##$TP07= 0
##$TPNAME0= <>
##$TPNAME1= <>
##$TPNAME2= <>
##$TPNAME3= <>
##$TPNAME4= <>
##$TPNAME5= <>
##$TPNAME6= <>
##$TPNAME7= <>
##$TPOAL= (0..7)
0.5 0.5 0.5 0.5 0.5 0.5 0.5 0.5 
##$TPOFFS= (0..7)
0 0 0 0 0 0 0 0 
##$TUNHIN= 0
##$TUNHOUT= 0
##$TUNXOUT= 0
##$USERA1= <user>
##$USERA2= <user>
##$USERA3= <user>
##$USERA4= <user>
##$USERA5= <user>
##$V9= 5
##$VALIST= <valist>
##$VCLIST= <CCCCCCCCCCCCCCC>
##$VD= 0
##$VDLIST= <DDDDDDDDDDDDDDD>
##$VPLIST= <PPPPPPPPPPPPPPP>
##$VTLIST= <TTTTTTTTTTTTTTT>
##$WBST= 1024
##$WBSW= 4
##$XGAIN= (0..3)
0 0 0 0 
##$XL= 0
##$YL= 0
##$YMAX_a= 239767
##$YMIN_a= -94673
##$ZGOPTNS= <>
##$ZL1= 120
##$ZL2= 120
##$ZL3= 120
##$ZL4= 120
##$ABSF1= 16.00401
##$ABSF2= -0.9686546
##$ABSG= 5
##$ABSL= 3
##$ALPHA= 0
##$AQORDER= 0
##$ASSFAC= 0
##$ASSFACI= 0
##$ASSFACX= 0
##$ASSWID= 0
##$AUNMP= <proc_1d>
##$AZFE= 0.1
##$AZFW= 0.1
##$BCFW= 0
##$BC_mod= 2
##$BYTORDP= 0
##$COROFFS= 0
##$CY= -3
##$DATMOD= 1
##$DC= 0
##$DFILT= <>
##$DTYPP= 0
##$F1P= 0
##$F2P= 0
##$FCOR= 1
##$FTSIZE= 16384
##$FT_mod= 6
##$GAMMA= 0
##$GB= 0
##$INTBC= 1
##$INTSCL= 2.992141e-10
##$ISEN= 128
##$LB= 0.24
##$LEV0= 0
##$LPBIN= 0
##$MAXI= 10000
##$MC2= 0
##$MEAN= 0
##$ME_mod= 0
##$MI= 1.114404
##$NCOEF= 0
##$NC_proc= -8
##$NLEV= 6
##$NOISF1= 3.799351
##$NOISF2= 2.8
##$NSP= 0
##$NTH_PI= 0
##$NZP= 0
##$OFFSET= 16.03411
##$PC= 1
##$PHC0= -10760.29
##$PHC1= 16.20095
##$PH_mod= 1
##$PKNL= yes
##$PPARMOD= 0
##$PSCAL= 0
##$PSIGN= 0
##$REVERSE= no
##$SF= 200.129996098244
##$SI= 16384
##$SIGF1= 3
##$SIGF2= 2
##$SINO= 5.538805
##$SIOLD= 16384
##$SREGLST= <1H.CDCl3>
##$SSB= 0
##$STSI= 16384
##$STSR= 0
##$SW_p= 3396.73913043478
##$SYMM= 0
##$S_DEV= 0
##$TDeff= 16384
##$TDoff= 0
##$TI= <>
##$TILT= no
##$TM1= 0
##$TM2= 0
##$TOPLEV= 0
##$USERP1= <user>
##$USERP2= <user>
##$USERP3= <user>
##$USERP4= <user>
##$USERP5= <user>
##$WDW= 1
##$XDIM= 16384
##$YMAX_p= 437499702
##$YMIN_p= -2309993
$$ End of Bruker specific parameters
$$ ---------------------------------
##NTUPLES= NMR SPECTRUM
##VAR_NAME=  FREQUENCY,     SPECTRUM/REAL,   SPECTRUM/IMAG
##SYMBOL=    X,             R,               I
##VAR_TYPE=  INDEPENDENT,   DEPENDENT,       DEPENDENT
##VAR_FORM=  AFFN,          ASDF,            ASDF
##VAR_DIM=   16384,         16384,           16384
##UNITS=     HZ,            ARBITRARY UNITS, ARBITRARY UNITS
##FACTOR=    0.207333158178281, 1,           1
##FIRST=     3208.90619474396, 0,            0
##LAST=      -187.832935690816, 0,           0
##MIN=       -187.832935690816, -2309993,    0
##MAX=       3208.90619474396, 437499702,    0
$$ Real data points
##PAGE= N=1
##DATA TABLE= (X++(R..R)), XYDATA
$$ [...]
6435A563587k03050k16973k40843k00263l49914M46540j71120P3511L3558K8246
6425G63279M87940r1497o06663M6017j02435M50847M29393j80043n35300j13849
6415E47689M05541Q17309m6114l68492L8930l58348K84615j60475j29032J38559
6405A170182p28299K52108N00932r538k61516K51904Q39475k00437m21120l5455
6395A358236M57619j60836m62614J23346O6114k45987N44390J48179L3420j18558
6385A743309K31872K79082K04492j92454n81714L71669K77569n95580k08556J87542
6375A717231O2731k60747p0181J90864L59532r06694J36112Q63809j30931k48271
6365A713455n50709L41505j42124M94859q2139n82430R4046L54059L67910R3836
$$ y = [1563587, 1360537, 1143564, 902721, 702458, 352544, 799084, 627964, 701475, 735033, 763279, 1251219, 1159722, 553059, 599076, 496641, 947488, 1376881, 1196838, 661538, 547689, 953230, 1770539, 1724425, 1355933, 1394863, 1036515, 1321130, 1160655, 1031623, 1170182, 441883, 693991, 1194923, 1185385, 923869, 1175773, 2015248, 1814811, 1393691, 1358236, 1815855, 1655019, 1192405, 1315751, 1381865, 1135878, 1680268, 1828447, 1861867, 1743309, 1975181, 2254263, 2458755, 2266301, 1684587, 2056256, 2333825, 1738245, 1529689, 1717231, 1779962, 1519215, 1449034, 1639898, 1999430, 1092736, 1228848, 2092657, 1961726, 1713455, 1162746, 1504251, 1362127, 1856986, 1774847, 1192417, 1286463, 1640522, 2008432, 2102268]
6355B102268K24730O83165r1113n55254j92287M17651J55500o40358K47856j34927
6345B217231j47778J8365K06869j70071P8708j14564J41551r7238j61001p3084
6335A898988L50939P5048p55041J72623N46438K46030k01408l85902K61552M46720
6325B655987l70744l13981M7920K0767l15674P81365l22418l51233N10780P3575
6315B416344J36217m76578Q203Q92075O29135m71938l64115n09369L78609K75877
6305B914460m23874m0124k50088R01274K80520p05828l6175K50174j75127l35328
6295B379884l2377J60506q9626k71786J25656N90018L33436K80163M46130m11818
6285C510186L28990P50167J37968j2746j52640j0450M76714L22594l7104L78560
$$ y = [2102268, 2326998, 3010163, 2919050, 2363796, 2171509, 2589160, 2744660, 2104302, 2352158, 2217231, 2069453, 2087818, 2294687, 2124616, 2203324, 2088760, 2230311, 2133073, 1972072, 1898988, 2249927, 2324975, 1569934, 1742557, 2288995, 2535025, 2333617, 1947715, 2209267, 2655987, 2285243, 1971262, 2019182, 2039949, 1724275, 2505640, 2183222, 1831989, 2342769, 2416344, 2552561, 2075983, 2084186, 2976261, 3605396, 3133458, 2769343, 2259974, 2638583, 2914460, 2490586, 2450462, 2200374, 3101648, 3382168, 2676340, 2640165, 2890339, 2715212, 2379884, 2347507, 2508013, 2418387, 2146601, 2272257, 2862275, 3195711, 3475874, 3922004, 3510186, 3839176, 4589343, 4727311, 4714565, 4561925, 4551475, 5028189, 5350783, 5313679, 5692239]
6275E692239J85829n1951L1992K14003M40126k9721k1486J42126L31430O41941
6265G576528L33883O53866J034671O85068N45350J263634R97283J120246J069348
6256A5279877K149894J852154J994651J912852J575926P41123k51641r81727k185980
6247B2087129j610064j529657k435955j944582p02053r63085j425996k14582L22754
6238A1583909k78866p0713r9078k26805m3539J74911P8979K33372K9137R2096
6228A1473403j49258m61864p29155L78324J92305r6535n48837q84514N19628N97792
6218A0291289k06185l5214n1596k29938L13568L45036P23426K35065M79652j54609
6208A1710494N12790M74094j77320O23775J08791l79041Q74893R84119n22164
$$ y = [5692239, 5878068, 5826117, 5858109, 6072112, 6512238, 6482517, 6461031, 6603157, 6934587, 7576528, 7910411, 8564277, 9598948, 10284016, 10829366, 12093000, 13090283, 14210529, 15279877, 17429771, 19281925, 21276576, 23189428, 24765354, 25506477, 25254836, 24273109, 22087129, 20477065, 18947408, 16511453, 14566871, 13864818, 12901733, 11475737, 11261155, 11583909, 11305043, 11234330, 11135252, 10908447, 10864908, 11039819, 11118798, 11352170, 11381307, 11473403, 11324145, 10862281, 10133126, 10511450, 10703755, 10607220, 10058383, 9173869, 9693497, 10291289, 10085104, 10049890, 9998294, 9768356, 10081924, 10426960, 11150386, 11385451, 11865103, 11710494, 12223284, 12697378, 12520058, 13143833, 13252624, 12873583, 13748476, 14732595, 14210431]
6199A4210431M56319l61428J54656o7900M97144Q07530K41045R73684K72233O13247
6189A7796961P77615R30144Q44269O77977R71906M84193P00349L62527R16469
6180B4462410J167330K33216J017423J291564J499542J511970J812542J778425
6172C4774422J413020P62601P60262J099042J459727J569463J676673K555975
6164D6071185K853738L548433K796395J126042K73150j524747l988995m681428
6156D6473773l557135k887662k976606k869735k417517j485136r91670q96439
6148B8391873j491077o67891o53303j343129j438276j484627q09724j223194p59197
6139A8521455p81398j229993m77854l37692r21195p82028k91264k55990k69305
$$ y = [14210431, 14666750, 14305322, 14459978, 14392078, 14889222, 15696752, 15937797, 16911481, 17183714, 17796961, 18574576, 19504720, 20348989, 21026966, 21998872, 22483065, 23183414, 23545941, 24462410, 25629740, 25862956, 26880379, 28171943, 29671485, 31183455, 32995997, 34774422, 36187442, 36950043, 37710305, 38809347, 40269074, 41838537, 43515210, 46071185, 48924923, 52473356, 55269751, 56395793, 56668943, 55144196, 51155201, 46473773, 42916638, 40028976, 37052370, 34182635, 31765118, 30279982, 29288312, 28391873, 26900796, 26232905, 25579602, 24236473, 22798197, 21313570, 20503846, 19280652, 18521455, 17740057, 16510064, 16032210, 15694518, 14773323, 13991295, 13700031, 13444041, 13174736]
6130A3174736o08764p1914M97013m66363o14702k76075j67354k23382L50604J697
6120A1595496l96734r9893J54470O69313j82747l81595L32592P92077L50246n57508
6110A2275717J05526r4536n58260q56725o01859q51132j83343j92352n02111k0655
6100H520270q78597m63256N28205j97000J6341J286R68208j54094m62636K73268
6090H151995k59006j88736l57666j92173Q8089K59416K53922O87322L42129Q3222
6080H868514m42527O67725n8733L43521K69220L43385L59268n5664j397476J34222
6070I031455q8539j080165j27329l13890k16044R281K23563K30960p45901n41045
6060F382346p15920M79592J56424n05224N17022O575j84782m60110K65509p29942
$$ y = [13174736, 12565972, 12494058, 12991071, 12524708, 11910006, 11633931, 11466577, 11243195, 11593799, 11595496, 11198762, 11098869, 11253339, 11922652, 11739905, 11358310, 11690902, 12482979, 12833225, 12275717, 12381243, 12286707, 11728447, 10871722, 10269863, 9418731, 9235388, 9043036, 8540925, 8520270, 7641673, 7178417, 7706622, 7509622, 7525963, 7527249, 8495457, 8341363, 7878727, 8151995, 7892989, 7704253, 7346587, 7154414, 7242503, 7501919, 7755841, 8443163, 8785292, 8868514, 8425987, 9093712, 9034979, 9378500, 9647720, 9991105, 10350373, 10294709, 8897233, 9031455, 8942916, 7862751, 7735422, 7421532, 7205488, 7214769, 7438332, 7669292, 6923391, 6382346, 5666426, 6146018, 6302442, 5797218, 6314240, 6320815, 6136033, 5675923, 5941432, 5211490]
6050E211490L35960M88066q90424o45919M85454j31933o00714o09658K23991N51002
6040D417315j89914p47953j2738J47568p22978j73647j16729m992K8644N26970
6030C151546L65863K25547k91732m31107J66588k58684l10036l49492L89196J2625
6020B670314j1950J33767j85171N05316j95471K75669l43493N06338L76419k3929
6010C707809j22555j254172J69647L25621M93915l51106n41202o26583P78551
6001B579925J50769n56002P51767n70985J13868k26249r22431m0303N97019K70063
5991B147441l43548j69399k94812L10605K1277r9705J57839Q17559J04449P8359
5981B730065j64001L7764j92905m35524o21492m4832N03702L5989K27796N09717
$$ y = [5211490, 5547450, 6035516, 5145092, 4499173, 4984627, 4852694, 4251980, 3642322, 3866313, 4417315, 4227401, 3479448, 3466710, 3614278, 2891300, 2717653, 2600924, 2595932, 2624576, 3151546, 3517409, 3742956, 3451224, 3020117, 3186705, 2928021, 2617985, 2268493, 2657689, 2670314, 2658364, 2792131, 2606960, 3112276, 2916805, 3192474, 2848981, 3355319, 3731738, 3707809, 3585254, 2331082, 2500729, 2826350, 3320265, 2969159, 2427957, 1801374, 2579925, 2730694, 2174692, 2926459, 2355474, 2469342, 2243093, 1320662, 1280359, 1877378, 2147441, 1803893, 1634494, 1339682, 1650287, 1671564, 1571859, 1729698, 2547257, 2651706, 2730065, 2566064, 2603828, 2410923, 1975399, 1353907, 1309075, 1812777, 1848766, 2076562, 2586279]
5971B586279m59256j90463J42280L05708M3990J85868K50859O8013J99597p99043
5961B333832m12568L16938P41791L13337n26498m49494k1967J279310K26640j149980
5951B651341q83332l16618J93083m66369K63418l48947l964j1218q955J5279N84974
5940A668692M48627l40390O1263K0107l40260k15927O9326j23852m65028o64757
5930A17801j56126J94635L29115K29192J71295o0655J62355N75385k93926k7121
5920A241950N50056k03846n44518J09986K76320L28380n8738q04880l49463L27070
5910H72317N69194K4285J75404J43511j78254k93308l33753m9583j31361J86152
5900I84604K19598o88805m53206M91448k79374K23819k08577k01019l993L47575
$$ y = [2586279, 2127023, 1936560, 2078840, 2384548, 2428538, 2614406, 2865265, 2933278, 3132875, 2333832, 1921264, 2238202, 2979993, 3293330, 2766832, 2317338, 2295371, 3574681, 3801321, 2651341, 1768009, 1451391, 1644474, 1178105, 1441523, 1092576, 1088612, 1077394, 1068439, 1083718, 1668692, 2117319, 1776929, 1838192, 1858299, 1518039, 1302112, 1371438, 1247586, 782558, 117801, -38325, 156310, 485425, 714617, 885912, 825257, 987612, 1562997, 1269071, 1241950, 1792006, 1588160, 1043642, 1153628, 1429948, 1758328, 1699590, 894710, 545247, 872317, 1441511, 1465796, 1641200, 1784711, 1606457, 1313149, 979396, 929813, 798452, 984604, 1204202, 515397, 62191, 553639, 274265, 498084, 289507, 88488, 84495, 432070]
5890D32070M67105J28766m71622L73623j81664K49654j90057j3526L84463q7142
5880A091670L8794o86804m47576N43845M68271k05687J68968P35635k36311k23947
5870A246858k22916p54193l87293J11389k52884m50827k59085M70574J301096
5861H02719l67568l34370M4142N93676J093254J45726n96276J27404m68340n00401
5851E39966n68403l8251M17494N5439K78201K10665J26970Q94337N1877k55468
5841A712827j79446n53721J88622l1913n94735m40221Q1175P686K70164L04635
5831G65073m8142K2225J00715K11798k80879j91043L4273Q66610k02470p92766
5821D85394j03359K43339L39089J001L35770J75511l19815J82657n94311l2080
$$ y = [432070, 899175, 1027941, 556319, 929942, 748278, 997932, 807875, 794349, 1178812, 1091670, 1130464, 443660, -3916, 539929, 1008200, 802513, 971481, 1707116, 1470805, 1246858, 1023942, 269749, -117544, -6155, -259039, -709866, -968951, -498377, 802719, 435151, 100781, 144923, 738599, 1831853, 1977579, 1381303, 1508707, 1040367, 539966, -28437, -66688, 350806, 406245, 684446, 895111, 1022081, 1916418, 1968295, 1712827, 1533381, 979660, 1168282, 1136369, 541634, 101413, 182588, 190274, 460438, 765073, 716931, 739156, 839871, 1051669, 770790, 579747, 614020, 1480630, 1278160, 485394, 382035, 625374, 964463, 965464, 1301234, 1476745, 1156930, 1339587, 745276, 713196]
5811G13196K57315L11163K81405j17874n24753o9884J82511j26996Q7896m2223
5801I51756o64726k86545J95019m8279l7870m58418m55894J045453R47109k8238
5791A159367j42523n8497N22425M1829l53063q14334M03618J82342j17613J67547
5781I91098P7297L04054j13067M63502K19759l88022L78980k33305j20508l44133
5771A235655k94819J14855j95116j38236K75995L9369n8096M2382N97437J56695
5761A776121J31112J2424l63830k94271K11661J31763O5259l19280k73037L95533
5751A473455J43518K45298j32207O21208K07477O27565k61692j114568k05473
5742A604581M6392J65291k2613l47371k74396J18894Q98785K07700j46454j14040
$$ y = [713196, 970511, 1281674, 1563079, 1445205, 920452, 850568, 1033079, 906083, 993979, 951756, 287030, 485, 195504, 147225, 109355, -349063, -804957, 240496, 1187605, 1159367, 1016844, 958347, 1480772, 1522601, 1169538, 355204, 758822, 941164, 823551, 991098, 1068395, 1372449, 1259382, 1722884, 1942643, 1554621, 1933601, 1700296, 1579788, 1235655, 940836, 1055691, 860575, 722339, 998334, 1037703, 979607, 1021989, 1619426, 1776121, 1907233, 1919657, 1555827, 1261556, 1473217, 1604980, 1670239, 1350959, 1077922, 1473455, 1616973, 1862271, 1730064, 2351272, 2558749, 3186314, 2924622, 1810054, 1604581, 1650973, 1816264, 1793651, 1446280, 1171884, 1290778, 2189563, 2397263, 2250809, 2136769]
5732B136769J82685k87564j39189p1674L22954j37868K48249K247p34465L67096
5722A889240k54112j55199P85709N79281K33578k40708k87284M50704p931l91407
5712B601871j71399N10616K03336K81717Q7457l04188l75348o675K39262m26705
5702B639944Q5444J53231O1179L87664j42013k01415l46643J65141J25686Q3972
5692C012190m02418l02691k52461m41148k9989k23960m13340N17304O05386r8426
5682A970447K38432K17677m12474L19795J03142l69166m92692J18437M3808J40114
5672A877520M2996k9009m9525j02134L31126k52243m82596n1694j19730L90726
5662A555437J64019m64796J04828N41443M07402M38861o9907N2789j18197j42424
$$ y = [2136769, 2319454, 2031890, 1892701, 1821027, 2143981, 2006113, 2254362, 2256609, 1522144, 1889240, 1635128, 1479929, 2265638, 2844919, 3078497, 2837789, 2550505, 3001209, 2993278, 2601871, 2430472, 2941088, 3144424, 3426141, 3513598, 3209410, 2834062, 2827387, 3066649, 2639944, 2725388, 2878619, 2939798, 3327462, 3185449, 2984034, 2637391, 2802532, 2928218, 3012190, 2609772, 2307081, 2054620, 1613472, 1583483, 1359523, 946183, 1463487, 2068873, 1970447, 2208879, 2426556, 2014082, 2333877, 2437019, 2067853, 1575161, 1693598, 1737406, 1877520, 1920516, 1891507, 1841982, 1739848, 2070974, 1818731, 1336135, 1284441, 1164711, 1555437, 1719456, 1254660, 1359488, 1900931, 2308333, 2747194, 2677287, 2730076, 2611879, 2469455]
5652B469455J29922L88251n67290n50163K10615N95657L4048M9090O71255l71618
5642C059222L62827K68861l67811p27516k95615K48502N53579k10741p22003l99835
5632A769470M3827k89794p07421J141860O62962J12953r4529j26569L5492k36044
5622B312207j31721k82488K73610j55087j93067l5853m5156m27976P30118L60001
5612B404588j57399J00040L6685l0563M05205o32437m6878O97032n48455m73916
5602A753902M93771j52377o08014J89727N52382l51641p8554R05583L50830o0725
5592B994884N80417l40919L52025l15447j175891J35005J1530j76140K16880K88112
5582B570456M54951K52980K88824j9579m58524L0572N650J85184j31230l29923
$$ y = [2469455, 2599377, 2987628, 2420338, 1870175, 2080790, 2676447, 2710495, 2759585, 3430840, 3059222, 3422049, 3690910, 3323099, 2595583, 2299968, 2548470, 3102049, 2891308, 2169305, 1769470, 1813297, 1523503, 816082, 1957942, 2620904, 2733857, 2639328, 2512759, 2548251, 2312207, 2180486, 1897998, 2171608, 2016521, 1823454, 1787601, 1742445, 1314469, 2044587, 2404588, 2247189, 2347229, 2383914, 2353351, 2758556, 2126119, 2079241, 2776273, 2227818, 1753902, 2247673, 2095296, 1487282, 1677009, 2229391, 1877750, 1799196, 2704779, 3055609, 2994884, 3575301, 3234382, 3586407, 3270960, 2095069, 2230074, 2241604, 2065464, 2282344, 2570456, 3025407, 3278387, 3567211, 3547632, 3089108, 3119680, 3125330, 3310514, 3179284, 2849361]
5572B849361J94966K30971n63921M59604K61780L0584K4473L06776J62651J04277
5562D061522o08782m52953K130j51632K03586K09346L15816k64776M87534M61636
5552D263427j69366n04084J40495K42845J63718K36948k08235J05691k88568P9011
5542D061882K04590k9271m86604l18183O39067j02215k29070J53846j97275L72028
5532D068795M48758K98997M50134J09023k13016L34714n3039j262225J35822K27568
5522D545531m0397m45027K24740K54382L33109N14173L42936Q27392J58372k87903
5512F427308q167M2929m10298p4276j64259n31265o8639K03094j69255M81875
5502E729047N36640j86847m4065O07655J30683p8556P23314p88731o27177N85868
$$ y = [2849361, 3044327, 3275298, 2711377, 3170981, 3432761, 3463345, 3487818, 3794594, 3957245, 4061522, 3452740, 2999787, 3001917, 2850285, 3053871, 3263217, 3579033, 3314257, 3801791, 4263427, 4094061, 3589977, 3730472, 3973317, 4137035, 4373983, 4165748, 4271439, 3982871, 4061882, 4266472, 4237201, 3750597, 3432414, 4071481, 3969266, 3740196, 3894042, 3696767, 4068795, 4517553, 4816550, 5266684, 5375707, 5162691, 5497405, 5444366, 4182141, 4317963, 4545531, 4505134, 4060107, 4284847, 4539229, 4872338, 5386511, 5729447, 6556839, 6715211, 6427308, 6419141, 6462070, 6051772, 5977496, 5813237, 5281972, 5213333, 5416427, 5247172, 5729047, 6265687, 6078840, 6034775, 6642430, 6773113, 6694557, 7417871, 6629140, 6001963, 6587831]
5492F587831l24456j85156J42308L89769Q6546O04375n4911K67112k11541k18162
5482G083715K45856M68866M8461o75660K56289M14003j9116j59152m13102O33276
5472G883436M75968N0280J161J65889M1465K09014M32632Q04905K44151j9164
5462A0289737p37831n34645L94193N79164J09142m70049K0148M04713O23675j85932
5452A0492315K34435O43257M35029j4222n53128L67131M57526P8878q1718j37065
5442A1922438k1215O0636R85790M49853K34615k36202J129676R57451r1001K49968
5432A5642009L87152Q13755L78417k40098P20613P57402N42132J137935J180078
5423B1319395R1403K90876J807399J045375J041430J181792M83333Q89570R49315
$$ y = [6587831, 6263375, 6078219, 6220527, 6610296, 6696842, 7301217, 7246306, 7513418, 7301877, 7083715, 7329571, 7798437, 7846898, 7171238, 7427527, 7841530, 7822414, 7663262, 7250160, 7883436, 8359404, 8409684, 8410845, 8576734, 8618199, 8827213, 9259845, 10064750, 10308901, 10289737, 9551906, 9017261, 9411454, 9990618, 10099760, 9629711, 9649859, 10054572, 10678247, 10492315, 10726750, 11370007, 11805036, 11790814, 11237686, 11604817, 12062343, 12141221, 12059503, 11922438, 11901223, 11961859, 12947649, 13397502, 13632117, 13395915, 14525591, 15483042, 15392041, 15642009, 16029161, 16842916, 17221333, 16981235, 17701848, 18459250, 19001382, 20139317, 21319395, 21410798, 21701674, 23509073, 24554448, 25595878, 26777670, 27261003, 28150573, 29099888]
5414B9099888R62883J652552J754984J069856K540552K934881K621848L207923
5406D5845367L868019M445679M871482M816562O424526P420960P925809Q231358
5398I3849762O938493O174232K818515j255029l784221o571387q778225q499688
5390H0892452q355376p733560o196902m666247l907707l792942l145905k750091
5382D0343722j676367j722449j845771j019363j21985j068017r64395o99509n53125
5373C0672741N8545k94753K43708q996K09582Q80776P30610Q12137L04414Q56441
5363C4465205J736884J372329K151157K353986J793923J598684J772264K161294
5355D9405726N69935J52653O5588p40951j059316r37427j513660j783015j974491
$$ y = [29099888, 30062771, 31715323, 33470307, 34540163, 37080715, 40015596, 42637444, 45845367, 49713386, 54159065, 59030547, 63847109, 70271635, 77692595, 85618404, 93849762, 100788255, 106962487, 109781002, 108525973, 104741752, 98170365, 89392140, 80892452, 72537076, 64803516, 58606614, 53940367, 50032660, 46239718, 43093813, 40343722, 38667355, 36944906, 35099135, 34079772, 33957787, 32889770, 31925375, 31225866, 30672741, 30731286, 30436533, 30680241, 30671245, 30880827, 31761603, 32492213, 33304350, 33608764, 34465205, 36202089, 37574418, 39725575, 42079561, 43873484, 45472168, 47244432, 49405726, 49975661, 50128314, 50193902, 49452951, 48393635, 47456208, 45942548, 44159533, 42185042]
5346D2185042l073081k681273l045360k605274j734099j899679j875632k154987
5338B3115657j307457q06784j420636r46071j149149o54375o40321p51577k07708
5329A5231579J31504j99046n55152m07130q9791q34554j16498L74328o74386n13872
5319A2346982l40093r0992J01586n55321P1169O39857l33284n9081k7940O0530
5309A1813413L82128J13629k12625l553K73935L09978N33429p46139l16104k26305
5299A1921786J8248P49510K67326K36800M18662M73982l95149k42694n0109l61750
5289A3036612K15215N383n25760l36146o70382q7556k73135n02020o94813m92550
5279I674848J38599o03609n28097j90993l28401j55698K10647k64601J99728j14277
$$ y = [42185042, 39111961, 36430688, 33385328, 30780054, 29045955, 27146276, 25270644, 23115657, 21808200, 21001416, 19580780, 18634709, 17485560, 16831185, 16190864, 15439287, 15231579, 15363083, 15164037, 14608885, 14201755, 14111964, 13277410, 13160912, 13535240, 12860854, 12346982, 12006889, 11915897, 12017483, 11462162, 11533331, 12173188, 11839904, 11780823, 11752883, 11813413, 12195541, 12309170, 12096545, 12092992, 12366927, 12676905, 13210334, 12464195, 12148091, 11921786, 11940034, 12689544, 12956870, 13193670, 13612332, 14086314, 13691165, 13448471, 13398362, 13036612, 13251827, 13257210, 12731450, 12395304, 11724922, 11637366, 11364231, 10862211, 10167398, 9674848, 9813447, 9209838, 8681741, 8490748, 8162347, 8006649, 8217296, 7952695, 8152423, 8038146]
5269H038146n01404l45059p52000K07322N20397k11021k98268J04233l32039m62193
5259E968114L25194L79499n20897p2979K68061p8l18520k82190M20858o04449
5249E562613l77832k84187K33985M81212j32112p2790p7625K14641k9849m393
5239E513663j67188P85073J19696l30627n40797m29788M16206j53049j72811N7261
5229E097639l92528r0141r6537M53735r5880q9507M04333J87601p2040m7729n25715
5218D733231j75365M12103k51332K61833k74203K20168j48499n19127L3386K11358
5208D503553O01895l59942o92774O76889k3532m157J89618n73522K92790N93213
5198E204031O07523p87990n41425R15766Q1815n76173k48797l50305J65172K7400
$$ y = [8038146, 7536742, 7191683, 6439683, 6647005, 7167402, 6956381, 6658113, 6762346, 6430307, 5968114, 6293308, 6672807, 6151910, 6078931, 6346992, 6346914, 6028394, 5746204, 6167062, 5562613, 5184781, 4900594, 5134579, 5615791, 5483679, 5410889, 5333264, 5547905, 5518056, 5513663, 5346475, 6131548, 6251244, 5920617, 5379820, 4950032, 5366238, 5213189, 5040378, 5097639, 4705111, 4614970, 4518433, 4972168, 4876288, 4786781, 5191114, 5378715, 5306675, 5258946, 4733231, 4557866, 4969969, 4718637, 4980470, 4706267, 4926435, 4777936, 4258809, 4292195, 4503553, 5105448, 4745506, 4052732, 4729621, 4706089, 4701932, 4891550, 4318028, 4610818, 5204031, 5811554, 5023564, 4482139, 5397905, 5479720, 4903547, 4654750, 4304445, 4469617, 4497017]
5188D497017p43416J67725M83440L95115J44128l9466L0296J82150K7420k81906
5178D862503m12969p6734R5184N21001J37605k94270q9007M28350K69925K30058
5168E671646J72083L85931M55272m8672j181785k13163L66614L91379m42219l13212
5158E243874m06229m11320O14584R4227k11007P3324K21941M38949k44925j1439
5148E401979M20016M20947n6731k18325L7188M9062M30383o52928m23622O5074
5138E473043N22048J8339P53323k32157o55209O71638K94758j97288R8552J02822
5128F849869K78781q83022r30785k3223K12265N23912K11839P0230l19867M65848
5118F455847O70516m39849k65911k70606L42616J05248j73754j70110K76560J68199
$$ y = [4497017, 3753601, 3921326, 4404766, 4799881, 4944009, 4904543, 4934839, 5116989, 5144409, 4862503, 4449534, 4372800, 4467984, 4988985, 5126590, 4832320, 4743313, 5171663, 5441588, 5671646, 5843729, 6229660, 6684932, 6636260, 5454475, 5241312, 5607926, 5999305, 5557086, 5243874, 4837645, 4426325, 5040909, 5135136, 4924129, 4997453, 5219394, 5658343, 5413418, 5401979, 5821995, 6242942, 6186211, 5967886, 6005074, 6054136, 6484519, 5831591, 5407969, 5473043, 5995091, 6013430, 6766753, 6534596, 5879387, 6551025, 6845783, 6648495, 6747047, 6849869, 7128650, 6245628, 5314843, 5291620, 5503885, 6027797, 6239636, 6309866, 5989999, 6455847, 7126363, 6686514, 6420603, 6149997, 6492613, 6597861, 6424107, 6253997, 6530557, 6698756]
5108F698756n43511J92379O71530J61847J89420K70943m89070n86103K43666k83351
5098F526506j48151p02586M5310J76938k56016J98670o0122P117J091416R0690
5088F969772j58801n5857J27432L72640Q5946l32901l11291j40523Q6261M00002
5078G042680j68178k8860M43985L89903M15093j82118J55264R5342Q6636l49882
5068G899865p24912l31060j81913J030605n4438p72514o00489J292738J51869
5059G709751J97620J5617K53148O54274M26904J10004R3355k83245m63431j76966
5049H537031j48246p40814Q88069K96407q67849P3646P0727K24267K96381m13780
5039H215839N34352M23669J4208k50132n90759J8276K66619Q2152k05495l47594
$$ y = [6698756, 6155245, 6347624, 7019154, 7181001, 7370421, 7641364, 7152294, 6566191, 6809857, 6526506, 6378355, 5675769, 5721079, 5898017, 5642001, 5840671, 5780549, 5787666, 6879082, 6969772, 6810971, 6755114, 6882546, 7255186, 7341132, 7008231, 6696940, 6556417, 6642678, 7042680, 6874502, 6845642, 7289627, 7679530, 8094623, 7912505, 8067769, 8163111, 8249747, 7899865, 7174953, 6843893, 6661980, 7692585, 7638147, 6865633, 6265144, 7557882, 7709751, 7907371, 7922988, 8176136, 8830410, 9257314, 9367318, 9460673, 9177428, 8713997, 8537031, 8388785, 7647971, 8536040, 8832447, 7964598, 8038244, 8108971, 8333238, 8629619, 8215839, 8750191, 9173860, 9188068, 8937936, 8347177, 8365453, 8632072, 8714224, 8508729, 8161135]
5029H161135J03142M84588m19112j6211k07227j79647L78498K38285K53644J1199
5019H808294J18670K71182l47095L87458M78224o5601K39394k25188M49848M2464
5009A0157650p11079N07036M11545k62884m60244r9624J04012M03111M50522L60462
4999A0860507l7219J59401m03401L46091P61582j2023J83911l06328J43037O39928
4989A2335486m90366K81188K60803M08467n16004m2719M09872M10736N87173J39176
4979A3783812k98625p9205J126422N67597l8801k92607N97861Q12321l97231L35788
4969A6117332L72957M11662M25232L03702N48317Q70698J189652M78074n48520
4960B0169106L90118J003123N12554N59365P88706J282883J250313J831423O85552
$$ y = [8161135, 8264277, 8748865, 8329753, 8313542, 8106315, 7926668, 8305166, 8543451, 8797095, 8808294, 8926964, 9198146, 8851051, 9238509, 9716733, 9651132, 9890526, 9665338, 10115186, 10157650, 9446571, 9953607, 10365152, 10102268, 9642024, 9542400, 9646412, 10049523, 10500045, 10860507, 10823288, 10982689, 10579288, 10925379, 11686961, 11674938, 11858849, 11552521, 11695558, 12335486, 11845120, 12126308, 12387111, 12795578, 12279574, 12236855, 12646727, 13057463, 13644636, 13783812, 13485187, 13405982, 14532404, 15100001, 15061200, 14768593, 15366454, 16178775, 15781544, 16117332, 16490289, 16901951, 17327183, 17630885, 18179202, 19049900, 20239552, 20717626, 20169106, 20559224, 21562347, 22074901, 22634266, 23422972, 24705855, 25956168, 27787591, 28473143]
4951B8473143O67246J257927K186451K223912J889836R51963K589942K776941
4943D3017361J704196J450165R18347O67885J154516L15866j083254k328728k359254
4934D3457100j493869j714165j999328j594546r64214j478438k063206r92510
4926C1156824r27323j329133r30667p66632r02396n57097J81906k72237m69538
4917B5183707p39277k00362o40545O8357j08510o59524j05684j4320l73773k52381
4907B2157688k07721J43436k9773j96892o02275N3081O62582k25208j71772M12935
4897B1996081l03647L00093Q2370j64186L13487M77148M9299m17031p8060R10316
4887B3165870J98602k32137Q7719j13576P49447m72967N9176k60612k26753J81359
$$ y = [28473143, 29140389, 30398316, 32584767, 34808679, 36698515, 37650478, 40240420, 43017361, 44721557, 46171722, 47090069, 47757954, 48912470, 49228336, 48145082, 45816354, 43457100, 41963231, 40249066, 38249738, 36655192, 35690978, 34212540, 32149334, 31156824, 30229501, 28900368, 27969701, 27203069, 26300673, 25743576, 25925482, 25653245, 25183707, 24444430, 24244068, 23603523, 23671880, 23563370, 22903846, 22798162, 22783842, 22410069, 22157688, 21949967, 22093403, 22063630, 21866738, 21264463, 21317544, 21980126, 21754918, 21583146, 21996081, 21692434, 21992527, 22074897, 21910711, 22224198, 22701346, 22750645, 22333614, 22255554, 23165870, 23364472, 23132335, 23220054, 23106478, 23855925, 23382958, 23442134, 23181522, 22954769, 23136128]
4877B3136128M24479O11973k81835N13761P00867L18480j20687P87903M59978
4868B6551047K58594Q54532k00664l87676l00153K23297J60298J37511O03880
4859B7900666j13152K9100O60362N79837J41712k17934N91030Q15895n6176j692
4849C0329648O15734P65077N26104O16809P66079J24433P50749J056417j82K1565
4839C5572433P33880L09450L06884J81756P23000O90373j86014L55608K84731
4830C8972101J321215N35376Q63393K73867M33462O89821O19207M34518N31964
4821D4674924Q13872O98309J058958m50174K36003M98062J426267N95298p0594
4812D9480925Q31281J593256J512604N60738J005512J060329k42495N69923O67075
$$ y = [23136128, 23560607, 24172580, 23890745, 24404506, 25105373, 25423853, 25303166, 26091069, 26551047, 26809641, 27664173, 27463509, 27075833, 26775680, 26998977, 27159275, 27296786, 27900666, 27787514, 27816614, 28476976, 29056813, 29198525, 28980591, 29571621, 30387516, 30331340, 30329648, 30945382, 31710459, 32236563, 32853372, 33619451, 33743884, 34494633, 35551050, 35550868, 35572433, 36306313, 36615763, 36922647, 37104403, 37827403, 38517776, 38331762, 38687370, 38972101, 40293316, 40828692, 41692085, 41965952, 42399414, 43089235, 43708442, 44142960, 44674924, 45488796, 46187105, 47246063, 46795889, 47031892, 47529954, 48956221, 49551519, 49480925, 50312206, 51905462, 53418066, 53978804, 54984316, 56044645, 55802150, 56372073, 57039148]
4803E7039148m33605M97813R63512O42086J79516J77681J503469Q79825J095843
4794F2545288J027487J456348J738416Q69340J483416J346940J441890J469564
4786G3378689J775555J532295K180072L101990K925549L195271K595105K812644
4778I3497170L811092L310541K215645K249745K821471K037234J356360J628127
4770A12927385R36164O98643J297998R90158Q28766J087282M19439O16714Q67496
4761A20670045K71960J273939K078793K169383J916712L531162L176501K318977
4753A37407472J637304j60824p08230k835593m532456n986139o414453o590751
4745A11816330p268567o828521o423988o579230m254282l799329m222673l261999
$$ y = [57039148, 56605543, 57103356, 58066868, 58708954, 58888470, 59066151, 60569620, 61449445, 62545288, 63572775, 65029123, 66767539, 67636879, 69120295, 70467235, 71909125, 73378689, 75154244, 76686539, 78866611, 81968601, 84894150, 88089421, 90684526, 93497170, 97308262, 100618803, 102834448, 105084193, 107905664, 109942898, 111299258, 112927385, 113863549, 114562192, 115860190, 116850348, 117679114, 118766396, 119185835, 119802549, 120670045, 120942005, 122215944, 124294737, 126464120, 128380832, 131911994, 135088495, 137407472, 139044776, 138883952, 138175722, 135340129, 130807673, 124821534, 118407081, 111816330, 104547763, 97719242, 91295254, 84716024, 80461742, 76662413, 72439740, 69177741]
4737F9177741l157087k821500j952262k703449k235575j724199j971299j469463
4729E1142907k064733k481975j003173n11852n92062j712820j316055j42730j591319
4720C9726188r09802q91879j333155j19679j090080j201812m07984q7930K64234
4711C3948101O7574O9002J01731O11262m04790q54463j1117j93003q67445l44456
4701C2122396l98023n79431j127098l51311m61981q47438j431948r01014p09697
4692B5314455M10663q81095J9141o31931n00223M81478k62267r8266m37313J27550
4682B3542192j69392j98404p73681m47802n28106p70854o39849m53562j4396p66549
4672A8779597p05610L25350O6990K13500k95527l48041J05406o75204n60282K66512
$$ y = [69177741, 66020654, 63199154, 61246892, 58543443, 56307868, 54583669, 52612370, 51142907, 49078174, 46596199, 45593026, 45081174, 44489112, 42776292, 41460237, 41317507, 39726188, 38816386, 37924507, 36591352, 36471673, 35381593, 34179781, 33771797, 33683867, 33948101, 34015675, 34084677, 34186408, 34797670, 34392880, 33538417, 33527300, 33334297, 32466852, 32122396, 31724373, 31144942, 30017844, 29666533, 29204552, 28357114, 26925166, 26024152, 25314455, 25725118, 24844023, 24863164, 24231233, 23731010, 24212488, 23950221, 23851955, 23414642, 23542192, 23372800, 23174396, 22400715, 21952913, 21424807, 20653953, 20014104, 19560542, 19546146, 18779597, 18073987, 18399337, 18466327, 18679827, 18384300, 18036259, 18141665, 17466461, 16906179, 17172691]
4662A7172691l20398n13970m61045L87634m30495k05545o94188m58902K74824
4653A4750606k68665r2049k10401n70598m40707K73922n33782q7155M05902L54124
4643A3581197J17834l71506N4797l46693m6258n52795q92066K90357j82449l04819
4633A1347599p4613L9771m3562n60170O35214L92643K80566L8683J4321k13952
4623A1856500m98175o40274k28042j71910k78486Q00024K87734k621N04105m20580
4613A1208275K76493j59358q42134J27737j56523j49307p2404L83320m33089N62448
4603A0745458M46091m271n25028L15320N62142k45069k7222q04491j45123n58679
4593I759128q27605N67042N57818P5990K63945o1395l13869J44779K58500J21512
$$ y = [17172691, 16852293, 16338323, 15877278, 16264912, 15834417, 15628872, 14934684, 14475782, 14750606, 14481941, 14389892, 14179491, 13608893, 13168186, 13442108, 12908326, 12821171, 13227073, 13581197, 13699031, 13327525, 13382322, 13035629, 12989371, 12436576, 11544510, 11834867, 11652418, 11347599, 11272986, 11312757, 11269195, 10709025, 11344239, 11736882, 12017448, 12056131, 12070452, 11856500, 11358325, 10718051, 10490009, 10318099, 10039613, 10839637, 11127371, 11124750, 11628855, 11208275, 11484768, 11325410, 10483276, 10611013, 10454490, 10305183, 10232779, 10616099, 10183010, 10745458, 11191549, 11187278, 10662250, 10977570, 11539712, 11294643, 11267421, 10462930, 10317807, 9759128, 8931523, 9498565, 10056383, 10132373, 10396318, 10334923, 10021054, 10165833, 10424333, 10545845]
4583A0545845j276116l30902k80960Q07818J81919l46824j06583O20527L70822
4574A0185546p25691o4756O0853N26758k81753q53309n16252P67952J058839K75697
4564A0433884l87946m28176j86228R87056P93730m85272k40592O82633j37075
4555A1032014m2366m29971l36765j23654q6663q3963O68430j173O19952j16906
4545A1098935j55647j42152l21837O7921m372N2637j57168J25944M28712L59108
4535A1352081k65441K20258O42520J00112o90809j851Q5204k86768l43085m60594
4525A0351627J47899J65768L23600J09535N15380J53219j59591J62901J7758m69382
4515A1318714o83960L48865L53032L39071l68126m11389J17959Q55538M49094
$$ y = [10545845, 9269729, 8938827, 8657867, 9465685, 9647604, 9300780, 9194197, 9814724, 10185546, 9459855, 9395099, 9455952, 9982710, 9700957, 8847648, 8331396, 9099348, 10158187, 10433884, 10045938, 9617762, 9431534, 10418590, 11212320, 10727048, 10486456, 11169089, 11032014, 10989648, 10559677, 10222912, 10099258, 10012595, 9928632, 10597062, 10595889, 11215841, 11098935, 10943288, 10801136, 10479299, 10547220, 10542848, 10595485, 10438317, 10564261, 10992973, 11352081, 11086640, 11306898, 11949418, 12049530, 11358721, 11356870, 11442074, 11155306, 10812221, 10351627, 10499526, 10665294, 10988894, 11098429, 11613809, 11767028, 11607437, 11770338, 11788096, 11318714, 10634754, 10983619, 11336651, 11675722, 11307596, 10896207, 11014166, 11869704, 12318798]
4506A2318798j76180M68031L92285L75417k14326l61868m58820M24468O104m844
4496A2769065P63812J26234J67312K64726J20153K10968J63721j31299J32170
4487A4586862j35841p00243p8024N16860L92012K09460j02075O71629L82461O52193
4477A6395294K35318N46532O80800M1662l49988k15853k11179J58152O35207l09124
4467A7606821j87494Q7826j13010M29172J07436J72055r9500K72413K63319j88625
4457A8350413L78023P68657O25881L84908K23842P72896J266181R92875P16006
4448B4479682M81645N7279K14800M27869J52372L46411O07001N48404O47681m8482
4438B7914662j5517Q73103N53787p2387j1478k05765k92335j30188l95302j022837
$$ y = [12318798, 12142618, 12610649, 13002934, 13378351, 13164025, 12802157, 12343337, 12767805, 12773909, 12769065, 13532877, 13659111, 13826423, 14091149, 14211302, 14422270, 14585991, 14454692, 14586862, 14451021, 13750778, 13672754, 14189614, 14581626, 14791086, 14689011, 15360640, 15743101, 16395294, 16630612, 17177144, 17857944, 17899606, 17549618, 17333765, 17122586, 17280738, 17915945, 17606821, 17419327, 17507153, 17394143, 17823315, 17930751, 18102806, 18003306, 18275719, 18539038, 18350413, 18728436, 19497093, 20122974, 20507882, 20731724, 21504620, 22770801, 23763676, 24479682, 24961327, 25018606, 25233406, 25661275, 25813647, 26160058, 26767059, 27315463, 27963144, 27914662, 27899145, 28772248, 29326035, 29253648, 29242170, 29036405, 28744070, 28613882, 28218580, 27195743]
4428B7195743n7581P9074o92003k62866J90454n91808j039020p66120p59421j162972
4418B2133480m71734M6243n59439j256038j113865l45719J73855l27990m72602
4409A7806191n76921j061210m00359k53988L4389m49426m8343m8549k58446j44413
4399A4598925K41973j35226p02296J58148L6779r6174l57773n02426r472m38943
4389A2793515q18626Q3521Q1801L54894J66023j09443J47377j23165O60885m34542
4379A2802240j60302Q7068j15201k61021n0160K32116J73814n06590l40441P77618
4369A2639141O33110j2749m21431N79737Q9820l11521R783l10512j05207N84476
4359A3374647M19261k21714N185m10056Q62215J05190j34675J10355m36952k78191
$$ y = [27195743, 27138162, 27217236, 26525233, 26262367, 26452821, 25861013, 24821993, 24055873, 23296452, 22133480, 21661746, 21707989, 21148550, 19892512, 18778647, 18432928, 18606783, 18278793, 17806191, 17229270, 16168060, 15767701, 15513713, 15548102, 15098676, 15050333, 15001784, 14743338, 14598925, 14840898, 14705672, 14003376, 14161524, 14198303, 14102129, 13744356, 13241930, 13232458, 12793515, 11974889, 12058410, 12140211, 12495105, 12661128, 12551685, 12699062, 12575897, 13236782, 12802240, 12641938, 12729006, 12613805, 12352784, 12302624, 12534740, 12708554, 12201964, 11861523, 12639141, 13272251, 13259502, 12838071, 13417808, 13507628, 13196107, 13205890, 12895378, 12790171, 13374647, 13793908, 13572194, 13577379, 13167323, 14029538, 14134728, 14000053, 14110408, 13673456, 13395265]
4349A3395265n10520j99395n9333j83600j119915r94858O75712m73097L87362
4340A0917621l09061J34805N87887o34165L13982J19554j16527j80953K21467
4331A1054610q30620l49582l51640P1936K42112m12298j75117L89430P0040l85754
4321I323117K71932O08834p56698l47151J24143n17935n04838j52134J016740
4312I066010J59150k30786q75858N94168j30282k82213j36216k35127K6543L53956
4302H309345P22744l26427L46268j172520L89760J34066k37194j32838N13316
4293H546520l70732j402404O34181J33293L19162m02369O9548O22676n8221j26412
4283G965242j82993O12710k94959l38460L60620l60753j56652j62828j15646J67585
$$ y = [13395265, 12884745, 12685350, 12626017, 12442417, 11322502, 10327644, 11003356, 10530259, 10917621, 10608560, 10743365, 11331252, 10697087, 11011069, 11130623, 11014096, 10833143, 11054610, 10223990, 9874408, 9522768, 9594704, 9836816, 9424518, 9249401, 9638831, 9708871, 9323117, 9595049, 10203883, 9447185, 9100034, 9224177, 8706242, 8201404, 8049270, 9066010, 9225160, 8994374, 8118516, 8712684, 8582402, 8300189, 8163973, 7928846, 7955389, 8309345, 9032089, 8705662, 9051930, 7879410, 8269170, 8403236, 8166042, 8033204, 8546520, 8175788, 6773384, 7407565, 7540858, 7860020, 7457651, 7527199, 8149875, 8091654, 7965242, 7782249, 8394959, 8100000, 7761540, 8122160, 7761407, 7604755, 7441927, 7326281, 7493866]
4273G493866J21206J92292J42256L24531J49882R316m34072j43412p15070L74080
4263G514875j70094m99257Q6392k30060M47149P07574K93773K28335N00634j021043
4253G858278l34123J44046J00841j88311m88228R8439n29553Q78985P40367p03371
4243G577370L21670k73914m52381k31493j29393j54563P38922j24399o28818M88719
4233G131720R3552J98587K03315M03722j93327m27044M19208R7241m1445n13593
4223G371936L97045J55419r4925R7144K18619M16778K70047Q04307M37350M34255
4213A0507975l43909K67098M6176K85462j81553k26175J0657p16425n65103N50047
4203I634250J18605k24232O0524J14089J56177N39050m25410m30017K33934R6129
$$ y = [7493866, 7615072, 7807364, 7949620, 8274151, 8424033, 8433349, 7999277, 7855865, 7140795, 7514875, 7344781, 6845524, 6931916, 6701856, 7149005, 7856579, 8150352, 8378687, 8879321, 7858278, 7524155, 7668201, 7769042, 7580731, 7092503, 7190942, 6661389, 7540374, 8280741, 7577370, 7899040, 7625126, 7172745, 6941252, 6811859, 6657296, 7396218, 7271819, 6643001, 7131720, 7225272, 7423859, 7627174, 8030896, 7837569, 7410525, 7829733, 7926974, 7885529, 7371936, 7768981, 7924400, 7829475, 7926619, 8145238, 8562016, 8832063, 9636370, 10073720, 10507975, 10164066, 10431164, 10477340, 10762802, 10581249, 10355074, 10365731, 9649306, 9084203, 9634250, 9752855, 9528623, 9589147, 9703236, 9859413, 10398463, 9973053, 9543036, 9776970, 9873099]
4193I873099o9011J85483J71605N75056N03656n34714K93446M51157J00234K87055
4183A1837066j93598K80914l07518j68638l02084p3652O47532m63850l40399j52048
4173A0763725K31128n61340k2446j00911j141125l46063r8553M80608q9455p81765
4163H333803n9078q3838M36550P58664P3933o2218L97631j65216K57034o42244
4153I245021l80761L17880M7969j96037k15472M57030l26569o15332j51593P20278
4143H902414J89280k0213O64892J24139K10109j56762n92294m32554r23j26424
4133H761664M08930j010403l09302P73057P5085J54325j13913k97913N90232L38786
4123I370548j50241k21857n6361k93427J11190m22963l12154J38249l2322L2452
$$ y = [9873099, 9804088, 9989571, 10161176, 10736232, 11239888, 10705174, 10998620, 11449777, 11550011, 11837066, 11643468, 11924382, 11616864, 11448226, 11146142, 11072490, 11720022, 11256172, 10915773, 10763725, 10994853, 10433513, 10411067, 10310156, 9169031, 8822968, 8724415, 9205023, 9115568, 8333803, 8274725, 8190887, 8627437, 9386101, 9460034, 9397816, 9795447, 9630231, 9887265, 9245021, 8864260, 9182140, 9230109, 9034072, 8818600, 9275630, 8949061, 8333729, 8182136, 8902414, 9091694, 9071481, 9736373, 9860512, 10070621, 9913859, 9321565, 8889011, 8888088, 8761664, 9170594, 8160191, 7850889, 8623946, 8699031, 8853356, 8739443, 8441530, 9031762, 9370548, 9220307, 8998450, 8942089, 8648662, 8759852, 8336889, 8024735, 8162984, 8130662, 8163114]
4113H163114l65769J02022M01142P3807J65282K70702L58579K461K90482k85671
4103I176151O14781j4381k29681o51441j44853O58395o94308M33937O30891m046
4093I775445m00322K84192j35932j70686j7131K95873m15982J07577J6352k02546
4083I136840K17472j91765k87258j52488j09306R21030P62578L1598J69096l72015
4073A0125782p22090p7384L06654j37498l76481J84548j48867m90240L99789M65005
4063I529218m71890k8924K95327j44372l70832k42303J17826j23144q46682k18673
4053G495551L83390J023732R6645K99122J83540K79912j90052Q217M04123n59955
4043I424225m88577j51646j13821n59716L62591O25456M72339j22520l62413R46793
$$ y = [8163114, 7797345, 7899367, 8300509, 8374316, 8539598, 8810300, 9168879, 9171340, 9461822, 9176151, 9790932, 9776551, 9546870, 8895429, 8750576, 9408971, 8714663, 9148600, 9779491, 9775445, 9375123, 9659315, 9523383, 9352697, 9335566, 9631439, 9215457, 9323034, 9339386, 9136840, 9354312, 9162547, 8875289, 8722801, 8613495, 9534525, 10297103, 10328701, 10497797, 10125782, 9403692, 9326308, 9632962, 9495464, 9118983, 9303531, 9154664, 8664424, 9064213, 9529218, 9057328, 9028404, 9323731, 9179359, 8808527, 8566224, 8684050, 8560906, 7714224, 7495551, 7878941, 8902673, 8999318, 9298440, 9481980, 9761892, 9571840, 9580057, 9984180, 9424225, 8935648, 8784002, 8670181, 8110465, 8473056, 9098512, 9570851, 9448331, 9085918, 10032711]
4033A0032711M44731n26406J58962P4201N52726m54283j78773Q74185k7835n73882
4023A0376337J35438M18923k99852k74646M61649J71495m08638n45155K96552
4014A0332103J84494j07046P59314Q75819j9586o6715J051877N73754J82469k99700
4004A3466783j54768o84123n89170P6402r7985k16206n09468K03158O60523k72599
3994A1882547J67809L97924K1597l58963p27897k79125N91224J79829k10353N62918
3984A2227510l56352l84606m26695L87764N55304j3014J51067O3060J8070n63539
3974A1658569k98055M80284j13399p06828l6177R80212K14076l13765J76391R4121
3964A2135429m94536l45804J36538q37273Q0262M57595N86942n39917k43121R12335
$$ y = [10032711, 10477442, 9951036, 10109998, 10184199, 10736925, 10282642, 10103869, 10978054, 10950219, 10376337, 10511775, 10930698, 10630846, 10356200, 10817849, 10989344, 10580706, 10035551, 10332103, 10516597, 10409551, 11168865, 12044684, 12025098, 11958383, 13010260, 13584014, 13766483, 13466783, 13312015, 12627892, 12038722, 12115124, 12017139, 11800933, 11291465, 11494623, 12155146, 11882547, 12050356, 12448280, 12469877, 12110914, 11383017, 11103892, 11695116, 11874945, 11664592, 12227510, 11871158, 11486552, 11059857, 11447621, 12002925, 11989911, 12140978, 12204038, 12222108, 11658569, 11360514, 11840798, 11727399, 11020571, 10984394, 11964606, 12178682, 11864917, 12041308, 12135429, 11640893, 11295089, 11431627, 10594354, 10674616, 11132211, 11719153, 11179236, 10936115, 11848450]
3954A1848450K84304j77011j52514n81470j18588L25971k62208L77630J82792
3945A1727356j52470j60561L94675O91448J94917J07742K42074j66079o6256R3063
3935A2905909p62125j47169k44m21754L08439j68801L46818N62466j03319k90625
3925A2229595m0778M07640k47110l20416o1062L36320l61689o60002O41703Q57321
3915A2781522Q20325m09130k90647j55346o9501M2510J21500k50843J19242N01029
3905A3210661O13243j48490m58079N74207R90455J6192J13560j50318m59728O18710
3895A4920413M57457p33983n84968M03042N37956l8832k72938p40127M02676P40352
3885A5091048m02922m89264J44441K04815N65416K11875r20009n4927L44722j0367
$$ y = [11848450, 12132754, 11955743, 11803229, 11221759, 11103171, 11429142, 11166934, 11544564, 11727356, 11574886, 11414325, 11809000, 12500448, 12695365, 12803107, 13045181, 12879102, 12812846, 12905909, 12143784, 11996615, 11996371, 11574617, 11883056, 11714255, 12061073, 12623539, 12520220, 12229595, 12188817, 12596457, 12349347, 12028931, 11967869, 12304189, 11942500, 11282498, 11924201, 12781522, 13601847, 13192717, 12902070, 12746724, 12677223, 12719733, 12841233, 12590390, 12709632, 13210661, 13823904, 13675414, 13217335, 13791542, 14781997, 14798189, 14911749, 14761431, 14301703, 14920413, 15377870, 14643887, 14058919, 14461961, 14999917, 14961085, 14688147, 13948020, 14350696, 15091048, 14688126, 14198862, 14343303, 14548118, 15113534, 15325409, 14405400, 14350473, 14695195, 14684828]
3875A4684828l17760j55974l20353J78197J94598K14903n95396M58103O76457
3866A5017603m34415L48509Q6723J20735j16524n97554l4156M36427P08434M80686
3856A6016468L09683j57498k76564o0281J63514K45239p463M20814L27468k6273
3846A6955107N83420k907M36802M13290k05830J28504K28442P25725O88623n04635
3836A9446541R8879M49071N8001L19463L56437J57846j12571n8077L25697M88612
3826B1529899o2511M32192M68540j4490R9187N97616n4932q6865Q80569N23802
3816B4313007j05522l180J41791L59380M35570j70763J19912N58665J58154J99622
3806B6006636J13881O67897O31019J233515J70902l35733P82296Q50587m05427
$$ y = [14684828, 14367068, 14211094, 13890741, 14068938, 14263536, 14478439, 13883043, 14341146, 15017603, 14583188, 14931697, 15018420, 15139155, 15022631, 14425077, 14390921, 14827348, 15535782, 16016468, 16326151, 16168653, 15892089, 15831808, 15995322, 16240561, 16233098, 16653912, 16981380, 16955107, 17538527, 17535620, 17972422, 18385712, 18179882, 18308386, 18536828, 19262553, 19951176, 19446541, 19545420, 19994491, 20052492, 20371955, 20728392, 20886238, 20773667, 20715590, 21041287, 21529899, 21467388, 21899580, 22368120, 22353630, 22452817, 23050433, 22995501, 22908636, 23789205, 24313007, 24207485, 24204305, 24346096, 24705476, 25141046, 24970283, 25090195, 25648860, 25807014, 26006636, 26120517, 26788414, 27419433, 28652948, 28823850, 28488117, 29270413, 30121000, 29715573]
3797B9715573q1129J35523L35537J499821L32665O14863M52771Q61019Q46700
3788C4713343K70789N32730K52449P27723Q11015j77001J296025J416601R59667
3779D0803341J628036J513519J225283J892303K086679J731147J656559J783862
3771E4320729J355674J661661J428225J781448K089552K256945J622449K754019
3763F9270702L256004L578408M138833L954820M163775N253134N411575N761304
3755A04788555P231604Q982729R923961J2080429J5475978J9668680K4183103
3748B02335039K9390646L3206613L2676381K5962738J0453248p930046k7230949
3741B98863670l9377511l9505857l3688276k6098343j7992126j2639719q457091
$$ y = [29715573, 29634444, 29769967, 30105504, 31605325, 31937990, 32552853, 33005624, 33866643, 34713343, 34984132, 35516862, 35769311, 36497034, 37308049, 37131048, 38427073, 39843674, 40803341, 42431377, 43944896, 45170179, 47062482, 49149161, 50880308, 52536867, 54320729, 55676403, 57338064, 58766289, 60547737, 62637289, 64894234, 66516683, 69270702, 72526706, 76105114, 80243947, 84198767, 88362542, 93615676, 99027251, 104788555, 112020159, 121002888, 130926849, 143007278, 158483256, 178151936, 202335039, 231725685, 264932298, 297608679, 323571417, 334024665, 326094619, 298863670, 259486159, 219980302, 186292026, 160193683, 142201557, 129561838, 121104747]
3734A21104747p257335n628585n094911m122611k943972k165540j877929k349987
3726H9663877j276780q27525o11717j125843q27240m58383n1005L08300n92373
3717H4201311N07628Q16060J158553J003413J113606J435551J891619K622368
3709I4750109K439018K628460K910661L449175M491035M458693M372911M170194
3701A23670256M607864L162913K821321K320892J273171J050951R60489J464071
3693A41331928K682656L776207M566042N649000P347091Q548871J0183943J0447880
3685A94533618J1295235J2942307J5240658J7651350J9526992K3688570K6995715
3678C21874445L1557163L3056961K9153496J8010833L846804p986994k0245106
$$ y = [121104747, 113847412, 108218827, 103123916, 99001305, 96057333, 93891793, 92013864, 89663877, 88387097, 87559572, 86947855, 85822012, 84994772, 84536389, 84485384, 84793684, 84201311, 84708939, 85524999, 86683552, 87686965, 88800571, 90236122, 92127741, 94750109, 97189127, 99817587, 102728248, 106177423, 110668458, 115127151, 119500062, 123670256, 128278120, 131441033, 134262354, 136583246, 137856417, 138907368, 139867857, 141331928, 144014584, 147790791, 152356833, 158005833, 165352924, 173901795, 184085738, 194533618, 205828853, 218771160, 234011818, 251663168, 271190160, 294878730, 321874445, 353431608, 386488569, 415642065, 433652898, 437499702, 429512708, 409267602]
3671D09267602k9757036l2485472k8838021k2908882j6918683j3678673j3184043
3664B51496792j2657423j3292447j1988119j1307214j0705353r748864p649444
3657A74147928o468393n796630n176985m552936m044378m200543m768058m706925
3649A34433080m226245m538712m268883l896756l626244l359262l326131k747899
3641A04442948k242288k461667k238874j689978j614013j476229j975263j455785
3633H9288851j064242j298701j006137j705919j251355n07603q13446o58476q17637
3624H0165335k16995l00499j117054r15581m15024l02906k12675K61507j86765
3615G6759343m89035m12593O48062N63862n37216k27776J24630j60081o87040
$$ y = [409267602, 379510566, 347025094, 318187073, 295278191, 278359508, 264680835, 251496792, 238839369, 225546922, 213558803, 202251589, 191546236, 181797372, 174147928, 167679535, 161882905, 156705920, 152152984, 148108606, 143908063, 139140005, 134433080, 130206835, 125668123, 121399240, 117502484, 113876240, 110516978, 107190847, 104442948, 102200660, 99738993, 97500119, 95810141, 94196128, 92719899, 90744636, 89288851, 88224609, 86925908, 85919771, 84213852, 82962497, 82454894, 81641448, 80982972, 80165335, 79948340, 79647841, 78530787, 77615206, 77200182, 76897276, 76684601, 76946108, 76759343, 76270308, 75857715, 76505777, 77069639, 76532423, 76304647, 76429277, 76269196, 75582156]
3606G5582156j184187j360687j212302j759274j927663j230875j079337o14716
3598F5213115j211834j095403j008023n47928l44071o04953j04254m10787m22651
3589E9463211m55248m96980J9109m54735M91280J04554N4951L87323j78371q97188
3579E8037906j74352L97571l71564r50964o60099p94573r72367j070553n56281
3570E2884724O4301j379864k00164K2044P4844o95283m34233k69565j23363m35534
3560D9507907m45971j84621r36525q3936q02506p30375L27426j042629K65338
3551D5874108q02808l34280J21347l10331J9378m03807l51819K90093L63573q5248
3541D4380206n30205K4451m68166j86447Q4519q3148p11847M0732K34697n8242
$$ y = [75582156, 74397969, 73037282, 71824980, 70065706, 68138043, 66907168, 65827831, 65213115, 64001281, 62905878, 61897855, 61349927, 61005856, 60400903, 60296649, 59885862, 59463211, 59007963, 58510983, 58530092, 58075357, 58566637, 58671191, 58726142, 59113465, 58935094, 58037906, 57863554, 58261125, 57889561, 56938597, 56278498, 55483925, 54511558, 53441005, 52884724, 52949025, 51569161, 51368997, 51391041, 51465885, 50770602, 50336369, 50066804, 49943441, 49507907, 49061936, 48877315, 47940790, 47856854, 47054348, 46323973, 46651399, 45608770, 45874108, 45071300, 44737020, 44858367, 44548036, 44567414, 44163607, 43811788, 44101881, 44465454, 44380206, 43850001, 43874452, 43406286, 43219839, 43304358, 43221210, 42509363, 42550095, 42784792, 42726550]
3531D2726550k13668o73750K60918j1010K33383q69029m94870l52871j73421L44603
3521D0776835P3327j55521J70587l5074N21034o01845q1209N99350K71977k13394
3511D1326067L01403l04815p42430p5590r8316j89810k08921J84256R8375l57700
3501C9932519O0038l69529j34046r9981m23276r1427M00304L59141J43030Q7443
3491C9864216N81731j88503N22779p9211k17665L97438l86630K62134m28224j161750
3481C9166315j36144L96015J91697k74474L9909J10073Q73298J44516n72658n46744
3471C9391803L00512K05248R9761R9295n79623K50221J215633Q48298K4498L62495
3461D2218141N38000P28475L94990L93974j76756N20543P3369L46300J24301Q4696
$$ y = [42726550, 42512882, 41839132, 42100050, 42089040, 42322423, 41453394, 40958524, 40605653, 40432232, 40776835, 40850162, 40694641, 40865228, 40830154, 41351188, 40749343, 40668134, 41267484, 41539461, 41326067, 41627470, 41322655, 40580225, 40504635, 40406319, 40216509, 40007588, 40191844, 40290219, 39932519, 39992557, 39623028, 39488982, 39389001, 38965725, 38874298, 39274602, 39633743, 39776773, 39864216, 40445947, 40257444, 40780223, 40701012, 40483347, 40880785, 40494155, 40756289, 40328065, 39166315, 39030171, 39426186, 39617883, 39343409, 39383318, 39493391, 40366689, 40511205, 39938547, 39391803, 39692315, 39897563, 39997324, 40096619, 39516996, 39767217, 40982850, 41831148, 41855646, 42218141, 42756141, 43484616, 43879606, 44273580, 44096824, 44617367, 44690736, 45037036, 45161337, 45246033]
3451D5246033L14224L68004K52511O09919n8951O13030L11445P5393L18223L13047
3441D8362878M315L21904J05716J15274L3312j4701K58124q193K79367O61636
3431E0119632J50422P33732P39382J095750J095437O72305n06439k46047K85132
3422E4139306K27569j00151m92425L2473o14375N2469K38013M16106j28582N53162
3412E4323565J453519P22499m89377K83107q9433J74895l21304K38964k16190
3403E6080245k00765M53320P61617M96611M68851J018961J039487Q49797L38356
3394F1306480J049631N92541M12936Q04688N85468J132909J450900Q08903Q22687
3385F8967143J236766J229355J400760J023170Q16587J049679J531419J395690
$$ y = [45246033, 45560257, 45928261, 46180772, 46790691, 46731740, 47344770, 47656215, 47731608, 48049831, 48362878, 48367193, 48689097, 48794813, 48910087, 48943399, 48928698, 49186822, 49178629, 49457996, 50119632, 50270054, 51003786, 51743168, 52838918, 53934355, 54606660, 54100221, 53854174, 54139306, 54366875, 54266724, 53774299, 53806772, 53192397, 53244866, 53482879, 53898985, 53770403, 54323565, 55777084, 56499583, 56010206, 56293313, 56203880, 56378775, 56057471, 56296435, 56080245, 55879480, 56332800, 57094417, 57591028, 58059879, 59078840, 60118327, 60968124, 61306480, 62356111, 62948652, 63361588, 64166276, 64751744, 65884653, 67335553, 68144456, 68967143, 70203909, 71433264, 72834024, 73857194, 74673781, 75723460, 77254879, 78650569]
3377G8650569J376329R63561O53893N04413Q49354J370547J738097K142132J891927
3368I0140822J957039J982599K257199K605468L182348L440736L791982M475203
3360A13833396N406463P258046Q632769Q967201J2176009J3259022J3651425J4949064
3352A98133395J3487079P550547Q82857n370283j3469084j6615385j5885209j3044602
3344A55669315j0787205q797581o619671n696902l549902m008639k980966k565987
3336A10662462j963183j542754j84297L57414P5429J302165J920142K800543M260436
3327A17688357M401206N468143N938923N168318M456758K463738j396412n582092
3319A38606939p836824q870901r146614p957433o520000n652215m628182m411757
$$ y = [78650569, 80026898, 80990459, 81644352, 82148765, 82998119, 84368666, 86106763, 88248895, 90140822, 92097861, 94080460, 96337659, 98943127, 102125475, 105566211, 109358193, 113833396, 119239859, 126497905, 135130674, 144097875, 156273884, 169532906, 183184331, 198133395, 211620474, 219171021, 220053878, 214683595, 201214511, 184599126, 168713917, 155669315, 144882110, 136084529, 129464858, 123767956, 120218054, 116209415, 113228449, 110662462, 108699279, 107156525, 106972228, 107329642, 107405071, 108707236, 110627378, 113427921, 117688357, 122089563, 127557706, 133496629, 138664947, 143121705, 145585443, 144189031, 138606939, 130770115, 121899214, 112752600, 104795167, 98275167, 92622952, 87994770, 83583013]
3311H3583013l439830k670734l102502k874181k304758k988988j926934j635560
3303F2639526j502558k007292r19409m1735p87982j139376o32171k48043J25549
3294E5486509l52593K38732O05413p28273r3107K08825p99221j484173j239988
3285E1842124j087229j175921j809848j627401n3249p99452j093782r56078o0105
3276D3179059k84180p97434n69461o01444n81968m09314m13063k94962K22867
3267C9450100m29181l5970N5857p30560J50652J72225J9735j369634O41512P59386
3257C8684122l42617k01960k45431Q75022m62371k67138J65208k27228l09547
3248C7668060K80943L29160L21780j63518N37864K52534p799K70374N89441J8430
$$ y = [83583013, 80143183, 77472449, 74369947, 71495766, 69191008, 66202020, 64275086, 62639526, 61136968, 59129676, 58210267, 58168532, 57380550, 56241174, 55609003, 55360960, 55486509, 55133916, 55372648, 55978061, 55249788, 55156681, 55365506, 54566285, 53082112, 51842124, 50754895, 49578974, 47769126, 46141725, 46088476, 45289024, 44195242, 43239164, 43179059, 42894879, 42097445, 41527984, 40926540, 40344572, 39935258, 39522195, 39227233, 39450100, 39020919, 38984949, 39040806, 38310246, 38460898, 38633123, 38652858, 37283224, 37924736, 38684122, 38341505, 38139545, 37894114, 38769136, 38306765, 38039627, 38204835, 37977607, 37668060, 37949003, 38278163, 38599943, 38436425, 38974289, 39226823, 39219024, 39489398, 40078839, 40097269]
3238D0097269L88400m78231J171265J120994M1769j314o25326L75728L36676P69881
3228D3197111O7019k60968L82614L80590L16911k24808M97622J90254K34769k5460
3218D4755654n9868j5182K48645J57616l32772N9032j15053K8396P69294L3874
3208D5529636P29284O72449L47672J219360J522415J500123P50068J650490J223045
3199E5144542R78325R15593R98614K31090p68998j388377o28683n40460n31548
3190E4410098j620708j060412q20938j155348o29662o12187l87492K10590p42063
3181D7591878m22573L30049N27996Q93834N10460N21337J54736J07879N17279
3172E0732875O97461O24325M63143L97327Q03624J082794J117563J618195N65581
$$ y = [40097269, 40485669, 40007438, 41178703, 42299697, 42341466, 42340152, 41714826, 42090554, 42427230, 43197111, 43264130, 43003162, 43385776, 43766366, 44083277, 43858469, 44356091, 44546345, 44781114, 44755654, 44695786, 44680604, 44929249, 45086865, 44754093, 44813125, 44698072, 44726468, 45495762, 45529636, 46258920, 46931369, 47279041, 48498401, 50020816, 51520939, 52271007, 53921497, 55144542, 56122867, 57038460, 58037074, 58268164, 57499166, 56110789, 55482106, 54941646, 54410098, 52789390, 51728978, 50908040, 49752692, 49123030, 48510843, 48123351, 48333941, 47591878, 47169305, 47499354, 48027350, 48921184, 49431644, 49952981, 50107717, 50215596, 50732875, 51430336, 52054661, 52517804, 52915131, 53718755, 54801549, 55919112, 57537307, 58102888]
3163E8102888J181811J492154J365393P75224O37395O10786N33110M93033J68978
3154F5360772P68123Q27282J272394Q84667j63850p65533O89042M98879o91470
3145F8680306r739M28542j9135N6255K64986K45855Q37236J588099O89943M13781
3135G3176129L47388J413012m99928k9790m26416n97682P29005L93135k77332
3126G4227521J391765J360177J817875J727262Q86850K610531J707258J282100
3118H7011339J041163K39753Q03659J053689O21711J000212K42906J454122J794860
3109I5263414K587876K109795K673425L449548L650705L807888L942225N065372
3101A22550248O172365O795147P632297Q918808J0187364J1627613J3331606J3664069
$$ y = [58102888, 59284699, 60776853, 62142246, 62917470, 63554865, 64165651, 64698761, 65191794, 65360772, 66128895, 66956177, 68228571, 69113238, 68949388, 68183855, 68872897, 69371776, 68680306, 68670567, 69099109, 69079974, 69136229, 69401215, 69647070, 70484306, 72072405, 72762348, 73176129, 73523517, 74936529, 74436601, 74406811, 73980395, 73382713, 74111718, 74504853, 74227521, 75619286, 76979463, 78797338, 80524600, 81411450, 84021981, 85729239, 87011339, 88052502, 88292255, 89095914, 90149603, 90771314, 91771526, 92014432, 93468554, 95263414, 97851290, 99961085, 102634510, 106084058, 109734763, 113542651, 117484876, 122550248, 128722613, 135517760, 143150057, 152068865, 162256229, 173883842, 187215448, 200879517]
3093B00879517J5293195J6068106J3622367Q936490M362775K950424M66810k8327
3085B62551357L12605Q34339L326713O229592Q022163R623343R339140O427719
3077C06666971K568672m040483j0525794j4790156j6844780j7313410j6407179
3070B29313841j5180493j3203246j2420531j1935924j1264504j0929937q415338
3063A45963868q237914p649768o705911o266671n625618l594129m160446m785171
3055I8938240l512750l818265l315044k874660l109338k415777j807514k436056
3047G5648836k568019j644354j317455r97976j177388o92070m35729N17738M62350
3038F7795933j32666l41376q87008j243015j793114k633585l096224k148890j343301
$$ y = [200879517, 216172712, 232240818, 245863185, 254799675, 259162450, 262112874, 262579684, 262551357, 262863962, 263698301, 267025014, 273254606, 281276769, 290900112, 300239252, 306666971, 309235643, 305195160, 294669366, 279879210, 263034430, 245721020, 229313841, 214133348, 200930102, 188509571, 176573647, 165309143, 154379206, 145963868, 137725954, 130076186, 123370275, 117103604, 111477986, 107883857, 103723411, 98938240, 95425490, 91607225, 88292181, 85417521, 82308183, 79892406, 78084892, 75648836, 73080817, 71436463, 70119008, 69121032, 67943644, 67251574, 66815845, 67333583, 67795933, 67663267, 67321891, 66434883, 65191868, 63398754, 60765169, 57668945, 55520055, 54176754]
3029E4176754k063369j618386j642050j739813J96926o49873r86165l46048n45878
3020D4782098j418680j123546r73064l90437l63521j012658o1130n95790l1911
3011C8811361k83671o1820P66653P8733L95412l45265J4812L7871p19238j298194
3001C7396654j498424j316396j182834r28066q85924n76603m14753j209413j240680
2992B8143561p75973k56563q08285k49333j362975k06925q3936j238835m78311
2983B2682425j94283o65758k70922L14666M0888k44571n40172p98426m02189j119285
2973A8802373r38741j76367L3400j62388m09747M56182J30284l16633N82581m10712
2963A7590232r08414j58771l47690j8507l74257j64696M27290r03031p94924P94462
$$ y = [54176754, 52113385, 50494999, 48852949, 47113136, 47310062, 46660189, 45674024, 45327976, 44782098, 43363418, 42239872, 41266808, 40876371, 40512850, 39500192, 39439062, 38843272, 38811361, 38527690, 38465870, 39232523, 39311256, 39706668, 39361403, 39376215, 39414086, 38694848, 37396654, 35898230, 34581834, 33399000, 32470934, 31585010, 31008407, 30593654, 29384241, 28143561, 27367588, 27111025, 26302740, 26053407, 24690432, 24483507, 24399571, 23160736, 22682425, 22488142, 21822384, 21551462, 21866128, 21907016, 21662445, 21122273, 20323847, 19921658, 18802373, 17863632, 17687265, 17720665, 17558277, 17148530, 17604712, 17734996, 17418363, 18000944, 17590232, 16681818, 16523047, 16175357, 16156850, 15782593, 15617897, 16045187, 15142156, 14347232, 15141694]
2953A5141694K90317m4212m09902j75814J32022K35979m67169l00002n72068l06817
2943A3524028l55164k13572p2159m69692m89106J11711k31127o47110M53371J92422
2933A1803602J55779l11212K52099Q80922k35133j356638l08888J343117p38718
2924A1484930l66012m24678q8603m30064n8324J59677m78972k3303L7330L66123
2914A0178104L32661L20982J35217o19210n67941j06384P96999p72307q53492
2905H844629R9700l38487L21166L47214K22608k21343n27048o43220O28802J72881
2895H906902n52969j63220k72144o74836N04129o12j76399M32146M2812J31827
2885H177636j92431l88672m98294m72730K0364o09185Q97887O85781l26901p44527
$$ y = [15141694, 15432011, 15387799, 14977897, 14802083, 14934105, 15170084, 14702915, 14402913, 13830845, 13524028, 13168864, 12955292, 12883133, 12413441, 11924335, 12036046, 11804919, 11157809, 11611180, 11803602, 11959381, 11648169, 11900268, 12781190, 12546057, 11189419, 10880531, 12223648, 11484930, 11118918, 10694240, 10605637, 10175573, 10117249, 10276926, 9797954, 9774651, 9811981, 10178104, 10510765, 10831747, 10966964, 10347754, 9779813, 9673429, 10470428, 9698121, 8844629, 8944329, 8605842, 8927008, 9274222, 9496830, 9275487, 8748439, 8105219, 8734021, 8906902, 8353933, 8190713, 7918569, 7243733, 7747862, 7747250, 7570851, 8002997, 8045809, 8177636, 7985205, 7596533, 7098239, 6625509, 6645873, 6036688, 6934575, 7620356, 7293455, 6548928]
2875F548928P3811J175863J22980o91970l88164M25947j2430n4633n52133k54803
2865F393396k75637M7189j1081j31836L61596N96768O70000p1145l73089M21045
2855G627206r74p92310l75777j67699o9472R5148K66529j0461j25429n5570N33120
2844F924311k20422m64948N0733L67947P86142j47991l45712m8189M3847k55600
2834F690118j09075P87180J94943J89592K67443J87719K18214k87933J20702N7421
2824H316324N82368k30973o8077L72425l22272l70448m5258q5563K1944n43979
2814G626491j56069n86960L09339k86272l44547m82642r2314l03470j50338j85212
2804E348006L26564O9649j096708k88101K43557K26070j34769k55324Q3163N93337
$$ y = [6548928, 6622739, 7798602, 7921582, 7229612, 6841448, 7267395, 7254965, 7200332, 6648199, 6393396, 6117759, 6164948, 6153867, 6022031, 6383627, 6980395, 7650395, 7579250, 7206161, 7627206, 7626232, 6833922, 6458145, 6290446, 6220974, 6316122, 6582651, 6572190, 6446761, 6391191, 6924311, 6703889, 6238941, 6289674, 6657621, 7443763, 7295772, 6950060, 6901871, 6945718, 6690118, 6581043, 7368223, 7563166, 7752758, 8020201, 8207920, 8426134, 8138201, 8258903, 8316324, 8898692, 8667719, 8599642, 8972067, 8649795, 8279347, 8234089, 8148526, 8170470, 7626491, 7470422, 6883462, 7192801, 6906529, 6561982, 6079340, 5987026, 5683556, 5533218, 5348006, 5674570, 5744219, 4647511, 4359410, 4602967, 4829037, 4694268, 4438944, 4522107, 5115444]
2794E115444j77363K0984n06194J24161l55972j71666m36137K06828j52396J12201
2784C779890K08166M87859k00164J96329L47390K52502l462q38513k10591J73137
2774D192543J74524k77775p50257J2318O2526O04045K14344L91110N01765L86172
2764E511315n2263m30246p4155J31017j0466o09330j60228q5601p40600m50335
2754C029108m25111K22414J26779O67226N5168m3813L5527Q7803l26808m58961
2744B969332o6960J96820q449L46599m02476n24269O45669o31616k05739M5653
2734B364564k3126P8183O56327l26768N19931n03170r6675M6855l68657j99205
2724B148259L6344J66772n07215K87466o4156m15157l35378j80381J63677k34068
$$ y = [5115444, 4938081, 4959065, 4452871, 4577032, 4221060, 4049394, 3613257, 3820085, 3667689, 3779890, 3988056, 4475915, 4275751, 4472080, 4819470, 5071972, 5068510, 4229997, 4019406, 4192543, 4367067, 4089292, 3339035, 3351353, 3413879, 4017924, 4232268, 4623378, 5125143, 5511315, 5459052, 5028806, 4954651, 5085668, 5075202, 4465872, 4305644, 4220043, 3479443, 3029108, 2603997, 2826411, 2953190, 3620416, 3675584, 3631771, 3667298, 3755101, 3428293, 2969332, 2902372, 3099192, 3090743, 3437342, 3034866, 2510597, 3156266, 2524650, 2318911, 2364564, 2341438, 2419621, 3075948, 2749180, 3269111, 2765941, 2669266, 2716121, 2347464, 2148259, 2184603, 2351375, 1844160, 2131626, 2067470, 1652313, 1316935, 1136554, 1300231, 1066163]
2714A066163O95498K34401K84781l4378j44294r3016l07786n87665n11831Q2745
2704F84618M37328R24607l1238o91057J34689L53827L41795L43045j45504l9051
2694B313059L9678m09508k01101n19210R7666J97999k49911k6934k20823R7720
2684A118635N92561K49592L1624l25745k23510R8946K96720p86641r9261L63837
2674A316758O3524k1008o17852J97188O69569P22987m21600r53940L85082J52469
2664A493177J46937n17363l88684L76928M11573O0014q47224l56718O8942P75201
2654A222783l24055q09094k4034J154857K27067j62776J88858q61542J70732N9160
2644H41956L76705p04901k79930K63930l4391O37536m32128P56868p4474m3063
$$ y = [1066163, 1761661, 1996062, 2280843, 2246465, 2102171, 2009155, 1701369, 1113704, 601873, 684618, 1121946, 2046553, 2015315, 1324258, 1458947, 1812774, 2154569, 2497614, 2352110, 2313059, 2352737, 1943229, 1742128, 1222918, 1320584, 1518583, 1268672, 1241738, 1020915, 1118635, 1711196, 1960788, 1992412, 1666667, 1443157, 1542103, 1838823, 1052182, 952921, 1316758, 1380282, 1359274, 741422, 938610, 1608179, 2331166, 1909566, 955626, 1340708, 1493177, 1640114, 1122751, 734067, 1110995, 1522568, 1582582, 735358, 378640, 447582, 1222783, 898728, 89634, 65600, 1220457, 1447524, 1284748, 1473606, 612064, 782796, 841956, 1218661, 513760, 233830, 497760, 463369, 1100905, 668777, 1425645, 1351171, 1308108]
2634A308108k63751k34015L4042K01581J93503n04274p27387J74111O31380l5235
2624G78063o42216l30459R5404J46611N92672m32994K81141J72361j65587K83655
2614G78651j37381J639M46845M7717m24409q94789M40429Q95912l96788j02711
2604F55115M2586r4690O88718j64211m23645j93782j44477J5696N707q87682l24006
2593h24671J006826L19146J27377o98290N64279O6385J11818K43890l58473l89421
2583A68866j33436N02814N913l77160K65225J15655L75067J2409M32309K96228
2573A663890L64735o19639r35716p1150M82049n73309j09634O14424N98151l60683
2563A053118l49110J71930k23246m55111j71485L93849j60087k15306l9826j28369
$$ y = [1308108, 1044357, 810342, 844384, 1045965, 1239468, 735194, 7807, 181918, 813298, 778063, 135847, -194612, -99208, 47403, 640075, 207081, 488222, 660583, 494996, 778651, 641270, 642909, 1089754, 1137471, 713062, -181727, 258702, 1154614, 757826, 655115, 697701, 603011, 1291729, 1127518, 703873, 510091, 365614, 381310, 387017, -500665, -824671, 182155, 501301, 628678, -69612, 494667, 561052, 672870, 916760, 558287, 168866, 35430, 538244, 544157, 166997, 432222, 547877, 922944, 935353, 1367662, 1663890, 2028625, 1408986, 473270, 402120, 884169, 310860, 201226, 815650, 1413801, 1053118, 704008, 875938, 652692, 197581, 26096, 419945, 259858, 44552, 4726, -123643]
2553a23643K55645K3016j21915j09351N81840K77378k02180j24610k20338M69897
2543G05739J41362k97002j011012P67737J061761k01004o23267K14451L71416
2534A130181N41018m92171p64349l10526M67621j07917J35536p33220j73495N33895
2524B26573L74256m85437n8616N5220J26298N11460L3414l66499j3008J21106
2514E24767j91958n83813n88592K17375Q42308J51752j84038r3915K56707L70463
2504G21056j24649K38791q00154L53415K17476o59963l1042M77584N74931j24773
2494H42672p73792l85064N59794O79677o08877q85090M54342M46844L54570L45658
2484A030734p06199K73654L85773m1768l10864j025529K22391J040082o1207l94680
$$ y = [-123643, 132002, 155018, 33103, -76248, 505592, 782970, 580790, 456180, 235842, 705739, 847101, 550099, -460913, 306824, 1368585, 1167581, 544314, 758765, 1130181, 1671199, 1179028, 414679, 104153, 571774, 463857, 599393, -133827, -307322, 226573, 600829, 115392, 56776, 111996, 238294, 749754, 783168, 416669, 403661, 524767, 332809, -251004, -839596, -622221, 220087, 371839, 187801, 93886, 350593, 721056, 596407, 835198, 35044, 388459, 605935, -54028, -85070, 392514, 967445, 842672, 68880, -316184, 243610, 923287, 314410, -570680, -116338, 330506, 685076, 1030734, 324535, 598189, 983962, 942194, 631330, -394199, -171808, 868274, 807067, 412387]
2474D12387o53241L45016O33374j95319K97831J65153k24276k85400J13140Q2627
2464F91292j11580k48816j96595K00471o91035N17215K60733J42418J45796n96402
2454A13497J26783J26932j35795n01306J62395M4686k79396J49205j40229j73595
2444e06823J24485O00446p1796m78911O63940P79199J05320n43192k79456J170
2434C94382j54387k53619K84673m91682m96483P91654L63689l72787n3652K59802
2424B71590K39514J63615o60282p70609j08608N49330j93732m87974o1720m19265
2414a478141J44807Q21102P39871k72707K19693O5937L03948j07720n47491j24935
2404b35636N2518o58456J82047J024166K37560L4814r2336K43194l93998J20104
$$ y = [412387, -240854, 104162, 737536, 542217, 840048, 1005201, 780925, 495525, 608665, 691292, 579712, 330896, 134301, 334772, -356263, 160952, 421685, 564103, 709899, 113497, 240280, 367212, 231417, -269889, -107494, -62808, -342204, -192999, -333228, -506823, -382338, 218108, 146312, -332599, 331341, 1110540, 1215860, 672668, 393212, 394382, 239995, -13624, 271049, -220633, -717116, 74538, 438227, 65440, 11788, 271590, 511104, 674719, 14437, -756172, -864780, -315450, -509182, -997156, -1058876, -1478141, -1333334, -512232, 227639, -45068, 174625, 240562, 544510, 436790, -110701, -235636, -183118, -841574, -659527, 364639, 602199, 637013, 544677, 787871, 393873, 513977]
2394E13977L31837l9932K90295o24712k72712j22972p70771J97998O64747j89098
2384b1343p78278M49173R15702N39873K15458o19695l58987m7489l4427J92783
2374D52770l28745J30084L3184O28933n3740j03651j57330J47905M22935n2087
2364A120258J56293k79319J96333o1876k71304o32074p71153N50619K38945j32649
2354A14073l25598L60022K17180J16668j37781l27696K34862O8471k24276j78654
2344h2729J52834k25283k73146k13896N62538M52616J91280l62077j97256P04789
2334G09670l0281k34337n07773n0570M50238O57213l76596n14800J87446n33543
2324b43333j05271k84587L48903n7000L05699l58303L08977M77166o629n16315
$$ y = [513977, 845814, 805882, 1096177, 471465, 198753, 75781, -694990, -496992, 167755, -21343, -799621, -350448, 565254, 1105127, 1320585, 700890, 341903, 294414, 259987, 452770, 124025, 254109, 287293, 916226, 862486, 758835, 601505, 749410, 1172345, 1120258, 1276551, 997232, 1193565, 1131689, 860385, 228311, -542842, 7777, 246722, 114073, -211525, 148497, 365677, 482345, 344564, 16868, 251730, 320201, 95925, -82729, 70105, -155178, -428324, -642220, -79682, 372934, 564214, 202137, 4881, 709670, 679389, 445052, -62721, -113291, 336947, 994160, 617564, 102764, 290210, -243333, -348604, -633191, -284288, -341288, -35589, -393892, -84915, 392251, 385622, -130693]
2314a30693J43275K61052m73385O78727l80132n43716k54947J81372Q80901K84879
2304F47333J2645K96411r2535j34151k76982l7803j71100J41726l31917J34562
2294A88189l8557q1301M16421M24376M68543k08001m1511j03890m49001l27957
2284B47311O6662K80514k38884l20954J51295O57580K82790n28913j26018N97603
2274A068986O95853J74582j29369p17355K5869L8013p77897m79896L4753N87812
2264E21351K27744j61295K76834M42543L85348n87978r9748K07994j87475O24925
2254A650243m14303r6676j65740n56363k49394M59015M33654L31756j30317n28993
2244G32882m65171K49371O17646J8313n16284j96500N58323p65163J38525M45021
$$ y = [-130693, 12582, 273634, -199751, 478976, 98844, -444872, -699819, -518447, 362454, 647333, 659978, 956389, 863854, 729703, 452721, 414918, 243818, 385544, 53627, 188189, 149632, 68331, 484752, 909128, 1377671, 1169670, 1128159, 1024269, 575268, 247311, 313973, 594487, 355603, 34649, 185944, 843524, 1126314, 597401, 471383, 1068986, 1764839, 1939421, 1810052, 1092697, 1118566, 1156579, 378682, -101214, -66461, 521351, 749095, 587800, 864634, 1307177, 1692525, 1104547, 1004799, 1212793, 1025318, 1650243, 1235940, 1139264, 973524, 417161, 167767, 626782, 1060436, 1392192, 1261875, 732882, 267711, 517082, 1134728, 1153041, 636757, 440257, 998580, 233417, 371942, 816963]
2234H16963M94688J93667l50412O2283L30909l27248J851M20268l76818n19911
2224G46240Q44738J2818l7668j51421r2730Q0982l09222K18214j26722k57948
2214I27281l21267M87509K76799j91497J31651N21781N58479n14889m58197J2939
2204A430589Q31033j28083k48139P4770M26630K27808m89278p1807K51235M36204
2194B740962J8747k55543O0452J07363K06124L41155n16412o31945K17434M92067
2184B780404n43850L91438k0975J36562l17793N99966K20772l69213q62209J6540
2174B031642N33925q1455J95801j6925N84576K98020K56642M88967n4532j39032
2164D097629m32532K4659j92976n31240K95954M13543k01895J30644O16049M13132
$$ y = [816963, 1311651, 1505318, 1154906, 1217189, 1548098, 1220850, 1222701, 1642969, 1266151, 746240, 1590978, 1603796, 1566128, 1414707, 1321977, 1402959, 1093737, 1311951, 1185229, 927281, 606014, 1093523, 1370322, 1178825, 1310476, 1832257, 2390736, 1875847, 1417650, 1430589, 2261622, 2133539, 1885400, 1960170, 2386800, 2614608, 2125330, 2053523, 2304758, 2740962, 2759709, 2504166, 2564618, 2671981, 2878105, 3219260, 2702848, 2070903, 2288337, 2780404, 2236554, 2627992, 2607017, 2743579, 2425786, 3025752, 3246524, 2877311, 2015102, 2031642, 2565567, 2484112, 2679913, 2662988, 3247564, 3545584, 3802226, 4291193, 4236661, 4097629, 3665097, 3689756, 3496780, 2965540, 3261494, 3675037, 3473142, 3603786, 4219835, 4632967]
2154D632967L38114k09949O29075J33870m86342r58824M0250J49479N4683L53728
2144D677051M34944j17921J71099Q30374K468M1197P60322N25360K9283n55721
2134F798456n73013K62489J24398l5081P78358J91727j71774P15151J013911O9386
2124I174008L0075L96069N55862K27745p18879J16491M74480J58927p80134K349
2114I636993M99650n98145Q2551K31552p67292m07218J15686r26582j241723K3470
2104F648942j13645P0685n75185m15668Q15220K24703o90368j006612j4463k53385
2094D690224m23257N5045o04165L90418N8540L1703l5567K07429J037980M46931
2084E855281k58616m68187M93258q7716K27441O45273M77598J17531J79756K63261
$$ y = [4632967, 4971081, 4761132, 5390207, 5524077, 5037735, 4078911, 4119161, 4268640, 4323323, 4677051, 5111995, 4994074, 5165173, 5995547, 5998015, 6039212, 6799534, 7324894, 7354177, 6798456, 6225443, 6487932, 6612330, 6577249, 7355607, 7547334, 7375560, 8090711, 9104622, 9174008, 9204083, 9600152, 10156014, 10383759, 9664880, 9781371, 10255851, 10414778, 9634644, 9636993, 10136643, 9538498, 9621049, 9852601, 9085309, 8678091, 8793777, 7867195, 6625472, 6648942, 6535297, 6605982, 6030797, 5615129, 6430349, 6655052, 5964684, 4958072, 4943609, 4690224, 4266967, 4322012, 3717847, 4108265, 4166805, 4198508, 4162941, 4370370, 5408350, 5855281, 5596665, 5128478, 5621736, 5534020, 5761461, 6406734, 6884332, 7001863, 7181619, 7444880]
2074G444880m12078n60651j497439L5221P1620m50274n89262j054688j81517o9528
2064B736284j42339M80056M52703m50427n68965M4943K63495l26573k25672r4291
2054B169214k97721p9107P7435n1987j62854M31087O98007Q13563P25071m20921
2044C901787l68077L16989n77128q43737k21838o65451L7427j63560r95517L24234
2034G45129N18737P32340P5390J19509j33670l08820J95237p74151n21922J01890
2024G49669o66548j7042O86443J88815j86176k223L03495L01576M99458l47304
2014A510163k58424P26j60320n74237M71893o44517k24915J22927k14126R35670
2004I64840N02072k21749n98592J92077L70950j05349J67179j066892P3122J67552
$$ y = [7444880, 7032802, 6472151, 4974712, 5009933, 5081553, 4631279, 4042017, 2987329, 2805812, 2736284, 2593945, 3074001, 3526704, 3076277, 2507312, 2552255, 2815750, 2489177, 2263505, 2169214, 1871493, 1792386, 1869821, 1817834, 1654980, 2086067, 2784074, 3597637, 4322708, 3901787, 3533710, 3850699, 3273571, 2429834, 2207996, 1542545, 1579972, 1416412, 420895, 745129, 1263866, 1996206, 2071596, 2191105, 2057435, 1748615, 1943852, 1169701, 647779, 749669, 83121, 66079, 752522, 941337, 755161, 752938, 1056433, 1358009, 1857467, 1510163, 1251739, 1252465, 1092145, 517908, 989801, 345284, 120369, 243296, 29170, 964840, 1466912, 1245163, 646571, 838648, 1209598, 1104249, 1271428, 204536, 277658, 445210]
1994D45210M36287p51919J7596K49663k62926K64187j67580p0482L83844j3677
1984E30203l87698M55557J73558J65900l87723j076642K77853Q21780k57566m4266
1974B70956l79950l23690l8781P90013p2495l16167J52558K22500N27569m6479
1964G86034q20193j2795J235991n51784r35441M09864M32984P703N9093p54028
1954a42572o28624K87601K27548K54161J47845j21570m10386M86945l93290O6287
1944b26055K74671L51016l1682O0829L59641m56486J25350l41181j017286K26182
1934f75001L74136l8711k33251k13181L31699M09746J60130l45370J88760K43727
1924B02684M0880l7267o78218L7769L32489n2725l80738j14370n17147N74737
$$ y = [445210, 881497, 129578, 147174, 396837, 133911, 398098, 230518, 160036, 543880, 530203, 142505, 598062, 771620, 937520, 549797, -526845, -248992, 572788, 315222, 270956, -108994, -432684, -471465, 318548, 246053, -70114, 82444, 304944, 832513, 786034, -34159, -46954, 1189037, 637253, -298188, 111676, 544660, 552363, 611456, -142572, -771196, -483595, -256047, -1886, 145959, 24389, -385997, 100948, -292342, -226055, 48616, 399632, 367950, 428779, 788420, 331934, 457284, 116103, -901183, -675001, -300865, -339576, -572827, -786008, -454309, -44563, 115567, -229803, -41043, 202684, 243564, 206297, -471921, -434152, -101663, -154388, -535126, -649496, -1166643, -591906]
1914e91906P17823L97806j74713j31074K53681j7891M87414r38710r4432N61828
1904D69826m89098l12621l99901o4923M35008N83573k93425l62958O71058L99261
1894F35800k86395r5706j19161k22660n6085n41924l46875K49826L37655O07799
1884A62274K43676k16463K83493O85281l72904m31089K63418l7074k52209l08255
1874B0148l12495J07314J14226k19976n7957Q4074R9321N22843M89876N846l29551
1863E23669R755p4415L73196l37096r14300k88254L08935l00633n96333l86580
1853a682056L48752Q70257N50055k35921J45627N12610J00657Q7548o10390j73024
1843h5885N30123o07575r48225k99086L48453Q28422L5768P8190j84425M15524
$$ y = [-591906, 125917, 523723, 349010, 217936, 471617, 453726, 941140, 2430, -92002, 469826, -19272, -331893, -731794, -796717, -361709, 221864, -71561, -434519, 236539, 635800, 349405, 253699, 134538, -88122, -144207, -686131, -1033006, -783180, -445525, 162274, 405950, 189487, 472980, 1158261, 785357, 354268, 617686, 580612, 328403, 20148, -292347, -185033, -70807, -290783, -348740, -264666, -165345, 357498, 847374, 853220, 523669, 533424, 459009, 832205, 495109, -419191, -707445, -398510, -699143, -1295476, -1682056, -1333304, -463047, 87008, -148913, -3286, 509324, 609981, 697529, 87139, -85885, 444238, -163337, -1111562, -1410648, -1062195, -233773, -198005, -119815, -304240, 111284]
1833A11284M78371R6603k88426P6852K36527k46485o39618l08289M64545L74896
1823C56260k45716m5510M04510N7129N5796K37582q36305N87007L00060J16594
1813I87407k66211m30002q3937L42908p92258m70582O80944M78992l74879N27350
1803E99732K86893n90561L37613O56875q8278j28770n70709r142O63953n62882
1793E94724l37724R2621Q77675k77899p80496J73365M60122N77742j87625k62050
1783I30455O4252P28452N95708j23395n27862l00242N27352L99205q33572J75637
1773A635990J85010n21586m48067M64261Q04320m01425J40055K75428N50822J56060
1763B840868m03956P9285K64270m33213k12921K42590n0934j78311J57872l83620
$$ y = [111284, 589655, 686258, 397832, 474684, 711211, 464726, -174892, -483181, -18636, 356260, 110544, 65034, 469544, 526673, 582469, 820051, -16254, 570753, 870813, 987407, 721196, 291194, 207257, 550165, -242093, -712675, -31731, 447261, 72382, 599732, 886625, 296064, 633677, 1290552, 1202274, 1073504, 502795, 493653, 1157606, 594724, 257000, 349621, 1227296, 949397, 168901, 342266, 802388, 1380130, 1192505, 930455, 994707, 1723159, 2318867, 2195472, 1667610, 1367368, 1894720, 2293925, 1460353, 1635990, 1821000, 1299414, 851347, 1315608, 2119928, 1718503, 1858558, 2133986, 2684808, 2840868, 2436912, 2516197, 2780467, 2347254, 2134333, 2376923, 2325989, 2147678, 2305550, 1921930]
1753A921930K36285k61454o5889J47202K42680o6923o654k1059p28568J22140
1743A519690O2780N74486J04075j1118N14601j58437J52700l72198m9717k34840
1733B102022j16774j7681J05190j11640m1422O27698k80265l35983R21079k22112
1723B630112k27914p58828M2472m72831m53294k92424K76957L62700j75168J153839
1713B085621J16474L93395k45440j72618L73162l94761r08379o15615K78324m84897
1703D25266j55648L7452N93148p3793J36565O14614j49940r4856K42798j37850
1693A437756m64667o14502l92987K49052j49618o8424L66976j95822p4294N20570
1683F14040p2710J05930j92326J626j16739n64200p2551L33386J58746j99933
$$ y = [1921930, 2158215, 1896761, 1830872, 1978074, 2220754, 2153831, 2147177, 2126118, 1397550, 1519690, 1582470, 2156956, 2261031, 2249913, 2764514, 2606077, 2758777, 2386579, 2336862, 2102022, 1985248, 1967567, 2072757, 1961117, 1919695, 2547393, 2267128, 1931145, 2852224, 2630112, 2402198, 1643370, 1685842, 1213011, 759717, 467293, 744250, 1106950, 931782, 2085621, 2202095, 2595490, 2350050, 2177432, 2550594, 2155833, 1247454, 631839, 910163, 425266, 269618, 307070, 900218, 826425, 962990, 1577604, 1427664, 1332808, 1575606, 1437756, 973089, 358587, -34400, 214652, 65034, -3390, 363586, 167764, 93470, 614040, 541330, 647260, 454934, 456560, 339821, -224379, -296930, 36456, 195202, -4731]
1673d731k89558L63193J73139p67754k22802M22342K67756k51967J27955K24672
1663D2245l80766l15893K11785P94706n77977k76371j5579N30648J00680m66166
1653c52688l40359k30530j19930J6147N75049O1735j39475N39047j93614k9914
1643b14532L27330K94431k43063P5846N48n57837m2999j013318r5707J28538N16872
1632h23891J68393M1373O61482m3918J5960k22617O12467m65015r1504k77597
1622d24867J66007k20315m05941M93243o867m97842k49466L91411O32388M06938
1612B84689j1542k09680l69412l60315K09676l36367k88471o20545O621P00478
1602i94868j8945K11399L54957K41547P22618m95059o38916m41240j04852R4207
$$ y = [-4731, -294289, 68904, 242043, -525711, -748513, -326171, -58415, -310382, -182427, 42245, -338521, -654414, -442629, 352077, -225900, -502271, -517850, 12798, 113478, -352688, -693047, -923577, -1043507, -1027360, -452311, -390576, -530051, 8996, -184618, -214532, 112798, 407229, 164166, 240012, 240560, -317277, -360276, -1373594, -1469301, -1340763, -823891, -655498, -614125, 47357, 3439, 19399, -203218, 409249, -55766, -147270, -424867, -258860, -479175, -885116, -391873, -398740, -896582, -1146048, -754637, -122249, 284689, 273147, 63467, -305945, -666260, -456584, -792951, -1081422, -1701967, -1695346, -994868, -1013813, -802414, -447457, -205910, 516708, 21649, -617267, -1058507, -1163359, -1069152]
1592a069152j41790M37776j20392K78500j40016K29633K78588J36879k68562l09938
1582f88474m70318L32749K38251p27472L35512L05753j06024K98135J05088J33534
1572b43266N8479P0857k28905M9949n93790n45434j24056M40459l4162k71067
1562a420936P98515r290P6984l0489l89788L57202J91266j45858m16242k80767
1552a269403n87958M26490P12932l70087k78306O11411N44566m47617o07010L28270
1542i36712K25700L39817j90757j89025p30609Q780K99845O35016n7237o17233
1532a212415M45980Q636M06327M74369l69683Q9946m24836j94274m05759J24480
1522a057229J71418j75474K95781m51073K37173Q45368K10028k48864l15875l29563
$$ y = [-1069152, -1210942, -773166, -893558, -615058, -755074, -525441, -246853, -109974, -378536, -688474, -1158792, -826043, -587792, -1315264, -979752, -673999, -780023, -481888, -376800, -243266, -184787, -113930, -342835, -292886, -886676, -1432110, -1556166, -1115707, -1149869, -1420936, -622421, -631711, -554727, -585216, -975004, -617802, -426536, -572394, -988636, -1269403, -1857361, -1430871, -717939, -1088026, -1366332, -754921, -210355, -657972, -1264982, -936712, -711012, -371195, -561952, -750977, -1481586, -1472806, -1172961, -537945, -595182, -1212415, -766435, -757799, -351472, 122897, -246786, -156840, -581676, -775950, -1181709, -1057229, -885811, -1061285, -765504, -1216577, -979404, -134036, 75992, -172872, -488747, -818310]
1512h18310Q39294m69238l11196L26059M62361j20575o4614K8823m8538k24221
1502d00155l46690J22001m49960Q1148L52505L53404R6149m04150M24693k41797
1492d12852q8701o32901M5851m82657L30381k09350j59338L09776M72671K97015
1482e30105o0611N46536p8522M448k68997n38048K22873l76909n31701R5547m86817
1471b002306J6843M27113N51642P87115l36440J358O98103m36589m16066l30704
1461a039931J60713l70711o12978o7147P31609r5390O48194m56613k95186L30144
1451a067296K08050M24958K54064j85814o87189M47817l68356n52267M55764J19720
1441i50549L24136n72771P56299J53674K47285n05679m39619M2338j34960K23003
$$ y = [-818310, 20984, -448254, -759450, -433391, 28970, -91605, -156219, -127396, -175934, -400155, -746845, -624844, -1074804, -993656, -641151, -287747, -191598, -595748, -171055, -412852, -501553, -1134454, -1088603, -1571260, -1240879, -1450229, -1609567, -1299791, -827120, -530105, -590716, -44180, -122702, -118254, -387251, -925299, -702426, -1079335, -1611036, -1515489, -2002306, -1985463, -1558350, -1006708, -219593, -556033, -554675, 143428, -293161, -709227, -1039931, -879218, -1249929, -1862907, -1930054, -1198445, -1293835, -645641, -1102254, -1397440, -1067296, -859246, -434288, -180224, -366038, -1053227, -605410, -973766, -1526033, -1070269, -950549, -626413, -1199184, -442885, -289211, -41926, -547605, -987224, -944886, -1079846, -856843]
1431h56843P30278L05503r15092M54458O08m42701K33908o3221J8412k58181q60985
1420a653856K53032N45702k4033j8596k9759m23430K8620J66285O68315l8753
1410e26473l94156l38512K18723O05754q5813j05622K16815N64539m8877o53186
1400e46808P5452n91068O65970Q7018L3360j50800r17375j23283L29272j14816
1390a253078J29928J50339M6678m65053P56495K50633n73240l07045L13090L67081
1380e84172J06050l62784q4689K98685m9959M01818J43473o95314o46855K01742
1370a272005o5454o8432k17891Q49503K74645J39398j4802j79782k83460N4858
1360g83422M01793q4366m83437m39474O9200n4872q29331j06084Q03580J28070
$$ y = [-856843, -126565, 178938, -736154, -281696, -281088, -723789, -489881, -553102, -534690, -792871, -1653856, -1400824, -855122, -879155, -897751, -927510, -1350940, -1322320, -1156035, -487720, -526473, -920629, -1259141, -1040418, -434664, -520477, -626099, -409284, 155255, 106378, -546808, -471356, -1062424, -396454, -309436, -276076, -426876, -1344251, -1467534, -1138262, -1253078, -1123150, -972811, -926133, -1391186, -634691, -384058, -957298, -1264343, -951253, -584172, -478122, -840906, -925595, -626910, -676869, -275051, -131578, -826892, -1473747, -1272005, -1337459, -1405891, -1623782, -774279, -499634, -360236, -375038, -554820, -838280, -783422, -381629, -465995, -949432, -1388906, -1319706, -1374578, -2203909, -2309993, -1506413, -1378343]
1350a378343J61936O97776R6282K59762J1672m50808j91012j91074l15976P33126
1340e66659K86828m76768j00480M15163p4841m53166N30723P31564O5670n09788
1330a51754k99207k09698m2052k58280q5810m42332k72394M37289Q14362L47997
1320a61879m74893l34967O70424L10894N2373k37531L00971N27312p0001p75460
1310a92757l16771q5615l55931Q48813l33145k45099Q23470M62504J55279p85831
1300b5083j44700k88701q50263Q91061j14132n1439m4563L82659j34032p27105
1290a106298n98640M26083O87915n64260K9933P30739L5649o43852o0029n1228
1280a113988q044P1964k99839P33934J52304L35993K53546o37911J4344l1123
$$ y = [-1378343, -1216407, -518631, -422349, -162587, -150915, -601723, -792735, -983809, -1299785, -566659, -279831, -756599, -857079, -441916, -516757, -969923, -439200, 292364, 358034, -151754, -450961, -660659, -702711, -960991, -1046801, -1489133, -1761527, -1324238, -509876, -161879, -636772, -971739, -301315, 9579, 61952, -175579, 125392, 652704, 582703, -192757, -509528, -595143, -951074, -102261, -435406, -680505, 142965, 605469, 760748, -25083, -169783, -458484, -1308747, -417686, -531818, -583257, -627820, -245161, -379193, -1106298, -1704938, -1278855, -590940, -1155200, -1125267, -394528, -358879, -1002731, -1062760, -1113988, -1122032, -1050068, -1349907, -615973, -463669, -127676, 125870, -512041, -497697, -528820]
1270e28820P348o8033J58505J89670l59207o9821L61190l76979K4054M73778l57967
1259e46282O3264K85136k42660J12463K32115n5708o61866m25254M32932M16044
1249c89816Q3241j74458O71679l25918n53799L13693K71912l61004M503R45099
1239D85132n66427l54180Q77102m76513q69709L0625L17643K03465K78253m84683
1229e59292K34495m5769l78583J36040L88987O1235P1916M02967n90445L27677
1219D9228K67996J8287r28352L26426k07985m6726P39771K68044k02554k40716
1209D3419q089k59772j31735M80066L56287j57172j73679m07151K48993L79916
1199C71083n65320O87132M63629l70225M49592J42991l61823o8630j95371N84613
$$ y = [-528820, -521472, -589505, -431000, -241330, -600537, -670358, -309168, -686147, -662093, -188315, -546282, -483018, -197882, -440542, -328079, -95964, -151672, -813538, -1238792, -805860, -389816, -306575, -481033, 190646, -135272, -689071, -375378, -103466, -464470, -459967, 485132, -81295, -435475, 441627, -34886, -904595, -873970, -556327, -352862, -74609, -559292, -324797, -370566, -749149, -613109, -224122, -162887, -90971, 311996, -278449, 49228, 317224, 335511, -592841, -266415, -474400, -521126, 218645, 486689, 284135, 43419, 35330, -224442, -356177, 123889, 480176, 323004, 149325, -257826, -8833, 371083, -194237, 492895, 956524, 586299, 1035891, 1178882, 817059, 748429, 553058, 1137671]
1189A137671p88550k33314K74458L30168k5836J38715J57576k94866n65356K8729
1179A59395k74229j49155L50560r56700Q81L97886L44134j16252Q3385K80251
1169A20156n75851j1545N09453J28070n84884n2576J37164k83023K83077k23252
1159e53211P11799l13029L2390L09329M6001o239o03137Q34161J06625l04234
1149B60455k71682j09044O23229J36696J83138q57798m05540L35309J098220n08731
1139D84252n43317j87238J67947Q9286k61043p8919Q98483M5007j57017k4635
1129D32806L04159p2773j70874j82280k31554j35111L18719K15890m38541M03252
1119D43693N23403J477n14142m38594k06206L4836L98457o21306J99479J77862
$$ y = [1137671, 349121, 115807, 390265, 720433, 694597, 833312, 990888, 696022, 130666, 159395, -114834, -263989, 86571, -870129, -869248, -471362, -127228, -243480, -160095, 120156, -455695, -467240, 42213, 170283, -414601, -467177, -330013, -613036, -329959, -553211, 158588, -154441, -122051, 187278, 233279, 227040, -376097, 458064, 564689, 260455, -11227, -120271, 502958, 639654, 822792, -35006, -440546, -105237, 992983, 484252, -59065, -246303, -78356, 10930, -250113, -329032, 569451, 614458, 457441, 432806, 736965, 664192, 493318, 311038, 79484, -55627, 263092, 478982, 40441, 443693, 967096, 968573, 454431, 15837, -190369, -155533, 242924, -378382, -178903, -1041]
1109a041M71641l74069j75723K65648l61306J044179k43762r8191p04878K08284
1099C0782Q592l43305o47948K7354O29162J96099k35478N75207M49344M29067
1089A118876j71823k87219j88483j73437R5741L75136n73123r1174M6293k00188
1079d9401M23631R5221L13137L40371L21268j168679p56449N87591P79212J14434
1069A000336j420754M33027P08941K73005r3349J14742n26242j29941K23639j0892
1059E72512m4837J39346R64861l14470m15269j17579P71729J89761j99334K97221
1049A843941J32784l38603m53764j70929P16177p75080j52825J46452Q9712j07424
1039I30441M43149O07809J53452K67032n19977o6243m92545N11461J02519L67249
$$ y = [-1041, 470600, 96531, -79192, 186456, -174850, 869329, 625567, 527376, -177502, 30782, 39374, -303931, -951879, -924525, -295363, -99264, -334742, 240465, 689809, 1118876, 947053, 659834, 471351, 297914, 393655, 768791, 195668, 104494, 150787, -49401, 374230, 469451, 782588, 1122959, 1444227, 275548, -480901, 106690, 885902, 1000336, -420418, 12609, 721550, 994555, 901206, 1015948, 489706, 359765, 583404, 572512, 527675, 667021, 1631882, 1317412, 902143, 784564, 1556293, 1746054, 1546720, 1843941, 1976725, 1638122, 1184358, 1013429, 1729606, 954526, 801701, 948153, 1037865, 930441, 1373590, 1981399, 2134851, 2401883, 1881906, 1815663, 1323118, 1834579, 1937098, 2304347]
1029B304347O04851j51217J017232O58832N55403n54763M21018m38672r36677
1020C480354q18556L28974o1018o97739J39370m24994N50987M72812J61620K58717
1010C390527l46264k6155N98814L93849q07026m00640K66825j83600M25024k64675
1000C046679N87469L61538M18106j46706J8464M06478O0462L30439j12937j10008
990D859984J97944P0886k16251K94823m2920p5528Q15265l73586J13764j3922
980E630459L01951j30821n27431l93442N83188R03390k12814k97811K17128K40788
970F314585L61765M26409q2222r5404J104293p8487p88837l12013O87244J282500
960H819833m78515Q1310M2723P31224K98978P33843J42342j58033l8254K54789
$$ y = [2304347, 2909198, 2757981, 3775213, 4434045, 4989448, 4434685, 4855703, 4417031, 3480354, 2661798, 2990772, 2929754, 2232015, 2371385, 1946391, 2497378, 2970190, 3131810, 3390527, 3044263, 3018108, 3616922, 4010771, 3203745, 2803105, 3069930, 2886330, 3311354, 3046679, 3634148, 3995686, 4413792, 4267086, 4285550, 4692028, 4752490, 5082929, 4969992, 4859984, 5057928, 5128814, 4912563, 5207386, 5164466, 5088938, 5904203, 5530617, 5644381, 5630459, 5932410, 5801589, 5274158, 4880716, 5463904, 6367294, 6154480, 5856669, 6073797, 6314585, 6676350, 7102759, 7020537, 6925133, 8029426, 7950939, 7162102, 6850089, 7537333, 8819833, 8341318, 8422628, 8465351, 9196575, 9495553, 10229396, 10371738, 10213705, 10175451, 10430240]
950A0430240J32763N59465J398601L39215K77223m968Q39380J352616J072871
941A6397406O66223J032294J580198J048979N07061O86822J914333J781425Q97596
932B6512337R86692J553477J451504K433517K736094K178976J835491K760906
924D2448994M420595L654701K634641K575610M070002M788552N259837O367453
916G6220385R068242J0670116J4456449J9002904K4530457K6750630L0908670
909B11607853L5832931K9975341J3448953k1988871m8196831m8678739l6488457
902A35512180k4939860j6706996j2585095r909167p755422o804183m839931l813501
894D8158025l360008k579307k506731j765677k681042l066450k140836k042755
$$ y = [10430240, 10563003, 11122468, 12521069, 12860284, 13137507, 13132539, 13971919, 15324535, 16397406, 17063629, 18095923, 19676121, 20725100, 21232161, 21918983, 23833316, 25614741, 26512337, 27499029, 29052506, 30504010, 32937527, 35673621, 37852597, 39688088, 42448994, 46869589, 50524290, 53158931, 55734541, 59804543, 64593095, 69852932, 76220385, 85288627, 95958743, 110415192, 129418096, 153948553, 180699183, 211607853, 247440784, 277416125, 290865078, 268876207, 220679376, 172000637, 135512180, 110572320, 93865324, 81280229, 71371062, 63615640, 56811457, 51971526, 48158025, 44798017, 42218710, 39711979, 37946302, 35265260, 32198810, 30057974, 28015219]
886B8015219j680255j523545j565537j320703q99143j900317j034423r26954j42707
$$ y = [28015219, 26334964, 24811419, 23245882, 21925179, 21026036, 19125719, 18091296, 17164342, 17021635]
$$ [...]
##END NTUPLES=NMR SPECTRUM
##END=
