##TITLE=1H_TG-2316-1
 CDCl3,8 sc, 
 10.02.2021
##JCAMPDX= 6.0         $$ Bruker NMR JCAMP-DX V2.0
##DATA TYPE= NMR SPECTRUM
##DATA CLASS= NTUPLES
##ORIGIN= UXNMR, Bruker Analytische Messtechnik GmbH
##OWNER= root
$$ XWIN-NMR		Version 3.5
$$ Wed Feb 10 12:47:44 2021 Russian Standard Time (UT+4h)  she@DPX200
##.OBSERVE FREQUENCY= 200.1315066352
##.OBSERVE NUCLEUS= ^1H
##.ACQUISITION MODE= SIMULTANEOUS
##.ACQUISITION SCHEME= undefined
##.AVERAGES= 8
##.DIGITISER RES= 18
##SPECTROMETER/DATA SYSTEM= spect
##.PULSE SEQUENCE= zg30
##.SOLVENT NAME= CD3CN
##.SHIFT REFERENCE= (INTERNAL, CD3CN, 0, 15.9761)
##AUDIT TRAIL= $$ (NUMBER, WHEN, WHO, WHERE, WHAT)
$$ ##TITLE= Audit trail, XWIN-NMR		Version 3.5
$$ ##JCAMPDX= 5.01
$$ ##ORIGIN= Bruker BioSpin GmbH
$$ ##OWNER= she
$$ F:/spectra/data/she/nmr/H-F/1/pdata/1/auditp.txt
$$ ##AUDIT TRAIL=  $$ (NUMBER, WHEN, WHO, WHERE, WHAT)
(   1,<2021-02-10 12:46:19.56 +0400>,<she>,<DPX200>,
      <created by zg, POWCHK disabled, PULCHK disabled
       configuration hash MD5:
       00 E9 B6 7A A2 85 ED C7 34 08 36 98 17 FE 4E 26
       data hash MD5: 16K
       64 C7 5B 15 10 9E 7A 02 CC 66 6C 9C DD A8 87 4E>)
(   2,<2021-02-10 12:46:23.17 +0400>,<she>,<DPX200>,
      <Start of raw data processing
       efp BC_mod = 2 LB = 0.24 FT_mod = 6 PKNL = 1 PHC0 = -10758.47 PHC1 = 10.00095 SI = 16K 
       data hash MD5: 16K
       BA 04 A7 F4 53 CB 27 E7 AE 36 36 1F 2C 1F 7A 9F>)
(   3,<2021-02-10 12:46:43.53 +0400>,<she>,<DPX200>,
      <pk PHC0 = 1.269019 PHC1 = 0.6000001 
       data hash MD5: 16K
       11 CE E6 6E EE E8 91 9C 02 F1 1D 88 10 FE 69 72>)
(   4,<2021-02-10 12:46:47.03 +0400>,<she>,<DPX200>,
      <abs ABSG = 5 
       data hash MD5: 16K
       AB EF 8B 6F 12 82 54 80 00 3D 79 0A EA 10 0B A6>)
$$ ##END=
$$ 
$$ hash MD5
$$ 04 A8 F9 F8 5D C9 5E 85 3B A4 49 51 86 92 46 6C
##$RELAX= 
##$RELAX= 
##$RELAX= 
##$RELAX= 
##$RELAX= 
##$RELAX= 
$$ Bruker specific parameters
$$ --------------------------
##$DU= <F:/spectra>
##$EXPNO= 1
##$NAME= <H-F>
##$PROCNO= 1
##$TYPE= <nmr>
##$USER= <she>
##$AMP= (0..31)
100 100 100 100 100 100 100 100 100 100 100 100 100 100 100 100 100 100 
100 100 100 100 100 100 100 100 100 100 100 100 100 100 
##$AQSEQ= 0
##$AQ_mod= 1
##$AUNM= <au_zg>
##$AUTOPOS= <>
##$BF1= 200.13
##$BF2= 200.13
##$BF3= 200.13
##$BF4= 200.13
##$BF5= 200.13
##$BF6= 200.13
##$BF7= 200.13
##$BF8= 200.13
##$BYTORDA= 1
##$CFDGTYP= 0
##$CFRGTYP= 5
##$CHEMSTR= <none>
##$CNST= (0..31)
1 1 145 1 1 1 1 1 1 1 1 1 1 1 1 1 1 1 1 1 1 1 1 1 1 1 1 1 1 1 1 1 
##$CPDPRG= <>
##$CPDPRG1= <>
##$CPDPRG2= <>
##$CPDPRG3= <>
##$CPDPRG4= <mlev>
##$CPDPRG5= <mlev>
##$CPDPRG6= <mlev>
##$CPDPRG7= <mlev>
##$CPDPRG8= <mlev>
##$CPDPRGB= <>
##$CPDPRGT= <>
##$D= (0..31)
0 1.2 0 0 0 0 0 0 0 0.06 0 0.03 0 0 0 0 0.0002 0 0 0 0 0 0 0 0 0 0 0 0 
0 0 0 
##$DATE= 1612946778
##$DBL= (0..7)
120 120 120 120 120 120 120 120 
##$DBP= (0..7)
150 150 150 150 150 150 150 150 
##$DBP07= 0
##$DBPNAM0= <>
##$DBPNAM1= <>
##$DBPNAM2= <>
##$DBPNAM3= <>
##$DBPNAM4= <>
$$ [...]
##$SUBNAM3= <"">
##$SUBNAM4= <"">
##$SUBNAM5= <"">
##$SUBNAM6= <"">
##$SUBNAM7= <"">
##$SUBNAM8= <"">
##$SUBNAM9= <"">
##$SW= 16.9725356469052
##$SWIBOX= (0..15)
0 0 2 0 0 0 0 0 0 0 0 0 0 0 0 0 
##$SW_h= 3396.73913043478
##$TD= 16384
##$TD0= 1
##$TE= 0
##$TE2= 300
##$TE3= 300
##$TEG= 300
##$TL= (0..7)
0 120 120 120 120 120 120 120 
##$TP= (0..7)
150 150 150 150 150 150 150 150 
##$TP07= 0
##$TPNAME0= <>
##$TPNAME1= <>
##$TPNAME2= <>
##$TPNAME3= <>
##$TPNAME4= <>
##$TPNAME5= <>
##$TPNAME6= <>
##$TPNAME7= <>
##$TPOAL= (0..7)
0.5 0.5 0.5 0.5 0.5 0.5 0.5 0.5 
##$TPOFFS= (0..7)
0 0 0 0 0 0 0 0 
##$TUNHIN= 0
##$TUNHOUT= 0
##$TUNXOUT= 0
##$USERA1= <user>
##$USERA2= <user>
##$USERA3= <user>
##$USERA4= <user>
##$USERA5= <user>
##$V9= 5
##$VALIST= <valist>
##$VCLIST= <CCCCCCCCCCCCCCC>
##$VD= 0
##$VDLIST= <DDDDDDDDDDDDDDD>
##$VPLIST= <PPPPPPPPPPPPPPP>
##$VTLIST= <TTTTTTTTTTTTTTT>
##$WBST= 1024
##$WBSW= 4
##$XGAIN= (0..3)
0 0 0 0 
##$XL= 0
##$YL= 0
##$YMAX_a= 163037
##$YMIN_a= -58517
##$ZGOPTNS= <>
##$ZL1= 120
##$ZL2= 120
##$ZL3= 120
##$ZL4= 120
##$ABSF1= 15.98646
##$ABSF2= -0.9862041
##$ABSG= 5
##$ABSL= 3
##$ALPHA= 0
##$AQORDER= 0
##$ASSFAC= 0
##$ASSFACI= 0
##$ASSFACX= 0
##$ASSWID= 0
##$AUNMP= <proc_1d>
##$AZFE= 0.1
##$AZFW= 0.1
##$BCFW= 0
##$BC_mod= 2
##$BYTORDP= 0
##$COROFFS= 0
##$CY= -3
##$DATMOD= 1
##$DC= 0
##$DFILT= <>
##$DTYPP= 0
##$F1P= 0
##$F2P= 0
##$FCOR= 1
##$FTSIZE= 16384
##$FT_mod= 6
##$GAMMA= 0
##$GB= 0
##$INTBC= 1
##$INTSCL= 2.992141e-10
##$ISEN= 128
##$LB= 0.24
##$LEV0= 0
##$LPBIN= 0
##$MAXI= 10000
##$MC2= 0
##$MEAN= 0
##$ME_mod= 0
##$MI= 1.114404
##$NCOEF= 0
##$NC_proc= -7
##$NLEV= 6
##$NOISF1= 3.799351
##$NOISF2= 2.8
##$NSP= 0
##$NTH_PI= 0
##$NZP= 0
##$OFFSET= 15.9761
##$PC= 1
##$PHC0= -10757.2
##$PHC1= 10.60095
##$PH_mod= 1
##$PKNL= yes
##$PPARMOD= 0
##$PSCAL= 0
##$PSIGN= 0
##$REVERSE= no
##$SF= 200.130007708769
##$SI= 16384
##$SIGF1= 3
##$SIGF2= 2
##$SINO= 5.538805
##$SIOLD= 16384
##$SREGLST= <1H.CDCl3>
##$SSB= 0
##$STSI= 16384
##$STSR= 0
##$SW_p= 3396.73913043478
##$SYMM= 0
##$S_DEV= 0
##$TDeff= 16384
##$TDoff= 0
##$TI= <>
##$TILT= no
##$TM1= 0
##$TM2= 0
##$TOPLEV= 0
##$USERP1= <user>
##$USERP2= <user>
##$USERP3= <user>
##$USERP4= <user>
##$USERP5= <user>
##$WDW= 1
##$XDIM= 16384
##$YMAX_p= 278010213
##$YMIN_p= -1022177
$$ End of Bruker specific parameters
$$ ---------------------------------
##NTUPLES= NMR SPECTRUM
##VAR_NAME=  FREQUENCY,     SPECTRUM/REAL,   SPECTRUM/IMAG
##SYMBOL=    X,             R,               I
##VAR_TYPE=  INDEPENDENT,   DEPENDENT,       DEPENDENT
##VAR_FORM=  AFFN,          ASDF,            ASDF
##VAR_DIM=   16384,         16384,           16384
##UNITS=     HZ,            ARBITRARY UNITS, ARBITRARY UNITS
##FACTOR=    0.207333158178281, 1,           1
##FIRST=     3197.29700974321, 0,            0
##LAST=      -199.442120691573, 0,           0
##MIN=       -199.442120691573, -1022177,    0
##MAX=       3197.29700974321, 278010213,    0
$$ Real data points
##PAGE= N=1
##DATA TABLE= (X++(R..R)), XYDATA
$$ [...]
8207 9205992 9426332 9767203 9536260 9349959 9581201 9859296 9969284 10237892 10442235 10381946
8197 10381946 9784146 10080570 10581182 10417668 10857806 12225632 12216184 11843206 11892595 12077812
8187 12077812 12191399 12080611 12549958 12394002 12462810 12734991 12882525 12938006 12876178 12962689
8177 12962689 13500445 13996906 14256631 14801857 14673511 14726827 15297910 15638147 16285840 16264592
8167 16264592 16335948 17110319 17597278 18371499 19159012 19570276 20461722 21662411 23253323
8158 23253323 24459866 25171698 25880657 27321138 28974360 30839251 32914725 34908883
8150 34908883 36969686 38695855 40116132 41469243 43338418 45192856 46506442 46999313
8142 46999313 47282271 47301062 47023680 45278519 42533769 39751050 37838608 36789513 36480993
8133 36480993 36246913 36323383 36160516 35881654 35744338 35240111 35256810 35501275 35983960 36935738
8123 36935738 38166889 39123044 40190511 41264649 42858079 44971124 47239208 49233298
8115 49233298 51990265 55242817 59198216 63070194 66429667 69697903 73050282 75626403
8107 75626403 77073021 76937562 75654768 72958228 68678628 63673248 59184442 55607679
8099 55607679 53702996 52206801 50422932 47838036 44391010 41480780 39028369 37440521
8091 37440521 36312694 34890450 33988072 33877825 33383126 32981091 32993744 32693954 32730675
8082 32730675 33091983 33695124 34464386 35265761 36287856 37620421 39049464 40620357 42089611
8073 42089611 42792366 43832439 44699940 46036787 47182381 47838593 47657309 46109855 43546747
8064 43546747 40148646 36414968 32951968 29996293 28077316 26510471 25097291 23953658
8056 23953658 22895143 22130662 21703764 20716787 19933216 19429276 18719819 18229047 17923093
8047 17923093 17324714 16835458 16301270 16061850 15513126 14931035 14967777 15234672 14903063 14492810
8037 14492810 14020992 13555888 13443057 13709920 13757833 13501149 13438586 13553552 13554931 13374871
8027 13374871 13512106 13349210 13438610 13856550 13905834 14041492 14076980 13915469 14358420 14429173
8017 14429173 14617164 14572304 14627076 14994373 15373931 15533308 15765215 16086196 16725291 17098346
8007 17098346 17235242 17716202 18336862 19010135 20027554 21193483 22339321 23583583 25154880
7998 25154880 26904835 28752396 30631117 32537703 33884523 35038743 36370071 37731813
7990 37731813 39233415 40484581 40847554 40150084 39043501 38740501 38834052 38919226 38539131
7981 38539131 38107890 37941681 38582801 40339633 43032715 46409975 50129982 53264395 55139470
7972 55139470 53898294 47909636 41589093 37466994 35089063 33571289 32978198 32938858 33112939
7963 33112939 32753345 32381064 32291863 33010766 34057275 35918529 37969321 39985143 41574800
7954 41574800 42169306 41096434 39261734 36827224 33966412 31106628 28798717 27116209
7946 27116209 25903889 24806555 23787023 22701800 21336607 20468356 19566414 18974948 18470615
7937 18470615 17928019 17559450 17154785 16834652 16414913 15958607 15745123 15942315 16396299
7928 16396299 16927484 17009519 17500465 17834855 17956771 17924913 17915304 18241220 18579106 19081404
7918 19081404 18975671 18611515 17657978 16945568 16087839 15439660 14780822 13954194 13214630
7909 13214630 12777398 11886589 11729083 11193225 10685213 10329269 10215408 10008371 9495432
7900 9495432 8950370 9084897 8893685 8635889 8734520 8589291 8525348 8151258 7957633 8136054
7890 8136054 7963886 7777191 7787745 7424985 7513160 7718647 7498782 7227553 6989318 6835670
7880 6835670 7112868 7461078 7288972 7327368 6941650 6800192 6721011 6647655 6988409 6830372
7870 6830372 6586828 6478951 6537247 6611691 6168278 5942800 5860415 5409774 5421023 5170053
7860 5170053 4900081 5037125 5397763 5154220 5226586 4885778 5342329 5289442 5164296 5154493
7850 5154493 4973254 4966973 4889789 5024351 5079201 4991434 4521877 4349957 4156026 4511802
7840 4511802 5067042 5375601 5507059 5120249 4976096 5110405 5186509 5636825 5379729 5115997
7830 5115997 4981942 4793669 4998370 4880456 4766412 4965774 5111986 5282106 5513531 5194979
7820 5194979 4995129 4859326 4539120 4588804 4440131 4150435 3937045 3876294 3880786 3867079
7810 3867079 4062659 4102653 3818933 3961961 4300822 4085735 3545721 3488658 3483145 3530914
7800 3530914 3791935 3774908 3587185 3462430 3557778 3696675 3824758 3588235 3554143 3584741
7790 3584741 3422207 3606602 3725393 3827815 4072645 4060570 3963237 3666776 3465880 3135334
7780 3135334 3837971 4410261 4370988 4612539 4585692 4362355 4005802 3661497 3744294 3730793
7770 3730793 3545801 3248289 3152366 3303700 3217628 3250665 2888263 2624686 2744296 3140873
7760 3140873 3486945 3617123 3280731 2887429 3078690 3486488 3737420 3639137 3344401 2930562
7750 2930562 2675331 2832845 2602832 2748535 2824776 2616230 2536128 2368226 2447621 2631921
7740 2631921 2675513 2459884 2540275 2488746 2467515 2147188 2215578 2204481 1918069 1896236 1967486
7729 1967486 2105030 2439394 2759051 2375819 1971179 1910685 2033029 2282272 2203762 2031944
7719 2031944 1975693 1654191 1806608 1847057 1855807 2068796 1961646 1940176 1744820 1833955 1882849
7708 1882849 2348183 2331571 1976295 1431437 1475266 1874906 1762251 1598292 1657895 1628035
7698 1628035 1885596 2154464 1940863 1715332 1631655 2012170 2133842 2300008 1798907 1345658
7688 1345658 1582469 1578194 1706484 1822360 1388424 1276966 1552554 1913620 1982087 2250532
7678 2250532 1916832 1504351 1380645 1632013 1867432 1961625 1843342 1777525 1909879 2006448
7668 2006448 2207610 2362043 1976762 2231935 2433009 2205431 1831251 2067650 1954153 1907053
7658 1907053 1815027 1850438 1680378 1881711 1972650 1667621 1667841 2018941 2141535 2259617 2267984
7647 2267984 2152662 1946565 2134143 2254435 2118203 2133152 2224255 2544928 2676619 2507833
7637 2507833 2336923 2457871 2852786 3094868 2843070 2653224 2389250 2470514 2627935 2853100
7627 2853100 2837620 2662670 2364669 2506312 2766930 3020430 2953797 2948447 2563709 2794245
7617 2794245 2892679 2732561 2479320 2314875 2117489 2328093 2034964 2149422 2283086 2342492
7607 2342492 2876337 2702120 2401321 2613252 3127810 3663531 3332615 2961140 2954750 2939178
7597 2939178 3148482 3006974 2694814 3022196 3391182 3599518 3579762 3375621 3116607 3167482
7587 3167482 3093249 3220515 3240830 3134615 3168944 3364686 3288488 3399205 3262931 2910066
7577 2910066 2531272 2638762 2807899 2764546 2969012 2904527 2643317 2310443 2151928 2104087
7567 2104087 1939878 1703259 1894611 1775165 1964397 2006204 2155112 2148618 2286141 2219237
7557 2219237 2132963 2173165 2323088 2606568 2370189 2128133 2173136 2235875 2390005 2403903
7547 2403903 2214711 1811604 1691679 2061137 2320978 1929705 1851225 1818216 2013304 1570941
7537 1570941 1426031 1613472 1904375 2205964 1844335 1429524 1225114 1436643 1541216 1283097
7527 1283097 1041498 583887 506978 890365 849976 986561 612503 503110 714711 968902
7517 968902 1011418 1056085 867467 741489 609278 777870 723459 674806 375333 101046
7507 101046 289735 664951 498525 341315 542996 411934 593513 476249 484878 308293
7497 308293 139005 366041 58238 -334733 -401533 -69938 150985 249869 307333 378235
7487 378235 432908 776927 559338 221137 241571 229494 541513 351057 388481 146433
7477 146433 135704 428060 644284 530017 247193 349401 678569 848814 612272 10357
7467 10357 245745 191352 401349 276405 41550 -29323 -133714 -233201 58939 131606 -60174
7456 -60174 -200725 -291445 -395733 -534584 -664778 -492328 -155823 127597 260755 -142292
7446 -142292 -243724 -342370 -271329 -46115 -175727 -42664 -376619 -259125 -104462 83758
7436 83758 15214 -158794 151984 -63661 -390710 -232890 -163797 106722 99104 -63168 -102916
7425 -102916 -137546 147196 279115 93005 -251158 -278600 -259836 150561 197092 64325
7415 64325 -191462 -52712 -244689 -100629 -52432 -57121 -279394 -738211 -742849 -436110 -366155
7404 -366155 -136447 -262483 -314434 -750242 -499210 -177999 -47556 -244261 -337509 -220465
7394 -220465 -287638 -464006 -275352 -55387 -178254 -280942 -456819 -241316 -25349 19486
7384 19486 -57888 -315633 -526163 -314652 -171805 -325693 -220877 -284937 -82058 111105
7374 111105 -145704 -289403 -187156 159908 20628 -18775 -503761 -329050 -167515 -233522
7364 -233522 -259335 -551838 -322995 -227812 -258671 -170334 -459213 -307351 -503997 -568790 -471992
7353 -471992 -639279 -462661 -582633 -285394 -152446 -363131 -247569 -293294 -222130 -78059
7343 -78059 -255292 -324734 -339642 -153228 -152664 -286928 -277935 -518320 -498608 -597984 -498813 -351018
7331 -351018 -168069 -96653 2665 -146382 -303719 -460106 -311754 -232796 -213148 -283209 -560994
7320 -560994 -678016 -517526 32833 -152397 -415797 -635265 -918847 -795343 -356168 -238321
7310 -238321 -251934 -561064 -585690 -325365 -126603 -100831 -110994 -283744 -507161 -547384 -491560
7299 -491560 -530696 -469180 -604012 -727978 -995372 -760950 -615898 -375600 -303059 -449234
7289 -449234 -182452 -206297 -292122 -413347 -596140 -593372 -13425 -22519 -223551 -396725 -410586
7278 -410586 -406776 -428027 -650543 -683792 -609888 -714840 -693889 -495169 -374770 -374464 -297620
7267 -297620 -535515 -287473 -93338 -308627 -251451 -525058 -450450 -485225 -527414 -688679
7257 -688679 -850160 -685358 -665559 -536970 -546859 -539720 -600084 -721735 -769354 -637281 -635675
7246 -635675 -922561 -1022177 -564355 -560586 -657181 -627181 -754062 -337524 -249029 -212132 -196462
7235 -196462 -444723 -546694 -788581 -504914 -246324 -605627 -609021 -582337 -427388 -294751
7225 -294751 -169275 -174951 -335576 -596337 -790380 -274379 -33618 40777 92277 -255492
7215 -255492 -350548 -568031 -635800 -309316 -136157 -146471 -171610 -111762 -265577 -263981 -171562
7204 -171562 -312151 -42843 -64722 -175587 -365278 -421129 -456525 -588962 -383276 -302328
7194 -302328 -22358 106530 -161650 -209850 -337037 -247981 -127086 -312113 -108019 -157999
7184 -157999 -398765 -776714 -497607 -249919 113349 269736 -93477 5344 -93800 -238699
7174 -238699 -449847 -383212 -401156 -323172 -760120 -598250 -540832 -395721 -241747 -487013
7164 -487013 -819536 -628348 -536469 -455604 -623384 -629275 -644826 -519835 -607239 -616760 -316329
7153 -316329 -287170 190183 -35497 -266028 -543130 -610628 -606837 -495127 -641712 -639748 -805908
7142 -805908 -558442 -648616 -728839 -542283 -307428 -306436 -589033 -777575 -685013 -625084 -272210
7131 -272210 149277 -102044 -375425 -347453 -349478 -268980 -631854 -434108 -466146 -580000 -586959
7120 -586959 -793289 -640185 -461509 -382991 -252293 -497556 -355953 -39394 -188042 -473849
7110 -473849 -510114 -751353 -937603 -692184 -596971 -515977 -351756 -325519 -357481 -269243 12418
7099 12418 -207131 -595462 -535147 -599559 -300470 48492 -283116 -675272 -439320 -457513
7089 -457513 -344937 -267858 33927 166594 56332 44334 -474271 -802169 -737499 -409929
7079 -409929 -306819 -586383 -685771 -463478 -657843 -655521 -592364 -695238 -515981 -457535 -618416
7068 -618416 -621361 -676885 -470209 -299134 -372275 -411765 -558877 -463722 -537528 -371886 -543992
7057 -543992 -547442 -662181 -568330 -571562 -506298 -310054 -240548 -17540 16454 -209522 -238219
7046 -238219 -96773 -88333 -224619 -334343 -151896 -291991 -103476 56318 -55108 -266828
7036 -266828 -458171 -446904 -194841 -247221 -180440 -261070 -695592 -947586 -778008 -604408
7026 -604408 -423913 -451847 -491811 -422121 -791164 -496996 -654767 -587126 -357189 -195401
7016 -195401 -331331 -605119 -675578 -576140 -721041 -718904 -575569 -546179 -614325 -326268 -419228
7005 -419228 -604867 -581584 -494601 -371211 -214631 -72608 -276572 -161048 -241902 -387244
6995 -387244 -423026 -371910 -75054 -74474 -145796 -428128 -591474 -536660 -148292 -36951 -362300
6984 -362300 -584872 -381196 -395853 -302740 -404549 -100462 -78913 -293603 -232369 -553883
6974 -553883 -312992 158651 339834 80182 220308 109345 -168307 -517175 -308849 -108691
6964 -108691 -182446 -286160 -16593 -90 206927 374170 213251 356854 596114 578088
6954 578088 626664 724858 681561 403305 192263 92839 -30942 -249750 -88657 114340
6944 114340 -58033 -174198 -49454 -247680 -406330 -26990 -79050 -331234 -430694 -276613
6934 -276613 37001 193670 -139281 -126444 -68974 21231 -424860 -645922 -443430 -390581
6924 -390581 -253039 99571 -358186 -406127 -178028 -270270 -328968 -805183 -680187 -384149
6914 -384149 -190724 -237128 -285414 -481204 -525930 -283026 -300067 -173567 30375 -342820
6904 -342820 -682731 -777968 -585571 -230557 -189903 -457066 -645363 -729429 -816558 -615750
6894 -615750 -331728 -171255 -303850 -515431 -240949 -188271 -453446 -413853 -551538 -516350
6884 -516350 -318928 -175467 -200545 -455849 -469302 -561057 -559353 -955400 -660054 -530193 -696966
6873 -696966 -814088 -755611 -810020 -421935 -627083 -287932 -86119 51334 -218376 -495369
6863 -495369 -607950 -241998 -248512 -367345 -254502 -482578 -405743 -418400 -276864 -307449 -276161
6852 -276161 -347849 -56293 -193924 -363611 -296473 -450201 -184304 -222937 -536327 -677363
6842 -677363 -202918 -260901 -378410 -331461 -563495 -544583 -299687 -194305 -371923 -466308
6832 -466308 -629875 -346028 -343279 -325140 -205302 -225995 -495002 -305539 -483271 -665165
6822 -665165 -577670 -125393 -154314 -143374 -392078 -610603 -715297 -471123 -424161 -551638
6812 -551638 -860750 -557819 -359624 -289594 -90184 -485445 -542831 -210729 152597 63803
6802 63803 -317496 -227140 -214645 -269543 -80502 -388041 -463891 -169956 -242177 -156308 -320625
6791 -320625 -521611 -545710 -339396 -349251 -336945 -554334 -422058 -242207 -207156 -157541 -300715
6780 -300715 -367345 -503897 -864252 -849170 -673648 -487486 -420748 -329602 -500517 -540738 -302046
6769 -302046 -54360 -187828 -343486 -265942 -378540 69066 443957 346157 224538 -45189
6759 -45189 -146092 142350 110388 -89081 -452485 -555676 -165996 131734 -13459 98525
6749 98525 -27776 14950 -335658 -334456 -254407 -549309 -595996 -227799 -45008 -65399 -394397
6738 -394397 -621806 -189838 254331 441748 345558 61415 -29992 253151 -49948 148424
6728 148424 26847 246460 420599 475665 740226 672067 491329 993658 1253205 1093805
6718 1093805 1043664 1139933 1131192 1295276 1297989 974428 441771 337546 413599 118797 87585
6707 87585 98824 463242 516082 380703 171664 -152844 -331277 69667 -110487 -112211 131036
6696 131036 309438 344026 353560 -137858 -316165 -319605 -226694 -216680 -81334 -207221 -336622
6685 -336622 -459491 -261964 -228721 -254696 -413909 -457705 -479566 6866 167196 -24529
6675 -24529 -128666 -206794 -346829 -520719 -484478 -222877 95360 89253 -80982 -115213 -429753
6664 -429753 -485944 -494086 -508151 -454245 -386533 -184995 -188750 -436035 -301615 -382961 -562640
6653 -562640 -288640 -53450 -218623 -3110 10370 126440 27376 -264014 -277109 -458800
6643 -458800 -550076 -701517 -394160 -231709 -514010 -423209 -406379 -272547 -216287 -337459
6633 -337459 -387724 -148954 185137 136962 1079 -342667 -329840 -102179 -59246 -261924
6623 -261924 -530508 -628989 -321932 -177558 135065 16636 -141168 -9325 175101 218640
6613 218640 77535 -12990 181157 -210512 -231827 -151795 -230682 -308168 -193384 -66774 95796
6602 95796 -194206 -189353 -111803 -240484 -444663 -504551 -886515 -900640 -833907 -473857 -323456
6591 -323456 -445395 -340874 -58803 -126201 81264 -48057 -87275 196895 -14036 -166421
6581 -166421 20140 19107 -342999 -699468 -351179 -259573 -388059 -317982 -257622 -244346 -69380
6570 -69380 -5779 -145599 -399331 -336819 11783 -108382 1609 -227590 -304652 -75533
6560 -75533 -65345 -45786 -170304 -447918 -525259 -280275 -270562 -114509 -52412 -306646 -331202
6549 -331202 -449443 -551104 -584676 -569552 -262126 -256596 -313580 1323 39370 184924 -771
6538 -771 -363798 -471128 -202990 10125 124954 -178414 -522644 -451460 -397210 -19051 31857
6527 31857 -308146 -403728 -126449 59114 -85289 -54308 -203681 -228418 -222633 8472 72917
6516 72917 -44110 -355847 -268328 -245139 -267035 -122647 54997 -131592 -272598 -379294
6506 -379294 -370042 -392296 -348115 -7504 -336367 -319609 105722 210338 9390 -256841 -136267
6495 -136267 83548 127423 -83553 -275791 -38382 -43600 23346 99125 22367 170030 149798
6484 149798 49290 -82620 -55623 -87459 -180007 -399902 -244162 -53683 -131963 38782
6474 38782 -125846 -172031 -121715 172150 601525 563215 20046 -158771 146199 64158 114164
6463 114164 129330 -81249 -125013 -37074 257544 191149 -177423 158203 295787 316266 -116001
6452 -116001 -269949 -248870 142161 -216327 -22810 197073 198196 394092 27593 100292
6442 100292 411216 454107 351953 316274 35512 121818 49048 -177188 -316465 -61496
6432 -61496 299612 329996 379586 422250 559039 469249 447525 559711 606317 755908 696445
6421 696445 433548 278944 135035 244420 135836 244359 55752 410696 466517 549860
6411 549860 667833 539899 445501 288188 185750 289907 566108 456417 565553 672672
6401 672672 695883 732852 697643 626684 934696 1047594 1299653 1154078 955292 1177050
6391 1177050 1165569 1189920 952703 1082759 1274959 1554109 1625630 1813192 1745874 1602669
6381 1602669 1776355 2032319 2212115 1944210 2029088 1723639 1968329 1826290 1930956 1995532
6371 1995532 2261825 2053828 2242542 2384141 2811297 3007846 2687102 2747163 2928158 2851109
6361 2851109 3167796 3166936 3223252 3222296 3243991 3338728 3323635 3340938 3313995 3320911 3337779 3363454
6349 3363454 3348942 3277183 3448919 3304311 3268282 3352859 3623939 3671888 3813456 3964016
6339 3964016 4363303 4495555 4735255 4746930 4957807 4992314 5228689 5394467 5581188 5829890
6329 5829890 6262815 6747488 7052351 7241929 7414784 7828129 8337980 9100778 9229723 9441152
6319 9441152 9595711 9931931 10669640 11185481 11291114 11523255 11992060 12613829 13728710
6310 13728710 14645580 15980411 17362786 18080347 19177647 20286657 22076137 23767577
6302 23767577 25775007 28149381 31031036 34656682 38978558 42816817 46850433 51042678
6294 51042678 56283374 61643771 66800324 71925113 75233310 75057026 71394018 64362831
6286 64362831 55285153 45676510 37489954 31021138 26608509 23499803 21253684 18928486
6278 18928486 16960385 15827598 14471843 13690165 12895323 11720531 11139409 10156864 9615872
6269 9615872 9365981 8761037 8256379 7933875 7151353 7180934 6933906 6665228 6465252 5876661
6259 5876661 5657124 5533229 4955217 4942521 4830057 4697868 4899498 4631403 4687383 4787229
6249 4787229 4338894 4062079 4502841 4520501 4360437 3926772 3844102 3709972 3549979 3366149
6239 3366149 3228469 3291936 3075241 3095039 3124231 3370785 3181948 3315604 3145961 3039937
6229 3039937 3184618 3590707 3641213 3415839 3685799 3977699 4669641 4880833 5230281 5250636
6219 5250636 5667311 6038419 6006358 5501271 4552905 4026464 4055226 3739016 3194806 2562707
6209 2562707 2611420 2369458 2051796 1651793 1563110 1454425 1400137 1426651 1440759 1605216
6199 1605216 1685406 1619581 1526794 1182998 1038230 1241857 1328039 1473359 1328249 1418281
6189 1418281 1683591 1710565 1434219 1098916 992471 913510 1220017 1048481 860649 625493
6179 625493 786533 1031308 665553 520325 671481 808860 676979 521448 528739 423765
6169 423765 330301 658688 446709 565665 699114 745221 525469 155292 -50892 308667
6159 308667 598553 534283 372417 247665 441834 368567 493022 394170 -144754 276446
6149 276446 567667 188770 39356 69063 251089 594208 399346 -39451 2257 -33895
6139 -33895 93306 107959 37009 192537 270402 211292 58474 -91899 140968 238058 145935
6128 145935 -227988 -83885 213090 258782 102524 369955 339034 334665 362095 294483 180759
6117 180759 169798 -119807 138947 163919 265283 308708 234174 -249224 -222015 259429 311600
6106 311600 320830 275809 32689 -33723 68630 64076 -108592 -373248 46956 206413 -71296
6095 -71296 -210912 -228047 -125957 262815 336465 265819 -135329 -199301 -44733 461667 709665
6084 709665 448431 400844 352744 581845 868793 681221 762550 722159 538838 532064 864223
6073 864223 590010 582107 370989 28303 246246 401362 271503 190742 -258341 -71680
6063 -71680 -195971 -285233 155587 72395 185865 286816 357209 326324 -53714 -252189 -359565
6052 -359565 103806 -67476 39321 -69230 -291548 -388098 -205363 156455 151086 -258961
6042 -258961 -451100 -213122 222475 314136 199723 263589 -215823 -195436 5158 91124
6032 91124 158765 310154 108866 362314 172527 327752 221177 322822 420502 512938
6022 512938 811884 683090 678843 649747 556482 119429 -8519 -45097 79386 260044 102800
6011 102800 118072 -160278 -370965 -81008 18352 106626 131982 -115402 -314358 -496258
6001 -496258 -350724 65613 -50534 13709 282666 160283 20117 50670 -200458 -40805
5991 -40805 -68900 -212284 -240385 21119 48052 171778 -136678 -219669 -13437 208609 112508
5980 112508 -206796 -242359 40358 248966 -42040 -14867 47450 -163440 -125058 -124807 -331116
5969 -331116 -453015 -172087 -3124 223595 32 -409167 -83026 -230118 151471 237505
5959 237505 -44653 -242804 -207688 -93387 -102246 -492995 -266136 164606 1053 -205643
5949 -205643 -286395 -241030 -45405 -337805 -355767 -115121 59894 6160 -118391 -244914
5939 -244914 -92615 193302 316544 78012 -290696 -479683 -153183 101228 -32209 -34837
5929 -34837 56039 96308 134024 -32532 115020 -469367 -290165 31006 34487 162355 241966
5918 241966 53584 -55427 145154 350212 25656 85085 215515 222279 405411 358360
5908 358360 274207 -82663 326913 553408 334957 374488 378458 -949 163201 190310 144825
5897 144825 -5684 -94057 -155019 -380870 -150851 210741 147858 44634 175753 269937
5887 269937 70573 305373 90687 911 -354364 -14119 569026 608037 326186 14233
5877 14233 -103978 -151823 -230270 202882 158442 196207 119163 58461 295430 127626 269030
5866 269030 149793 -112060 146115 471236 602336 678037 384128 357001 389374 223627
5856 223627 -178726 -18056 -137492 205961 411689 199321 19804 -281111 -249402 100314
5846 100314 215194 221395 147027 210212 256179 492253 413795 163923 -50597 -224283 -107386
5835 -107386 59382 20856 472397 662454 480430 197066 76522 177672 186489 214310
5825 214310 384265 312787 200223 483806 475461 165833 309671 489591 198154 417684
5815 417684 162954 314428 623885 788620 770322 523044 421520 304449 142573 273378
5805 273378 397383 636799 636846 781106 623824 656616 410909 115821 219052 460519 724565
5794 724565 671127 728384 934565 774383 361023 -24408 -60540 218958 559709 668954
5784 668954 643664 412258 189259 -124636 28982 68863 162923 213777 427878 425010 597390
5773 597390 698588 542506 228524 302126 438725 324796 72850 90802 499455 684076
5763 684076 785947 397675 501479 145800 181065 321132 112953 47113 555045 827413
5753 827413 461004 244332 52082 264606 475615 490049 620312 576696 585024 347066
5743 347066 192947 133916 213875 206114 259581 245779 244330 -194009 -57806 -222648 -349939
5732 -349939 -377215 -302221 -242980 -51787 -203628 -41030 -132459 153733 105028 -103694 -390796
5721 -390796 -296296 -263189 -115835 129736 60882 342732 58458 -125225 -205967 -67394
5711 -67394 -79897 -195466 -388702 -340036 -178374 279907 -32227 -99716 -170509 -456410 -247078
5700 -247078 4135 -86562 -83666 -301353 -202764 138947 236747 -118244 -138111 -405767 -304005
5689 -304005 -464965 -449613 -371520 -360458 -299825 -192545 -335200 -443462 -426941 -380299 -572138
5678 -572138 -528454 -354170 -189166 -102032 -566689 -739619 -585863 -279291 -91478 162835
5668 162835 -350216 -292498 -44220 -120432 -197823 -308780 -483591 -82746 -289007 -186241
5658 -186241 215273 204837 216299 115795 206972 433825 336323 98527 22620 -95327 -201217
5647 -201217 -227149 -246649 -538548 -683275 -558187 -449026 -460357 -536261 -414925 -602587
5637 -602587 -540768 -272042 -157762 -253844 -343465 -217636 -184886 91086 232681 -79171
5627 -79171 -23220 69797 -88294 190842 242420 -60199 77553 49113 143466 242679 110017
5616 110017 565798 578871 406058 608913 599357 371805 471239 280537 344298 411656 327855
5605 327855 479824 434909 185924 176433 149154 211954 225151 491591 339080 58349 -86434
5594 -86434 -81910 -69669 -6628 324589 187073 225763 240529 618386 921433 481477 417195
5583 417195 374452 230887 659154 894145 822131 455293 453806 490276 595731 602726 569164
5572 569164 674783 671198 652262 852863 1000763 947620 903316 746860 944949 1271659 864939
5561 864939 958843 831011 672545 654239 429921 306110 154109 128599 397180 443755
5551 443755 299365 354151 216984 28228 427717 711396 1002246 700570 329852 574722
5541 574722 1026300 1253554 968271 960910 980966 1130637 1315155 1342898 970309 1037156 956224
5530 956224 1021163 1116046 1122771 909000 673048 592131 930989 1243729 1189606 1254190 1241447
5519 1241447 1357946 1496775 1320348 1180353 1049134 1207692 1361816 1659608 1689303 1464478
5509 1464478 1506334 1919222 1991211 2385105 2792184 2598994 2405246 2829572 3633355 4145877
5499 4145877 3821778 3553285 3300882 3011567 3202711 3442088 3363281 3113258 2985985 3154080
5489 3154080 3340988 3567457 3367977 3766726 4120986 4698589 5565384 5901111 6265831 6265000
5479 6265000 7009685 7797126 8098597 7860148 7679202 7394698 6837960 6417412 6203262 5488013
5469 5488013 4642300 4044315 3838422 3815504 3084901 2557260 2506696 2208105 2356525 2668969
5459 2668969 2319245 1766518 1445175 1566576 1749110 1931820 2151785 1868836 1568522 1384350
5449 1384350 1264658 1243758 1259968 1002058 886694 903627 1105791 1208732 1181656 614800
5439 614800 594308 1088256 1339554 969607 724428 529605 265861 533827 613851 850379
5429 850379 819271 517852 324447 353487 473903 490178 553342 557095 631076 995234 1039647
5418 1039647 780511 186719 336911 761396 860227 1203492 1227593 763335 400381 440654
5408 440654 938461 1146238 1191843 1064030 868254 1018185 1280263 1446643 1196931 1242348
5398 1242348 1314979 1633773 1692582 1549587 1455540 1588730 1401255 1455946 1603478 1767584
5388 1767584 1603148 1825685 2067489 2210647 2303281 2337253 1997168 1655700 1224287 1062737
5378 1062737 1245834 1327389 1516659 1634800 1593079 1420990 1442531 1455649 1549064 1482827 1438250
5367 1438250 1725953 1823770 1554272 1567322 1923970 1952923 2125710 2164247 1870951 2228185
5357 2228185 2570220 2398962 2203262 1770131 1593533 1633310 1560362 1537495 1683985 1753282
5347 1753282 1600718 1537091 1586469 1673510 1592946 1211769 1125590 1224237 881677 992312 922387
5336 922387 953736 560106 925232 843852 885415 1229352 1407169 1713113 1588177 1841784
5326 1841784 1586918 1198518 1163476 1661121 2148353 2049883 1998742 1992492 2192615 2234762 2380972
5315 2380972 2422584 2118970 2342775 1991267 1386141 1366244 1183800 1454323 1372237 1126500
5305 1126500 990797 1198097 1215930 1464375 1295822 1218573 1253500 1387147 1187987 1039119
5295 1039119 829799 748391 1035033 1526469 1621846 1413404 1330426 1394642 1079095 748401
5285 748401 899429 865349 1051640 1313532 1527802 1335865 1266448 1314231 1314198 1315063 1211120
5274 1211120 1513409 1368947 1146949 1231382 1261077 1577861 1589763 1407018 1495524 1277651
5264 1277651 1519240 2050785 2132867 2066573 2012585 2094608 2034989 1847691 1638222 1881962
5254 1881962 2152697 2471188 2402499 2526357 2510278 2189283 2081515 2176888 2160265 2350770
5244 2350770 2406470 2459825 2278680 2360570 2410713 2151529 2174855 2225037 2491317 2874575 2949819
5233 2949819 2887553 2664367 2337293 2208872 2088105 2264940 2079786 2274263 2497089 2676998
5223 2676998 2514521 2619923 2753469 2439191 2769610 3141351 3088187 3089344 3421476 3641420
5213 3641420 3884539 3671936 3786819 3626537 3841215 4108071 4446151 4690366 4457874 4547734
5203 4547734 4853712 5242706 5689949 6006640 6368091 6500366 6458283 6369550 5916475 5539634
5193 5539634 5692537 5645005 5431172 5208767 5753308 6195799 6735728 6687951 6406153 6426399
5183 6426399 6158925 5900174 5270347 4589065 4623362 4754894 4903264 4839117 4975245 4900554
5173 4900554 4830903 4613397 4639525 4527592 4786188 4998971 5344663 5343302 5077207 5113578
5163 5113578 4973753 4953828 5085426 4966631 4973092 5340422 5390809 5714609 5877178 5981166
5153 5981166 5949316 6073270 6343667 6545785 7037712 7793433 8484514 8767709 9160796 9855219
5143 9855219 10136374 10034101 9872747 9615068 9533716 9634580 9623000 9800331 10117855 10516835
5133 10516835 10715654 10729448 10845035 10948207 10604579 10330081 9914853 9269306 8812746 8699134
5123 8699134 8201412 8095212 7990147 7965175 8016483 7959476 7479073 7540395 7502378 7536636 7452002
5112 7452002 7704912 7390893 7731214 8186777 8397726 8989474 8919816 8665796 8701323 8932834
5102 8932834 8702660 8633758 8452225 8398042 8683588 8701718 8729228 8663856 8347630 8487901
5092 8487901 8451069 8277814 8494472 8435723 8402792 8440964 8267670 7804272 7561123 7595239
5082 7595239 7793370 8013726 7861540 7883420 7885880 7946729 8302122 8450179 8659019 8809021
5072 8809021 9011800 9016327 9338960 9734764 9967334 9937294 9830829 9763817 9780264 10061383
5062 10061383 10410846 10535045 10695857 10727528 11363384 11591749 11534895 11497156 11740776 11832330
5052 11832330 12202746 12574979 13121192 13522067 13615260 14226583 14529152 14709504 15326074 15510973
5042 15510973 15714491 15873731 16096999 16166150 15811037 15757102 16006209 16375994 16847986 17546362
5032 17546362 17550312 17974533 18497634 19066705 19640886 20315406 20711427 21102466 21893723 22731222
5022 22731222 23181907 23841107 24314774 24918736 25808704 26556467 27311827 27987854 28924043
5013 28924043 30095873 31160531 32540588 34149269 35221510 36049792 36803965 37550222 38862278
5004 38862278 40359181 41850256 43441009 45049640 46987739 49594965 52267513 55194198
4996 55194198 58209106 62090164 66529957 71296074 76319129 82252728 88936556 96602582
4988 96602582 104120956 111494582 117639420 122036849 124759335 125300557 123196965 119421730
4980 119421730 114574482 109508135 104243830 98899815 93219376 87176172 81070820 75871516
4972 75871516 70402021 65129886 60735862 56517465 52638131 48990206 45508632 42310671
4964 42310671 39728197 37676363 35786973 34028681 32630419 31813878 31122253 30518059 29586045
4955 29586045 28320410 26992698 25776685 24638054 23501421 22113730 21027941 19458009
4947 19458009 18184956 17677856 16662977 15874177 15279733 14629371 14264233 13581729 13069575
4938 13069575 12907485 12354693 12260256 12534372 11858383 11326951 11062668 10461759 10243724 9576805
4928 9576805 9364016 9369822 9092759 8791000 8553115 8288104 8100541 7858683 8030229 7845237
4918 7845237 7659986 7455372 7612221 7938300 8026389 7486243 7540830 7796767 7965165 7967752
4908 7967752 7731761 7826441 7864762 7738355 7491670 7201248 6900264 6669779 6553258 6450852
4898 6450852 6405726 6322098 6601850 6348198 6210640 5676789 5395871 5360213 5441178 5581889
4888 5581889 5254616 5005191 5063378 5005758 4688487 4720449 4727028 4812288 4815173 4918010 5134103
4877 5134103 4814456 4814979 4912903 4899790 4879936 5286888 5332572 5511661 6019038 6197352 6382474
4866 6382474 6636767 6727235 6993740 7220985 7461399 7260734 6627135 6013369 5896109 5420157
4856 5420157 5189581 4782830 4553303 4375537 4722028 4847450 4950383 4999386 4910290 4742224
4846 4742224 4846807 5082011 5089407 5199026 5268683 5574392 5798978 6289596 6648286 6912420
4836 6912420 7049156 7401103 7231137 6573136 6117079 5721238 5365381 4841643 4420381 3970990
4826 3970990 4170003 4516608 4570963 4490709 4414355 5076338 5275310 5012470 4533266 4265812
4816 4265812 4714859 5110780 5022493 4791384 4943794 5419557 5861069 6234539 5972912 5655777
4806 5655777 5011220 4957174 4859874 4490571 4173316 4077513 3958148 3979710 3666498 3790730
4796 3790730 3726804 3882545 4226461 4473607 4565472 4896469 4844873 4530107 4119157 3930047
4786 3930047 4188409 4476424 5079855 5270253 5382133 5867057 5603253 5288845 4847360 4453839
4776 4453839 4355866 4152475 3796395 3637492 3389964 3215847 3409508 3318053 3032628 2923870
4766 2923870 2816309 3061871 3389253 3634686 3738768 3474243 3105684 3256440 3322237 3464487
4756 3464487 3411669 3430265 3387000 3271534 3196482 3382209 3128899 2638746 2597960 2464992
4746 2464992 2593339 2531770 2477099 2165538 1786773 1924866 1952251 1898943 1762158 1836287
4736 1836287 2090745 2230626 1907925 1818714 1639917 1735319 1772695 1501341 1484805 1543433
4726 1543433 1362111 1542837 1665905 1577469 1401628 1575644 1528674 1163231 1482721 1645840
4716 1645840 1703228 1812069 1693465 975154 972686 1408544 1265965 1324046 1565390 1507889
4706 1507889 1553370 1527911 1823104 1501949 1118944 1271130 1154811 997274 1320336 1634145
4696 1634145 1915430 1852295 1609597 1357688 1179965 1245005 1556936 1531106 1375169 1643861
4686 1643861 1720718 1453673 1501361 1496753 1207914 1134052 1436190 1401590 1685310 1715310 1753012
4675 1753012 1501686 1535482 1398741 1124291 747988 954250 1147864 1159463 1539874 1639260
4665 1639260 1706380 1716764 1484239 1697844 1609415 1782192 1952363 1861167 1725293 2047260
4655 2047260 1984786 1454880 1184729 1146139 1350477 1719413 1657676 1334280 1259460 1606474
4645 1606474 1683895 1601386 1381633 1397974 1472169 1595811 2005346 2286433 1942302 2048009
4635 2048009 1913745 1732135 1718260 1700464 1884421 2025985 1848459 1757942 1684870 1469587
4625 1469587 1859737 1905987 1939800 1640559 1652625 1924429 2092976 2116824 1996175 2008178
4615 2008178 1886186 1822927 1722462 1605070 1969632 2473768 2779790 2693798 2699546 2604368
4605 2604368 2409274 2306611 2457705 2211901 2489246 2517003 2551882 2640151 2803933 2671318
4595 2671318 2599098 2956721 2956340 3077216 3228219 3609341 3768578 3266666 3075041 3241931
4585 3241931 3122993 3252850 3613272 3517754 3760160 3946906 3867592 4190356 4499526 4654717
4575 4654717 4563472 4009030 4287121 4880808 5229741 5241227 5174798 4690719 5055367 5644573
4565 5644573 5661736 6046291 6404115 6766657 7367534 7568694 7441586 7305974 7224338 7252817
4555 7252817 7451494 7448959 7682090 7970153 7964643 8330783 8450447 8454391 8421135 8915206 9034924
4544 9034924 9000860 9270952 9227958 9862690 9726212 9966781 10270879 10604634 11052416 11332666
4534 11332666 11017357 10914980 10803632 10919681 11186458 11002148 11257155 11798413 12201706
4525 12201706 12850684 13333435 13656376 14388956 14927687 15575329 16410222 16884085 18054215
4516 18054215 19298217 20511863 21973706 23381515 25341896 27686904 30181417 33604924
4508 33604924 37016868 39925454 43006075 45186381 46190430 45990550 44806828 44205278
4500 44205278 44011740 44715495 45743352 46541720 47690471 48420534 48540839 48051073 47601761
4491 47601761 47457130 47715699 48645288 49944820 51158694 52607352 54120030 55466198 55837514
4482 55837514 55266705 53694261 51372535 47777923 44331378 41226528 38442490 36563055
4474 36563055 35055573 34159145 33588686 33018254 32564097 31653679 30299338 28062628 25333888
4465 25333888 22239505 19754538 18009013 16826379 15752214 14590909 13638187 12905886
4457 12905886 12086292 11883684 11410005 10556763 10183451 10167626 9765924 9776729 9652507 9470480
4447 9470480 9446098 9348077 9396986 9218361 9222848 9685997 9825990 9629793 9219128 8946773
4437 8946773 8289855 8329277 8098924 7218491 7178879 7146796 6923407 6873028 6825820 6623511
4427 6623511 6534302 6523110 6348472 6138742 5855844 5985386 6088057 6008615 6118127 6310308
4417 6310308 6083389 6121463 6049744 5722081 5379114 5114911 4872660 4718987 4404430 4278102
4407 4278102 4047409 3395669 3198840 3255569 3478503 3468467 3471558 3308229 2906804 2985403
4397 2985403 2912030 3085306 2976257 2957832 2925351 3008167 3068955 3108651 3120402 2985699 2905213
4386 2905213 2442591 2525171 2615292 2788465 2542367 2210261 2560581 2678647 2463727 2559940
4376 2559940 2078158 2067318 2360337 2431540 2235406 2231326 2327542 2262971 2257189 2256953 2120421
4365 2120421 2222962 1945089 2301041 2196565 2364163 2262803 2215928 2083393 1959154 1767962
4355 1767962 1657769 1834272 1730675 1714965 1828139 1954460 1960634 1847959 1698318 1234328
4345 1234328 1287378 1685565 1946064 1840517 1449254 1364808 1654328 1644336 1418986 1225234
4335 1225234 1519484 1466891 1509914 1440215 1394333 1372059 1186336 1001347 865356 761268
4325 761268 688135 1006226 1220892 1212667 1367904 1228014 982163 980024 936157 1187496 922669
4314 922669 932681 855246 592189 941159 1330236 951885 466255 503434 549437 518592 712612
4303 712612 1202579 1225151 735978 1098164 1002181 919538 1009954 1038598 1152219 1007290 1220171
4292 1220171 1227170 1015896 1322933 1431162 1091022 1068531 1198200 1120907 1102429 753257
4282 753257 669079 819046 765792 894539 844006 1083715 1285661 1195569 1419461 1561564
4272 1561564 1326716 1090788 918107 801665 813644 978603 1048113 1273075 1319666 1057619
4262 1057619 1146766 808970 789199 1087291 1099260 973998 1088942 1188981 1282061 1271322
4252 1271322 1062830 1048310 1231567 1347851 1032609 1139643 1092468 991736 1407964 1348590
4242 1348590 1322326 947361 788807 1135125 1296678 1479498 1705389 2085827 2218112 2413826
4232 2413826 2446991 2246899 2470276 2399284 2431836 2597799 2518793 2509694 2693411 2465114 2441191
4221 2441191 2388776 2498075 2765954 3448590 3548872 3604512 3843997 3821517 3623590 3099180
4211 3099180 2984170 3222217 3434343 3475076 3604392 3482287 3766264 4385819 4175255 4468079
4201 4468079 4435831 4308013 4560830 4793346 4645895 4711780 4481336 4328595 4273285 4403521
4191 4403521 4261398 4254568 4545453 4792236 4981689 5102649 4892333 4559557 4267673 4220176
4181 4220176 4408836 4163106 4107468 3701349 3323820 3405323 3597243 3655851 3427183 3113559
4171 3113559 3401839 3647634 3644947 3288532 3369640 3136084 2868373 2465649 2093354 2058745
4161 2058745 2087478 2422169 2588719 2219156 2252187 2199966 2392292 1978386 1780842 1889291
4151 1889291 1950257 1900630 1515587 1321471 1566090 1713513 1870176 1480755 1218619 1154718
4141 1154718 1445289 1492903 1585975 1415922 1435454 1722309 1681087 1811636 1586792 1727308
4131 1727308 1725287 1563410 1800555 1873150 1649948 1420142 1442546 1211542 1092890 1276931
4121 1276931 1487408 1240716 1241800 1189017 1209641 1302507 1151458 1093552 1368422 1725213 1560322
4110 1560322 1531951 1404280 1305072 1508007 1455124 1366937 1388020 878532 1193121 1315749
4100 1315749 1249398 1026904 980126 809362 525338 531453 629535 715395 903652 879954 1088605
4089 1088605 897853 782077 1253099 1427848 1237412 1214854 1083798 1249901 1331626 1274727
4079 1274727 1171980 1091487 896586 1233023 1485805 1602298 2010266 2028831 2080878 2039876
4069 2039876 2126238 1979295 1953066 1882652 1801588 1781723 1418445 1446953 1860084 1710095 1829609
4058 1829609 1544067 1369644 1213080 1439938 1710918 1434067 970324 866958 1206372 1091105
4048 1091105 862489 1172250 1148771 1288972 1323640 1416550 1531301 1747275 1931102 1690112
4038 1690112 1416643 1473930 1616763 1876140 1967949 1775737 1586930 1543387 1643688 1608246
4028 1608246 1841447 1859958 1910079 2137285 2107131 2243677 2263299 2262429 2338395 2174210 1839346
4017 1839346 1739312 1904594 2031132 1958436 1936678 2286488 2166250 2252476 2339171 2228746
4007 2228746 2121483 2353684 2420392 2350940 2136306 2489720 2913102 2946427 2934522 2926701 2864933
3996 2864933 2924554 2908046 2869467 2697206 2807171 2932498 2957553 3189800 3208681 3566039
3986 3566039 3683904 3635153 3894234 3585154 3746666 3856317 3740315 3653374 3880599 3933915
3976 3933915 4046442 4076898 4127377 4400468 4199192 4080265 4309531 4337791 4589600 4212443
3966 4212443 3796726 3848369 4075097 4327201 4307803 4222521 4582129 4914234 4981525 5363562
3956 5363562 5256606 5372693 5664568 6036109 6023934 5931387 5892742 6056036 6173513 6468728
3946 6468728 6422390 6522449 6667444 7024790 7485090 7566864 7526019 7950693 8035511 7955803
3936 7955803 8021873 8322180 8621148 8452953 8814890 8989551 9261502 9822665 9898680 9886840
3926 9886840 10353032 10543249 11070421 11751328 12100707 12233766 12495636 12920641 13108503 13703120
3916 13703120 14182056 14906228 15516960 15942055 16664963 17292406 17746213 18204377 18658033
3907 18658033 18941174 19379315 20134125 20189679 20179667 20428639 21242073 21803376 22041468 22418889
3897 22418889 22618611 22655114 22876697 23275323 23493326 23575340 23573290 23618045 23508455 23109922
3887 23109922 22865314 23024597 23037776 23225714 22740357 22325264 22170548 22018592 21856975 21521382
3877 21521382 21087001 20755501 20513386 19899158 19287241 19141585 18916384 19112245 19073743 18372372
3867 18372372 17858164 17781664 18094095 18179835 17987459 17771794 17707222 18041883 18369632 18577061
3857 18577061 18622613 18680277 18834506 19526658 20223892 20097316 20049457 20120150 19945809 19919116
3847 19919116 19528055 18812498 18495063 17897711 17269505 16842880 16305314 16065632 15840984
3838 15840984 15556078 15225768 14910807 14832580 14802688 15030483 14905446 14950608 15251099 15313095
3828 15313095 15739404 15916282 15748364 15963983 16109438 16236655 16683414 17159939 17652398
3819 17652398 18109002 18675051 19571318 20343147 20896558 22377525 23530423 25188697 27325255
3810 27325255 29318984 31940092 34357681 38267793 43249289 49010011 55782013 64247052
3802 64247052 72949754 81831428 88817461 91111066 87629977 79521291 68022526 55983520
3794 55983520 45639187 38574420 34067703 30938674 28565563 26271515 24428191 23029734
3786 23029734 22252762 21566046 21000018 20455874 20003708 20110161 20311614 19887376 19233734
3777 19233734 18465165 17583086 17069091 16730708 16382201 15968536 15667719 15186397 15059034
3768 15059034 15351380 15854339 16382867 16533588 16774255 17339106 18203876 18628385 19374424
3759 19374424 20353068 21108913 21179834 21436251 21326924 20623347 19821823 19295935 19106167 19427684
3749 19427684 19629197 20102936 20782844 21642213 22980800 24772171 26512072 28693835 31047015
3740 31047015 34072547 37880739 42163675 47825520 54622186 62008964 70243467 77899393
3732 77899393 84194147 86558383 83982642 77969995 69843894 59361660 48256968 39441242
3724 39441242 33326231 29097851 26213845 23612640 21537768 20151595 18540737 16893349
3716 16893349 15963086 14804543 14099076 13290381 12506486 12257103 11864468 11341753 10698224
3707 10698224 9835911 9484484 9655321 9626874 9357957 9112823 8702239 8349636 8043237 7492126
3697 7492126 7505325 7452840 7264110 7039651 6399695 6670087 6846624 6337727 6213967 5627845
3687 5627845 5323363 5213865 5249753 4898245 4787810 4380419 4630657 4855904 4693483 4457978
3677 4457978 4200601 4170526 4165821 3990188 3914737 3672612 3685281 3517202 3723759 3612795
3667 3612795 3671004 3764332 3822108 3731062 3255350 3039757 3318710 3475284 3414812 3487138 3543529
3656 3543529 3554954 3464543 3169129 3232288 3612367 3665750 3663010 3558252 3355285 2996712 2944068
3645 2944068 2645591 2668003 3085217 3232686 2954283 2542840 2685443 2954170 3013445 3169512
3635 3169512 3096760 2968597 3138962 3298097 3179272 3343035 3400078 3534414 3654614 3649586
3625 3649586 3598097 3874257 3668728 3884373 3510878 3365397 3723406 3799502 3986939 4161471
3615 4161471 4605924 4765814 5040407 5358927 5721345 6092343 6300812 6716344 7028857 7308057
3605 7308057 7738913 7676385 7508798 6794126 6188787 5720479 5976799 6508312 6841725 7267469
3595 7267469 7588835 8073179 8193222 7791254 7628728 7093167 7016951 7052389 7118982 7282419
3585 7282419 7681994 7697309 7558863 7399118 7017793 6828383 6391126 6006547 6069283 5986163
3575 5986163 6276888 6348276 6446941 6540618 6691400 6751933 6523673 6106811 5377768 5003395
3565 5003395 4900775 4654259 4498667 4202461 4107881 4105123 4173942 4272360 4120536 3663918
3555 3663918 3678831 3801782 3528593 3570384 3616460 3768450 3576417 3492904 3672051 3765719
3545 3765719 3809424 3948975 3547583 3260355 3191684 3420404 3378649 3634267 3675872 3959737
3535 3959737 4060037 3598216 3080224 3337957 3615394 3657808 3663819 3655478 3890839 3818415 3795111
3524 3795111 3947188 3567766 3527073 3605087 3584784 3756971 3747485 3839826 3962674 3660848 3415220
3513 3415220 3261522 3336091 3512575 4039598 3858469 3611721 3743307 3561217 3803147 3736563
3503 3736563 3682893 3583169 3596609 4042271 4444361 4486531 4352288 4179445 3800637 3564327
3493 3564327 3728098 4038863 4325784 4469923 4268179 4341618 4159089 4032934 4543893 4676005
3483 4676005 4450287 4345544 4403176 4505679 4552908 5011255 5203917 4750208 4425847 4962886
3473 4962886 5304477 5610683 5994500 6403706 6714003 7072064 7575934 8295587 8944297 9668506
3463 9668506 10733236 11687175 12681378 14187743 15408265 16213847 16806898 16144734 15086655
3454 15086655 13655518 12171152 10751815 9765740 8809757 7787891 6998537 6755000 6497268
3445 6497268 6241039 6089750 5867894 5485267 5164879 5259418 4989135 4786436 4771527 4590002
3435 4590002 4481785 4414618 4742673 4411911 4034942 4445571 4242761 4172677 4057928 4364817
3425 4364817 4470457 4629044 4945755 4556549 4698603 4876197 5056690 5048654 5197176 5375585
3415 5375585 5659622 5867819 6347528 6610125 6562323 6541478 6137579 5634102 5639858 5330176
3405 5330176 5398538 5673514 5375515 5391784 5714726 6176171 6976339 6746573 6421983 6306591
3395 6306591 6102270 6257091 6352189 6182149 5967945 5434017 4724675 4549623 4716973 4750359
3385 4750359 4909661 4581899 4185152 4141655 4041333 4162886 4003777 3544382 3221272 3526414
3375 3526414 3738450 3637097 3655901 3623842 3932808 3699292 3649838 3571865 3509555 3346876
3365 3346876 3207091 2850738 2608590 2813222 2699866 2852915 2633000 2686682 2798233 2804111
3355 2804111 2781374 2775262 2869579 2781307 2751753 2685866 2671826 2860478 3021769 3351517 3255040
3344 3255040 2926432 2571546 2488110 2698212 3055748 3196689 2886540 2746953 2672788 2941461
3334 2941461 3130728 3202129 3492406 3247360 2994032 3157361 3244449 3281746 2902747 2722977
3324 2722977 2567117 2795718 2920234 2800401 2897930 2632461 2820867 2865385 2982638 2975618
3314 2975618 3038686 3270668 3400346 3069176 3490747 3789362 3838337 3900683 3991600 3945308
3304 3945308 3845669 3733352 3617465 3978632 3974074 4137397 4250034 4060801 4022535 4398498
3294 4398498 4791849 4817222 4663426 4424892 4491138 4730439 5001960 5322552 5217247 4954176
3284 4954176 4791087 4701673 5039388 5329368 5287576 5515569 5424819 5459521 5888730 5953579
3274 5953579 5854908 6246508 6809987 7219757 7547913 7653044 8093695 8633493 9090886 9975463
3264 9975463 10629951 11493996 12902996 14269385 16016712 17359485 18776818 19896505 20050994
3255 20050994 18745361 16646602 14394829 12824091 11904446 11290331 10460818 10308160 10144829
3246 10144829 10182038 9927539 9709202 9428828 9420346 9842014 9745702 9426750 9348637 9400339
3236 9400339 9420955 9722800 10146798 10176827 10400560 10648936 10589412 10733544 10742545 11151326
3226 11151326 11708165 12161343 12546447 12903064 13621421 14342934 14608309 15094254 14993475
3217 14993475 15030259 14607585 14249333 13911225 13835231 13991751 13912874 13824195 13682733 13757500
3207 13757500 14097753 14192796 14219734 13985750 14248391 14764054 14916713 15216603 15468506 15862264
3197 15862264 16358310 16716621 17065708 17767703 18291139 18730775 19393446 19788239 20746302
3188 20746302 21786214 22597577 23757121 24502727 25285791 26700950 28048984 29427711 30791203
3179 30791203 32043665 33355711 34640947 36128789 37676530 39432064 41350021 42852611
3171 42852611 44936421 47430269 49968679 53401018 57267513 61091665 65691795 70691178
3163 70691178 76063617 82490561 89852495 98970638 109734548 122172299 137925206 156172959
3155 156172959 178406228 203991236 230843084 256087379 274140470 278010213 263748493
3148 263748493 233287384 195881142 162001331 136951222 119555125 107136188 97922168
3141 97922168 89985989 83185286 76476982 69752945 63802007 58612062 54582975 51210133
3133 51210133 47499867 43834142 40591244 37808949 35967122 34096721 32103261 30515789
3125 30515789 29044368 27761551 26504419 25005248 23905517 23284956 22660950 21719584 21001490
3116 21001490 20402715 19636539 18813932 17769933 16912429 16310772 15814128 15333620 14762744
3107 14762744 14125367 13794604 13557157 13238424 12945290 12763511 12410519 12444732 12718843 12230510
3097 12230510 11999802 12019956 11605046 11367497 11011168 10580067 10441332 10360465 10187921 10072147
3087 10072147 10078502 9793513 9586872 9379357 9190512 9329530 9106398 9235762 8951594 8669663
3077 8669663 8706934 9006907 9177491 9071828 9000916 8706380 8591294 8812008 8641747 8891955
3067 8891955 8909648 9162097 9237017 9037826 9176634 9528206 9955827 10561466 11178957 11605295
3057 11605295 12275738 13339303 14123149 14905234 15124032 15179232 14887796 14025153 13394899
3048 13394899 12295278 11098277 10339377 9447743 9227481 9120016 9321635 9282590 8800409
3039 8800409 8135628 7586622 7146760 6617318 6433195 6259668 5936550 6129169 6216784 6280204
3029 6280204 5987083 6186199 6325301 6238533 6332940 6322178 6965164 7123239 7133872 7408775
3019 7408775 7427711 7555219 7205389 6440689 6261289 6368132 6248264 5642328 4905298 4666126
3009 4666126 4389155 4014389 4162767 3585000 3445093 3530393 3575671 3687156 3634200 3316275
2999 3316275 3289220 3111757 3144938 3235985 3136568 3235838 3151104 2673001 2508408 2580836 3150978
2988 3150978 3506272 3271113 3143500 3143747 3384672 3057526 2847251 2898053 2898762 3185244 3214738
2977 3214738 3085917 2816642 3028755 3298388 3408786 3382697 2962558 2958918 3001782 2701064
2967 2701064 2590173 2351959 2393246 1989173 1832192 2057005 1879849 2306136 2207520 1716552
2957 1716552 1536227 1545132 1794088 1872403 1723270 1661948 1637764 1578231 1986394 1814776 1597513
2946 1597513 1697020 1619466 1988225 2342048 2130140 2001320 2233845 2358921 2313723 2437958
2936 2437958 2487742 2310091 2186749 2095957 2235544 2461878 2618007 2543624 2206886 1999601
2926 1999601 2194966 2588957 2838089 2931465 2791106 2670405 2749044 2360250 2294442 2379698
2916 2379698 2051515 2295262 2299994 2458388 2656773 2481881 2404984 2409632 1927819 2192603
2906 2192603 2089476 2100962 1967286 2132369 2541230 2620954 2537241 2079925 1974416 2557238
2896 2557238 2617560 2377191 2233747 2511722 2816261 2668899 2564587 2255854 1967390 2219012
2886 2219012 2626003 2877959 2778802 2691408 2283321 2295220 2470528 2471954 2453002 2404018 2495914
2875 2495914 2585413 2700908 2617377 3013353 3249787 3058638 3068875 3160267 3118801 3141446 2976050
2864 2976050 3009604 2868816 3174804 3249123 3007240 2797150 3194682 3749918 3760420 3777222
2854 3777222 3855041 3699389 3950786 4011454 4125011 4235181 4450529 4393251 4739579 5097148
2844 5097148 5380206 5664889 5824199 6021992 6528583 6702604 7167368 7148230 6891331 6759104
2834 6759104 6465924 5688299 5233927 4782939 4613468 4557446 4331494 4021961 3837553 4040568
2824 4040568 4330998 4153850 3705744 3390532 3557661 3627731 4045938 4063120 3658402 3761869
2814 3761869 3915451 4126979 4046886 3845080 3988089 4254368 4328319 4429543 4253777 4151980
2804 4151980 4547594 4421414 4406633 4224596 4139762 4579952 4526526 4422852 4390167 4636139
2794 4636139 4846495 4520858 4504639 4490668 4324768 4004610 3791030 4129226 4480730 4619265
2784 4619265 4623586 4671806 4310768 4516512 4894085 4753334 4682660 4771043 4787157 4595519 4320329
2773 4320329 4344633 4546133 4913888 4988649 4963909 4679704 4639777 4668482 5151764 4895126
2763 4895126 4540114 4869163 4999187 5031899 4848441 4455977 4640805 4947348 5301000 5167611
2753 5167611 4738370 4817720 4913719 4670222 4754673 4684969 4884924 5190994 5215523 5042283
2743 5042283 4453389 4058899 4094472 4234661 4236021 4479732 4638923 4488322 4217076 3933690
2733 3933690 4128126 4267289 4322208 4088679 3880668 3958422 3902487 3808773 3808228 3428025 3571868
2722 3571868 3690105 3467985 3638612 3426035 3585883 4100276 3627235 3616894 3792611 3559295
2712 3559295 3621811 3189872 3294308 3542773 3489142 3680382 3260310 3125487 3144930 3047371
2702 3047371 2971985 2946720 2814673 3115642 3290787 3294823 3103038 2723138 2772506 2893940
2692 2893940 3092111 3216160 2871550 3092641 3301557 3329459 3318503 3527642 3405874 3516042
2682 3516042 3556347 3485192 3331276 3288182 3544844 3333651 3186519 3167703 3194143 3044259
2672 3044259 3130329 3321116 3468069 3388759 3341290 3268622 3139984 3292006 3292175 3156417 2941065
2661 2941065 2645290 2907196 3254648 3096535 3289650 3308248 3030298 3204043 3044037 2983489
2651 2983489 3173298 3312128 3383752 3263712 2945098 3472408 3774650 3741713 3877876 3852848
2641 3852848 3769583 4075232 4265189 4129844 3875942 3916432 3966511 4114069 3816867 3595144
2631 3595144 3674776 3905851 3456491 3384286 3442153 3691325 3825146 3862263 3668313 3634564
2621 3634564 3551415 3612898 3530482 3616884 3852712 3409574 3356283 3552474 3581379 3740670 3770498
2610 3770498 3633939 3600267 3545011 3880800 3884060 3627717 3700856 4103882 3971207 3857061
2600 3857061 3685347 3514276 3865433 4016158 4200256 3883512 3804273 3798581 3735664 3782557
2590 3782557 3792927 3573755 3569971 3687823 3891055 3775776 3666716 3875872 3645676 3372173
2580 3372173 3665289 3767122 3895172 4081357 3781605 3344403 3202206 3385824 3616278 3550824
2570 3550824 3319794 3238807 3294971 3824406 3542001 3640837 3869103 3808101 3631650 3083308
2560 3083308 3022173 3258473 3544349 3521357 3618631 3410904 3665018 3463836 3097928 2937420
2550 2937420 3017342 3311560 3296739 2920683 2710263 2716035 2855883 2782106 2281006 2292362 2520048
2539 2520048 2973332 2954038 2721114 2482736 2338573 2345666 2465197 2342785 2258663 2192032
2529 2192032 2627398 2564870 2458600 2461939 2648617 2798096 2437776 2086490 2155111 2473967
2519 2473967 2655592 2613181 2811837 2484977 2319513 2220067 2212890 2347206 2397282 2509311
2509 2509311 2574319 2129007 2114545 2157301 2312742 2277407 1936433 1621915 1892520 2212323
2499 2212323 2458505 2291438 2340938 2365492 2241847 1941407 1967763 2147981 2325469 2001101
2489 2001101 1893495 1752676 1611692 2076268 2248364 2166500 2201795 2153825 2079190 2354278
2479 2354278 2172032 1937635 1808991 2098078 2315947 1868717 1768611 2022330 1971550 2207761
2469 2207761 2377903 2245616 2173527 2113900 2307012 2428881 2086341 2287284 2365538 2643508
2459 2643508 2850967 2863065 2588833 2379121 2072321 2165013 2525100 2606088 2537368 2333602
2449 2333602 2557624 2654745 2693164 2574163 2362390 2420648 2485035 2481122 2369997 2585573 2721245
2438 2721245 2842105 2814339 2685381 2569459 2580582 2822765 2759357 2775766 2974744 2830543
2428 2830543 3079710 2986782 2651624 2498111 2586135 2767480 2886028 2745977 2794832 2972757
2418 2972757 2651846 2736267 2854002 2801809 2827786 2791164 3076895 3206366 2982064 2789014
2408 2789014 2801854 2846029 2942171 2832151 2511072 2490419 2701808 2995682 3119764 3106991
2398 3106991 2937577 3032789 3362440 3228554 3148840 3017242 3165101 3414432 3367231 3244204
2388 3244204 3167234 3010945 3276222 3395767 3322385 3645317 3680463 3722786 3961788 3771121
2378 3771121 3759074 3458573 3269812 3459503 3641152 3300110 3518785 3709790 3847290 4068699
2368 4068699 3873068 4009835 4265725 4381257 4624137 4303082 4139874 4373960 4602508 4855999
2358 4855999 4761956 4209437 4149061 4338951 4730556 4883852 5085820 5280677 5302396 5717109
2348 5717109 6174214 5981734 5730521 5630589 5798604 5994534 5850294 5696362 5543405 5777186
2338 5777186 6280947 6052657 5776502 6057143 6080061 6388278 6548719 6565646 6497258 6362717
2328 6362717 6415443 6506003 6121372 6358284 6479716 6487147 6663926 6848509 7034218 7226069
2318 7226069 7075310 7020608 6746638 6810754 7072852 7328378 7596418 7764886 7315084 7201175
2308 7201175 7148133 7482606 7773316 7778804 7773394 8083623 8059638 8229201 8401290 8822510 8936485
2297 8936485 8647530 8780079 8936133 8901726 8898952 8765145 8760360 8993866 8925626 8955939 8906044
2286 8906044 8999497 9286142 9634227 9788829 9768781 9810314 10514671 10651515 10538846 10396343
2276 10396343 10739718 11350673 11470354 11634170 11787567 12121791 12320459 12856308 12674190
2267 12674190 12654644 12747877 12871460 13294717 13463843 13307742 13313232 13243103 13548834 13982074
2257 13982074 13630312 13400894 13414526 13874034 14053657 14551743 14907370 14842334 14758146 14756050
2247 14756050 14896767 15111626 15337064 15628449 15941340 15950232 16252452 16800041 16927279 17677541
2237 17677541 18132126 18200937 18519690 18335465 18546792 18762754 18657944 18503030 18519781 18479466
2227 18479466 18491831 18597010 18515113 18808516 19129617 19613473 19776164 19921551 20195332 20299165
2217 20299165 20786948 21126300 21262062 21774599 22513709 23114030 23596762 23983417 24371937
2208 24371937 24841008 25437808 26139864 26647768 27350856 28268890 28563740 29017893 29715242
2199 29715242 29905386 30145864 30398789 31020091 31663038 32375727 33311946 34130251 34664453
2190 34664453 35586986 36467665 37014796 37540573 38334863 39439216 40830418 41970364 43376895
2181 43376895 44471489 45942200 47902037 49631012 50849012 51860019 52641591 53332261
2173 53332261 53074798 51939870 49866319 47117945 44420524 41132989 38439748 36111037
2165 36111037 34168004 32740263 31416965 29501249 28227976 27104310 26348123 25530356
2157 25530356 24596424 23725316 23096935 22436365 22049679 21696655 21048358 20441067 19989336
2148 19989336 19808011 19234042 19000067 18564210 18265725 18205822 17984455 17475351 17335191 16573011
2138 16573011 16496332 16458961 15952242 15358889 14672984 14322152 14238533 13913208 13554247 13064483
2128 13064483 12395893 12241927 12232581 12385085 12286986 11906437 11499958 11009022 10824412 10813373
2118 10813373 10400456 10282475 10120930 9948578 9768757 9660152 9741036 9670838 9307740 9091728
2108 9091728 9088228 8982110 9264773 9027021 8718776 8897653 8639699 8251554 8247906 7854641
2098 7854641 7879491 7870149 7831778 8049713 8070523 7958768 8002661 7576048 7403606 7672545 7244302
2087 7244302 7350212 7357831 7250204 7070254 6953972 6623731 6359113 6218528 6435496 6717048
2077 6717048 6565671 6264881 6111950 6267898 6361407 6237888 6020189 5833246 5906859 5895053
2067 5895053 5539720 5469558 5706966 5817959 5902230 5657798 5367925 4874508 5042092 5484925
2057 5484925 5356063 5287732 5315320 5013061 5077324 4898540 5025788 4845081 4785867 4932601
2047 4932601 5151418 4877678 4919046 5091681 4810421 4842457 4674668 4672042 5055323 5039168
2037 5039168 4973532 4715302 4679354 4800410 4885050 4877679 4731988 4507396 4123477 4012116
2027 4012116 4311735 4377373 4652157 4531346 4249123 3877177 3854546 4181084 3918031 3890916
2017 3890916 3888579 3939065 3762170 3929818 4095319 4226841 3863666 4071250 3842615 3802034
2007 3802034 3466209 3433086 3792426 3786096 3761928 3561203 3120240 3090967 3222404 3237242 3090548
1996 3090548 3138132 3155853 3261395 3423887 3477270 3315647 2807623 2923756 2845195 3179177
1986 3179177 3645006 3383003 3072300 2891108 2826044 2911086 2921194 3028843 3292980 3217269
1976 3217269 3192913 3214557 3440323 3316165 3360763 3375548 3053649 2969950 2933571 3064012 3234813
1965 3234813 3365758 3164387 3239351 2961607 2740930 2651706 2937045 3357078 3276249 2662332
1955 2662332 2455353 2124884 2257253 2664195 2674740 2445490 2410811 2651755 2801547 3157582
1945 3157582 3011151 2924790 2616942 2307611 2528613 2939585 2968325 3118625 2798646 2612828
1935 2612828 2973117 3234753 3278126 3375944 3545840 3514211 3566166 3548301 3973274 4389393
1925 4389393 4437347 4237528 4265915 4352310 4496660 4480418 4555643 4789562 4444750 4351054 3926308
1914 3926308 4059405 3923497 3897854 4038898 4056580 3820338 3676289 3687786 4029496 4257378
1904 4257378 4095390 3788912 3418451 3725938 4404704 4534510 4518050 4737079 4807742 4783822
1894 4783822 5059691 5380705 5475804 5422798 5585781 5696864 5619815 5869457 6281541 6418599
1884 6418599 6282182 6197883 6186324 6328839 6367564 6485419 6675456 6649461 6498967 6349193
1874 6349193 6449797 6477427 6573593 6660965 6556994 6707689 6742827 6968954 7307981 7385217
1864 7385217 7416213 7595265 7397372 7984539 8462545 8793850 9248742 9300493 9346243 9868562
1854 9868562 10513199 11256834 11992846 12053642 12020564 12236756 12448654 12948743 13033628 12836654
1844 12836654 13096120 13501060 13500953 13522077 13649586 13863008 14243434 14540169 14758195 15191936
1834 15191936 15221379 15721126 16119032 16400761 16687980 17213246 17704089 18259316 18970864 19479648
1824 19479648 19926202 20059126 20198634 20620974 21014167 21474935 21959796 22013914 22301422 22737760
1814 22737760 23126032 23318247 22966911 22558481 22054273 21736728 21348304 20981721 20668910
1805 20668910 19884214 19555256 19401166 19204466 19250123 19520732 19609503 20269338 20515447 20687389
1795 20687389 20849725 21161291 21455477 21440335 21778313 21935096 21984422 21958568 21693077 21804394
1785 21804394 22050352 21884854 21746534 21264964 20713686 20394591 19964062 19346510 18759153
1776 18759153 17898149 17065654 16616311 16138686 15839820 15275687 14991711 15088163 14897657 14644929
1766 14644929 14383036 14202507 13779051 13490665 13365284 13400174 13403801 13106973 12870582 12155706
1756 12155706 11801309 11621937 11314812 10924761 10450930 10492369 9968524 9544804 9232644 8813969
1746 8813969 8915628 8694773 8346343 7692559 7140477 7189783 7151528 6849428 6655112 6124014
1736 6124014 5559615 5483526 5246529 4876231 5083929 4873966 4900055 5114259 5275740 5352634
1726 5352634 5123444 4836689 4522576 4336508 4402778 4650019 4308567 4120248 3846218 3754866
1716 3754866 3667822 3474254 3406119 3726700 3640916 3848228 3768137 3060364 3012481 3143288
1706 3143288 3205678 3034957 2685577 2491284 2473798 2618245 2959453 3077100 3182262 2900224
1696 2900224 2624129 2536115 2536263 2779641 2655707 2447194 2403929 1922352 1974854 2078789 2021368
1685 2021368 2019019 1705154 1907111 2000999 2388942 2299808 2076557 2004018 2017946 1895577 1617486
1674 1617486 1815647 1624617 1477010 1619259 1548638 1139334 886444 1049290 1178922 930958
1664 930958 769658 836717 1005705 925800 1130866 918412 769950 766396 559545 648519 653242
1653 653242 1055734 1075548 626187 272322 4204 251217 430130 745926 570243 361433
1643 361433 240529 129573 151867 263470 331320 69332 94965 279135 209835 433744
1633 433744 465669 643983 420862 441063 434807 189767 126690 296259 403192 330794 107794
1622 107794 -38284 -361 73630 118893 79860 -76870 140363 607581 298308 394130 442464
1611 442464 323338 -63277 -162422 195386 93454 -71653 3614 -20613 14837 -5463 184165
1600 184165 -41832 -94969 -258046 -246244 -301482 -249977 -208537 -344030 -202100 -225288 -186706
1589 -186706 -467034 -395122 133012 -48267 51926 -45812 -482640 -650939 -564951 -151174
1579 -151174 -304749 -536945 -612410 -485350 -671953 -497304 -455883 -459332 -151892 -502894
1569 -502894 -602059 -476295 -251359 -93988 81315 -137974 -51980 -267037 -206357 -147323
1559 -147323 -43893 59700 194399 160227 -195179 65629 162937 81157 50299 -118112
1549 -118112 -229077 -68399 291163 665123 367986 -118447 -320101 -154184 -47852 -57897
1539 -57897 11694 -10607 -410884 -495004 -207488 -206436 -224976 -115771 -236439 -708353 -563748
1528 -563748 -362330 -211654 -55606 -87256 -19733 -79696 -150226 118469 -6039 -119934
1518 -119934 134053 33970 -182979 165043 -33511 -134295 68544 -32327 -94158 -104875
1508 -104875 5065 254707 479257 378481 294456 177068 347097 773323 630607 557394
1498 557394 372617 105634 15242 -11476 -66040 111357 65428 -87066 -54660 -289597 398
1487 398 257659 247485 -116986 -124752 -167881 -395182 141808 188503 331804 652240 373014
1476 373014 219524 229344 320054 452649 379161 -39479 193803 -297802 -292172 -38281 -35811
1465 -35811 -352140 -345030 -418805 -116513 188237 330249 573241 329239 352346 199784 193336
1454 193336 340296 -93086 -306832 -185025 -156922 -29122 -236746 -133900 184414 -444142
1444 -444142 -545610 -313754 -426849 -197802 -53954 -215176 -41246 -105036 -268343 -144398
1434 -144398 -198992 66192 58822 -95115 20684 -233342 -391222 -441721 -241656 -422251
1424 -422251 -541065 -685144 -436333 -213935 -73259 -133793 -498738 -504919 -481616 -52013
1414 -52013 -110437 -456773 -336832 -457346 -464394 -150023 19763 -283581 -440516 -611103
1404 -611103 -344992 -125745 -225750 -71210 -229858 -442173 -498856 -460074 -322759 -123199
1394 -123199 -222815 11710 -21953 -138530 -413501 -452564 -389796 -369094 -450788 -553829 -265955
1383 -265955 -417265 -701585 -598271 -532094 -857736 -895678 -747333 -773474 -484909 -112622
1373 -112622 -74979 -483837 -485252 -319163 -112560 -92427 -100334 -305598 -380093 -365397 -145308
1362 -145308 -44100 -120549 -217868 -498602 -571417 -319661 -364701 -278338 -287692 -123535 -172282
1351 -172282 -299218 -290250 -8051 -276402 -148343 -44457 -112753 -294282 -282851 -400419
1341 -400419 -643074 -636020 -912898 -951922 -699050 -809603 -677484 -736835 -664026 -711943 -487318
1330 -487318 -617674 -649949 -711686 -816218 -456403 -498269 -740823 -606668 -402725 -142353
1320 -142353 -242051 -643328 -329857 -135705 58927 97226 -53748 -419228 -200450 -270242
1310 -270242 -155959 -105355 -37130 -143957 -56895 -35048 47899 212 -73150 24530 240702
1299 240702 15377 2776 -92130 -240829 -264188 -227958 -377857 -722697 -848526 -502283
1289 -502283 -101897 -282347 -480304 -601135 -475357 -220859 -220815 -435689 -557654 -726771
1279 -726771 -718318 -453961 -341952 -403782 -512725 -439453 -369657 -517325 -582730 -609887 -671742
1268 -671742 -305816 -130926 -243563 -561667 -423981 -217978 -337857 -195979 45225 96091
1258 96091 5464 45065 4245 27851 117266 177681 265597 204736 -12310 -227338 143911
1247 143911 503720 459193 177544 59818 446676 382523 2865 -90100 -453561 -489107
1237 -489107 -178032 -39055 62632 -565159 -521594 -360150 -404452 -564733 -830614 -699755
1227 -699755 -716123 -597474 -380237 -806602 -881468 -572865 -256241 -182820 -317853 -223213
1217 -223213 -160291 -303048 -189706 -96587 -317618 -107400 -27538 -175131 -200125 -273037 -150953
1206 -150953 301994 -31241 -172772 -134600 292471 305427 238448 -24064 8855 125055
1196 125055 454020 444375 93627 -171471 118208 142662 -50634 -195017 -36095 -96238
1186 -96238 -192548 -507324 -701529 -489757 -541550 -449440 -479549 -552375 -192458 -285774 -373886
1175 -373886 -278728 -520323 -88416 -140817 -63566 -74792 44974 101802 438665 562880 -898
1164 -898 -338327 -65425 -23202 -132431 -74984 65688 84712 -56838 -119172 193659 412204
1153 412204 471692 247816 -48629 -185035 36738 378717 498089 33724 -188002 73616
1143 73616 386779 250209 143145 -45999 101139 124656 186274 180941 -64633 -44392 366202
1132 366202 169885 -119186 -327042 100269 324162 277834 -83147 -1819 53242 169087
1122 169087 124140 -184071 -140767 61199 378708 214323 127513 253646 627619 1049013
1112 1049013 1058985 819805 680678 641440 748421 802403 705822 795869 563800 583897 799420
1101 799420 923169 1138923 836689 1100759 1026947 1214966 1263707 1421631 1452344 1204237
1091 1204237 1157576 1061684 1030468 1200460 1195628 1143435 1263981 1315769 1233638 1347385 1585817
1080 1585817 1400834 1008401 849766 576896 619898 899879 1092500 1044457 961786 963135
1070 963135 996333 936751 1113120 1166933 1319730 1288485 1091783 1080430 1126549 1492261 1532724
1059 1532724 1474801 1382071 1411722 1827997 2252398 2200146 1986542 1511473 1302912 1845800
1049 1845800 2051977 2186124 2310905 2165761 2257024 2477460 2498320 2208523 2128566 2423773
1039 2423773 2556729 2590631 2702297 2685685 2806123 3188109 3234059 3327057 2909824 2955524
1029 2955524 3190250 3497076 3834355 3898631 3614406 3338368 3569374 3388584 3800085 3846361
1019 3846361 4009050 3902192 3996348 4089296 3966536 4089093 4368694 4127854 3938341 4265062
1009 4265062 4759323 5237300 5459861 5416795 5125005 5370857 5873168 6229907 6299946 6322778
999 6322778 6529938 7198301 7718773 7948460 8191457 8529270 9177472 9839310 10127128 10624592
989 10624592 11212962 12303769 12893753 13581671 13993988 14481302 15316786 16631450 18103538
980 18103538 19631427 21251627 22667825 24152828 25757061 27001572 28851095 31051489
972 31051489 33760773 37236743 42119223 47483386 54066953 62878773 74405215 88177991
964 88177991 103049049 118381630 129739052 136463086 128112024 101224429 75476684 59073620
956 59073620 49030640 42271668 36792837 32418206 28634589 26019024 24441094 23093214
948 23093214 21941528 20974977 19657020 18578565 17510560 15819910 14534702 13606818 12914160
939 12914160 12116691 11182488 10510029 10177918 9612492 9208964 8761692 8209620 7839203 7663339
929 7663339 7659022 7076643 6614377 6183779 5868889 5247008 5355932 4765113 4634192 4981382
919 4981382 4875520 4450821 3922938 3628116 3752480 3704155 3821019 3442006 3148751 3038651
909 3038651 3255363 3192606 3149215 2707655 2541633 2449878 2566511 2897502 3018798 2782111
899 2782111 2626951 2542520 2394988 2323579 2451099 2549664 2338833 2227550 2159724 2171253 2267388
888 2267388 2401120 2249375 1976663 1593791 1506290 1534965 1703676 1815205 1619186 1429646
878 1429646 1687576 1471836 1568111 1652159 1484709 1271233 1219019 1421785 1252042 858076
868 858076 967341 1135371 829071 612232 576786 540156 716070 1078867 1040033 876157
858 876157 1028142 1104939 1072968 1015005 956585 530826 405483 462801 729959 942656 845799
847 845799 817956 595584 432587 36551 -32403 23002 708803 576639 479061 447600 207073
836 207073 235757 529646 624061 386401 303219 435889 674970 596770 713198 718031 424161
825 424161 86135 76186 210066 353564 42672 190700 161020 450625 180198 140671 113822
814 113822 92832 337329 385195 342048 159252 272607 335471 -119587 -263088 -218681 -191440
803 -191440 61049 281749 741534 699550 306276 157197 -17021 -4551 173967 239897
793 239897 175442 133833 -65958 20538 454683 532082 416995 316212 83180 205264 284429
782 284429 515374 244250 26390 -241772 -246303 -625506 -624736 -78963 -124229 -107841 -196218
771 -196218 -34467 88720 120999 296787 152214 -96955 -247102 -74528 260818 549607
761 549607 615088 588857 32992 -232433 -234978 -88990 370458 372979 -39409 -124612 90829
750 90829 219142 124966 53985 102045 -39014 -117575 285885 359993 227204 566712 100480
739 100480 -327404 -460948 -324763 -51699 108822 307156 387544 -42850 -8683 -139713
729 -139713 -207496 -73292 224837 -98958 -297487 -142398 106998 260563 328530 236005
719 236005 -169130 -292713 -90508 -43546 219155 121653 24284 325498 24289 -64591 43387
708 43387 133472 111493 101077 -243978 -54026 338888 340786 275652 -44633 -320843 -273801
697 -273801 -6277 357853 406996 225717 215105 -276896 -175209 -10952 -13017 -34194 145762
686 145762 384417 223819 116009 356153 349242 504602 334085 66526 152881 76967 434927
675 434927 837257 935231 372473 84810 106356 86785 82277 270761 226114 186403 146156
664 146156 -40384 40063 -15940 -187685 -395222 -637330 -530996 -384009 70710 428882
654 428882 25959 -422778 -734365 -685467 -487629 -91761 -257620 -239033 -566715 -203389
644 -203389 179035 544328 263499 -8876 68559 -74168 308936 403408 283362 99731
634 99731 191998 235164 -20039 -164108 37282 -16783 -161645 96913 120166 56418 17552
623 17552 464716 282511 -45376 -392534 -204215 -157247 -15577 199565 -40836 -391304
613 -391304 -598839 -675243 -664071 -137351 113396 107362 -41345 -45091 -259967 -111435 212456
602 212456 395412 23793 -101883 -214678 102479 195113 510694 151582 61854 -102973
592 -102973 -225769 -161071 -5361 -221391 -194172 -425678 -41853 218530 -71811 -109548
582 -109548 -222489 -284123 -130770 54966 92015 36921 -193481 -258595 -154775 -401491 -406299
571 -406299 -42312 408303 215894 -82837 -152330 -368002 -423176 -172115 -11905 -70271
561 -70271 -285791 -245884 -45623 26114 194444 469876 633605 513373 131559 -48691
551 -48691 32331 127635 496736 266864 81867 86913 184105 312762 -22638 -244545 -47403
540 -47403 21687 138395 284490 166098 -390609 -169434 -314702 -282805 -91395 -162011 -324873
529 -324873 -189844 -114539 -171896 -150741 28610 189602 102542 47566 161901 60867 -352819
518 -352819 -14071 1408 36608 197421 -44013 -190632 -234334 83064 184326 123670 -103256
507 -103256 -297073 -173251 -43148 -45033 66170 -157426 -200840 -126558 -90415 -95763 -167047
496 -167047 -142901 -128866 22043 195302 288681 333006 239061 -98329 -65726 -179021 18066
485 18066 -32561 52702 152808 56748 -85029 44337 -11546 -310459 -171314 40027 -7039
474 -7039 168647 133901 -94011 -93809 -232724 -28544 -257041 -327334 -406508 267131 137932
463 137932 197668 132693 44839 -177461 -385323 108523 -191309 -222072 167987 91800 -168498
452 -168498 112804 -45167 191473 -107347 -229228 -206030 -284943 -231725 -370251 -304750 -399078
441 -399078 -214080 -417775 -326928 -164159 -5783 -25717 292495 342571 331776 236676 205384
430 205384 -32016 -130929 -227254 -31979 -110140 -59071 241378 36523 -313708 100778 -17789
419 -17789 -243831 156803 150885 541525 547676 209768 -140019 -397178 -325486 -125902 -322099
408 -322099 -308809 -174648 59858 -38367 -173409 -73471 -112576 -395209 -442066 -394895 -339672
397 -339672 -156594 -140678 -453972 -679542 -534851 -28908 -46291 -63403 -26733 222946 375088
386 375088 426849 220554 -46638 -372943 -630395 -414830 -197152 -282779 -67675 18478
376 18478 416889 123239 -115549 -143853 -98898 -31548 19571 -44960 279530 155425 -39754
365 -39754 -4705 -234865 30159 18617 29010 -153204 -491804 -366776 222554 56930 27942
354 27942 -166313 -373464 -244130 -366827 -577344 -502856 -59283 -24319 -113387 -236138 -287220
343 -287220 -730 42125 77033 50946 -92635 70168 -46295 -250995 -639948 -602553 -760236
332 -760236 -427756 -37171 -226296 -235293 30528 -160702 -383174 -474987 -224001 -6960
322 -6960 -277411 28876 -95674 -35018 241087 265924 -325073 -316769 -717845 -748922 -460905
311 -460905 -358821 -418773 -419107 -406465 -260365 -286786 -362526 -32527 38441 175396 247490
300 247490 88558 11945 -22080 -125108 -462480 -597991 -270627 -39891 -85799 -67306 -50308
289 -50308 -181082 -506150 -603405 -487822 -723860 -696199 -202632 -176721 -473999 -368650 -192551
278 -192551 28927 142908 -109251 -151092 -325073 70368 89532 -18592 15013 -289381
268 -289381 -435223 -523336 -408090 -435017 -245983 -36311 112660 -256152 -22653 40369
258 40369 -172401 -317921 -137726 69209 -65813 -209590 -37168 -55558 99348 188468
248 188468 26540 -187315 -236558 -359943 -280149 -111661 -284616 -253930 -350219 -507108 -447713
237 -447713 -451586 -411495 -101630 -244878 -346840 -277919 -36016 -104353 -150242 -85176 -251084
226 -251084 -195427 -52725 -144754 -178939 -279526 -368976 -259898 -512182 -394007 -20377 9793
215 9793 -12338 -102082 -24006 -42699 185927 271983 34345 -253827 -95642 -239823 -380503
204 -380503 -430033 -582061 -580257 -408658 -418135 -370043 -177715 -168509 -234088 -339179 -619591
193 -619591 -328643 -259494 -378155 -321077 -197253 -125110 40857 277443 44654 35437 63212
182 63212 -47238 -152265 106143 226689 33404 -45749 -14116 -388717 -351422 -179880 -337542
171 -337542 -466078 -451334 -378132 -165243 -86476 -411883 -482749 -289899 -218107 -104552 -57835
160 -57835 -254828 -387970 -217674 -155759 -138741 -761613 -724554 -559880 -218937 -285469 -303829
149 -303829 -279376 -187693 -229316 -211701 -258064 -501115 -343574 -69548 6539 -311716 -201218
138 -201218 -155764 40048 -256195 -361936 -445592 -572316 -394967 -9175 -99794 -68923 -289249
127 -289249 -457726 -200962 -90885 -288635 -53439 -128188 -117737 -181661 -164983 -223574 -95082
116 -95082 54249 29213 -43896 -225362 -128486 -76779 33673 -163378 -318111 -431824 -389081
105 -389081 -247009 -325542 -165930 -273398 -215074 -214906 -164314 -165391 -281503 -320926 -324717 -143234
93 -143234 -67810 -359569 -597028 -578891 -634866 -562171 -651372 -571115 -452467 -269548 -401420
82 -401420 -308457 -472334 -439405 -347655 -399820 -504066 -348651 -414626 -318673 -342906 -370755
71 -370755 -473598 -229290 -227141 -76436 -88723 -200081 -356359 -193428 77184 125917 -232132
60 -232132 -329490 -149765 -193335 -174007 -129245 -54470 -54358 47360 66653 -321219 -487750 -429553
48 -429553 -478975 -248999 -325762 -341216 -399753 -536649 -184325 -420900 -644429 -572962 -312823
37 -312823 -199758 -292445 -282814 -421692 -169419 170793 245189 -216054 -413583 -193433 -55716
26 -55716 -245219 -102439 -169465 -7977 1943 -166676 -426875 -292679 -310096 -240704 -337076
15 -337076 -414957 -410328 -402370 -377739 -274582 -402754 -482149 -209005 43788 -47508 -252473
4 -252473 -393908 -579271 -492950 -398402
0 -398402
$$ Imaginary data points
##PAGE= N=2
##DATA TABLE= (X++(I..I)), XYDATA
16383 -1863655 -2001592 -2037982 -1996713 -1694478 -1615342 -1612027 -1481141 -1320167 -1291604 -1508673
16373 -1508673 -1588992 -1524272 -1632356 -1469218 -1224489 -1488619 -1515765 -1439007 -1348119 -1324327
16363 -1324327 -1360639 -1538920 -1436201 -1381117 -1494253 -1549402 -1636085 -1412493 -1138519 -1091772
16353 -1091772 -1379272 -1445538 -1272940 -1195234 -1117207 -1101480 -1191272 -1200814 -1040026 -897117 -969296
16342 -969296 -1029135 -951089 -736162 -618729 -583143 -825669 -967808 -884651 -943211 -805321
16332 -805321 -773591 -737760 -440525 -257296 -268885 -338220 -413777 -487295 -313737 -374370 -531318
16321 -531318 -380782 -178012 -72668 -369918 -506974 -759293 -662684 -458373 -352924 -403498
16311 -403498 -570186 -356727 -52760 15812 11628 115381 -182843 -419426 -145741 -31768
16301 -31768 96890 140452 61059 53198 -50750 -159603 -263470 -68789 188102 448748
16291 448748 502010 329303 488613 585891 624919 350946 269124 207421 355797 442742 500324
16280 500324 646603 591572 615407 736025 480159 427517 599257 576212 484191 353792
16270 353792 283111 421788 506629 457888 428564 303987 136870 196277 662908 925172
16260 925172 809159 1031441 1067490 954269 1008326 1068002 1041097 1020171 1030694 1305017 938098
16249 938098 937788 899979 886811 957110 1103545 1019937 1003926 1410561 1128920 1044454 1204366
16238 1204366 1232212 1040897 920458 1220801 1276310 1209560 1125788 1053989 956975 930766 1316960
16227 1316960 1319937 1075114 831218 1026456 901219 1114280 1111423 1139140 972013 727879
16217 727879 936566 995933 989100 1255150 1377195 1175757 1094425 1429136 1318759 1495287
16207 1495287 1324992 1068718 1289508 1524615 1764435 1742953 1303075 1387471 1428299 1494614
16197 1494614 1528902 1453009 1288561 1681025 2042786 2036874 1832146 1478281 1600578 1743592
16187 1743592 1626698 1494241 1572784 1476673 1439761 1594357 1512636 1463058 1458015 1269085 1417558
16176 1417558 1521612 1641391 1815972 1641473 1663213 1557717 1551097 1562184 1740255 1662222
16166 1662222 1494872 1732642 1774511 1795192 1884830 1778478 1666115 1692701 1937521 1695962
16156 1695962 1638915 1829348 1871425 1729506 1437195 1468386 1345349 1648785 1867157 2086116
16146 2086116 1770347 2086566 2053546 1847070 1826729 1672691 1450496 1653618 1899267 1843271
16136 1843271 1642817 1554672 1922397 1773086 1429033 1235319 1558721 1808654 2089012 2073816
16126 2073816 1726851 1444477 1712243 1828995 1750952 1695047 1752012 2125873 2099072 1869222
16116 1869222 1797586 1921977 2270210 2038389 1569772 1608995 1722134 2066242 2308389 2212674
16106 2212674 2041711 1971479 1798513 1963440 1791984 1415873 1491781 1878415 2166016 2408904
16096 2408904 2016370 1806177 1562586 1470019 1449206 1278849 1459482 1659981 1794523 1759117
16086 1759117 1757820 1810871 1827851 1935437 1868773 1653851 1869125 2058647 2082821 2063531 2185213
16075 2185213 1962341 1900726 1744272 1505245 1773875 2182021 2491126 2448306 2214520 1980248
16065 1980248 1842245 1822975 1986193 1935348 1806217 1936306 2034806 1926568 1920896 1727764
16055 1727764 1724445 1346446 1560154 1804512 1878099 2215119 2339910 2237895 1987202 2061979
16045 2061979 1947271 1628084 1498255 1493748 1811049 1915057 1920666 1678958 1724185 1687110
16035 1687110 2007535 1949269 1892517 1928160 1959320 2415058 2451646 2316848 1825755 1628815
16025 1628815 1893287 1851803 2031114 2334068 2211218 2232520 2103601 2320892 2129526 1911531
16015 1911531 1671099 1486461 1801796 1990809 2259279 2203593 2045245 2062780 1880723 1620195
16005 1620195 1512206 1947306 1892892 1868373 1967637 1886633 2003432 1579677 1658438 1646708
15995 1646708 1411477 1764442 1852657 1775413 1674925 2133766 2285195 1937188 1765675 1652969
15985 1652969 1714773 2084726 2172316 2388604 2277836 2132497 1982231 2142940 1766891 2079921
15975 2079921 2246098 2066258 2180637 2343403 2313566 2067512 2142610 1958288 1924822 1899140
15965 1899140 1655436 1749590 1991769 2200641 1868621 1811415 1725889 1956076 1715455 1799459
15955 1799459 1971277 1726450 1921725 2233815 1898016 1850748 1729023 1405341 1332703 1407066
15945 1407066 1935820 1957999 1893639 1862976 1965612 1837843 1803455 1929905 2002785 2221907
15935 2221907 2171430 1869308 2011297 1803789 1736445 1589344 1564642 1484502 1654338 1928652
15925 1928652 1982121 1993503 2055023 2409230 2381641 2258302 2022847 1977138 2169987 2184620
15915 2184620 2329881 2026274 1952602 1709571 1694668 1938133 1595721 1685039 2059887 1983297
15905 1983297 2028592 1820454 2031165 1775113 1442927 1476392 1517507 1774626 2154017 2148635
15895 2148635 1815060 1739823 1981404 2126029 1930043 1804113 1921186 2039855 2373926 2382179
15885 2382179 2058402 1758192 2251489 2079222 1715438 1537975 1754259 1976822 2176581
15876 2176581 2166053 1982986 2171318 2337044 2177326 1678222 1814313 1950388 2161557 2136988
15866 2136988 1927352 1815522 2041635 2314258 2322278 1815208 1509623 1510415 1704498 1975660
15856 1975660 2042954 1922494 1816549 1646346 1552361 1265770 1504914 2016461 2200871 2115015
15846 2115015 2113455 2069271 2083195 2383413 2155754 2138048 2184480 2505786 2689793 2126893
15836 2126893 1892191 2097491 1929317 2014963 2258150 2019438 2178416 2411036 2530859 2022357
15826 2022357 1690477 1766616 1993324 1863093 1891799 1820309 1815551 2171648 2234106 2299755 1808241
15815 1808241 2134576 1732820 1439837 1428158 1531130 2073398 2258757 2412306 2044230 1614109
15805 1614109 1818432 2229409 2309377 2335706 2212002 2203735 2395423 2260719 2032037 1767186
15795 1767186 1938428 2184439 2106290 1630498 1654299 2027756 2154345 2206038 1795404 1662536
15785 1662536 1649480 1872019 2102210 1834532 1668399 2052524 2324662 2192825 2571018 2670385
15775 2670385 2482640 2183996 2005281 2086878 2119585 2241616 2016845 1960734 1823918 1777353
15765 1777353 1610482 1489569 1575862 2267935 2250302 2182832 1852630 1622218 1592364 1803378
15755 1803378 1740452 1618199 1673590 1863290 1887000 1769098 1849858 1742558 2006304 2094092
15745 2094092 2058095 2163504 2235927 2294220 2019169 1988082 1928560 2188886 2315115 2282567
15735 2282567 2263588 2131287 2098909 2435148 2618961 2322061 2266879 2214190 1886938 1684821
15725 1684821 1827557 1999922 2057529 2105159 2237358 1982901 1810961 2080739 2122810 1900956
15715 1900956 2035808 2418339 2385228 2128766 2049342 1843501 1846516 1921793 1982566 1652931
15705 1652931 1763748 2131455 2100798 1870662 1780041 1646695 1680618 1966465 1922683 1569904
15695 1569904 1792263 1853726 2373545 2173050 2326631 2373870 2157470 2063433 2036135 1723329
15685 1723329 1907514 2164659 2370776 2449659 2016652 1853032 2007255 1889074 1768190 2090938
15675 2090938 1958518 2209853 2046778 1880756 1913621 2114681 2310082 2353701 2050465 2017144
15665 2017144 2054190 2396107 2341596 2147254 1950461 1687176 1921670 2092431 2034461 2365247
15655 2365247 2066594 1839369 2087391 2709814 2854377 2544838 1893049 1561290 1927034
15646 1927034 1962218 2208970 2254019 2355001 2565467 2234257 1946478 1683541 1809604 2139873
15636 2139873 2034635 2057668 2025192 1888185 2226003 2173781 1768244 1739453 1756590 1980305
15626 1980305 2134658 2301619 2314523 2008320 1830333 2212128 1978075 1908782 1844419 2232023
15616 2232023 2480096 2523251 2211005 1972881 2121009 2296045 2320448 2164953 1862718 1823638
15606 1823638 2395714 2623461 2794196 2698372 2050866 2002178 1769091 1848764 2221438 2179976
15596 2179976 2011242 2252675 2149181 2344383 2387046 1979170 1806590 1769933 1736457 1814975
15586 1814975 1871334 1662000 2210245 2158523 1751809 1568998 1508431 1777236 2121855 2358422
15576 2358422 2025178 2074111 2166687 2151936 2232536 2190459 2117432 1930701 2041212 2148674
15566 2148674 2265137 2426897 2588475 2387376 1922493 1410260 1703462 2024491 2210697
15557 2210697 2227942 2083957 1737768 1690946 1913071 2197897 2163013 2205245 1946782 1959448
15547 1959448 1982004 2101416 2066165 2346148 2282556 1999323 1712016 1928764 2276438 2233867
15537 2233867 2287848 2281107 2057987 1963784 1643549 1791457 1987578 1872170 2052108 1857828
15527 1857828 1919150 1980243 1878906 1838810 1671213 1659283 2036497 2138764 2231183 2138101
15517 2138101 2259542 2002306 1892452 1892497 1859436 1871004 2079615 2090220 2145415 2147235 2113653
15506 2113653 2249327 2028166 1954278 2019606 1950621 1943177 2207781 2052491 2080605 2270789
15496 2270789 2060883 1994910 1706288 1563629 1752336 2063828 2296825 2124073 1614457 1721397
15486 1721397 1974701 1967552 1990842 1926058 1760344 1735777 1880557 1816895 1973107 1997056 2049341
15475 2049341 1920999 1878325 1938496 2198664 2236108 2117543 2060342 1648870 1842631 2235631
15465 2235631 2086255 1880708 2068503 2040121 2118473 2447823 2577795 2375215 1781161 1773515
15455 1773515 1834651 1857973 1810420 2170701 2224871 2065296 2060979 2032983 2022383 1935015 2254856
15444 2254856 2146573 2098540 2188576 2269939 2207592 1986862 1791837 1844079 1900283 1892688 1979522
15433 1979522 2102504 2135414 2026510 1805980 1716159 1739951 1785161 1855853 2182574 2273466
15423 2273466 2243666 2101689 2121468 2039819 2133507 2250978 1940427 1800959 1957631 2130794
15413 2130794 2294967 2438815 2561856 2001379 1983654 2003795 1968758 2097101 2382607 2270030
15403 2270030 2052557 1980149 2102573 2420165 2509749 2289696 2331800 2075735 1845857 1867678
15393 1867678 1921710 2035231 2006422 1874554 1842344 2353643 2266371 2187178 2029304 2189764
15383 2189764 2286874 2440796 2282542 1926177 1645532 1923144 2169284 1842037 1868392 2027816
15373 2027816 1980566 2310190 2077682 1713233 1377865 1229785 1774465 2273158 1991074 1701524
15363 1701524 1966533 2361073 2527445 2462857 2412304 2215592 2334681 2248630 2324783 2364451
15353 2364451 2489947 2395782 2519425 2340991 2080381 2101150 2229745 2492264 2499804 2484925
15343 2484925 2437750 2175646 1862709 1782380 1629049 1777809 1833206 2028112 2072338 2324527
15333 2324527 2266520 2271708 1969816 1564975 1603800 1595178 1878414 1928174 1964883 2107190 1930913
15322 1930913 1901827 1994492 2118576 2250725 2207678 2235539 2391790 2213067 2284612 2210804
15312 2210804 1942569 1957601 1906044 1905493 2116424 2082080 2164966 2328434 2318516 2412504 1900444
15301 1900444 1689794 1692473 1687443 2023173 2320844 2036102 1829895 2076445 1990087 2016456
15291 2016456 1843674 1529109 1582305 1881878 2141869 2071287 2020611 2215608 1995539 1939771
15281 1939771 1666757 1458882 1409740 1634001 2021028 2160416 1942076 1816566 1644389 2093013
15271 2093013 2310280 2125012 2072573 2227506 2521285 2486482 2047705 2125647 2371007 2069239
15261 2069239 2219372 2241416 2180790 2561001 2725168 2227366 2157391 1780741 1795261 1775434
15251 1775434 1978869 2157231 2108898 2008746 2144028 2175700 2194766 1954810 2109495 2275425
15241 2275425 2317735 2149034 2101397 2215752 2288115 2346640 1883023 1739802 1702070 1824070
15231 1824070 2069058 2239639 2392233 2404097 2082268 1878472 1586424 1757341 1708120 1849804
15221 1849804 2082025 2155749 2490506 2591646 2380807 2184564 2151007 2252444 2440083 2277251
15211 2277251 2326048 2295712 2183170 2003768 1965965 1885309 2010959 1942386 2122567 1965828
15201 1965828 1822831 2040678 2309535 2466948 2604001 2440256 2134193 2452368 2423359 2179997
15191 2179997 2335410 2353661 2152581 2207586 1950911 1766166 1919480 1965321 2136306 2061510
15181 2061510 1925221 2278864 2251667 2575702 2689838 2375117 2099117 1871026 2031407 2236550
15171 2236550 2099951 2462447 2329597 2279229 2393235 2162655 2077879 2597093 2481064 2109496
15161 2109496 2127886 2199757 2551739 2378230 2324398 2484331 2380600 2429895 2604826 2450687
15151 2450687 2152233 2248035 2286363 2281131 2151282 2002582 2290996 2170051 2368147 2276971
15141 2276971 2169060 1882012 1861818 2018071 1839011 1458886 1928564 1905872 2229728 2184758
15131 2184758 2293240 2638970 2380733 2035756 2100368 2157091 2049089 2065811 1919416 1872776
15121 1872776 1629433 2136221 2503226 2210869 1998881 2425458 2229237 2197131 2428408 2190621
15111 2190621 1679524 1778264 2037070 2085172 1906879 1866672 1960214 1940096 2241781 2584740
15101 2584740 2367126 2519727 2507709 2725608 2536041 2377451 2237299 2061583 2145543 2224806
15091 2224806 2299487 2324505 2111085 2104130 2327256 2362065 2701251 2423560 2414755 2489676 2299054
15080 2299054 2280721 2323968 2057715 1981250 1917751 2065211 1932266 2038708 2023217 2147761
15070 2147761 2350834 2434812 2795860 2640363 2411422 2046350 2079413 2281144 1986709 1818186
15060 1818186 1869269 1844968 2074629 1772191 1963756 1962271 2244767 2499873 2811212 2765285
15050 2765285 2695243 2459471 2163009 2065681 2284323 2365415 2243491 2151605 2003709 2050477
15040 2050477 2226696 2060800 2068454 1939706 2095182 2570657 2397272 2075640 2017143 2168300
15030 2168300 2208472 2350071 2417110 2314983 1950317 1790026 1556325 1674325 2022851 2081775
15020 2081775 2143227 2183507 2071498 2011469 2268313 2361648 1969820 1875492 1833604 1967887
15010 1967887 2008117 2073503 1722651 1846287 2098810 2579579 2754450 2446146 2470670 2533878
15000 2533878 2464121 2176955 2124171 1898742 1902959 2152483 1805597 1800336 2024862 2117498 2167618
14989 2167618 2142143 2312117 2289420 1919465 2070615 2040987 2094250 2153896 2090740 1687539
14979 1687539 1784427 1805993 1961625 2062410 2267034 2271081 2205180 2130890 2227961 2169228 2238008
14968 2238008 2581689 2702452 2346679 2099215 2092378 2265938 2097164 1915726 1841517 2009502
14958 2009502 2114626 1970882 2008023 2420538 2447454 2342815 2469543 2177349 2168429 1839205
14948 1839205 2083352 2119449 1745751 1257955 1507832 2064065 2455779 2482699 2376412 2449455
14938 2449455 2692989 2560606 2110987 2040321 2288952 2321400 2433581 2005552 1903931 2036112
14928 2036112 2166655 2181958 2269158 2161782 2170262 2485685 2516264 2511960 2055932 1853754 2144290
14917 2144290 2133383 2057516 2079970 1861041 1649282 2085190 2321301 2442155 2449531 2198893
14907 2198893 2282446 2342982 2347144 2527747 2520861 2479895 2142540 2238082 2184314 2071209 2240507
14896 2240507 2037990 2089907 1866048 1903057 2166624 2087996 2310820 2697337 2709803 2618558
14886 2618558 2253480 1938070 2231334 2253747 2271681 2270140 2108043 1789973 1791960 2111360
14876 2111360 2253978 2211157 2035668 2033645 1922412 2299819 2291610 2185518 1736494 1460192
14866 1460192 1811634 2151495 2214806 2083737 1877791 2027152 2127765 2045338 2104497 2180358
14856 2180358 2130158 2468428 2200377 2008669 2083408 1766020 2020596 1953106 2042769 2045213
14846 2045213 1986752 1886611 2243792 2403062 2244924 2096802 2330068 2433026 2431058 2134214
14836 2134214 2318297 2251399 2561189 2389298 2057599 1690560 1700612 1755444 1680660 1969591
14826 1969591 2437982 2385496 2315897 2252265 2238754 2077988 1833850 1694663 2160414 2553947
14816 2553947 2215008 1982440 1664574 1937300 2221753 2155211 1818605 1744718 1915306 2370259
14806 2370259 2143458 2094762 1882734 2148294 2051987 1824714 1791462 1816554 1968378 2067636
14796 2067636 2128396 2086515 2143475 2203217 2031994 2087883 1860463 2267045 2498359 2697745
14786 2697745 2624347 2530012 2378028 2333724 2089490 2036724 2175382 2430154 2612484 2508447
14776 2508447 2315634 2202570 2271969 2541662 2539961 2323947 2135800 2004098 1805326 1700239
14766 1700239 1836287 2144818 2245321 2262107 2147831 2024747 2334162 2682676 2332697 2394986
14756 2394986 2306305 2378347 2281785 1997044 1743952 1594846 2010357 1935722 1978070 1825011
14746 1825011 1947597 2241855 2094641 2146530 1893629 1931219 2344997 2606413 2623815 2319975
14736 2319975 2198806 1970383 2050454 2299452 2387681 2272673 2291502 2283244 2279877 2087844 2263944
14725 2263944 2246672 2428313 2340653 2447035 2292303 2286529 2330924 2586862 2061625 1656312
14715 1656312 1911015 2002256 2331322 2555421 2237110 2486804 2485278 2341741 2283227 2061234
14705 2061234 1987596 1870273 1718790 1819815 2014440 2011011 2170387 1910281 2133920 2326967
14695 2326967 2079669 2409646 2437784 2475057 2307905 2292069 1992661 2148085 2267885 1986637
14685 1986637 2348508 2273664 2356651 2285827 2331784 2553427 2537650 2622381 2522641 2237567 2143944
14674 2143944 2100307 2571139 2529054 2541706 2446679 2429016 2352846 2245787 2219199 2303886 2200827
14663 2200827 2109788 2256524 2089924 2092147 2130386 2045185 1988334 2246359 2030193 2045807 1929442
14652 1929442 1894289 2033628 2066494 2206430 2170856 2279785 2376733 2671363 2490876 2388579
14642 2388579 2303556 2471067 2611012 2655897 2678801 2555042 2323102 2593805 2607818 2701137
14632 2701137 2789684 2651051 2682435 2617648 2518466 2270383 2132103 2166339 2450937 1963258
14622 1963258 1974270 1819010 1998119 1980193 1883747 1927561 2295381 2333826 2288146 2010541
14612 2010541 1999618 2015580 1873588 1797261 1884800 2194273 2374627 2420871 2330822 2198102
14602 2198102 2106997 2223967 2269157 1894685 2170629 2442870 2368430 2591005 2401612 2464979
14592 2464979 2129676 2125551 2352988 2570695 2244807 2361706 2233580 2309540 2423941 2329599
14582 2329599 2401603 2368236 2499384 2242104 1985127 2161826 2147341 2075940 2011824 2256028
14572 2256028 2353555 2200269 2237980 2176290 2363209 2477999 2560686 2469536 2234499 2014570
14562 2014570 2105163 2391905 2156902 1979801 2328734 2251026 2023587 2153379 2074583 2235773
14552 2235773 2069002 2001676 2323740 2414180 2426845 2361385 2112513 2424608 2285407 2334253
14542 2334253 2305765 2240938 2246040 2174608 2111145 2106912 2283032 2274050 2135465 2375350 2405574
14531 2405574 2385680 2313221 2544556 2522621 2392336 2652258 2809894 2605442 2439278 2443646
14521 2443646 2536774 2421936 2484566 2628921 2617914 2656611 2391423 2209244 1817043 1822368
14511 1822368 2037910 2321882 2244528 2139057 2094095 2229390 2283397 2155930 2117691 2355366
14501 2355366 2433013 2433542 2249999 1872310 2152635 1970065 1971885 2048554 1950610 1779548 2201384
14490 2201384 2721733 2218643 1830111 1896003 2194206 2113580 2231422 2377291 2438362 2444796
14480 2444796 2627799 2675535 2594525 2410596 2353724 2383550 2395637 2364639 2428895 2240375 2708351
14469 2708351 2753007 2353215 2313909 2462868 2438281 2380625 2149228 2177039 2206265 2209388 2266733
14458 2266733 2203411 1874083 2256768 2326934 2086893 2213520 1988497 1909002 2153918 2090114
14448 2090114 2009412 1908734 1903320 1711785 1915142 2192031 2375915 2164484 1925012 2111829
14438 2111829 2217262 2442496 2384561 2336821 1978338 2396304 2591987 2111332 2195988 1969463
14428 1969463 2124089 2502413 2601377 2697306 2302774 2324478 2642215 2251093 1869701 2141007
14418 2141007 2633223 2698878 2991878 2843387 2482328 2719331 2594810 2725849 2165751 2010690
14408 2010690 1917845 1851419 2071710 2161513 1990688 1885960 1973146 2177473 1970580 1910880
$$ [...]
##END NTUPLES=NMR SPECTRUM
##END=
