##TITLE=1H_TG-2315
 CDCl3,8 sc, 
 5.02.2021
##JCAMPDX= 6.0         $$ Bruker NMR JCAMP-DX V2.0
##DATA TYPE= NMR SPECTRUM
##DATA CLASS= NTUPLES
##ORIGIN= UXNMR, Bruker Analytische Messtechnik GmbH
##OWNER= root
$$ XWIN-NMR		Version 3.5
$$ Fri Feb  5 10:18:01 2021 Russian Standard Time (UT+4h)  she@DPX200
##.OBSERVE FREQUENCY= 200.1315066352
##.OBSERVE NUCLEUS= ^1H
##.ACQUISITION MODE= SIMULTANEOUS
##.ACQUISITION SCHEME= undefined
##.AVERAGES= 8
##.DIGITISER RES= 18
##SPECTROMETER/DATA SYSTEM= spect
##.PULSE SEQUENCE= zg30
##.SOLVENT NAME= CDCl3
##.SHIFT REFERENCE= (INTERNAL, CDCl3, 0, 15.9305)
##AUDIT TRAIL= $$ (NUMBER, WHEN, WHO, WHERE, WHAT)
$$ ##TITLE= Audit trail, XWIN-NMR		Version 3.5
$$ ##JCAMPDX= 5.01
$$ ##ORIGIN= Bruker BioSpin GmbH
$$ ##OWNER= she
$$ F:/spectra/data/she/nmr/H-F/1/pdata/1/auditp.txt
$$ ##AUDIT TRAIL=  $$ (NUMBER, WHEN, WHO, WHERE, WHAT)
(   1,<2021-02-05 10:16:45.62 +0400>,<she>,<DPX200>,
      <created by zg, POWCHK disabled, PULCHK disabled
       configuration hash MD5:
       00 E9 B6 7A A2 85 ED C7 34 08 36 98 17 FE 4E 26
       data hash MD5: 16K
       A1 55 51 8A D7 0A ED 8C B5 BF CD C5 8D A7 76 A5>)
(   2,<2021-02-05 10:16:47.98 +0400>,<she>,<DPX200>,
      <Start of raw data processing
       efp BC_mod = 2 LB = 0.24 FT_mod = 6 PKNL = 1 PHC0 = -10394.25 PHC1 = 5.800948 SI = 16K 
       data hash MD5: 16K
       97 DC 93 37 8D 84 05 2E 54 58 9F 1F 84 DD 67 60>)
(   3,<2021-02-05 10:17:09.03 +0400>,<she>,<DPX200>,
      <pk PHC0 = 1.092879 PHC1 = -6 
       data hash MD5: 16K
       34 94 84 AE 15 A3 A6 DF A9 FB 7E E2 9A BA FC D2>)
(   4,<2021-02-05 10:17:12.34 +0400>,<she>,<DPX200>,
      <abs ABSG = 5 
       data hash MD5: 16K
       C7 1B 24 78 C7 CA 97 A2 42 6A F4 62 36 02 4D DD>)
$$ ##END=
$$ 
$$ hash MD5
$$ A3 C3 F2 64 24 DE 39 09 88 C9 39 1C 79 30 EA 29
##$RELAX= 
##$RELAX= 
##$RELAX= 
##$RELAX= 
##$RELAX= 
##$RELAX= 
$$ Bruker specific parameters
$$ --------------------------
##$DU= <F:/spectra>
##$EXPNO= 1
##$NAME= <H-F>
##$PROCNO= 1
##$TYPE= <nmr>
##$USER= <she>
##$AMP= (0..31)
100 100 100 100 100 100 100 100 100 100 100 100 100 100 100 100 100 100 
100 100 100 100 100 100 100 100 100 100 100 100 100 100 
##$AQSEQ= 0
##$AQ_mod= 1
##$AUNM= <au_zg>
##$AUTOPOS= <>
##$BF1= 200.13
##$BF2= 200.13
##$BF3= 200.13
##$BF4= 200.13
##$BF5= 200.13
##$BF6= 200.13
##$BF7= 200.13
##$BF8= 200.13
##$BYTORDA= 1
##$CFDGTYP= 0
##$CFRGTYP= 5
##$CHEMSTR= <none>
##$CNST= (0..31)
1 1 145 1 1 1 1 1 1 1 1 1 1 1 1 1 1 1 1 1 1 1 1 1 1 1 1 1 1 1 1 1 
##$CPDPRG= <>
##$CPDPRG1= <>
##$CPDPRG2= <>
##$CPDPRG3= <>
##$CPDPRG4= <mlev>
##$CPDPRG5= <mlev>
##$CPDPRG6= <mlev>
##$CPDPRG7= <mlev>
##$CPDPRG8= <mlev>
##$CPDPRGB= <>
##$CPDPRGT= <>
##$D= (0..31)
0 1.2 0 0 0 0 0 0 0 0.06 0 0.03 0 0 0 0 0.0002 0 0 0 0 0 0 0 0 0 0 0 0 
0 0 0 
##$DATE= 1612505805
##$DBL= (0..7)
120 120 120 120 120 120 120 120 
##$DBP= (0..7)
150 150 150 150 150 150 150 150 
##$DBP07= 0
##$DBPNAM0= <>
##$DBPNAM1= <>
##$DBPNAM2= <>
##$DBPNAM3= <>
##$DBPNAM4= <>
$$ [...]
##$SUBNAM3= <"">
##$SUBNAM4= <"">
##$SUBNAM5= <"">
##$SUBNAM6= <"">
##$SUBNAM7= <"">
##$SUBNAM8= <"">
##$SUBNAM9= <"">
##$SW= 16.9725356469052
##$SWIBOX= (0..15)
0 0 2 0 0 0 0 0 0 0 0 0 0 0 0 0 
##$SW_h= 3396.73913043478
##$TD= 16384
##$TD0= 1
##$TE= 0
##$TE2= 300
##$TE3= 300
##$TEG= 300
##$TL= (0..7)
0 120 120 120 120 120 120 120 
##$TP= (0..7)
150 150 150 150 150 150 150 150 
##$TP07= 0
##$TPNAME0= <>
##$TPNAME1= <>
##$TPNAME2= <>
##$TPNAME3= <>
##$TPNAME4= <>
##$TPNAME5= <>
##$TPNAME6= <>
##$TPNAME7= <>
##$TPOAL= (0..7)
0.5 0.5 0.5 0.5 0.5 0.5 0.5 0.5 
##$TPOFFS= (0..7)
0 0 0 0 0 0 0 0 
##$TUNHIN= 0
##$TUNHOUT= 0
##$TUNXOUT= 0
##$USERA1= <user>
##$USERA2= <user>
##$USERA3= <user>
##$USERA4= <user>
##$USERA5= <user>
##$V9= 5
##$VALIST= <valist>
##$VCLIST= <CCCCCCCCCCCCCCC>
##$VD= 0
##$VDLIST= <DDDDDDDDDDDDDDD>
##$VPLIST= <PPPPPPPPPPPPPPP>
##$VTLIST= <TTTTTTTTTTTTTTT>
##$WBST= 1024
##$WBSW= 4
##$XGAIN= (0..3)
0 0 0 0 
##$XL= 0
##$YL= 0
##$YMAX_a= 292080
##$YMIN_a= -130799
##$ZGOPTNS= <>
##$ZL1= 120
##$ZL2= 120
##$ZL3= 120
##$ZL4= 120
##$ABSF1= 15.89736
##$ABSF2= -1.075302
##$ABSG= 5
##$ABSL= 3
##$ALPHA= 0
##$AQORDER= 0
##$ASSFAC= 0
##$ASSFACI= 0
##$ASSFACX= 0
##$ASSWID= 0
##$AUNMP= <proc_1d>
##$AZFE= 0.1
##$AZFW= 0.1
##$BCFW= 0
##$BC_mod= 2
##$BYTORDP= 0
##$COROFFS= 0
##$CY= -3
##$DATMOD= 1
##$DC= 0
##$DFILT= <>
##$DTYPP= 0
##$F1P= 0
##$F2P= 0
##$FCOR= 1
##$FTSIZE= 16384
##$FT_mod= 6
##$GAMMA= 0
##$GB= 0
##$INTBC= 1
##$INTSCL= 2.992141e-10
##$ISEN= 128
##$LB= 0.24
##$LEV0= 0
##$LPBIN= 0
##$MAXI= 10000
##$MC2= 0
##$MEAN= 0
##$ME_mod= 0
##$MI= 1.114404
##$NCOEF= 0
##$NC_proc= -7
##$NLEV= 6
##$NOISF1= 3.799351
##$NOISF2= 2.8
##$NSP= 0
##$NTH_PI= 0
##$NZP= 0
##$OFFSET= 15.93052
##$PC= 1
##$PHC0= -10393.16
##$PHC1= -0.1990519
##$PH_mod= 1
##$PKNL= yes
##$PPARMOD= 0
##$PSCAL= 0
##$PSIGN= 0
##$REVERSE= no
##$SF= 200.130016829076
##$SI= 16384
##$SIGF1= 3
##$SIGF2= 2
##$SINO= 5.538805
##$SIOLD= 16384
##$SREGLST= <1H.CDCl3>
##$SSB= 0
##$STSI= 16384
##$STSR= 0
##$SW_p= 3396.73913043478
##$SYMM= 0
##$S_DEV= 0
##$TDeff= 16384
##$TDoff= 0
##$TI= <>
##$TILT= no
##$TM1= 0
##$TM2= 0
##$TOPLEV= 0
##$USERP1= <user>
##$USERP2= <user>
##$USERP3= <user>
##$USERP4= <user>
##$USERP5= <user>
##$WDW= 1
##$XDIM= 16384
##$YMAX_p= 472405879
##$YMIN_p= -827681
$$ End of Bruker specific parameters
$$ ---------------------------------
##NTUPLES= NMR SPECTRUM
##VAR_NAME=  FREQUENCY,     SPECTRUM/REAL,   SPECTRUM/IMAG
##SYMBOL=    X,             R,               I
##VAR_TYPE=  INDEPENDENT,   DEPENDENT,       DEPENDENT
##VAR_FORM=  AFFN,          ASDF,            ASDF
##VAR_DIM=   16384,         16384,           16384
##UNITS=     HZ,            ARBITRARY UNITS, ARBITRARY UNITS
##FACTOR=    0.207333158178281, 1,           1
##FIRST=     3188.17524723908, 0,            0
##LAST=      -208.563883195704, 0,           0
##MIN=       -208.563883195704, -827681,     0
##MAX=       3188.17524723908, 472405879,    0
$$ Real data points
##PAGE= N=1
##DATA TABLE= (X++(R..R)), XYDATA
$$ [...]
6158A029943M3329Q0804k47622q5351L97726J1455l27037j71870P0358J84163
6148I85898j02391j59757j06003q3200q9789K71762j35078k00611j54440K10768
6138D37159j50782J80918J29847n1270q406J28620j2272M2635m5980k644j98008
6127D49817J22037K61280j01915j48450n1925j02728n0358J9832J49848J67520
6117G14958p4004j68494j3539O5336q4270J57152j19640j99564K71907J55970
6107G05812j65634r1179K17151j05339k35664J23082J7887k24009J55993K45593
6097F43693n9806m4579K11309j04381K108m8911m0935j6785o6888K0352m7930
6086D47247K67334p8141l07235L79131P3893p3998L7274J38739k96106j88390
$$ y = [1029943, 1073272, 1154076, 906454, 821103, 1218829, 1230284, 903247, 731377, 801735, 985898, 883507, 723750, 617747, 534547, 444758, 716520, 581442, 380831, 226391, 437159, 286377, 467295, 597142, 545872, 537466, 666086, 653814, 696449, 650469, 647825, 449817, 571854, 833134, 731219, 582769, 530844, 428116, 377758, 397590, 547438, 714958, 640954, 472460, 458921, 524257, 439987, 597139, 477499, 277935, 549842, 705812, 540178, 448999, 666150, 560811, 325147, 448229, 466116, 242107, 398100, 643693, 583887, 539308, 750617, 646236, 648344, 599433, 558498, 541713, 474825, 495177, 447247, 714581, 636440, 329205, 708336, 782229, 708231, 745505, 884244, 588138, 399748]
6076C99748K56174k77064j78047J79660L1944r1643K74607k9506m13600J0665
6066A62938J67657K65555K08001k37881k13632J10045K3201k43575M9401M08305
6056G00015m29311p8418K70808J72931l09423O615K8786l33712K01044M0891n9389
6045B10837j13474r9871J52139J54739N2488R9472j43050r1874q0080K28569J17643
6034D87538k43663j24144L16898J05844k74723R0342J57486l59797Q0173M5677
6024B81631K88112k21660j0471j10143N8188q0137j18060j5571j4553K51715J98600
6013E07651L9019q0172l04197M5755M0917N4389J21265J16204o2917k22080M8276
6002C04110p9061O7391L56759j08375p7492J86433q2265k03475j95142j98692
$$ y = [399748, 655922, 378858, 200811, 380471, 412415, 320772, 595379, 565873, 152273, 162938, 330595, 596150, 804151, 566270, 352638, 462683, 485884, 242309, 291710, 700015, 270704, 192286, 463094, 636025, 326602, 333217, 362003, 28291, 229335, 270226, 210837, 97363, -2508, 149631, 304370, 356858, 456330, 313280, 221406, 141326, 369895, 487538, 243875, 119731, 436629, 542473, 267750, 358092, 515578, 155781, 235954, 281631, 569743, 348083, 337612, 227469, 285657, 205520, 87460, 71889, 57336, 309051, 507651, 546670, 466498, 162301, 208056, 248973, 303362, 424627, 540831, 477914, 255834, 304110, 225049, 292440, 649199, 540824, 463332, 649765, 567500, 364025, 168883, -29809]
5992b9809K16858J09055K7292j27587J16887M10456r5247j54592J42072L4716
5982F50101j18489N8752j43242j34086j43318N4541J25914M1083J34473o6838
5972D58891j06164K93158m2091j83639j56799J60205l0141o2545J3928n1869O6358
5961C59292j01986J14490R3045j4145l848k41383J43777q9094r7445m6723k1577
5950I4403j23556K0330J65845p6942j44126N9540k5923M3974K6497M5820j41786
5939e5924j58151L97481q011j81634J57809J66472M3098j28007P131o062k32781
5928A421j38605L6516m590k9900O5059R4917M0218R2603q3402j00779K20335n339
5916A88454J26616K7819q8388K0689k89740J06932K04353P084q4616q993K13525
$$ y = [-29809, 187049, 296104, 323396, 195809, 312696, 723152, 627905, 473313, 615385, 650101, 531612, 590364, 447122, 313036, 169718, 224259, 350173, 391256, 525729, 458891, 352727, 645885, 603794, 420155, 263356, 423561, 393420, 330875, 344803, 292934, 359292, 257306, 371796, 464841, 450696, 446848, 205465, 349242, 260148, 162703, 115980, 94403, -29153, -8823, 157022, 80080, -64046, -4506, -30429, 13545, 40042, 85862, -55924, -214075, 183406, 175395, -6239, 151570, 318042, 361140, 233133, 240264, 234202, 1421, -137184, -100668, -105258, -135158, -70099, 24818, 65036, 157639, 74237, -26542, 193793, 188454, 315070, 342889, 254501, 275190, -14550, 92382, 296735, 303819, 219203, 210210, 423735]
5905D23735j37495l4368j89116J73383o3652j71908k2472l4486R8796k5910J10498
5894A27005k528K25534k15722j34213j11472J3237k1511j46704p0621J56439L01443
5883A20887M3686p7660j12721J76529k18659p6016K04745p9881l6899N059P6371
5872B5441j08119J1055P9094J5391r6321K36488Q4916j53155Q7906o0804J0974
5861A32866J44178j32691p5682J53679m1767P1501K19901J2761j19635l6003J50007
5850D79115l46708J06853J94596l8624l51658J01462M27222n9641r6932j97341
5840B18344J78765L5097j37624K3291r5549j02895r2603R5912J33408q8139P9931
5829B47938j46650J73287J04974R518k1061l60692j15446J34221M004k8259l1646
$$ y = [423735, 286240, 251872, 62756, 236139, 172487, 579, -21893, -56379, 42417, 16507, 127005, 124477, 350011, 134289, 76, -111396, -98159, -119670, -266374, -336995, -180556, 120887, 164573, 86913, -25808, 150721, -67938, -143954, 60791, -19090, -55989, -50930, 25441, -82678, -71623, 7471, 22862, -73459, 163029, 247945, 94790, 182696, 121892, 132866, 277044, 144353, 68671, 222350, 180583, 252084, 471985, 484746, 365111, 329108, 479115, 132407, 239260, 433856, 395232, 43574, 145036, 572258, 512617, 415685, 218344, 397109, 432206, 294582, 317873, 222324, 119429, 26826, 122738, 256146, 168007, 247938, 101288, 274575, 379549, 389067, 368006, 7314, -108132, 26089, 30093, 1834, -29812]
5818b9812K04963N3034J86500p3426O2589L7199k23255N2977J26398n0125j02163
5807B44879n2148k1052R402p3028R3835K46807j63568j30569L9781J85457j64430
5796B15366r8245P5462J62541m217l6218J02397J8576k53164J98938J76641m63436
5785I4641J05197K91782j83167k42135P4132J27794j09589R9364Q4184n7928k4787
5774B59488j2519K90044n8460k08489L8376J3887k97157m441K33646K3738k29857
5763D8256J64975N2296j39168j19633J17409J59029r2177l968J42245n8118j35160
5752A35986L0287R2997j5253K24286q078l04167J22845K33525K35048l02942l68472
5741G6062J33417J86161P2764q6519J01348j56850j05731n6776L1340K67674j33609
$$ y = [-29812, 175151, 228185, 414685, 341259, 403848, 441047, 217792, 270769, 397167, 347042, 244879, 192731, 171679, 181081, 108053, 201888, 448695, 285127, 154558, 194339, 379796, 215366, 117121, 192583, 355124, 350907, 314689, 417086, 435662, 182498, 381436, 558077, 94641, 199838, 491620, 308453, 66318, 140450, 268244, 158655, 258019, 342203, 284275, 259488, 246969, 537013, 478553, 270064, 308440, 322327, 25170, 20729, 254375, 278113, 48256, 213231, 265527, 126359, 6726, 124135, 283164, 190987, 187019, 329264, 271146, 135986, 166273, 259270, 244017, 468303, 460225, 156058, 278903, 512428, 747476, 444534, 76062, 209479, 395640, 468404, 381885, 483233, 326383, 220652, 163876, 195216, 462890, 329281]
5730C29281l7909J30743P4569j75136J97021j23251j95202L6555p586K5015p3610
5719A80490R8512N7694K5942j84303j86689R6819P8708k1553r3010K3210J02757
5708A78577J41791j1644j92935j46572J10615L2521p6481R4942J40006j21993
5698A48827l40639L16698K28864j32390j77093J71497M3908J67560K66035p8632
5688F14635j30402k06499J34560O521J16065Q9709k13027j90004n6936J77324
5678C41946N0548R6537k20992p8318K19250K44342J8359R4823k56616k48616m6864
5667B14399R3870L7392o4239J63958l2415M13954K53170l86530j865M1121l53407
5656C79408k61650K82483j62041j5147K18859O4605j59864J06577N0476K9979
$$ y = [329281, 291372, 422115, 496684, 321548, 518569, 395318, 200116, 236671, 229085, 254100, 180490, 279002, 336696, 362638, 178335, -8354, 88465, 167173, 145620, 52610, 75820, 178577, 320368, 308724, 115789, -30783, 79832, 112353, 35872, 130814, 270820, 148827, -191812, 124886, 353750, 221360, 44267, 215764, 259672, 427232, 693267, 614635, 484233, 277734, 412294, 418815, 534880, 624589, 411562, 221558, 164622, 341946, 392494, 489031, 268039, 189721, 408971, 653313, 671672, 766495, 509879, 261263, 214399, 308269, 345661, 281422, 445380, 412965, 826919, 1080089, 693559, 691694, 732815, 379408, 117758, 400241, 238200, 223053, 441912, 506517, 346653, 453230, 503706, 533685]
5646E33685j06307J53768K47649m25180j23238n8263L78938r7920j73420Q1947
5636D11659J95417r5230j9611K09329J15348k83739M3122M7480j60613J1098J96707
5625F70967k76544j80366K19367J32217j24683N7043r6028N8681P9277j12641
5615D27290K44995L4166j68312j49838K28670J89847j68416J2457q7439O2777
5605F26197J19572j27133k61263j42386K58072M57311p11k21117J20612M5537
5595H74691j60612j84897K46909j7645j82150M4720J24784K15199L2791K4120
5585A017910p0724p327J43687J87446K8785j50663j8745r3613M323n457J6764
5574A052386K9776k56258j8215L82891K09796j05674l25357R3247P1803Q1849
$$ y = [533685, 427378, 581146, 828795, 403615, 280377, 222114, 601052, 503132, 329712, 411659, 607076, 511846, 492235, 701564, 816912, 533173, 576295, 623775, 463162, 474260, 670967, 394423, 214057, 433424, 565641, 440958, 498001, 401973, 460654, 539931, 427290, 672285, 706451, 538139, 388301, 616971, 806818, 638402, 650859, 563420, 626197, 745769, 618636, 357373, 214987, 473059, 930370, 929659, 708542, 829154, 874691, 714079, 529182, 776091, 758446, 576296, 621016, 745800, 960999, 993790, 1017910, 947186, 939859, 1083546, 1270992, 1299777, 1149114, 1130369, 1036756, 1041079, 1035622, 1052386, 1082162, 825904, 807689, 1190580, 1400376, 1294702, 969345, 1062592, 1134395, 1216244]
5564A216244J18824k1020k19004J2606P3658M0092J15793O5869o8508j58930N6992
5553A232616J33950m9724K0875k36288j29502J67179K83464P185K2128j26938
5543A324945K6679K3248R9805N9262j82324j79813m2584K52938q5326N8074l5488
5532A319416M0221j13759J17394J97394k48010L4103o1104R0858J54422K5491
5522A556426M9805m04724m7535K83271L77902l2941q9658J42052R8435Q7939M5317
5511B066289j64635j13051L2595K35326J17803M9738J34731L56479k16617l3756
5501B464902M59838P2949j90583K2600K74922K70395l4791N1246K0722L6880R2386
5490C541466N0517J84207j28898k4377p3120P5778j122n342L15897J09752J5409
$$ y = [1216244, 1335068, 1314048, 1095044, 1107650, 1181308, 1221400, 1337193, 1403062, 1334554, 1175624, 1232616, 1366566, 1316842, 1337717, 1101429, 971927, 1139106, 1422570, 1429755, 1451883, 1324945, 1351624, 1374872, 1474677, 1533939, 1351615, 1171802, 1129218, 1382156, 1296830, 1354904, 1319416, 1359637, 1245878, 1363272, 1560666, 1312656, 1346759, 1285655, 1376513, 1530935, 1556426, 1606231, 1201507, 1153972, 1437243, 1815145, 1782204, 1692546, 1834598, 1933033, 2020972, 2066289, 1901654, 1788603, 1821198, 2056524, 2174327, 2224065, 2358796, 2715275, 2498658, 2464902, 2924740, 2997689, 2807106, 2829706, 3104628, 3375023, 3340232, 3391478, 3412200, 3449080, 3541466, 3591983, 3776190, 3647292, 3622915, 3549795, 3625573, 3624451, 3619109, 3935006, 4044758, 4060167]
5479D060167M24632J03475K63170o1183L43869N7486j81057L26103R9085L86204
5469E821951L90165N04177L71174L12385N82485K89081O11590O93312P61964Q43262
5459A1181546N88674J004068J088519J070155P64701K07619L65903L63064O0381
5450A6694630o3140l04585o83148p01239l43075n64184m57939k01016m30448l87972
5440A2557884j81543K65487k37472K40604M86353K51863J16906K0758J17509j845
5430A3636504o6346J63797M12359M19371N37612K75286N19391O58264J235102
5421A7791340P25444Q00863N69771M06790P7838J20188P4035R4884j7786p1419
5411B0571948J44517M25005L78678P03828L26477K00693K75417l20021j37676
$$ y = [4060167, 4484799, 4588274, 4851444, 4790261, 5134130, 5191616, 5010559, 5336662, 5435747, 5821951, 6212116, 6716293, 7087467, 7399852, 7982337, 8271418, 8883008, 9576320, 10338284, 11181546, 11770220, 12774288, 13862807, 14932962, 15697663, 15905282, 16271185, 16634249, 16694630, 16631490, 16326905, 15643757, 14942518, 14599443, 14035259, 13577320, 13376304, 12945856, 12557884, 12376341, 12641828, 12404356, 12644960, 13131313, 13383176, 13500082, 13520840, 13638349, 13636504, 13570158, 13733955, 14146314, 14565685, 15103297, 15378583, 15897974, 16556238, 17791340, 18516784, 19317647, 19887418, 20294208, 20372046, 20492234, 20566269, 20661153, 20643367, 20571948, 20716465, 21141470, 21520148, 22223976, 22550453, 22751146, 23026563, 22706542, 22568866]
5402B2568866k95656n23818m57286k00788m01962o62327q80184j091151j260520
5393A6795174j128196j125864r08515r66216j101358r64048o46148n53032o21978
5384H779819l10160p81839o55932j84999l11300j50803n16243j76294j58362l57997
5374E175890k61090j19267k93311j94389K70386k28330l77486j37410j10370J91462
5364C916085m21661n8598J50348m2666l39056O2298R7675K48489j68158O664J30438
5353C581858N4699o0115k47623m0044k09729o0445j23875n9271l8216L4791j20361
5342B711669k0064k5189Q957k8712l8980k34123j55257l6929k13323j47959K58879
5331B078969R3855j3742k415R1804j6800m14120J6770J87100q4298j19675o5204
$$ y = [22568866, 22273210, 21749392, 21292106, 21091318, 20689356, 20027029, 19146845, 18055694, 16795174, 15666978, 14541114, 13632599, 12666383, 11565025, 10600977, 9954829, 9401797, 8779819, 8469659, 7687820, 7031888, 6846889, 6535589, 6384786, 5868543, 5692249, 5533887, 5175890, 4914800, 4795533, 4502222, 4307833, 4578219, 4349889, 3972403, 3834993, 3724623, 3916085, 3494424, 3435826, 3586174, 3543508, 3204452, 3266750, 3364425, 3612914, 3444756, 3451420, 3581858, 3636557, 3576442, 3328819, 3288775, 3079046, 3018601, 2894726, 2835455, 2797239, 2832030, 2711669, 2691605, 2666416, 2675373, 2646661, 2607681, 2373558, 2218301, 2181372, 1968049, 1820090, 2078969, 2172824, 2159082, 2156667, 2248471, 2231671, 1817551, 1834321, 2021421, 1937123, 1817448, 1752244]
5320A752244P9729R8846j0981J68630Q6629k08272J65131P8152k23951j24691
5310A861466Q7782k3147J0295j4778P473K57643k13584k781K46156j37549o2635
5299B016341K4998K06181k46328k02903J69948j22887j02243o7514J58686p2020
5289A762259J41858K89763k11743k68049P6115o0232O9743k95295l91265J35208
5279A248362R7389J4025k62848J49055n7406j180J54255q709j08003l05343L9432
5268I59029K0999n5953K57471N5682j32390l4169J38474q553K1469J07450l2296
5257A297213k08694O1310J761M03636L7602k98081m3487J50161J65114j3579J96773
5246A749729K4696n827q8150K8964k48366k87365J39340K68465K7780j45417L33457
$$ y = [1752244, 1831973, 1930819, 1919838, 2088468, 2175097, 1966825, 2131956, 2210108, 1986157, 1861466, 1949248, 1926101, 1936396, 1921618, 1929091, 2186734, 1973150, 1970369, 2216525, 2078976, 2016341, 2041339, 2247520, 2001192, 1798289, 1968237, 1845350, 1743107, 1675593, 1834279, 1762259, 1904117, 2193880, 1982137, 1714088, 1790203, 1729971, 1799714, 1504419, 1113154, 1248362, 1345751, 1359776, 1096928, 1245983, 1188577, 1187397, 1341652, 1332943, 1224940, 919597, 959029, 980028, 924075, 1181546, 1237228, 1104838, 1070669, 1209143, 1200590, 1222059, 1329509, 1297213, 1088519, 1149829, 1151590, 1555226, 1592828, 1294747, 1251260, 1401421, 1566535, 1552956, 1749729, 1774425, 1768598, 1680448, 1709412, 1461046, 1173681, 1313021, 1581486, 1609266, 1463849, 1797306]
5235A797306M3223l6927j724M8959O6881l12182k05104K01319Q1959J34948J03613
5224A922271j97332r540K9740J18488N3347j2611j93134l04868J46265j36460
5214A416166J02628j1227q6427J99467N6488r0194l27830J9763J2578q2052J89342
5203A398702K14194o7356j85928P2777J31101q043P2554r0380m8743O2297O3373
5192A614548N4980j32275j5008J69828K20513k54596q9567K93615o0112j09891
5182A692035O959J31468k24617P1887L54250J43701k02532J75909J78446j03856
5172B223650r8909L16143l8751k65446j1983J19284j22468j03604J19206P0377
5162B207499o8005N6942J93625k0768j10277K09799r7609k83505K99659K62017
$$ y = [1797306, 1840529, 1803602, 1801878, 1850837, 1917718, 1605536, 1400432, 1601751, 1683710, 1818658, 1922271, 1724939, 1715399, 1745139, 1863627, 1916974, 1904363, 1711229, 1406361, 1552626, 1416166, 1518794, 1507567, 1421140, 1620607, 1677095, 1586901, 1259071, 1278834, 1291412, 1209360, 1398702, 1612896, 1545540, 1359612, 1432389, 1563490, 1555447, 1628001, 1537621, 1488878, 1551175, 1614548, 1669528, 1537253, 1522245, 1692073, 1912586, 1657990, 1568423, 1862038, 1801926, 1692035, 1698994, 1830462, 1605845, 1677732, 2031982, 2175683, 1973151, 2149060, 2327506, 2223650, 2124741, 2440884, 2402133, 2136687, 2124704, 2243988, 2121520, 2017916, 2137122, 2207499, 2139494, 2196436, 2390061, 2369293, 2259016, 2468815, 2371206, 2087701, 2387360, 2649377]
5152B649377k0877P116j57847J81749J06777J7317K9463L0317j05092O4586J03265
5141B906151j76663j0575m0820J18808J02511r7567L19363j06381j963J50993
5131C163857r5932L7563Q9999j09640k35860J50490K57856j19467j73241J50420
5121C116045J18280l3682k6171L25601N2184j6116O2702J02864j86141k27229
5111C288337P7272l1510m7467K55650L4173K9870k07884J32344Q4074o4918k36146
5100C313795K95594O4655j93650R6752K03360l8341j65731K14940J74595j25384
5090C840585j13371J79764N6662k19561j52161R4678j8303j89737L01031K26716
5080D006303j09286J42J42419K677j60097Q9015j17474n9992n8833K56260J05718
$$ y = [2649377, 2628500, 2635616, 2477769, 2659518, 2766295, 2783612, 2813075, 2843392, 2738300, 2802886, 2906151, 2729488, 2718913, 2678093, 2796901, 2899412, 2801845, 3121208, 3014827, 3012864, 3163857, 3067925, 3105488, 3195487, 3085847, 2849987, 3000477, 3258333, 3138866, 2965625, 3116045, 3234325, 3200643, 3174472, 3500073, 3552257, 3536141, 3598843, 3701707, 3515566, 3288337, 3365609, 3334099, 3286632, 3542282, 3576455, 3606325, 3398441, 3530785, 3614859, 3549941, 3313795, 3609389, 3674044, 3480394, 3577146, 3780506, 3742165, 3576434, 3791374, 3965969, 3840585, 3727214, 3906978, 3963640, 3744079, 3591918, 3686596, 3668293, 3478556, 3779587, 4006303, 3897017, 3897159, 4039578, 4042255, 3882158, 3971173, 3853699, 3793707, 3734874, 3991134, 4096852]
5069D096852J34779J42968J79311J4k72072N3769J79493k3270Q0539J33581r0393
5058D615571Q5621q798K25811N6130O7357P265p003L3841J05976J29379k00626
5047E110524O2536K66520J58717J4822L02337K34982L6139L04950L4595j68893
5037F357229r2765K50978J47801J81845r3455J10493K61287L06906J19895R4902
5027G645116K88420q2655N7739J79855L36932O47036j2758k8586K07173K67727
5017I505999L61219J58962L54093L08978K28339K62020K20901K19605M11194Q9795
5007A2121105N50177N07387M68609M08119M18757L04673N10827M11801M15645
4998A6117100M08015M54654P93798O54812N52870Q50562N74960N38358J050081
$$ y = [4096852, 4231631, 4374599, 4553910, 4553924, 4281852, 4335621, 4515114, 4491844, 4572383, 4705964, 4615571, 4701192, 4692394, 4918205, 4974335, 5041692, 5048957, 5041954, 5075795, 5181771, 5311150, 5110524, 5173060, 5439580, 5598297, 5613119, 5915456, 6150438, 6186577, 6491527, 6526122, 6357229, 6264464, 6515442, 6663243, 6845088, 6751633, 6862126, 7123413, 7430319, 7550214, 7645116, 7933536, 7850881, 7908620, 8088475, 8425407, 9072443, 9059685, 9031099, 9238272, 9505999, 9867218, 10026180, 10380273, 10689251, 10917590, 11179610, 11400511, 11620116, 12031310, 12121105, 12671282, 13178669, 13647278, 14055397, 14474154, 14778827, 15289654, 15701455, 16117100, 16525115, 16979769, 17773567, 18428379, 18981249, 19831811, 20406771, 20945129, 21995210]
4989B1995210J099571O91956N04335P59280Q74467Q94358P62987Q43184J152576
4980B9577924J059373J061419J598269J713435J691042J851792J998841K036677
4972D2588772K387979K194500K357550K496325L144862L279927L505796M409253
4964F6364964M496873N026494N679559O569406O574215P331765Q102529P930301
4956A18076106P536891O617310M856415K308480j30226j214117j500465j356433
4948A35193961j148703k156058l599245m807947n704053o010745o692334o716210
4940I8358666o103719n981805o438575n902863n075699m731666m427823l951053
4932E5745463l511665l776414l020472k288152k214230k191604j805226j808118
$$ y = [21995210, 23094781, 23786737, 24291072, 25050352, 25924819, 26819177, 27582164, 28425348, 29577924, 30637297, 31698716, 33296985, 35010420, 36701462, 38553254, 40552095, 42588772, 44976751, 47171251, 49528801, 52025126, 55169988, 58449915, 61955711, 66364964, 70861837, 75888331, 81567890, 88137296, 94711511, 102043276, 110145805, 118076106, 125612997, 132230307, 137086722, 139395202, 139264976, 138050859, 136550394, 135193961, 134045258, 131889200, 128289955, 123482008, 117777955, 111767210, 105074876, 98358666, 92254947, 86273142, 79834567, 73931704, 68856005, 64124339, 59696516, 55745463, 52233798, 48457384, 45436912, 43148760, 40934530, 38742926, 36937700, 35129582]
4924C5129582j728727j479934j143130r36676j151728j406934j135080j231441
4916B4915932r41655q12280q65598q77888j038660m65221o38808q99012o41427
4907A7735383m21423m45469n71067k40251l76940k60993m96791m94406l03263
4898A4124780l39315k28845k80903j57397l62700J11984j57299n7710k15205k0979
4888A2416411J31164o1066l00947N4561k11328j59465Q4235J31337J76482m4875
4878A2216509J46884q3447n2651o3732J99314J53864j58196O1L97565L44415J23031
4867A3223617J16420L87383M47386L65689J66570P34437L98416L14037O27396
4858A6781351Q90260O84109O06555Q00076R49592P34895J119197J138658J106107
$$ y = [35129582, 33400855, 31920921, 30777791, 29841115, 28689387, 27282453, 26147373, 24915932, 23974277, 23161997, 22296399, 21418511, 20379851, 19914630, 19275822, 18376810, 17735383, 17313960, 16868491, 16297424, 16057173, 15680233, 15419240, 14922449, 14428043, 14124780, 13785465, 13556620, 13275717, 13118320, 12755620, 12867604, 12710305, 12652595, 12437390, 12416411, 12547575, 12486509, 12185562, 12240123, 12028795, 11869330, 11953565, 12084902, 12261384, 12216509, 12363393, 12279946, 12227295, 12163563, 12362877, 12516741, 12358545, 12358606, 12756171, 13100586, 13223617, 13340037, 13727420, 14174806, 14540495, 14707065, 15441502, 15839918, 16153955, 16781351, 17671611, 18355720, 18962275, 19762351, 20711943, 21446838, 22566035, 23704693, 24810800]
4849B4810800J184456J308369J836876J454524R95470J434015J334926J033493
4841C5392929R77815J203390J086968R54365J697346J872479J601159J497595
4833D6284046J555947J394144K09459n11353p74501j555093k156775k007993k019209
4824D0418672k502705k322486j930217j644143j626979j228792r30797j237815
4816B6994738j263773o61761n69666p16279p77561k17379j47393j47611m3964
4807B2449351R3886J46496k6132J37730L06639R4491K73458M82999J46815J17665
4797B4223398L93018M17383K73350J14909k5534K19937J02765j72128j70224k89675
4787B5087199o79331o35077k24853k02117o01378n34279k98965k98761l79181
$$ y = [24810800, 25995256, 27303625, 29140501, 30595025, 31590495, 33024510, 34359436, 35392929, 36370744, 37574134, 38661102, 39615467, 41312813, 43185292, 44786451, 46284046, 47839993, 49234137, 49443596, 48932243, 48157742, 46602649, 44445874, 42437881, 40418672, 37915967, 35593481, 33663264, 32019121, 30392142, 29163350, 28232553, 26994738, 25730965, 25069204, 24499538, 23783259, 23005698, 22788319, 22640926, 22493315, 22449351, 22543237, 22689733, 22663601, 22801331, 23107970, 23202461, 23475919, 23958918, 24105733, 24223398, 24616416, 25033799, 25307149, 25422058, 25396524, 25616461, 25719226, 25547098, 25376874, 25087199, 24407868, 23772791, 23547938, 23345821, 22744443, 22210164, 21911199, 21612438, 21233257]
4778B1233257m71651j85631p95635n88645n96773m80378n71710p50931o24264
4769A6167639o74923l93734n54902m49556l93468l86875m68062l65789j02129
4760A2378201k91987n0160q774l50281k52344K0991L7462j93122k42742p0560
4750A0976684k5773p9897O0125j3666J30283J69852J05666l3983j83256l40518
4740A0765517k36093k27903k45081k19920k27951l12912m24852l81441j69027
4731H320337m232k46595j02493o8874k19364k09444j17577j68590k88803j94531
4721F699834o495n2393l5997j21623L2827q0168J75789j44771j11002n8285p2093
4710F225623r3191j91289Q8729J4557P1562J49474M0947p2780J41602p352j05802
$$ y = [21233257, 20761606, 20575975, 19780340, 19191695, 18594922, 18114544, 17542834, 16791903, 16167639, 15492716, 15098982, 14544080, 14094524, 13701056, 13314181, 12846119, 12480330, 12378201, 12086214, 12036054, 12027280, 11676999, 11424655, 11445646, 11483108, 11289986, 11047244, 10976684, 10950911, 10871014, 10931139, 10917473, 11047756, 11217608, 11323274, 11289291, 11106035, 10765517, 10529424, 10301521, 10056440, 9836520, 9608569, 9295657, 8870805, 8489364, 8320337, 8316105, 8069510, 7967017, 7898143, 7678779, 7469335, 7351758, 7183168, 6894365, 6699834, 6693339, 6640946, 6604949, 6483326, 6516153, 6435985, 6611774, 6467003, 6356001, 6297716, 6225623, 6132432, 5941143, 6029872, 6044429, 6115991, 6265465, 6306412, 6233632, 6375234, 6367882, 6262080]
4699F262080o7902R4459q3381k4780n3303l8286m9948J15768j8187J07962M41484
4688F685966J46909j62571l2134k8316O2820Q269J14951p1697R0601J08380J10622
4677G033800L9884k5178L82176k8010k09319m0012L14985K5710j24404j33834
4667G235798n546J12186K49592j76971K3023l7245J0797L03225j50359O374K37528
4656G808402K3410j34387J45810j400J2285j50381j16360Q5956o1033J9139r1714
4645G539727j06859O2548J25519L46436m4454j40765L7702L5603J71474K37463
4635H264394r7871n6821J80416L69254M171n9100q207J07825J10014j35892J25220
4624H803403J76682J61546L408p849l3924J0331M8073Q7065M7537j11469K14846
$$ y = [6262080, 6194178, 6288637, 6205256, 6180476, 6127173, 6088887, 6038939, 6154707, 6136520, 6244482, 6685966, 6832875, 6670304, 6638170, 6609854, 6672674, 6680943, 6795894, 6724197, 6814798, 6923178, 7033800, 7073684, 7048506, 7430682, 7402672, 7193353, 7153341, 7468326, 7494036, 7369632, 7235798, 7230252, 7342438, 7592030, 7415059, 7438082, 7400837, 7411634, 7714859, 7564500, 7570874, 7808402, 7831812, 7697425, 7843235, 7841835, 7854120, 7703739, 7587379, 7673335, 7612302, 7631441, 7539727, 7432868, 7495416, 7620935, 7967371, 7922917, 7782152, 7819854, 7855457, 8026931, 8264394, 8166523, 8109702, 8290118, 8659372, 8663543, 8604443, 8596236, 8704061, 8814075, 8678183, 8803403, 8980085, 9141631, 9145039, 9137190, 9103266, 9113597, 9161670, 9248735, 9296272, 9184803, 9399649]
4613I399649K31492k29155J0382M11761j82239m7695J74411J13159o5061m5488
4603I771216J86236p5690j75762j00799P8410N6985k8035J83029J85624j8234
4593A0062980l40856k6685L13682L8212J56930K97106K549k39965o0318L83523
4583A0587158o3012j52807L03986K3928J87275N4818J17710j13852L00888K43726
4573A1489818l5239n2201n4921K19413Q8108p7759J39787L12805j0678K6681J36894
4562A2182708M26181r6215M266K82571k8973Q305N3041J20367O8264L97051O3090
4551A3480656J66028L49262J04427Q2838K0139J46064K80708L80705K54492J71462
4541A5436781L65528L75152N50044J38114K53174L85683L25728L35130L50722
$$ y = [9399649, 9631141, 9401986, 9412368, 9824129, 9641890, 9594195, 9768606, 9881765, 9816704, 9771216, 9957452, 9881762, 9706000, 9605201, 9683611, 9740596, 9712561, 9895590, 10081214, 10062980, 9722124, 9695439, 10009121, 10047333, 10204263, 10501369, 10503918, 10263953, 10203635, 10587158, 10524146, 10371339, 10675325, 10699253, 10886528, 10941346, 11059056, 10945204, 11246092, 11489818, 11454579, 11402378, 11347457, 11566870, 11654978, 11577219, 11717006, 12029811, 12019133, 12045814, 12182708, 12608889, 12512674, 12516940, 12799511, 12770538, 12778843, 12831884, 12952251, 13020515, 13417566, 13480656, 13646684, 13995946, 14100373, 14183211, 14203350, 14349414, 14630122, 15010827, 15265319, 15436781, 15802309, 16177461, 16727505, 16865619, 17118793, 17504476, 17830204, 18165334, 18516056]
4532A8516056L28054J45910R2369L44022M00367N88719J41879J52815L31793K94376
4522B1336360O23608K83216J48511J08496L87782N50277M35018K94265M12162
4513B4579695N26784N52860N70924P77785N22931O39256R23517Q07013J249029
4504C1149794J506242J437771J437343K053898K348792K495083K734050K541496
4496D7704469K219819J016404J42133o3394j93253L25163M63161L76699M31192
4487E2422393R39577J464587J979881K531358J960313K537269K865158K742118
4479F9442654K311447K350029K775371K825642L021282L077645L203472L351821
4471I2359363K976537J982917L68107n82338q02410q90945n11241q68642j149702
$$ y = [18516056, 18844110, 18990020, 19082389, 19426411, 19826778, 20415497, 20557376, 20710191, 21041984, 21336360, 21959968, 22243184, 22391695, 22500191, 22887973, 23438250, 23873268, 24167533, 24579695, 25106479, 25659339, 26230263, 27008048, 27530979, 28170235, 29093752, 29900765, 31149794, 32656036, 34093807, 35531150, 37585048, 39933840, 42428923, 45162973, 47704469, 49924288, 50940692, 51082825, 51019431, 50826178, 51151341, 51614502, 51991201, 52422393, 53361970, 54826557, 56806438, 59337796, 61298109, 63835378, 66700536, 69442654, 71754101, 74104130, 76879501, 79705143, 82726425, 85804070, 89007542, 92359363, 95335900, 97318817, 97686924, 97104586, 96302176, 95411231, 94899990, 94031348, 92881646]
4462I2881646j161906j187157q18513j100154j601288k034596k173878k337248
4454H0466906k899497k688198k680773k643692k822755k644912k019606k517341
4446E9550132k055927j965867k069656k295003k363855k695337k635706k184616
4438D1284165k187484k479084j865690j738816j800782j401349j367729q83410
4430B7559821j018015j206695j045221n08599p13437q58707l94249l63267m58513
4421B0993118j74622j50618k473k19284j68627k54790j19746o8732n8373n21966
4411A9253887o02639n22416k40166l45156l99788k31028j77627l46495m16095
4402A5972477m4464k24010j21601m21661k41397P6663k07442j67654j05183k31056
$$ y = [92881646, 91719740, 90532583, 89714070, 88613916, 87012628, 84978032, 82804154, 80466906, 77567409, 74879211, 72198438, 69554746, 66731991, 64087079, 62067473, 59550132, 57494205, 55528338, 53458682, 51163679, 48799824, 46104487, 43468781, 41284165, 39096681, 36617597, 34751907, 33013091, 31212309, 29810960, 28443231, 27559821, 26541806, 25335111, 24289890, 23781291, 23067854, 22209147, 21814898, 21451631, 20993118, 20818496, 20667878, 20665405, 20446121, 20277494, 20022704, 19902958, 19834226, 19775853, 19253887, 18651248, 18128832, 17888666, 17543510, 17143722, 16912694, 16735067, 16388572, 15972477, 15928013, 15704003, 15582402, 15160741, 14919344, 14996007, 14788565, 14620911, 14515728, 14284672]
4392A4284672j41754K7297q4420k14653j48689m00800n51514l29857j17411l75961
4382A1946910k86692l03861k07962R5080r2561k79484o6641M4726J0674k06222
4372A0653967j52947K8623P2082j84223k50657K69770J84650J52009J15249J13128
4362A1001651J14718j30349r0286j16614m05395j57613M9497k23127m28198L3183
4352I647467j22898k56229L30654K69258j0057K8302J27717L13383j07793j45397
4342A0074407j09507J80616J47516O3996K23793j54507k20068j36912j58624k74955
4332I635755m48874k06825k11602k30475j49655r4183k31516r4040j04169Q528
4322G872944j4382J9384k9445Q226q5595r7547L9151j37327j26587K19726M90849
$$ y = [14284672, 14142918, 14170215, 14085795, 13871142, 13722453, 13321653, 12770139, 12440282, 12322871, 11946910, 11660218, 11356357, 11148395, 11243475, 11150914, 10871430, 10804789, 10849515, 10860189, 10653967, 10501020, 10529643, 10601725, 10417502, 10166845, 10436615, 10621265, 10773274, 10888523, 11001651, 11116369, 10986020, 10895734, 10779120, 10373725, 10216112, 10265609, 10042482, 9614284, 9647467, 9524569, 9268340, 9598994, 9868252, 9858195, 9886497, 10014214, 10327597, 10219804, 10074407, 9964900, 10145516, 10293032, 10357028, 10580821, 10426314, 10206246, 10069334, 9910710, 9635755, 9186881, 8980056, 8768454, 8537979, 8388324, 8294141, 8062625, 7968585, 7864416, 7872944, 7858562, 7877946, 7848501, 7856727, 7771132, 7673585, 7712736, 7575409, 7448822, 7668548, 8159397]
4311H159397k3230J00979r2865k3655k49026j03062l6951l18255l48746j29415
4301F935171j46224j32936k39269N0370j66238l29844j19115K86709j67457j74823
4291E796344Q8569K109l21306K9113j8013j1062n017J69745M63070k82795m98434
4280E412323L7487L4239j87768J42201J73228l97806k35725J19343M2952Q3983
4270E224457J17986K32711m23478Q827J19439k0800k10384j70633J22213j42160
4260D858178J07661J88315L5278J55027j42233l7482j08831j20347o1118j17266
4250D757182m8452r9126n354L4252P3873J25371j07689j18518j42755M2896J02454
4239D614134m4538m3082j04892R5593k6493j92970l5179l00258L81698K23516
$$ y = [8159397, 8136167, 8237146, 8144281, 8120626, 7871600, 7768538, 7731587, 7413332, 7064586, 6935171, 6788947, 6656011, 6416742, 6467112, 6300874, 5971030, 5851915, 6138624, 5971167, 5796344, 5884913, 5887022, 5565716, 5594829, 5576816, 5565754, 5560737, 5730482, 6193552, 5910757, 5412323, 5449810, 5484049, 5296281, 5438482, 5611710, 5213904, 4978179, 5097522, 5140474, 5224457, 5342443, 5575154, 5151676, 5160503, 5279942, 5259142, 5048758, 4878125, 5000338, 4858178, 4965839, 5154154, 5189432, 5344459, 5202226, 5164744, 5055913, 4935566, 4874448, 4757182, 4708730, 4609604, 4604250, 4638502, 4712375, 4837746, 4730057, 4611539, 4468784, 4511680, 4614134, 4569596, 4526514, 4421622, 4517215, 4490722, 4297752, 4262573, 3962315, 4344013, 4567529]
4229D567529j09895o8860l5334p1174k15185K5262R9444o8817j26533m6616j33669
4218C816152k14043L27724J30112k02920j32474j22398J21598j9098o4260N1294
4208C691687j10637o1557q3736q934K97662j03615K38720o4903k56574O8716R6810
4197C703639k65167k11261l4004J47933L34441J45349M3175l3731q4811K2894
4187C768457N8472M2351l54634j99663L11683k8527m6070q352K02103k34144k12372
4176C299304J98627N693j71529R6803O2529m06968L119K30841j28613k0529k1022
4165C148255J14618J71254j23400q3698k09603O5120k65188p030M59314j75755
4155C093887j05964j15474J02494r5886J4360o6263j31037L844J33402J971l0568
$$ y = [4567529, 4457634, 4388774, 4353440, 4282266, 4067081, 4092343, 4191787, 4122970, 3996437, 3949821, 3816152, 3602109, 3929833, 4059945, 3857025, 3724551, 3602153, 3723751, 3704653, 3640393, 3691687, 3581050, 3519493, 3435757, 3426823, 3724485, 3620870, 3859590, 3794687, 3538113, 3606829, 3703639, 3438472, 3227211, 3193207, 3341140, 3675581, 3820930, 3864105, 3830374, 3745563, 3768457, 3826929, 3869280, 3514646, 3314983, 3626666, 3598139, 3552069, 3543717, 3745820, 3511676, 3299304, 3497931, 3503624, 3332095, 3428898, 3491427, 3084459, 3087578, 3318419, 3189806, 3169277, 3148255, 3262873, 3434127, 3310727, 3227029, 3017426, 3082546, 2817358, 2810328, 3269642, 3093887, 2987923, 2872449, 2974943, 2879057, 2893417, 2827154, 2696117, 2699961, 2833363, 2835334, 2804766]
4144B804766j19864r3799J76J73793l5180k26255J11980J05662J12412J2662P9458
4133B925811k45537j21014L19966N7535Q1870k82705J2126p844j5489J87942K2288
4122B934949K604K7127q06j05923q6750O4513N1542m3509Q4191n9145J73270m9927
4110B992136L4038j89819L01041j68147J9059M2701j7453R0213n553K4739K51292
4099C374247m84222P3392J53043K20409p6835j89533P1139j45474O5976O8513
4089C130655R0210j47960r3434K81535J08963K0028L3772j47510l64195M1848
4079B953912J79776j00763k96051Q3066J43973k38471O9143L14337l66123k62987
4069B479812J85766n2288o5852l35548L25449K9398k02696j01824J75053P2889
$$ y = [2804766, 2684902, 2591103, 2591279, 2765072, 2729892, 2503637, 2615617, 2721279, 2833691, 2846353, 2925811, 2680274, 2559260, 2879226, 2936761, 3018631, 2735926, 2748052, 2740208, 2724719, 2912661, 2934949, 2937553, 2964680, 2963874, 2857951, 2771201, 2835714, 2887256, 2843747, 2927938, 2868793, 3042063, 2992136, 3026174, 2836355, 3137396, 2969249, 2988308, 3031009, 3013556, 3103769, 3098216, 3122955, 3374247, 2890025, 2963417, 3116460, 3336869, 3260034, 3070501, 3141640, 2996166, 3062142, 3130655, 3220865, 3072905, 2979471, 3261006, 3369969, 3389997, 3423769, 3276259, 2912064, 2953912, 3133688, 3032925, 2736874, 2819940, 2963913, 2725442, 2794585, 3108922, 2742799, 2479812, 2665578, 2613290, 2547438, 2211890, 2537339, 2566737, 2364041, 2262217, 2437270, 2510159]
4059B510159j41818J19883l2098L9758J14568k9145j36770l50193Q9556L04712
4049B488612J75894k45561K12884k9171j20728j63985J45439j59852k02380j34193
4039A966959L11498J27900j34690j51566J91870K49096k90460o2543J9035j30776
4029B096323O6143N2918O3705j45826K23753j44839l29707j3804K88167p9576
4019B077257p3274J15155J65203n1583j12039L2581j18986J22505N7335K51723
4009B465877R56p397p6962m3010l9490L4316K09343j68865r3006P0206J77882
3998B529850o4348j80124J90092J847m6287j0387J30796o1278k5520J26063J2892
3987B603596k42273J81067j97235J00277N1042J22756J08835k56402p0162j95433
$$ y = [2510159, 2368341, 2488224, 2456126, 2495884, 2610452, 2581307, 2444537, 2094344, 2183900, 2488612, 2664506, 2418945, 2631829, 2602658, 2481930, 2317945, 2463384, 2303532, 2101152, 1966959, 2278457, 2406357, 2271667, 2120101, 2311971, 2561067, 2270607, 2208064, 2227099, 2096323, 2162466, 2215384, 2279089, 2133263, 2357016, 2212177, 1882470, 1868666, 2156833, 2077257, 2003983, 2119138, 2284341, 2232758, 2120719, 2153300, 2034314, 2156819, 2214154, 2465877, 2466833, 2459436, 2382474, 2339464, 2299974, 2334290, 2543633, 2374768, 2281762, 2351968, 2529850, 2465502, 2285378, 2475470, 2477317, 2431030, 2420643, 2551439, 2490161, 2464641, 2590704, 2603596, 2361323, 2542390, 2345155, 2445432, 2496474, 2619230, 2728065, 2471663, 2401501, 2206068]
3977B206068J15565N6474R0052Q3787k48179J09316K13521O7690k35502Q2643
3967B541435q283j36422K03407R9875j70406l27079K45367J34026J12933J15689
3957B810542J35945o2197q8853Q9159j9466q0754j43972J37144l1616N8513p7521
3946B726924Q0072j42871k7608N120M30235J40017l92523N5934n9651r5610L3445
3935B753484P7030J1296r9658j81701J62884Q3472L8664P043q9212K11720L1770
3924C006792P3963l7597l51003k31143K83574K56573q43J28400J05372j8561j37947
3913C077580m777k1120m293J44122K20248r6648m9993J354j34372m6477j19730
3902B965894K77892J00213K63060L996j63923L1413n6346l9759M7800r0578r8435
$$ y = [2206068, 2321633, 2378107, 2468159, 2551946, 2303767, 2413083, 2626604, 2694294, 2458792, 2541435, 2533152, 2396730, 2600137, 2700012, 2529606, 2202527, 2447894, 2581920, 2694853, 2810542, 2946487, 2884290, 2795437, 2884596, 2865130, 2784376, 2640404, 2777548, 2745932, 2804445, 2726924, 2806996, 2664125, 2636517, 2641637, 3071872, 3211889, 2819366, 2875300, 2815649, 2720039, 2753484, 2830514, 2841810, 2742152, 2560451, 2723335, 2806807, 2845471, 2852514, 2763302, 2975022, 3006792, 3080755, 3043158, 2692155, 2461012, 2744586, 3001159, 3000316, 3128716, 3234088, 3215527, 3077580, 3072803, 3051683, 3047390, 3191512, 3411760, 3315112, 3265119, 3266473, 3132101, 3085624, 2965894, 3243786, 3343999, 3607059, 3611055, 3447132, 3478545, 3422199, 3382440, 3430240, 3339662, 3241227]
3891C241227Q2374K68409K18085L0631k28397j37520K28715K49859k66311n3613
3881C633459k1079J03346j48921J35060P3261M584J57396K28758K1215j23863
3871D063216L28486O2087l43564J9211M22116j55917j15382j1134K07416n2808
3861D423727Q5964K29793K39760j84207j95541Q4408J8430p2171J34537K4443
3851D789143Q7677r9643J49814p2816m7649j90258L29685j39118r8794J66452
3841D874493J16288l49916N4455L41351r7364j71446J82983J47286m6653K10112
3831E261589J13774j81576K17149j57414q8372J50440L6362J72169J75402Q4100
3821E783623O1920J93711K00483k42028n5507M22694p907j25073J11184K32863
$$ y = [3241227, 3323601, 3592010, 3810095, 3840726, 3612329, 3474809, 3703524, 3953383, 3687072, 3633459, 3612380, 3715726, 3566805, 3701865, 3775126, 3779710, 3937106, 4165864, 4187079, 4063216, 4391702, 4453789, 4110225, 4129436, 4551552, 4395635, 4280253, 4269119, 4476535, 4423727, 4509691, 4739484, 4979244, 4795037, 4599496, 4683904, 4702334, 4630163, 4764700, 4789143, 4876820, 4777177, 4926991, 4854175, 4806526, 4616268, 4945953, 4806835, 4708041, 4874493, 4990781, 4640865, 4695320, 5036671, 4939307, 4767861, 4950844, 5098130, 5051477, 5261589, 5375363, 5193787, 5410936, 5253522, 5165150, 5315590, 5351952, 5524121, 5699523, 5783623, 5845543, 6039254, 6239737, 5997709, 5942202, 6364896, 6356989, 6231916, 6343100, 6575963]
3811F575963N332M16384K63858j89434p8968J84351J73288J19402j32054K22064
3801G560186j14453J46039K19069K18262J88660k199j14220L93138M76800j08913
3791H862369j32368J75134L93251P1272J09116K36528K49799L43784J91997K26361
3781A0727243L77048J41568J65960K61012L20600K99653K688J52687J88178L81704
3771A3018341M00788O10807M93436K35827N68066N68970N45804P02083P68694
3762A7912816O48475N87944M55913N94663P95787M52181N05729P91805J143235
3753B3888548J139407J272559J114594J350531J617921J847601J666805J410857
3745C5308823J508884J155102M20080K18853J95656l97681q43199p21669p65335
$$ y = [6575963, 6581295, 6997679, 7261537, 7072103, 6993135, 7177486, 7350774, 7470176, 7338122, 7560186, 7445733, 7591772, 7810841, 8029103, 8217763, 8215564, 8101344, 8494482, 8971282, 8862369, 8730001, 8905135, 9298386, 9369658, 9478774, 9715302, 9965101, 10308885, 10500882, 10727243, 11104291, 11245859, 11411819, 11672831, 11993431, 12293084, 12295772, 12448459, 12636637, 13018341, 13419129, 14029936, 14523372, 14759199, 15327265, 15896235, 16442039, 17144122, 17912816, 18561291, 19149235, 19605148, 20199811, 20995598, 21447779, 21953508, 22745313, 23888548, 25027955, 26300514, 27415108, 28765639, 30383560, 32231161, 33897966, 35308823, 36817707, 37972809, 38392889, 38611742, 38807398, 38409717, 37566518, 36844849, 36079514]
3736C6079514p66349n06780k55573n43630j60992R0746M39769N45303Q87094R14108
3726C6723210J172305J193702J537503K003163K369531K399566K424575L027048
3718E2850603K882098K672728K284806J824960J194358K96094l65068j492644
3710F2147935j905063k077461j988252j900855j744237j357646j304607j251352
3702D8618462j464339r65619j342414j106879j075652j024010q62940q68198n93231
3693C9315180l18866n58214l15574j04559L28568K85081L26299O52797P32083
3684D0342795Q70788R60223J058178J204656Q55415N46387J54246l9339k83011
3675D5670338q83880r98874j114358j216122j217924j194444j516892j154738
$$ y = [36079514, 35313165, 34806385, 34550812, 34007182, 33846190, 33936936, 34376705, 34922008, 35809102, 36723210, 37895515, 39089217, 40626720, 42629883, 44999414, 47398980, 49823555, 52850603, 55732701, 58405429, 60690235, 62515195, 63709553, 64005647, 63640579, 62147935, 60242872, 58165411, 56177159, 54276304, 52532067, 51174421, 49869814, 48618462, 47154123, 46188504, 44846090, 43739211, 42663559, 41639549, 40776609, 39908411, 39315180, 38996314, 38438100, 38122526, 38017967, 38346535, 38631616, 38957915, 39610712, 40342795, 41213583, 42173806, 43231984, 44436640, 45292055, 45838442, 45992688, 45953349, 45670338, 44786458, 43787584, 42673226, 41457104, 40239180, 39044736, 37527844, 36373106]
3667C6373106j029172j225592j063012j305482r46596q86931q11385q42081q97750
3658B7365105n35916k39897p75448n80573k06397J40456j92019j25551k40127
3649B4609633j19423K15818r2851O4031k01582J15094K4651r0384J58447M6311
3639B4729745L91919J57672l185r4246k02803m00242m43399o99124m49131m79228
3629B2507978m40697p42539o55671m51501l41453m12223k58547r3713n08575r6327
3619A8506732k9313j86277q5599k63996j41073j91576j736m8563k73776k21948
3609A7062875j98502n248k1520k99421j49653k77073k61319j61674q4046m82301
3599A5122118o31207l48902m11453j81425n94291j49209k57377m12807l52361
$$ y = [36373106, 35343934, 34118342, 33055330, 31749848, 30803252, 29916321, 29104936, 28262855, 27365105, 26829189, 26589292, 25813844, 25233271, 25026874, 25167330, 24975311, 24849760, 24609633, 24490210, 24706028, 24613177, 24677208, 24475626, 24590720, 24615371, 24524987, 24683434, 24729745, 25121664, 25279336, 25276151, 25181905, 24979102, 24578860, 24135461, 23436337, 22987206, 22507978, 22067281, 21324742, 20669071, 20217570, 19876117, 19463894, 19205347, 19111634, 18603059, 18506732, 18477419, 18291142, 18205543, 17941547, 17800474, 17608898, 17607162, 17558599, 17284823, 17062875, 16864373, 16859125, 16837605, 16538184, 16388531, 16111458, 15850139, 15688465, 15604419, 15122118, 14490911, 14142009, 13730556, 13549131, 12954840, 12805631, 12548254, 12135447, 11783086]
3590A1783086j8049l18092l47183j24262j2879j75033J6539k11108j61382l49723
3580A0081914J45726O3053K8903j62288L13349K99048J93024J13731N48856L53142
3570A1978458j769J16545Q4491l23110k58929j15708l28296n18679j66661N645
3560A0471987l36675m96013J36982J38502j76964r1676J03240P200k70705N5599
3550I541477J33007j94532j17626J39394p0324N5407K37920J32834l55759k91095
3540I210703O4442K30788j63008r9007K82484N7865j01095P3968N0530J16555
3530I724225j78086K9583j56803n4182K09758K09966l11954r5764K45712L76848
3520I999303j03420K241J34106J94463J51150K59918J8123N9239J78725K39615
$$ y = [11783086, 11765037, 11446945, 11099762, 10975500, 10962621, 10787588, 10804127, 10593019, 10431637, 10081914, 10227640, 10290693, 10319596, 10157308, 10470657, 10769705, 10962729, 11076460, 11625316, 11978458, 11976689, 12093234, 12177725, 11854615, 11595686, 11479978, 11151682, 10633003, 10466342, 10471987, 10135312, 9639299, 9776281, 9914783, 9737819, 9646143, 9749383, 9756583, 9485878, 9541477, 9674484, 9479952, 9362326, 9501720, 9431396, 9486803, 9724723, 9857557, 9501798, 9210703, 9275145, 9505933, 9342925, 9243918, 9526402, 9584267, 9483172, 9557140, 9607670, 9724225, 9546139, 9575722, 9418919, 9364737, 9574495, 9784461, 9472507, 9376743, 9622455, 9999303, 9895883, 9898124, 10032230, 10226693, 10377843, 10637761, 10655884, 10715123, 10893848, 11133463]
3510A1133463R2222k6322J09392Q4229k7983r0925J96626K36546m2947j06674
3500A1557627j03902P3743R454R5315j8539n879J17813K38101o2106L1728M25752
3489A2359107K27374N4360J24733K96871K92960L12299K59374N49610P54299M48401
3479A5679388K07154J01836j10596O0588J90911l1025k83337j34142K19434j12087
3469A5788124k4095J37839N1231O5837k499L82785k96773J10612L39092r3414
3459A6458739L1554N23090L64043J38771q3167P03258O24495K8225K58303N37790
3449A9585101M68081K04840L10999L19529M37447j00032J52033M68716l3227L30846
3439B2144333P11039L38435J65042O83029P89800K88589Q87060R55922R04683
$$ y = [11133463, 11225685, 11199363, 11308755, 11392984, 11365001, 11274076, 11470702, 11707248, 11664301, 11557627, 11453725, 11527468, 11536922, 11632237, 11613698, 11607819, 11725632, 11963733, 11901627, 11933355, 12359107, 12586481, 12640841, 12765574, 13062445, 13355405, 13667704, 13927078, 14476688, 15230987, 15679388, 15886542, 15988378, 15877782, 15938370, 16129281, 16098256, 15814919, 15680777, 15900211, 15788124, 15764029, 15901868, 15953099, 16018936, 16016437, 16399222, 16102449, 16213061, 16552153, 16458739, 16490293, 17013383, 17377426, 17516197, 17433030, 18136288, 18760783, 18789008, 19047311, 19585101, 20053182, 20258022, 20569021, 20888550, 21325997, 21225965, 21377998, 21846714, 21813487, 22144333, 22855372, 23193807, 23358849, 24041878, 24831678, 25120267, 26007327, 26963249, 27867932]
3430B7867932J229919J287967J391666J707313J856101K479965K562992K514523
3422D2898378K619662L519888L629726L264970L256013K726632J429289O79262
3414F4023820P72462O31248k60072j421003j994373k863798l373729l188360k774759
3405D9551436k211174k070228j782814j545255j352172r35335m97225m48517o81226
3396C8027490k04277K72192Q5556M6427M18359O56902P28742O41412J369303J495905
3386D3538011J126547J840536K197397K240171K724230K914259L343535L281709
3378F3206395L242550K772377K227522J488244M53807r64994k610807m160547
3370F5654547m720050m468722l782713l365718k783243k540393k111097j861303
$$ y = [27867932, 29097851, 30385818, 31777484, 33484797, 35340898, 37820863, 40383855, 42898378, 45518040, 49037928, 52667654, 55932624, 59188637, 61915269, 63344558, 64023820, 64796282, 65427530, 65167458, 63746455, 61752082, 58888284, 55514555, 52326195, 49551436, 47340262, 45270034, 43487220, 41941965, 40589793, 39654458, 39157233, 38708716, 38027490, 37823213, 38095405, 38180961, 38227388, 38645747, 39302649, 40031391, 40672803, 42042106, 43538011, 44664558, 46505094, 48702491, 50942662, 53666892, 56581151, 59924686, 63206395, 66448945, 69221322, 71448844, 72937088, 73390895, 72425901, 69815094, 65654547, 60934497, 56465775, 52683062, 49317344, 46534101, 43993708, 41882611, 40021308]
3362D0021308j728168j498531j039314j032550r46147p63612m81252m45590l37612
3353C1748532j47979n41733o41232J3719r1589l42052l17202L9940P8806N9625
3343B9858835L85802O92247J33500j29688O50221M66954j82K56459O14771p490
3333C2921429k99124J66998J35403k14369L3000L03471M25259J75924K24510K02705
3323C4075206K89401K1796L61114K60577Q3493J20948N48389N39335J20734M10011
3313C6831004O46824K14770L89189N86266Q41303M87536J11669O20445R37204
3304D1666210O88734O94934Q22898J199276J008594J123641J777399J434708J253630
3295E1670024J590475J625161J598860J873432K473726K302547K275567K870222
$$ y = [40021308, 38293140, 36794609, 35755295, 34722745, 33776598, 33012986, 32531734, 32086144, 31748532, 31600553, 31058820, 30417588, 30431307, 30339718, 29997666, 29680464, 29720404, 29799210, 29858835, 30244637, 30936884, 31070384, 30940696, 31590917, 32057871, 32057689, 32314148, 32928919, 32921429, 32622305, 32789303, 32924706, 32710337, 32743337, 33046808, 33472067, 33647991, 33872501, 34075206, 34364607, 34386403, 34747517, 35008094, 35091587, 35212535, 35760924, 36300259, 36420993, 36831004, 37477828, 37692598, 38081787, 38668053, 39509356, 39996892, 40108561, 40729006, 41666210, 42354944, 43049878, 43872776, 45072052, 46080646, 47204287, 48981686, 50416394, 51670024, 53260499, 54885660, 56484520, 58357952, 60831678, 63134225, 65409792, 68280014]
3287F8280014L354063L990635M499605M918446N544913O296496O827631P664980
3279A11376783Q523894J0103447J2470506J4841741J8103356K2450923K8318999
3272B26189649L4970494M0997738M4411644M5088043M0235508K7737150J2775653
3265D72405879l768225k1630316l5707810m3341142m6627318m5780080m0528450
3258B35022538l3942654k7661131k1464600j6954475j3837805j1136705q936134
3251A01089034p880908o938602n268077m304331m131383l148051k802025k705089
3243F3910568k291731j834536j660389j707392j734628j371263j077102j327840
3235E0905687j018328p96988r74593q34725o91547o76471p93677r23196n01168
$$ y = [68280014, 71634077, 75624712, 80124317, 85042763, 90587676, 96884172, 103711803, 111376783, 119900677, 130004124, 142474630, 157316371, 175419727, 197870650, 226189649, 261160143, 302157881, 346569525, 391657568, 431893076, 459630226, 472405879, 468637654, 447007338, 411299528, 367958386, 321331068, 275550988, 235022538, 201079884, 173418753, 151954153, 134999678, 121161873, 110025168, 101089034, 93208126, 86269524, 81001447, 76697116, 72565733, 69417682, 66615657, 63910568, 61618837, 59784301, 58123912, 56416520, 54681892, 53310629, 52233527, 50905687, 49887359, 49090371, 48115778, 47281053, 46589506, 45913035, 45119358, 44196162, 43694994]
3226D3694994q28297n05936k53953l24100n52277l34987j35481k11945l48966
3217D0199052k14062p9693j75983p9736j39268J06190J70361k8272J34366M71762
3207D0364717O01598N35064N75743M84222O69272P39606P84824Q74467R63362
3198D6592875J073784J148507J760598J869125J935503K253785K773253K912440
3190F2319870L180096L373481L604261M208153N015633N560992O753712Q519391
3182A02535589J0624006J2576222J5047677J8101301K1797289K5741915L0078558
3175B36502557L2762495K7917456J3444967q566956k6465042l4578945l2214861
3168B08801671k3814054j6511514j0640591p555177o306147p500874r343980j1098497
$$ y = [43694994, 42866697, 42360761, 42106808, 41782708, 41230431, 40895444, 40759963, 40548018, 40199052, 39984990, 39905297, 39729314, 39649578, 39510310, 39616500, 39786861, 39758589, 39892955, 40364717, 40966315, 41501379, 42077122, 42561344, 43230616, 43970222, 44755046, 45629513, 46592875, 47666659, 48815166, 50575764, 52444889, 54380392, 56634177, 59407430, 62319870, 65499966, 68873447, 72477708, 76685861, 81701494, 87262486, 94016198, 102535589, 113159595, 125735817, 140783494, 158884795, 180682084, 206423999, 236502557, 269265052, 297182508, 310627475, 302060519, 275595477, 241016532, 208801671, 184987617, 168476103, 157835512, 150280335, 143974188, 136473314, 127129334, 116030837]
3160A16030837j1479514j0425831q964382p118525n547644m796483l999011l695844
3152F0003603l284578k790015k435830k279094k037645j705261j291216j120300
3144D3059664o77271m29029l03927l87648k09304k8869J79899K55701J18095M96660
3134D2073971O28618Q77620J050676J393912J959017K259677K538579K620164
3126E5402234K420050K637139K356676J856173J528372J245141M92217n27581
3118F7410421j540552j640308k283861k693046k375861k401215k591592k671170
3110D9212816l093106l167611l122377k808799k667373k393666k047869j618257
3102B8293758j543094j402577j334580j216306j202042r30867r97359n83667o97081
$$ y = [116030837, 104551323, 94125492, 85161110, 78042585, 72494941, 67698458, 63699447, 60003603, 56719025, 53929010, 51493180, 49214086, 47176441, 45471180, 44179964, 43059664, 42382393, 41953364, 41649437, 41261789, 41052485, 41023616, 41203515, 41459216, 41577311, 42073971, 42702589, 43580209, 44630885, 46024797, 47983814, 50243491, 52782070, 55402234, 57822284, 60459423, 62816099, 64672272, 66200644, 67445785, 67938002, 67410421, 65869869, 64229561, 61945700, 59252654, 56876793, 54475578, 51883986, 49212816, 46119710, 42952099, 39829722, 37020923, 34353550, 31959884, 29912015, 28293758, 26750664, 25348087, 24013507, 22797201, 21595159, 20664292, 19666933, 19083266, 18386185]
3093A8386185q07770m82107j49024o05961m59176l26318o02572m60743m18728
3084A4073786m64167l55649j48467j76854m25347m75884n3644l12095j13744k19267
3074A1328668j86611k25073k84615l22386m77229k67538j22825k60724o6515m26553
3064H688599l6270j46972l81109j47618k20498j67973m58902k54348j66154l20079
3054F388676j47625j47535j09126j56685N570l08363k71276K89825M637k39269
3044E308829j74409Q1902L8845m70185j39030j16968N8468k8047p7630J71782
3034D653557n9590J50578l9679q2819J56849L64841J62404k14172K51215M58892
3024E802076J43510O1750K98053M23276k69584n80779n77190l97255m30535l53243
$$ y = [18386185, 17578415, 17096308, 16947284, 16341323, 15882147, 15555829, 14953257, 14492514, 14073786, 13609619, 13253970, 13105503, 12928649, 12503302, 12027418, 11973774, 11661679, 11547935, 11328668, 11142057, 10916984, 10632369, 10309983, 9832754, 9565216, 9442391, 9181667, 9115152, 8688599, 8652329, 8505357, 8124248, 7976630, 7756132, 7588159, 7129257, 6874909, 6708755, 6388676, 6241051, 6093516, 5984390, 5827705, 5833275, 5524912, 5253636, 5543461, 5548098, 5308829, 5134420, 5216322, 5255167, 4784982, 4645952, 4528984, 4587452, 4559405, 4481775, 4653557, 4593967, 4744545, 4704866, 4622047, 4778896, 5143737, 5306141, 5091969, 5343184, 5802076, 5945586, 6007336, 6305389, 6728665, 6459081, 5878302, 5301112, 4903857, 4473322, 4120079]
3014D120079j43116m78899m88322p2626J34093k0629l75467K8238J27781m53914
3004B377218l28580J94175J81458p4498L8995R6976r5905k05773p2030K4509o5659
2993B070886m189J45765L63612R4547J57568L81625M7644m82324j689J12923O4032
2982B950400J79646j6997R104k07815K22944K40128n9710k92695J53379J84185
2972C362569j10296J72212N7752k40771r6525K56226J31454j9286L68690o1568
2962C820457K10958J77017L6870J66273k99280n85259k57348k19659k47021k99794
2952B503214k65178k24014k12011K2243p743k07555j12039J5067p204j99101N6716
2941A362395j80613j6952j69360P1435J87175l1265j04081k08554o3005j07491
$$ y = [4120079, 3976963, 3498064, 3009742, 2937116, 3071209, 3050580, 2675113, 2703351, 2831132, 2377218, 2048638, 2242813, 2424271, 2349773, 2388768, 2485744, 2389839, 2184066, 2112036, 2136545, 2070886, 2066697, 2212462, 2576074, 2670621, 2828189, 3209814, 3257458, 2775134, 2773445, 2886368, 2950400, 3130046, 3113049, 3122153, 2914338, 3137282, 3377410, 3317700, 3025005, 3178384, 3362569, 3252273, 3424485, 3482237, 3241466, 3144941, 3401167, 3532621, 3513335, 3882025, 3820457, 4031415, 4208432, 4245302, 4411575, 4112295, 3527036, 3269688, 3050029, 2803008, 2503214, 2238036, 2014022, 1802011, 1824254, 1816511, 1608956, 1496917, 1511984, 1504780, 1305679, 1362395, 1181782, 1164830, 995470, 1066905, 1254080, 1222815, 1118734, 910180, 847175, 739684]
2931G39684l5537R5529m9818m5287l9229q1344j33915o3811J28414n1172K41997
2920G05511j87941Q649J10794j96681k5361J01702J10087n8381n2864J84738J333
2909G01586J21944n9731j46913p2201K19941J45785q4323k95197j01215J9555
2899D49231L42042r251O7136N0240q3130N8749q8819j04368P1855J22520m6491
2888H29714N841R5169j7902j70322j19239n4115k5669Q7486J31792p4805j86922
2877E01028J36755N9708O2927L8469j81190j29869M24126K58962K72407J69457
2867A612780J44427J09368J01641J19959q2137k19387p5905k49485k97246J73568
2857A337583j05140j08181M9774M9885r5957k10175M215r2980k06250j57150q8342
$$ y = [739684, 704147, 799676, 749858, 704571, 665342, 583998, 450083, 386272, 514686, 463514, 705511, 517570, 526219, 637013, 440332, 414971, 516673, 626760, 568379, 515515, 700253, 701586, 823530, 763799, 616886, 544685, 764626, 910411, 826088, 530891, 429676, 449231, 791273, 782022, 849158, 899398, 816268, 875017, 786198, 681830, 753685, 876205, 829714, 835555, 930724, 912822, 742500, 623261, 569146, 543477, 630963, 762755, 687950, 501028, 637783, 697491, 760418, 798887, 617697, 487828, 911954, 1170916, 1443323, 1612780, 1757207, 1866575, 1968216, 2088175, 2006038, 1786651, 1710746, 1461261, 1164015, 1337583, 1232443, 1124262, 1174036, 1223921, 1127964, 917789, 922004, 829024, 622774, 465624, 377282]
2846C77282R0821K8699o6247q6147J23982O7110j08230M528j17582n35291O0231
2835a60844K55579L9853j72394J54301P9738P3158j7749L9502k39778n816M5119
2824I0669J4476m491l4886O0615k5806j28441K13242K76066q4745k27051J64174
2813C13822K98998j39746q5938J67834n2379K3562M4039k8777m175K69879K29505
2802A036624k80494J05849J29882k49716l7891J69488j90586j94875P9253J48975
2792G16509l7313r2837l7292j07030Q5285J82288k21039k29013P7051k63733l3986
2781C8890K51744l2696k02872O8441K40085m2576L2577j6011J62675k92486j69485
2770C8286P2548K05105J02345P3797k9824L3264N2474P6646J01492m7958k65112
$$ y = [377282, 468103, 496802, 430555, 344408, 468390, 535500, 427270, 431798, 314216, -221075, -160844, 94735, 134588, -37806, 116495, 196233, 269391, 251642, 291144, 51366, 45550, 90669, 105145, 100654, 65768, 126383, 100577, -27864, 185378, 461444, 376699, 149648, 313822, 612820, 473074, 387136, 554970, 502591, 526153, 570192, 541415, 537240, 807119, 1036624, 756130, 861979, 991861, 742145, 704254, 873742, 683156, 488281, 567534, 716509, 679196, 586359, 549067, 442037, 527322, 709610, 488571, 259558, 336609, 72876, 38890, 290634, 257938, 55066, 123507, 363592, 321016, 353593, 337582, 500257, 207771, 38286, 110834, 315939, 418284, 492081, 462257, 495521, 547995, 624641, 726133, 678175, 413063]
2759D13063n7119J10939k3321l4899j28499L3116r1756J27928K82516k34633j20711
2748B76624P0138k00940K0737l1358J83911n3134N4624j6903P2591j04211k8236
2737B43843K780r7607n7223j8167P152L41996l1406l95567L0544J72445J0358
2726B09148k08504R0626O9081o85Q0250K58969k53988j67267L50800p8760k35527
2715A14143K04230K38589l6935m40732j02358J49662k5118p7603J38284M0211
2705B02373j66911j5977J90531l11731k62611J01413M93607j69087j26937J62196
2695I6866k18657k01255L3184r241j58329k5390q8484J46970J71287Q7577j67735
2684c33207j71591J69668K1702K00618L5627R2577j42207j45520m4642o4809J75413
$$ y = [413063, 355944, 466883, 443562, 408663, 280164, 313280, 221524, 349452, 631968, 397335, 276624, 346762, 145822, 166559, 135201, 319112, 265978, 320602, 303699, 376290, 272079, 243843, 246623, 149016, 91793, 73626, 80778, 422774, 391368, -4199, 26345, 198790, 209148, 644, 91270, 160351, 159666, 239916, 498885, 244897, 77630, 428430, 349670, 114143, 318373, 556962, 520027, 79295, -23063, 126599, 101481, 23878, 162162, 202373, 35462, 19485, 210016, -101715, -364326, -262913, 230694, 61607, -65330, 96866, -121791, -323046, -289862, -299103, -457432, -482822, -571306, -424336, -253049, -165472, -333207, -504798, -335130, -313428, -112810, -77183, 15394, -126813, -272333, -316975, -381784, -206371]
2673b06371J88484j49049r3473J84680k5689j16413L7648O7054J26621J21694
2663A35186k01160r0031K30668n962J10440m0067k21080Q7766J07679K38906k88342
2652F4003j12910J76922K19766l974p1955n2578o7501k31007J57448K22670R0430
2641C91314O6455l0644r7430J6570K06092J40770l912j91210J64157K89982j39607
2630H12537l6213n5282J63707l1309j95052K17821n6624r5135j43055R8158J25178
2619H04731j19558k5615J17370m2815j87525L01207j15930M7640K0856j5706k67314
2608E17341j20287J4844J9969j76265n7627J10778n3640l5173J16797O5913K6953
2597D29603M9848j09551p8009l1565k15004K00178j13079k6121J29356J1386l2576
$$ y = [-206371, -17887, -166936, -260409, -75729, -101418, -217831, -180183, -113129, 13492, 135186, -65974, -156005, 74663, 68701, 179141, 139074, -82006, 5760, 113439, 352345, 64003, -48907, 128015, 347781, 343807, 271852, 219274, 151773, -79234, 78214, 300884, 391314, 457769, 427125, 329695, 346265, 552357, 693127, 689215, 498005, 662162, 952144, 812537, 776324, 721042, 884749, 853440, 658388, 876209, 819585, 724450, 581395, 679553, 804731, 685173, 659558, 776928, 734113, 546588, 847795, 731865, 779505, 800361, 784655, 517341, 397054, 411898, 431867, 255602, 197975, 308753, 255113, 219940, 336737, 402650, 429603, 479451, 369900, 291891, 260326, 45322, 245500, 132421, 106300, 235656, 247042, 214466]
2586B14466j19673J69923m6505J69452l4265J13437M8217L3887n0603J7336J43244
2575F58916K45389k25365k021Q6798q725O2451O3938R8495Q5071k14525M0348
2564H90770j04194j85585J83772K30113j17123j23627J82484Q2600k85658n7939
2554F95613M10059M558n5022J44086M088k24413k28288K03811K10669k23831J2005
2543I53335J90808J4082j44678J01941l210l41558O2211O1874M2232o3189J52490
2532A026338j97572l03285O645P7685J26537m6854O4260j18171j6955K3861p6537
2521E65952o0308j66274q792K1866K06438k0960j37873L19895J74591l21869q5207
2510D87459J35651q4232k34422j64690J71855J02067M8038j04359n1157M876k3924
$$ y = [214466, 94793, 264716, 218211, 387663, 353398, 466835, 515052, 548939, 498336, 515672, 658916, 904305, 678940, 676919, 763717, 754992, 817443, 881381, 979876, 1064947, 850422, 890770, 786576, 600991, 784763, 1014876, 897753, 774126, 956610, 1039210, 753552, 695613, 1105672, 1110230, 1055208, 1199294, 1203382, 978969, 750681, 954492, 1165161, 941330, 953335, 1144143, 1158225, 1013547, 1115488, 1112278, 770720, 832931, 894805, 937037, 873848, 1026338, 828766, 525481, 532126, 609811, 736348, 689494, 753754, 635583, 618628, 642489, 565952, 505644, 339370, 330578, 352444, 558882, 537922, 400049, 719944, 894535, 572666, 487459, 623110, 538878, 304456, 139766, 311621, 413688, 461726, 357367, 306210, 311086, 287162]
2499B87162p1968N8578m055J12833M9055j58428k16466M1890J34115k22872O9779
2488G9623K29182J4682l14633Q9861l5822k42613o2927M0335m1651R5727P5383
2477g2853j6426l2355n3360K15933L5834j37834n3112J8857m1187j60291Q068
2466b88726J751j05081P987J26918O8569K25392L28239j38647k44486j82307K0227
2455a80164p1393p5810k7157J77881J32792L6346N8175o5150R7084k363n3162
2444B7079J34215j8226p2861j22913O1824k75766J32564K60068j63071k5658L06080
2433B43335J58682o5l08555J34779o2903k28450j2836R6895j5741O199k2377l0582
2421d1619J49156O2622o0251j1735J29300J04470q6190q3757M6826j2156j78280
$$ y = [287162, 215194, 273772, 269717, 382550, 431605, 273177, 56711, 98601, 232716, 9844, 79623, 308805, 323487, 8854, 98715, 62893, -179720, -242647, -202312, -243963, -148236, -72853, -89279, -121634, -174994, 40939, 76773, -61061, -114173, -95316, -136503, -296794, -288726, -286975, -392056, -384069, -257151, -188582, 36810, 365049, 226402, -18084, -200391, -180164, -251557, -327367, -354524, -176643, -43851, -7505, 50670, -14480, 82604, 80241, 27079, 161294, 143068, 70207, -52706, 9118, -266648, -134084, 125984, -37087, -62745, 243335, 402017, 401952, 93397, 228176, 165273, -63177, -76013, 20882, 5141, 11340, -11037, -41619, 107537, 170159, 109908, 98173, 227473, 331943, 245753, 161996, 208822, 196666, 18386]
2410A8386j35607K69147J87407k93198K0060J15945r8248j79437l4474j15305
2400b45324p1560J21098L0583K28636k7304L78212m8575k78949o5343o474j49280
2389a34280J23908P1887q4898j05180J80496N7989j96871k07654J26671K12504
2379D4572r1418j42371O9353l7688K0795l5911J63779j45191J27006J05078M8398
2368A26402K66127K7775K72613l49407k39517J07314o1021m370J00411J15462
2358C61789k62453K9159L38902j72198l68699n439J19301K23898k53853K6688
2348C7095p4097k20453K48590j46107m9089Q4793J71127m0151M5173j9185L4441
2337G2137m589k53648K966K81113o4317j87630j10038J67766Q2266k00162R8209
$$ y = [18386, -117221, 151926, 339333, 46135, 66195, 182140, 83892, -95545, -130019, -245324, -316884, -195786, -165203, 63433, 36129, 414341, 365766, 86817, 21474, 15000, -134280, -10372, 61515, -23383, -128563, 51933, 109922, -86949, -294603, -167932, 44572, -46846, -189217, -119864, -157552, -136757, -172668, -8889, -154080, -27074, 78004, 126402, 392529, 420304, 692917, 343510, 103993, 211307, 150286, 145916, 246327, 361789, 99336, 128495, 467397, 295199, -73500, -78939, 40362, 264260, 10407, 37095, -37002, -257455, -8865, -154972, -204061, -119268, 51859, 11708, 56881, 37696, 72137, 67548, -186100, -183134, 97979, 33662, -153968, -264006, -96240, -13974, -214136, -115927]
2326a15927K175j38023J14211L1448J52613k13981l1773p9680j9486J98693J9056
2315h0674J41938P4645J85037L4991N2704j72199j68234q3824k3276o2716J45240
2304D3632k2687P4823L8502N4719N7405p9867l5532k50437j08255l9598K71538
2293D243O4778j57644k646M9246J37290j00786L38734j32608O2400n2166j88662
2282B2179K74478r7647O799p0660M1472J79510J42537P734J20587o8599j03560
2271D54830l20494K73325J68669j34762L7044q9842J87257j12677K52510k84600
2261D31260J03205L67983k29348p2219j28746L12237k64482m9748N3821J25732
2251F49695m8652R4972K0296r4728J90441j66543n4709j8427K22258j03609L16577
$$ y = [-115927, -113752, -251775, -137564, -106116, 46497, -167484, -199257, -278937, -298423, -99730, -80674, 61264, 135909, 320946, 355937, 408641, 236442, 68208, -15616, -38892, -101608, 43632, 20945, 95768, 134270, 188989, 246394, 166527, 130995, -119442, -227697, -267295, 4243, 69021, -88623, -91269, -42023, 95267, -5519, 333215, 200607, 263007, 210841, 22179, 296657, 199010, 205809, 135149, 176621, 356131, 498668, 506402, 626989, 558390, 454830, 134336, 407661, 576330, 441568, 478612, 388770, 576027, 463350, 715860, 431260, 534465, 902448, 673100, 600881, 472135, 784372, 519890, 470142, 523963, 649695, 601043, 696015, 716311, 621583, 812024, 645481, 590772, 572345, 794603, 690994, 1007571]
2240A007571L2575j30614K45681k10927L35392K47169J35652k05813K62587k18367
2230A500906M9269K45778K82209j18616j4406N24179q2507J63184J89033M6027
2220B785056n7331k4127N5540k61181j93833k00490l4268j00710M9385J27283
2210B145324m04864m28734L00135k7857j98163l70606O9557K12377l69339j921
2200I25909j79045K14113p3269O3071J10227k5511j6368J02196l79823k26709
2190E14791P3851K96239m08757p5299K97423j75699l234O3886P0537l0669l78440
2179B44629J52324k36297K85409j737P4965j51531j57847J6683q0223J55819p7154
2168B25040P4658j06662j52571m7283J76067R525j2247k08500M054J21168Q2130
$$ y = [1007571, 1040146, 909532, 1155213, 944286, 1279678, 1526847, 1662499, 1456686, 1719273, 1500906, 1550175, 1795953, 2078162, 1959546, 1945140, 2469319, 2386812, 2549996, 2739029, 2785056, 2727725, 2703598, 2759138, 2497957, 2304124, 2103634, 2069366, 1968656, 2018041, 2145324, 1740460, 1311726, 1611861, 1584004, 1385841, 1015235, 1084792, 1297169, 927830, 925909, 746864, 960977, 887708, 950779, 1061006, 1035495, 1019127, 1121323, 741500, 514791, 588642, 884881, 476124, 400825, 698248, 522549, 519315, 583201, 653738, 623069, 244629, 396953, 160656, 446065, 444328, 519293, 367762, 209915, 226598, 146375, 302194, 225040, 299698, 193036, 40465, -6818, 169249, 178774, 166527, -41973, -37919, 83249, 165379]
2157A65379J26115l7305L1980j97846J2970j62210k4703Q7057j8211R9399o5400
2146A7225K98832o1385P1718j88491K75243j1710j49121n8211J17317J34848j38331
2135C07934O921j79136k0871j07145k9660j33560J07114J56527j49446K10800
2125A69478M1887J45493l15893j58709l1648J61834k34208k05229J25074J22710
2115a79211J41630k65049j51938K37080R2047j71474k31165q051L11799q605k91163
2104e24100j9568L41388K70328k32968j06430L12654N2983q2294r430k451l9616
2093c9504K36294j65992j99334O0786M22743l57329m11674K20718K85943j68493
2083a15842Q219O6443j4707j050q841J67233J9118k40202j26354J5P7181k29715
$$ y = [165379, 291494, 254189, 286169, 88323, 101293, -60917, -85620, 1437, -16774, 82625, 17225, 316057, 254672, 326390, 137899, 413142, 401432, 252311, 194100, 311417, 446265, 307934, 314855, 135719, 114848, 7703, -21957, -155517, -48403, 108124, -41322, 169478, 211365, 356858, 40965, -117744, -149392, 12442, -221766, -426995, -301921, -179211, -37581, -302630, -454568, -217488, -125441, -296915, -528080, -536131, -224332, -232937, -524100, -543668, -202280, 68048, -164920, -271350, 41304, 94287, 11993, 2563, 112, -39504, 196790, 30798, -168536, -107750, 314993, -42336, -454010, -233292, 52651, -115842, -107623, -41180, -55887, -56937, -65778, 101455, 120573, -119629, -245983, -245968, -168787, -398502]
2071c98502k9547L954l045j41850K73689Q0949k01457J66753J42174J20690p0407
2060e6599j66015R8548k09111p9702P6374R718P2132k63735J33978J51344m840
2049b37908k06810J22029r6035J90917R3131j471k74700K04028K23796o0094k39278
2038b82395K07932J3725j41613P362J5684L1837j70466j42888J77318P1736n3468
2027b65236r9959L0026J94543j1359j20943J79493J2619Q2982j08318j49509J36564
2016a19097J61516m1454m396r1220M1866J64770p9985k29563M6358j3594k37607
2005d02406J54122K70091J22451j21784m2646j84402M2607m2262J56552k46185
1995b93862K0702r1386J32335J29250j77935J7092K71408j05922j70461R6422
$$ y = [-398502, -428049, -424095, -427140, -568990, -295301, -214352, -415809, -249056, -106882, 13808, -56599, -222614, -124066, -333177, -412879, -336505, -326787, -254655, -518390, -384412, -233068, -237908, -444718, -322689, -418724, -227807, -134676, -136147, -410847, -206819, 16977, -43117, -282395, -74463, -60738, -202351, -194989, -179305, -147468, -317934, -460822, -283504, -211768, -265236, -365195, -335169, -140626, -151985, -272928, -93435, -80816, 2166, -106152, -255661, -119097, 42419, 965, -3431, -94651, -52785, 111985, 32000, -197563, -151205, -164799, -402406, -248284, 21807, 144258, 22474, -20172, -204574, -161967, -204229, -47677, -293862, -273160, -364546, -232211, -102961, -280896, -263804, 7604, -98318, -268779, -172357]
1985a72357L39155p0049j30317M4231q0497J23495m4610o4198J6090j47769O4123
1974a22703j02628K5012K39302N4409j38466m641J19634R0537r9111j10098J69835
1963A21082N7469k43007l7902R0280J21187J49143k68636j95477J55165K02780
1953A52084n21847j59245L88084L1547j02657K6425O7629r8626q9597L3891L8595
1942b33717l4354p2899J89039j6244q2932j55096N9411K02160Q4244o5445J74726
1931D8893q6978m9227N8550n2857j20584K05051K35219m04071K4933K20671J04827
1920A84427j78490N6047K23891n10258j08451J05700L76569K4223l50768K00613
1910B3503K72055p1410l57330L37729j45308k04578L04126J22473j67107n1588
$$ y = [-172357, 166798, 96749, -33568, 10663, -69834, 53661, 9051, -55147, -39057, -186826, -122703, -225331, -200319, 38983, 93392, -45074, -49715, 69919, 160456, 61345, -48753, 121082, 178551, -64456, -102358, -12078, 109109, 258252, -10384, -205861, -50696, 152084, -369763, -529008, -140924, -109377, -212034, -185609, -117980, -216606, -306203, -272312, -233717, -268071, -340970, -151931, -168175, -251107, -406203, -346792, -144632, -60388, -125833, 48893, -38085, -87312, -28762, -81619, -202203, 2848, 238067, -166004, -141071, 79600, 184427, 5937, 61984, 285875, -224383, -332834, -227134, 149435, 173658, -177110, 23503, 295558, 224148, -133182, 204547, 59239, -145339, 158787, 281260, 114153, 62565]
1900F2565j90713J13896K5406M5531J71509O0908m6678J78402J14097q7734j10840
1889C36349N0530j10295R8400J35565J77523O3973k28285o0771K90748n4648j83507
1878E15582P3618j0756m3518O1638L6654l541j09916L1190K23463k20405J85701
1867G39710O6514P9191j09554M0930K66773l52030l0782j01459J56894L01781
1857A057968j61855O6678l4545J72296l23542o6580J65963k8408r5181K5313j32523
1846F45584j60969j62569K80035K7177K00807k90503R356J46365j50140J94954
1836G40097J70696M5371j20595P4863M39650m39339k3293L86986J46515m34475
1826I86476j35142L31332l39275j09347K31614p3277k59899k3419J39180m6507
$$ y = [62565, -128148, -14252, 11154, 56685, 228194, 289102, 242424, 420826, 534923, 447189, 336349, 386879, 276584, 374984, 510549, 688072, 752045, 523760, 462989, 753737, 699089, 515582, 589200, 578444, 534926, 596564, 633218, 629677, 519761, 550951, 774414, 554009, 739710, 806224, 885415, 775861, 816791, 1083564, 731534, 700752, 599293, 756187, 1057968, 896113, 962791, 928246, 1100542, 777000, 710420, 876383, 847975, 752794, 778107, 645584, 484615, 322046, 602081, 629258, 830065, 539562, 548918, 695283, 545143, 740097, 910793, 956164, 835569, 910432, 1350082, 910743, 887450, 1274436, 1420951, 986476, 851334, 1182666, 843391, 734044, 965658, 892381, 632482, 609063, 748243, 701736]
1816G01736k61161K74510j88660n1141j75639P7415J31543k92786j9195K37109
1806D33731J0343m8231l5592J24389k26281L29981j45772q4365R649j37417o2848
1795A67587Q4812l5325r8532j1946P9237M3462r4043R5826J48648l67158o2834
1784e0266L66961k03506r3690O3042m7638k12291K09388L08819k15871J0564J8020
1773A53532k65079p8314K40231K8607l31046j04762l5415K63791J18790J3626
1763C961p465L3608j15857K0023j86407L8304p9514J53635R1465o0204q2157j94314
1751c84922P2116J29626L90027J81023l60427j59727j57667q2729N5405K6656
1741b90619j2554j62079J07784P0172J76008J02156J1844k92623p8103K66784
$$ y = [701736, 440575, 715085, 526425, 475284, 299645, 377060, 508603, 215817, 196622, 433731, 444074, 395843, 360251, 484640, 258359, 588340, 442568, 358203, 367852, 230435, 167587, 252399, 217074, 118542, 106596, 185833, 229295, 135252, 231078, 379726, 12568, -50266, 316695, 113189, 19499, 82541, 34903, -177388, 32000, 340819, 124948, 135512, 153532, -111547, -189861, 50370, 78977, -252069, -356831, -392246, -128455, -9665, 3961, -3504, 30104, -85753, -65730, -252137, -213833, -293347, -139712, -48247, -108451, -190608, -384922, -312806, -183180, 206847, 387870, 27443, -132284, -289951, -372680, -317275, -290619, -303173, -465252, -357468, -287296, -111288, -9132, 2712, -289911, -368014, -101230]
1731a01230J05648p2187o7473P909p9989q4415M9433J22221j67983l7200J17580
1720b07686J9996J00512K5740j87208l21521J01074M52000l6070l50933N4825
1710c49271M6918m2467O8937J62211p6598j35326O4334p9377p3984K21625M9386
1699a43612j06041J9784N2284n9221k00192J18189L13612l63814l8879M0481r8961
1688d66370L5920K0287k06502J28165L2275m2492o9823J38713j06913p0224k02223
1677h09187K79608M43929q5822o7285p6057O4544K7132r9697K42418j94472q9325
1666c64214Q5884P2428k27738J3870K04278k21388K02408p3836M9460J9008m9973
1655b89813P6279M4823l64267J89722n1497j63591j12286L23336m0761j65776
$$ y = [-101230, 4418, -67769, -135242, -127333, -207322, -291737, -242304, -120083, -288066, -325266, -207686, -187690, -87178, -61438, -248646, -570167, -469093, -17093, -53163, -404096, -349271, -302353, -344820, -275883, -113672, -190270, -325596, -261262, -340639, -414623, -192998, -143612, -249653, -229869, -177585, -236806, -436998, -318809, -5197, -369011, -407890, -367409, -466370, -430450, -410163, -616665, -488500, -456225, -498717, -568540, -429827, -536740, -606964, -809187, -529579, -85650, -171472, -238757, -314814, -250270, -223138, -322835, -80417, -274889, -364214, -278330, -205902, -433640, -419770, -215492, -436880, -234472, -308308, -258848, -239840, -289813, -213534, -168711, -532978, -343256, -394753, -558344, -670630, -347294, -388055, -553831]
1645e53831J10355L35848n0439k50217K4741L50631j45682j72392j68476k1124
1635e40586k4239k9040P8279j35543M5030K57495K61675o2374l47941J26285q4808
1624d55767O0228M9599J4109j16422Q4078O5888o8214J64400p5303K5158K2153
1613b30093j73710L8661K91407J14401k67223k41752J46970L1222l47087J61834
1603d75370M74810P4495j96582j91618J65112l579j89749j048J64394k05866J65834
1592b19167K1639o5730J2846J8851L5567M8508J68229J79977j7153k15920k46462
1581b78815K69762R4781j77010n9004K31616l01043m084K64067M4497k4643j35372
1570g5248p9087j78792p4038O7270j5505K5046k22377J09155M10577L5210j24234
$$ y = [-553831, -443476, -107628, -158067, -408284, -383543, -32912, -178594, -350986, -519462, -540586, -564825, -593865, -515586, -651129, -606099, -348604, -86929, -149303, -497244, -370959, -455767, -395539, -345940, -331831, -448253, -364175, -298287, -366501, -202101, -277404, -252246, -230093, -403803, -365142, -73735, 40666, -226557, -468309, -321339, -290117, -637204, -475370, -560, 73935, -122647, -314265, -149153, -152732, -342481, -343529, -179135, -385001, -219167, -197528, -263258, -250412, -231561, -195994, -147486, 20743, 200720, 183567, -32353, -278815, -9053, 85728, -91282, -150286, 81330, -219713, -223797, 40270, 84767, 60124, -75248, -154335, -333127, -407165, -339895, -355400, -330354, -552731, -443576, -32999, 2211, -122023]
1559a22023j21110J4059k9682j87129J37100p3578Q7028j33280j5416L20840j23042
1548b46233K0343Q4193P4367p5946k8002K1302j59123k53244J00110J88533K1522
1537b52178j13549J39467k82405J47788K69732p2442k23038L9459J65982p959
1527a89143r102m3838K864q576q0639j58043K45938P2654k43828j44329J35422
1516d20620j2216j9447m2393k51758q1247L04145K36206k68510j47073M80183
1506b22730k63082j9117K65411K29142L1621l08809k93703K29574L34393q7331
1496a04631j02219K25344j01888q2942j78802J89865R927m8819n0062n229K2349
1485b27107N7695K09132j85487J2537K84172J29157l26426k24814Q0927J03004
$$ y = [-122023, -243133, -229074, -258756, -445885, -308785, -382363, -295335, -428615, -444031, -123191, -246233, -225890, -141697, -67330, -143276, -171278, -149976, -309099, -562343, -462233, -273700, -252178, -365727, -226260, -508665, -360877, -91145, -163587, -386625, -347166, -181184, -189143, -198245, -242083, -239219, -247795, -328434, -486477, -240539, -167885, -411713, -556042, -420620, -432836, -452283, -494676, -746434, -827681, -523536, -287330, -555840, -702913, -222730, -485812, -504929, -239518, -10376, 21245, -287564, -581267, -351693, -17300, -104631, -206850, 18494, -83394, -166336, -345138, -155273, -145346, -194165, -244227, -249456, -227107, -169412, 39720, -145767, -133230, 150942, 280099, -46327, -271141, -190214, -87210]
1475h7210j8954J48833j59871n1944j95451J95761k04424J00172J63938J8851
1465i0299n1534K78346J76489j69714k99827n1287K13317o2452r5643J31120J67455
1454A45971R956j17444Q6297j30212l46683J20051J21603l24350P8586K80318
1444g5907M9131k56115M5096K52674l01360l9526J97786J96440R2301k87596j89486
1433c16562J28365l0796j08196m3515Q8669J04601j62571J5723K22200j11003
1423b13085k05430N7295k38370L13527K26748M9508O3688k19326Q5061M05558
1413C25174j41012j18550K0045j78139j93318j2866L35661l5493k94913K34312
1403e9099K17202j84780M2781L1091k824l06641k1017o9161Q9688L10724j06446
$$ y = [-87210, -106164, 42669, -117202, -169146, -364597, -168836, -373260, -273088, -109150, -90299, -141833, 136513, 313002, 143288, -156539, -207826, 5491, -56961, -152604, -21484, 145971, 155927, 38483, 124780, -5432, -352115, -232064, -110461, -434811, -356225, -75907, -26776, -282891, -237795, 14879, -286481, -326007, -128221, 68219, 160520, -127076, -316562, -188197, -218993, -327189, -370704, -282035, -177434, -340005, -324282, -102082, -213085, -418515, -361220, -599590, -286063, -59315, -9807, 53881, -165445, -80384, 325174, 184162, 65612, 85657, -92482, -285800, -298666, 36995, 1502, -293411, -59099, 158103, -26677, 16104, 47195, 44371, -262270, -283287, -352448, -262760, 47964, -58482]
1392e8482j95847l3797N2780K89714J5522k25118k35825J5810K48745j75627p7645
1381c79770M4886J79465L6799j62553J37219K52799J42073k19827j8692l2m9917
1370c7550Q6093o8372k42585K60129K12874O4299l21890M8656J55741j72075k74837
1359b89517K50331J29137k69744j39500L16092J16205j36637k54724J09454k2724
1349a91627M9994j9370J06638P2277l33809J03692k74262n6900L41640o6868k06599
1338d75194N8417L56799r5780l03597R5716p1971J97615j27856j06820J80226
1328b92445J08747j32103j6477K13173j21079R4966J85049L864k09222j66718
1318c32245K39202p2353k05314J29261J59804J64992l3323j1019P6649j72710
$$ y = [-58482, -254329, -288126, -235346, 54368, 69890, -155228, -391053, -375243, -126498, -302125, -379770, -334884, -155419, -118620, -281173, -143954, 108845, 250918, 31091, 12399, 12367, -37550, 48543, -19829, -262414, -2285, 210589, 274888, -47002, 1654, 157395, -14680, -289517, -39186, 89951, -179793, -319293, -3201, 113004, -23633, -278357, -168903, -191627, -141633, -161003, -54365, 17912, -315897, -212205, -486467, -543367, -201727, -268595, -475194, -416777, -59978, -155758, -459355, -363639, -435610, -237995, -365851, -472671, -292445, -183698, -315801, -332278, -119105, -240184, -145218, 39831, 43695, -165527, -332245, -93043, -165396, -370710, -241449, -81645, 83347, 50024, 39005, 115654, -57056]
1308e7056r7130r4949J41249j03194N0531L7433l0441j73933Q5760K26889N0280
1297C5439O7287o4009L8210J84512j32997J5872J04951j33086M5466K30129Q0250
1286D72024l2578p1264M4438r9445j28444J01830P1618j78210l01390Q7569K19211
1275A85359q0261j45235K22705Q5441j02302N777K82688r8178m35238p4796L10146
1264A56106j32933l40002J18570Q2303n7462J94541L57936l89693k60202K51833
1254a9003q6991j85308j8664K96350K4726l47648l1049K07349L80142j92106j34026
1243a06228K42502J14004k19518O6279J12874l96303o1397K99063r7549q1093
1233a27366K04487J46955l81136P7558L99233o1995J98623Q1304k44122j27459
$$ y = [-57056, -154186, -249135, -107886, -211080, -160549, -123116, -153557, -327490, -241730, -14841, 35439, 102726, 38717, 76927, 261439, 128442, 144314, 249265, 116179, 161645, 391774, 472024, 439446, 368182, 412620, 313175, 184731, 286561, 358179, 179969, -121421, -33852, 185359, 105098, -40137, 182568, 268009, 165707, 171484, 454172, 355994, -79244, -154040, 156106, 23173, -316829, -198259, -115956, -173418, 21123, 379059, -10634, -270836, -19003, -105994, -291302, -309966, -13616, 11110, -336538, -367587, -160238, 219904, 27798, -106228, 136274, 250278, 30760, 97039, 209913, -186390, -247787, 51276, -46273, -127366, 77121, 224076, -157060, -79502, 319731, 257736, 456359, 537663, 293541, 166082]
1223A66082l7063J89794m9916O2001K40129m8967j78186k14458O4563M9064P57
1212B43800j00535K0701K56420r4705k4774j3804P1460j7008j00260K32368j02770
1201C70893k53243q1013J04673L6102L3483K4436p1249Q1906K50215l66290L3143
1190A63056R6288M6451p1862p3392m1699r7588n411K9099j06768N6912J58157
1179A53243j8877j42170l3256O3229J3380J32827l1505N4147J35477j87159k401
1168A36935J71221m6599k74178M49222K53902l23330l26138L04753K96830l03178
1158C39440r1035J17599M9369J02757J35164p1700j27702J3815O3864l2888R8567
1147E97250k35853r861J01192n3871j27803j73879J69132o5427M9220K75252j67026
$$ y = [166082, 129019, 318813, 268897, 330898, 571027, 522060, 343874, 129416, 193979, 243043, 243800, 143265, 163966, 420386, 325681, 300907, 287103, 358563, 341555, 241295, 473663, 370893, 117650, 36637, 141310, 177412, 210895, 235331, 164082, 245988, 496203, 129913, 163056, 259344, 305795, 233933, 160541, 118842, 21254, 15843, 44942, -61826, -4914, 153243, 134366, -7804, -41060, 22169, 35549, 168376, 136871, 191018, 326495, 139336, 136935, 308156, 261557, -12621, 436601, 690503, 367173, 41035, 345788, 642618, 339440, 248405, 366004, 415373, 518130, 653294, 581594, 453892, 467707, 531571, 498683, 597250, 361397, 351536, 452728, 398857, 271054, 97175, 266307, 200880, 250100, 525352, 358326]
1136C58326K2718K9581J58756j08121j03370J35276j04847l7076J6269J70399
1126E37911M1083L9055J69249j81461P9217k3092M427R6511L2175J47340M271
1115I46686o629r7329m5796J93423p2056J62696K17710J87357R5764j16871m4435
1104A420520j37036q586m2242j70074n3918K6141K82105j16077p1643k6382K3224
1093A126032j484j6901l5590O6825L63863n0199j57130N6964l9154J47806k13585
1082A247447J67599L18692j88553K21447J12562j17109k98440l2324K31299L0371
1072A692991J894K25402P1330P9519j54787K1680J38805K09175K8694R4327J67532
1061B576562R6014J83414R0959p2788N0948J55565J33800l5194K09435Q4540J21948
$$ y = [358326, 381044, 410625, 569381, 461260, 357890, 493166, 388319, 351243, 367512, 537911, 578994, 618049, 787298, 605837, 685054, 661962, 666389, 762900, 795075, 942415, 946686, 940057, 842728, 796932, 990355, 918299, 1080995, 1298705, 1486062, 1581826, 1464955, 1420520, 1283484, 1274898, 1232656, 1062582, 1008664, 1034805, 1316910, 1200833, 1129190, 1102808, 1126032, 1124548, 1107647, 1072057, 1138882, 1502745, 1452546, 1295416, 1352380, 1313226, 1461032, 1247447, 1415046, 1733738, 1545185, 1766632, 1879194, 1762085, 1463645, 1431321, 1662620, 1692991, 1694885, 1920287, 1991617, 2071136, 1916349, 1938029, 2076834, 2286009, 2314703, 2409030, 2576562, 2672576, 2855990, 2946949, 2874161, 2925109, 3080674, 3214474, 3179280, 3388715, 3473255, 3595203]
1050C595203n8573j2395J26395M1963L1810M8417K56464K62454R4444M20523J78843
1039D985548r0451K15342J76319L70588l2637K06974O61436K06632J17005L79280
1029G196036M20517L17631O79382O89703O95192O88410R72983Q48290N67878Q91117
1019A3967139J082987J016138J163002J666645K153925K475012K908632L997876
1011C0431356M950227N890700P255412R495350J1305707O400460m274749p271633
1003F4182830k679522o70807q965458j1312355p846480n340887l928120l184666
995B0254535k344238j934722j537567j496248q71588r15349o44421q46032n90432
986I073938m01613n44384p46825o39556m47479j00053n92511j71966k15128l50145
$$ y = [3595203, 3536630, 3524235, 3650630, 3692593, 3724403, 3772820, 4029284, 4291738, 4386182, 4806705, 4985548, 4895097, 5110439, 5286758, 5657346, 5624709, 5831683, 6493119, 6699751, 6816756, 7196036, 7616553, 7934184, 8613566, 9303269, 9998461, 10686871, 11659854, 12508144, 13076022, 13967139, 15050126, 16066264, 17229266, 18895911, 21049836, 23524848, 26433480, 30431356, 35381583, 41272283, 48527695, 58023045, 69328752, 75729212, 71454463, 64182830, 61503308, 60832501, 51867043, 40554688, 32708208, 27367321, 23439201, 20254535, 17910297, 15975575, 14438008, 12941760, 12070172, 11154823, 10510402, 9664370, 9073938, 8672325, 8127941, 7381116, 6741560, 6294081, 6194028, 5601517, 5429551, 5214423, 4864278]
976D864278l18101l12537j11069j83067r8640K0037j12839j83376l15198j05010
966C144478k15614j3097l5645M4151l00792j87218j59909l79562M0749N1796k37499
955A751838k17543j84137J87523L8003R3454o3086k27033j78859n119J87510o0375
944A322176j41621J2037n8273J49703k4841l1714P4958j36687j09342M3621J76467
933A276484j25939j47078j76805k00793j7431L3617N0971j39621N8183L25808
923I37396j32008j11454q1991P4747k01174p6115L31382l7908k44977n2232l04788
912A00878L37904j53005k61261j50367J15141K67537K606j7437j78031J98877
902B62842J33273l78088P5664j06877j93961J42228j2103J61467j20183J13434
$$ y = [4864278, 4546177, 4233640, 4122571, 3939504, 3840864, 3860901, 3748062, 3564686, 3249488, 3144478, 2928864, 2915767, 2880122, 2924273, 2623481, 2436263, 2276354, 1896792, 1937541, 1989337, 1751838, 1534295, 1350158, 1537681, 1575684, 1669138, 1606052, 1379019, 1200160, 1195041, 1382551, 1322176, 1180555, 1192592, 1134319, 1284022, 1259181, 1227467, 1302425, 1165738, 1056396, 1100017, 1276484, 1150545, 1003467, 826662, 625869, 608438, 642055, 693026, 553405, 611588, 937396, 805388, 693934, 611943, 686690, 485516, 409401, 740783, 702875, 457898, 405666, 100878, 438782, 285777, 24516, -125851, -10710, 256827, 259433, 241996, 63965, 262842, 396115, 18027, 93691, -13186, -207147, -64919, -77022, 84445, -35738, 77696]
892G7696o0167J15811q658J75859J8783j87956j5250L4170j05737k87886j3868
881b57203K09787j2513o0416J54909M3747r1968j02630J12897o232k75780l8713
870c24115K10813L2826M2039J51643l9758M4368j84854J1170J61266j73589J22487
859E4296J22746J71449l33686L172J41627j17896j58388j15655J18238J15992
849A895N5263P882L6811p1956J1785L5208J20238j61669o3153J08167O6605o6331
837H0745j53995K96229n4170k87994R7898k5585o1209J11888K418k43254j04432
826c41461J46378n3717j0339m0517O0907O5629R7221r0493K7039J56114m7156
815c0395j90769J07340J9028m742o6819o1320k39532J17171K54676k3095q5229
$$ y = [77696, 17529, 133340, 124682, 300541, 319324, 131368, 116118, 150288, 44551, -243335, -257203, -47416, -59929, -120345, 34564, 78311, -13657, -116287, -3390, -9622, -285402, -324115, -113302, -80476, -38437, 113206, 73448, 117816, -67038, -55868, 105398, -68191, 54296, 177042, 348491, 14805, 17977, 159604, 41708, -116680, -232335, -114097, 1895, 57158, 65040, 101851, 29895, 41680, 76888, 197126, 35457, -27696, 80471, 147076, 80745, -73250, 222979, 168809, -119185, -21287, -46872, -108081, 3807, 6225, -237029, -341461, -195083, -248800, -259139, -299656, -238749, -173120, -75899, -166392, -139353, 16761, -30395, -221164, -113824, -94796, -99538, -166357, -227677, -467209, -350038, -95362, -118457, -203686]
804b03686n6560K17675K4085M3050j24174K0281J15792o9634P1590J32826M3855
793B15100j63087q2264K78065l4821J8564j3487k34980J8975Q3677r7532Q1963
782G0173m3946J55565j79153j82698R6984M64945Q115m79876J02268K56479J16485
771C85341j26720m522j10084O9380J97312J01643o7981l8681J75876k80726k59551
760D1287P4495K39797n3352k61763p9067L45728l3300k62471m0003K04318K02620
749C78289k77431l9j66500j99340J81168J991j37534K57621J68558L7110k27626
738A6267j34512K49785P4584j45806n10990J13188J58969j01452K31510J01704
728E3247k31124J621J71234K09718k63761p6615K35542J00203K3215J20774R7222
$$ y = [-203686, -260246, -42571, -18486, 24564, -99610, -79329, 36463, -33171, 38419, 171245, 215100, 52013, -30251, 247814, 212993, 231557, 218070, -16910, 2065, 85742, -11790, 70173, 26227, 181792, 2639, -180059, -83075, 381870, 389985, -89891, 12377, 268856, 385341, 258621, 254099, 144015, 213395, 410707, 512350, 444369, 405688, 581564, 300838, 41287, 115782, 355579, 302227, 40464, -38603, 307125, 273825, 11354, -28649, 175669, 378289, 100858, 100819, -65681, -265021, -83853, -81862, -219396, 38225, 206783, 243893, 16267, -118245, 131540, 206124, 60318, -450672, -337484, -178515, -279967, -48457, 53247, -177877, -176256, -5022, 204696, -59065, -135680, 99862, 200065, 223280, 344054, 441276]
717D41276l40780J8027K08203j22202J16105k17914o6264J44922k82024m0760
707a41411J51845k6537l72500L20948O0175k23353M26948K61896l52724j50715
697d5428J39528p3883l27684O924L87021m6849r7929J52024J10008j86662q209
686H861R914r314r1041K30818l686k02774q7215j22291Q9690r9968K93843O1063
674G7900l8746J4494O856q564j24699K00646J84365m29647o3475J1169K89189
663A19488n2242J06399P0306j43644K88897L643k33080n2869J18275K8862k90961
652c6926K53329o9729j71664J9381j5880J39804K09102n8513k70842q5349L7226
641e0061J21152r7547p9033k27206R346M00426J75717k85808J25105R1175m59543
$$ y = [441276, 100496, 118523, 326726, 204524, 320629, 102715, 36451, 181373, -100651, -141411, 10434, -16103, -388603, -67655, -7480, -230833, 196115, 458011, 105287, -45428, 94100, 20217, -307467, -300543, 86478, 39629, -58300, 93724, 203732, 17070, 8861, 18775, 9461, -81580, 149238, 145552, -57222, -144437, -266728, -177038, -277006, 16837, 77900, 39154, 53648, 60504, 51940, -72759, 127887, 312252, -117395, -180870, -169701, 119488, 67246, 173645, 243951, 100307, 389204, 392847, 159767, 106898, 225173, 254035, -36926, 216403, 146674, -24990, -5609, -21489, 118315, 327417, 268904, -1938, -87287, -50061, 71091, -26456, -105489, -332695, -323349, 77077, 252794, -33014, 92091, 183266, -276277]
630b76277m0990L84479J63742k41757o556K36379n7236Q170k05325j14493K41725
619I1861K72906k28593j29999M9028k36336J71550J01762k40693R1738K23027
609A66251k32412l70566N50931J77624k47177k11366J25545J29892n9076J38645
599A68291K24250j81872K77359p0585j26306n1730L7722K9688l02323p3697j04713
588a73916L8264K59728j91042J06834J12761O1856J23435j38060r9616j86062
578h5818N3006J46987j67468j08828M1070R6806J76644k43426K17261J6959j79528
567c6335q883K3282j81040j14684O540J25013M2463j60307l9217J19918k8728
556b51978n0097J36867m8807j7383K27132r4468k77763J0645J43962J04755l1331
$$ y = [-276277, -317267, 67212, 230954, -10803, -17359, 219020, 161784, 169954, -35371, -149864, 91861, 364767, 136174, 6175, 55203, -181133, -9583, 92179, -148514, -56776, 166251, -66161, -436727, 114204, 291828, 44651, -166715, -41170, 88722, 29646, 168291, 392541, 210669, 488028, 417443, 291137, 239407, 277129, 306817, 4494, -69203, -173916, -135652, 124076, -66966, 39868, 152629, 214485, 337920, 199860, 100244, -85818, -32812, 114175, -53293, -162121, -121051, -24245, 152399, -91027, 126234, 143193, -36335, -45218, -21936, -202976, -317660, -311120, -186107, -143644, -303951, -343168, -223250, -251978, -302075, -165208, -214015, -231398, -4266, -98734, -376497, -365852, -221890, -117135, -148466]
545a48466J90107K00789k48155k1477j67101L75952j58430j17562L4443J51274
535I1374j00540O5288L74272j75814k04003j09122L0954J78115J07727o0388k76009
524g8146k18662L62173o2384j40474P2153J01999j81882o8221M04476J22626l85513
513g1855j15085j49388L78864r9279j95494k3283K76406M8092k33821O8754p2912
502a89001n8695N409O3896N6488m7667R7886K4497j67208K33161J6296k04532
491a69470Q7750o3811M8937J94259J21017n1978k47270J31350j27593J17717J0189
480E1097r3159J42368N4059j55224K07197k668k82189j52616J0124N3721q3506
469b50796J57135j46057P0444J58558r7986q3351Q8759L29684r4806k08175J59807
$$ y = [-148466, 41641, 242430, -5725, -27202, -194303, 181649, 23219, -94343, -59900, 91374, -9166, 56122, 430394, 254580, 50577, -58545, -27591, 150524, 258251, 197863, -78146, -296808, 65365, 2981, -137493, -65340, 36659, -145223, -213444, 191032, 313658, -71855, -186940, -336328, 42536, -56743, -252237, -275520, 886, 48978, -184843, -116089, -189001, -247696, -242287, -178391, -121903, -169570, -71684, -47187, -214395, 18766, 35062, -169470, -81720, -145531, -96594, 97665, 218682, 166704, -80566, 50784, -76809, 40908, 51097, -42062, 100306, 154365, -859, 206338, 203670, -78519, -231135, -221011, -167290, -250796, -93661, -239718, -169274, -10716, -108702, -192053, -103294, 226390, 131584, -76591, 83216]
458H3216K4555m2150K5054R7910n3038k83911p697J352N941N3337O6173p1523
446a00781J36963K6765N4022n8345J60898o376m2153j32958k06459L32331J08102
435B72009j67298J2225O0645L1794j15022o4398J08922M7200M2219j29163L5294
424A34427q9308J55785j28579J4609J41956N577j29976j40839J11688R8261J54171
413C27772j8303j65300Q1582R6223k2424k04336k9546L94435J73790l41854j98902
402I3137J16885K94691q1926j48927p4822J48702j52538j45445j28004J12699
392C4452K02872j77762P3268J8840J53957O2446k11672M4442o5783Q466p9487
381F4039N7279K16781J35777j12762k37301K63923J09581l63736J87364R694K1517
$$ y = [83216, 107771, 65621, 90675, 188585, 135547, -148364, -156061, -154709, -148768, -95431, -29258, -100781, 36182, 62947, 116969, 58624, 219522, 213146, 170993, 38035, -168424, 163907, 272009, 104711, 116936, 177581, 209375, 94353, 29955, 138877, 186077, 228296, 99133, 134427, 45119, 200904, 72325, 86934, 228890, 234467, 104491, -36348, 75340, 173601, 327772, 309469, 144169, 225751, 321974, 299550, 95214, 65668, 460103, 633893, 292039, 93137, 210022, 504713, 422787, 273860, 199038, 347740, 195202, 49757, -78247, 34452, 237324, 59562, 132830, 151670, 305627, 368073, 156401, 200843, 135060, 143526, 64039, 121318, 338099, 473876, 361114, 123813, 387736, 497317, 133581, 320945, 330639, 352156]
370C52156P0742N4052Q4927l92882J16161J61951k24166Q8217m1048q35j15268
359A54007Q0026N10159r3561n3966k51826J61085m8481j38447q6012j28623K4924
348A29285J36111L3123l0236j16856J53801J3816j35359k49951K85200j24396
338I4538K9622R3220J36828p84k52344Q6761o5435r4323J80199j01361j6747l368
326H6806R9680J01439J09660O6141j27751N5893l22477J61338J24162k03297J12947
315B64541J02752j03610k38217P0742J04832o7468J90113j92140J75543Q1510
305C88598m1650J27364k86510J29687J69851j80853M3918k39406K19206N0752
295C80957k5426l4609j09302K38899p2485L9917J46106j16201j34764k40175J16163
$$ y = [352156, 422898, 476950, 561877, 168995, 285156, 447107, 222941, 311158, 270110, 269275, 154007, 234033, 744192, 650631, 596665, 344839, 505924, 457443, 318996, 232984, 104361, 129285, 265396, 298519, 268283, 151427, 305228, 319044, 183685, -66266, 218934, 94538, 124160, 217380, 354208, 353424, 101080, 187841, 122406, 28083, 208282, 106921, 90174, 86806, 186486, 287925, 397585, 463726, 335975, 391868, 69391, 230729, 354891, 151594, 264541, 367293, 263683, 25466, 96208, 201040, 133572, 323685, 131545, 307088, 388598, 346948, 474312, 187802, 317489, 487340, 306487, 350405, 110999, 330205, 380957, 355531, 320922, 211620, 450519, 378034, 417951, 564057, 447856, 313092, 72917, 189080]
284A89080J35814O1940j98582O3382J07959o6686l3295l4553J22729r2096K1867
273B77559M6433R5307J10787k82590l9429j62964J56599K60714l13227K9634J77972
262C56795Q2603q5904k89538K3165N4033L41757r6198j00321P6598j20728J88838
251D31100k13928k0841o6284n8490l9557k27571K12011Q9595m6440J80630l3948
240B06277N7863k16809K1758P2040j65878R8011K17688K05954k54444j53111q4715
229D634m6699K28682j03043K09794o8135j85888Q1766K9212J35265k18714q6653
218a9779K29105j80907j71408L16724J17174l09182j88391K70679J32297K2749
$$ y = [189080, 324894, 386834, 188252, 251634, 359593, 292907, 259612, 225059, 347788, 255692, 277559, 323992, 419299, 530086, 247496, 208067, 45103, 201702, 462416, 149189, 178823, 356795, 439398, 353494, 63956, 87121, 141154, 482911, 386713, 286392, 362990, 242262, 431100, 217172, 196331, 130047, 71557, 32000, -195571, 16440, 106035, 59595, 240225, 206277, 264140, 47331, 69089, 141129, -24749, 73262, 290950, 496904, 242460, 89349, 4634, -42065, 186617, 83574, 293368, 225233, 39345, 121111, 150323, 285588, 66874, -19779, 209326, 28419, -142989, 173735, 290909, -18273, -206664, 64015, 196312, 219061]
$$ [...]
##END NTUPLES=NMR SPECTRUM
##END=
