##TITLE=1H_TG-2315-5
 CDCl3,8 sc, 
 8.02.2021
##JCAMPDX= 6.0         $$ Bruker NMR JCAMP-DX V2.0
##DATA TYPE= NMR SPECTRUM
##DATA CLASS= NTUPLES
##ORIGIN= UXNMR, Bruker Analytische Messtechnik GmbH
##OWNER= root
$$ XWIN-NMR		Version 3.5
$$ Mon Feb  8 11:49:15 2021 Russian Standard Time (UT+4h)  she@DPX200
##.OBSERVE FREQUENCY= 200.1315066352
##.OBSERVE NUCLEUS= ^1H
##.ACQUISITION MODE= SIMULTANEOUS
##.ACQUISITION SCHEME= undefined
##.AVERAGES= 8
##.DIGITISER RES= 18
##SPECTROMETER/DATA SYSTEM= spect
##.PULSE SEQUENCE= zg30
##.SOLVENT NAME= CDCl3
##.SHIFT REFERENCE= (INTERNAL, CDCl3, 0, 15.9523)
##AUDIT TRAIL= $$ (NUMBER, WHEN, WHO, WHERE, WHAT)
$$ ##TITLE= Audit trail, XWIN-NMR		Version 3.5
$$ ##JCAMPDX= 5.01
$$ ##ORIGIN= Bruker BioSpin GmbH
$$ ##OWNER= she
$$ F:/spectra/data/she/nmr/H-F/1/pdata/1/auditp.txt
$$ ##AUDIT TRAIL=  $$ (NUMBER, WHEN, WHO, WHERE, WHAT)
(   1,<2021-02-08 11:48:09.50 +0400>,<she>,<DPX200>,
      <created by zg, POWCHK disabled, PULCHK disabled
       configuration hash MD5:
       00 E9 B6 7A A2 85 ED C7 34 08 36 98 17 FE 4E 26
       data hash MD5: 16K
       D5 02 55 70 00 3A 7B AE 16 F0 0F 7D 62 54 D7 20>)
(   2,<2021-02-08 11:48:12.01 +0400>,<she>,<DPX200>,
      <Start of raw data processing
       efp BC_mod = 2 LB = 0.24 FT_mod = 6 PKNL = 1 PHC0 = -10756.92 PHC1 = 12.00094 SI = 16K 
       data hash MD5: 16K
       56 7C 66 F0 4C A0 04 CB A6 21 B8 F5 D3 E9 D5 0A>)
(   3,<2021-02-08 11:48:30.06 +0400>,<she>,<DPX200>,
      <pk PHC0 = 2.131082 PHC1 = -2.6 
       data hash MD5: 16K
       C5 0B 69 B1 9A FA 95 73 5E 06 47 EE CF 96 BD 80>)
(   4,<2021-02-08 11:48:33.21 +0400>,<she>,<DPX200>,
      <abs ABSG = 5 
       data hash MD5: 16K
       A4 53 FF 15 A2 9D 51 0B 0B 74 F8 39 E4 4C 56 12>)
$$ ##END=
$$ 
$$ hash MD5
$$ 2E 73 35 D3 D0 6B E5 45 07 36 D8 89 AD 8D AC D1
##$RELAX= 
##$RELAX= 
##$RELAX= 
##$RELAX= 
##$RELAX= 
##$RELAX= 
$$ Bruker specific parameters
$$ --------------------------
##$DU= <F:/spectra>
##$EXPNO= 1
##$NAME= <H-F>
##$PROCNO= 1
##$TYPE= <nmr>
##$USER= <she>
##$AMP= (0..31)
100 100 100 100 100 100 100 100 100 100 100 100 100 100 100 100 100 100 
100 100 100 100 100 100 100 100 100 100 100 100 100 100 
##$AQSEQ= 0
##$AQ_mod= 1
##$AUNM= <au_zg>
##$AUTOPOS= <>
##$BF1= 200.13
##$BF2= 200.13
##$BF3= 200.13
##$BF4= 200.13
##$BF5= 200.13
##$BF6= 200.13
##$BF7= 200.13
##$BF8= 200.13
##$BYTORDA= 1
##$CFDGTYP= 0
##$CFRGTYP= 5
##$CHEMSTR= <none>
##$CNST= (0..31)
1 1 145 1 1 1 1 1 1 1 1 1 1 1 1 1 1 1 1 1 1 1 1 1 1 1 1 1 1 1 1 1 
##$CPDPRG= <>
##$CPDPRG1= <>
##$CPDPRG2= <>
##$CPDPRG3= <>
##$CPDPRG4= <mlev>
##$CPDPRG5= <mlev>
##$CPDPRG6= <mlev>
##$CPDPRG7= <mlev>
##$CPDPRG8= <mlev>
##$CPDPRGB= <>
##$CPDPRGT= <>
##$D= (0..31)
0 1.2 0 0 0 0 0 0 0 0.06 0 0.03 0 0 0 0 0.0002 0 0 0 0 0 0 0 0 0 0 0 0 
0 0 0 
##$DATE= 1612770489
##$DBL= (0..7)
120 120 120 120 120 120 120 120 
##$DBP= (0..7)
150 150 150 150 150 150 150 150 
##$DBP07= 0
##$DBPNAM0= <>
##$DBPNAM1= <>
##$DBPNAM2= <>
##$DBPNAM3= <>
##$DBPNAM4= <>
$$ [...]
##$SUBNAM3= <"">
##$SUBNAM4= <"">
##$SUBNAM5= <"">
##$SUBNAM6= <"">
##$SUBNAM7= <"">
##$SUBNAM8= <"">
##$SUBNAM9= <"">
##$SW= 16.9725356469052
##$SWIBOX= (0..15)
0 0 2 0 0 0 0 0 0 0 0 0 0 0 0 0 
##$SW_h= 3396.73913043478
##$TD= 16384
##$TD0= 1
##$TE= 0
##$TE2= 300
##$TE3= 300
##$TEG= 300
##$TL= (0..7)
0 120 120 120 120 120 120 120 
##$TP= (0..7)
150 150 150 150 150 150 150 150 
##$TP07= 0
##$TPNAME0= <>
##$TPNAME1= <>
##$TPNAME2= <>
##$TPNAME3= <>
##$TPNAME4= <>
##$TPNAME5= <>
##$TPNAME6= <>
##$TPNAME7= <>
##$TPOAL= (0..7)
0.5 0.5 0.5 0.5 0.5 0.5 0.5 0.5 
##$TPOFFS= (0..7)
0 0 0 0 0 0 0 0 
##$TUNHIN= 0
##$TUNHOUT= 0
##$TUNXOUT= 0
##$USERA1= <user>
##$USERA2= <user>
##$USERA3= <user>
##$USERA4= <user>
##$USERA5= <user>
##$V9= 5
##$VALIST= <valist>
##$VCLIST= <CCCCCCCCCCCCCCC>
##$VD= 0
##$VDLIST= <DDDDDDDDDDDDDDD>
##$VPLIST= <PPPPPPPPPPPPPPP>
##$VTLIST= <TTTTTTTTTTTTTTT>
##$WBST= 1024
##$WBSW= 4
##$XGAIN= (0..3)
0 0 0 0 
##$XL= 0
##$YL= 0
##$YMAX_a= 383152
##$YMIN_a= -175316
##$ZGOPTNS= <>
##$ZL1= 120
##$ZL2= 120
##$ZL3= 120
##$ZL4= 120
##$ABSF1= 15.95227
##$ABSF2= -1.020392
##$ABSG= 5
##$ABSL= 3
##$ALPHA= 0
##$AQORDER= 0
##$ASSFAC= 0
##$ASSFACI= 0
##$ASSFACX= 0
##$ASSWID= 0
##$AUNMP= <proc_1d>
##$AZFE= 0.1
##$AZFW= 0.1
##$BCFW= 0
##$BC_mod= 2
##$BYTORDP= 0
##$COROFFS= 0
##$CY= -3
##$DATMOD= 1
##$DC= 0
##$DFILT= <>
##$DTYPP= 0
##$F1P= 0
##$F2P= 0
##$FCOR= 1
##$FTSIZE= 16384
##$FT_mod= 6
##$GAMMA= 0
##$GB= 0
##$INTBC= 1
##$INTSCL= 2.992141e-10
##$ISEN= 128
##$LB= 0.24
##$LEV0= 0
##$LPBIN= 0
##$MAXI= 10000
##$MC2= 0
##$MEAN= 0
##$ME_mod= 0
##$MI= 1.114404
##$NCOEF= 0
##$NC_proc= -7
##$NLEV= 6
##$NOISF1= 3.799351
##$NOISF2= 2.8
##$NSP= 0
##$NTH_PI= 0
##$NZP= 0
##$OFFSET= 15.95227
##$PC= 1
##$PHC0= -10754.79
##$PHC1= 9.40094
##$PH_mod= 1
##$PKNL= yes
##$PPARMOD= 0
##$PSCAL= 0
##$PSIGN= 0
##$REVERSE= no
##$SF= 200.130012476562
##$SI= 16384
##$SIGF1= 3
##$SIGF2= 2
##$SINO= 5.538805
##$SIOLD= 16384
##$SREGLST= <1H.CDCl3>
##$SSB= 0
##$STSI= 16384
##$STSR= 0
##$SW_p= 3396.73913043478
##$SYMM= 0
##$S_DEV= 0
##$TDeff= 16384
##$TDoff= 0
##$TI= <>
##$TILT= no
##$TM1= 0
##$TM2= 0
##$TOPLEV= 0
##$USERP1= <user>
##$USERP2= <user>
##$USERP3= <user>
##$USERP4= <user>
##$USERP5= <user>
##$WDW= 1
##$XDIM= 16384
##$YMAX_p= 316578094
##$YMIN_p= -661783
$$ End of Bruker specific parameters
$$ ---------------------------------
##NTUPLES= NMR SPECTRUM
##VAR_NAME=  FREQUENCY,     SPECTRUM/REAL,   SPECTRUM/IMAG
##SYMBOL=    X,             R,               I
##VAR_TYPE=  INDEPENDENT,   DEPENDENT,       DEPENDENT
##VAR_FORM=  AFFN,          ASDF,            ASDF
##VAR_DIM=   16384,         16384,           16384
##UNITS=     HZ,            ARBITRARY UNITS, ARBITRARY UNITS
##FACTOR=    0.207333158178281, 1,           1
##FIRST=     3192.52790489915, 0,            0
##LAST=      -204.211225535625, 0,           0
##MIN=       -204.211225535625, -661783,     0
##MAX=       3192.52790489915, 316578094,    0
$$ Real data points
##PAGE= N=1
##DATA TABLE= (X++(R..R)), XYDATA
$$ [...]
5941G10061M0911k82057R1832K16488j38081Q809K020j44834k4174J55641j97546
5930D39070l1206n9546J03006k16105j31287J85523j85482J29043J92239L9003
5920D64258J04405l92866K2234J57018j99913j56149J57143K31009j46800K50193
5910D90532m5602r8353J31138p5554P4875m5765j83881O708K6965K43207m4244
5899D80026k14963J45942l3149p659K11795K89497j91025j22622j75200Q2664
5889D65306M0684J4007K8554k29732j02956P8316n874K4644M7999j41394M8043
5878B67597j9282k17759K52226l775k0402J5635k49755J43672j95912J65428J44047
5867B81720n3781M6163J5407k25061N55J86767k79502J52517Q4108j86650J70587
$$ plain form
5941 710061 750972 468915 560747 777235 639154 647963 649983 505149 480975 636616 439070
5930 439070 407864 348318 451324 235219 103932 289455 103973 233016 425255 464258
5920 464258 568663 175797 198031 355049 155136 -1013 156130 387139 240339 490532
5910 490532 444930 346577 477715 402161 477036 431271 247390 254098 281063 524270 480026
5899 480026 265063 411005 377856 370197 581992 871489 680464 557842 382642 465306
5889 465306 505990 519997 548551 318819 215863 294179 288305 312949 360948 219554 267597
5878 267597 248315 30556 282782 279007 258605 274240 24485 168157 -27755 137673 281720
5867 281720 227939 274102 289509 64448 65003 251770 -27732 124785 208893 22243 192830
5856A92830J8882R8978L1352j20968K40337j41578m403O2199J73322k8882K41216
5845G63285l52679k12227N17567k11312k50848j47225o545N4548o1191K58590
5835C51963R1811l52571K91084j8050m4169j99782L04583N2805k51793j23901
5825A01980k503n712j89343N5338J8415k530J4108O6375L0487k50882K20325L14876
5813C70934l6706j8074m9067K60744q6007k06139R2400J98961k10973J29630K02090
5802F47793j77453k283r0368j27085n6139J11904K95027l695P9564l9058l05942
5791C32265N1615J70115j43135P3518K86790l19322J07691J95675P2725k27964
5781E99973N0587R5300k84831j84528R2890Q3085J34320M2914n8852j90136p0629
$$ plain form
5856 192830 211712 310690 342042 221074 461411 319833 315430 377629 550951 522069 763285
5845 763285 410606 198379 715946 504634 253786 106561 100016 154564 93373 351963
5835 351963 443774 91203 382287 364237 320068 120286 424869 477674 225881 101980
5825 101980 99477 93765 -95578 -40240 -21825 -24355 -10247 56128 86615 -164267 56058 370934
5813 370934 334228 316154 267087 527831 441824 235685 328085 527046 316073 445703 647793
5802 647793 470340 468057 377689 250604 194465 306369 601396 597701 677265 638207 332265
5791 332265 383880 553995 410860 484378 771168 451846 559537 755212 827937 599973
5781 599973 650560 745860 461029 276501 369391 452476 586796 629710 570858 380722 310093
5770C10093M81305j65654K45440K03532m0886j91410k9669J69645l4610q8079
5760H59707o2530l11606J21465L4264k74587J7936K45658j5761k16519J01967
5750D99994K4766j43208J17449L51196j13472O4582l2580m097j00560j7531J35226
5739G81765J08303K395j31687O275j3797k08276O1416K3520j5188J75583m44829
5728C45480J86880j1862q4942k9545k103R6875r671J00949m4609j26962j58210
5717B62280L30114R5729L949k69367p1586L52271l34531j35530J07037N1366p0410
5706C21322r1607J05915Q2024J92025j46703o6824k2622L4925J48430K9919r7164
5695D89640m9737k90930n1853L74980J06044l07078J95156j03278j02982K72761
$$ plain form
5770 310093 791398 625744 871184 1074716 1033830 842420 812751 982396 947786 859707
5760 859707 797177 485571 607036 641300 366713 384649 630307 614546 398027 499994
5750 499994 524760 381552 499001 850197 736725 801307 768727 764630 664070 646539 781765
5739 781765 890068 892463 760776 767051 753254 544978 606394 629914 614726 790309 345480
5728 345480 532360 520498 435556 406011 403908 500783 491112 592061 547452 420490 262280
5717 262280 592394 688123 692072 422705 351119 703390 368859 233329 340366 391732 321322
5706 321322 229715 335630 417654 609679 462976 396152 373530 408455 556885 586804 489640
5695 489640 439903 148973 97120 472100 578144 271066 466222 362944 259962 532723
5685E32723r5632j48162Q0219R322j37669K03948Q6580k82675k6193J20427J31281
5674D74169q8297k1763Q2076q3015J84878k8430R9776k52072J34687M30870j12291
5663H20588k01311k1196J71020o1750j53610K25845k3808o5915j97345O6720j6371
5652E42867j10764L6945K65619M4987n4292J65061j78659j47876j06280J29306
5642E86914o864K8348K78557J13204j34688J4035n0662N5652k04799J28498K8546
5631H36741M403L4703j13214j9968M5205q9302r2810J58321J5429J0034j5959
5620G73583J70193Q9721k8643m4482J43715k5466m0770j69436O2228j2285j87457
5609G30901J2964J43985m9730L3530K26277l9452n1005j22620K46417L2935p8442
$$ plain form
5685 532723 437091 288929 369148 378470 240801 444749 531329 248654 222461 342888 474169
5674 474169 385872 364109 446185 363170 548048 519618 619394 367322 502009 932879 820588
5663 820588 619277 598081 769101 707351 553741 779586 755778 689863 492518 559238 542867
5652 542867 432103 469048 734667 779654 725362 890423 711764 563888 457608 586914
5642 586914 580050 608398 886955 1000159 865471 879506 828844 884496 679697 808195 836741
5631 836741 841144 875847 762633 742665 787870 698568 605758 764079 779508 789542 773583
5620 773583 943776 1033497 1004854 960372 1104087 1078621 1037851 868415 930643 918358 730901
5609 730901 743865 887850 838120 871650 1097927 1058475 1007470 884850 1131267 1164202 1085760
5598A085760N2514m747j67534J11357j4831r1404P3384K26912J07177J22603q3233
5587A417958j92619N6702Q9508j02894l75351K62451O8529J75316J39381J30521
5577A669502N8026j85888J63269P1653j93422N8234l3286J49070k36146K02598
5567A723610l9550m15587K76382R0517m880K91516L09451k17409K08591k04018
5557B018623j97351L23026j00245O5676J90056l17710Q5610J07324k14589j05738
5547A854682J68131L7469Q0727j9678j6966K31595k73427L58679l7545r9732L87507
5536B671442j12493m8746O8016J16018J22954m2481k0134K9515j73780l36230
5526B274081L60736k2513j6088M14483j25549R6561j30532L90676R372P5312J46170
$$ plain form
5598 1085760 1138274 1133527 965993 1077350 1062519 971115 1044499 1271411 1378588 1501191 1417958
5587 1417958 1225339 1282041 1371549 1268655 893304 1155755 1224284 1399600 1538981 1669502
5577 1669502 1727528 1541640 1704909 1776562 1583140 1641374 1608088 1757158 1521012 1723610
5567 1723610 1684060 1268473 1544855 1635372 1630492 1922008 2231459 2014050 2222641 2018623
5557 2018623 1821272 2144298 2044053 2109729 2299785 1982075 2067685 2175009 1960420 1854682
5547 1854682 2022813 2060282 2141009 2121331 2104365 2335960 2062533 2421212 2383667 2283935 2671442
5536 2671442 2558949 2510203 2578219 2694237 2817191 2774710 2754576 2784091 2610311 2274081
5526 2274081 2634817 2612304 2596216 3010699 2885150 2981711 2851179 3241855 3251227 3326539 3472709
5515C472709j11046M6295J99599J74881j66744L73501q665L5286N73445k81135
5505D308126R2979J9008O2412L16364j5266J46574P0151J82100k08877M90869
5495E464440L13684M3913Q9736K38636L17878P5909K82131M42786K75852K34370
5485G779335K94619N50657J73645L33174N75135m6056N4769l23429K76786j57242
5475I511393m821j04788R0473K54059l18256N31969Q1971M15398J86697m9002
5465A0595093N57136N18875N21743M32169N88985L97792P51856R85142N18523
5456A5867314P07204P19650J320780J123984J422048J583950J609672K162920
5448B6517522K180994K378754K514410K429652K069705J699358J321026J182345
$$ plain form
5515 3472709 3361663 3407958 3607557 3782438 3615694 3989195 3980530 4015816 4589261 4308126
5505 4308126 4401105 4420113 4482525 4798889 4783623 4930197 5000348 5182448 4973571 5464440
5495 5464440 5778124 5822037 5911773 6150409 6468287 6544196 6826327 7269113 7544965 7779335
5485 7779335 8073954 8624611 8798256 9131430 9706565 9660509 9715278 9391849 9668635 9511393
5475 9511393 9506572 9401784 9492257 9746316 9428060 9960029 10042000 10457398 10644095 10595093
5465 10595093 11152229 11671104 12192847 12625016 13214001 13611793 14363649 15348791 15867314
5456 15867314 16574518 17294168 18614948 19738932 21160980 22744930 24354602 26517522
5448 26517522 28698516 31077270 33591680 36021332 38091037 39790395 41111421 42293766
5440D2293766J385533R90754P53944O20345m61719q49061j589718j678495j656958
5431C9808391j410378j171429j203241n29116k04914L10864Q95268Q11266J306863
5422C8613574J185519J211549L40714k41465l21677j136891r27256j434760q64834
5413C6424473l12789l06167J91116Q38894R30172R45858J491773J750434J780311
5404D3734075K319585K923258L318686L531368L979731M758781N375179O125351
5396G6066014O325159O141309N067792L459641J702141O1648q25745j038091r76371
5387I5983497M4145n0674p57995j546278k942631m683788n970707o636771o431070
5378F7007728o051229n539606m311975m083945l843627l136288l085867k664591
$$ plain form
5440 42293766 43679299 44670053 45423997 46044342 45582623 44733562 43143844 41465349 39808391
5431 39808391 38398013 37226584 36023343 35494227 35289313 35600177 36495445 37306711 38613574
5422 38613574 39799093 41010642 41351356 41109891 40788214 39651323 38724067 37289307 36424473
5413 36424473 36111684 35805517 35996633 36835527 37765699 38711557 40203330 41953764 43734075
5404 43734075 46053660 48976918 52295604 55826972 59806703 64565484 69940663 76066014
5396 76066014 82391173 88532482 93600274 97059915 98762056 98823704 97997959 96959868 95983497
5387 95983497 96027642 95976968 95218973 93672695 90730064 86046276 80075569 73438798 67007728
5378 67007728 60956499 55416893 51104918 47020973 43177346 40041058 36955191 34290600
5370C4290600k319006k147482j495991j578411j512273j278312j087191j261667
5362B1610267p06966q43242n42086m81575o95880n24327n65935n89256m21601
5353A6239399l17010l06300l49899k39658l33796j45155J98962l2338J84769O1245
5343A4960219o478L37620Q65608Q8811j25097k3062n92734r42607q92616r17563
5333A2752101n66512m20218o78181n65657n57909r6712j05833n40257l21400O3896
5323H963318l73899l49796k11406l46307j82629j06615j21064j00623j45754m39146
5313F586079l69818j91895k07326K63473k22279m21133n5227O1840p5359j21452
5303E246903l5628O0336J29008l51692m13747O9331p4193n8467J91746k35510
$$ plain form
5370 34290600 31971594 29824112 28328121 26749710 25237437 23959125 22871934 21610267
5362 21610267 20903301 20060059 19517973 19036398 18340518 17816191 17250256 16661000 16239399
5353 16239399 15922389 15616089 15266190 15026532 14692736 14547581 14746543 14714205 14898974 14960219
5343 14960219 14953741 15291361 16156969 16245780 16120683 16097621 15504887 14562280 13669664 12752101
5333 12752101 12185589 11765371 11087190 10521533 9963624 9866912 9761079 9220822 8899422 8963318
5323 8963318 8589419 8239623 8028217 7681910 7499281 7392666 7271602 7170979 7025225 6586079
5313 6586079 6216261 6024366 5817040 6080513 5858234 5437101 5381874 5443714 5368355 5246903
5303 5246903 5211275 5271611 5400619 5048927 4635180 4704511 4630318 4571851 4763597 4528087
5293D528087j05623j0973j59750j76099J85914J79407K10033k51218l69815j5610
5283D014353l69582j3422K835j20634j9909r6479p7612L5180k46608J7370Q9380
5272C214872J47323l90j78664q1642j81670P6963K91139k61626j70444N76340
5262C432201j67301l72940L53423j76821k79269K67294l11844j52117k1841Q0112
5252B650897L60841j48224m65106N87j64953n521o4447k78083J49439K1118M765
5241B061313K99870l73347k20527L03673N018J02843j01172k9357l5432O1767
5231B074649J9542J79822R0403j69856J06956j56071J62514J74258n9173j52376
5221B270668L009j56545j54910J75611R2008k71940j75567J29310j56318k67170
$$ plain form
5293 4528087 4422464 4411491 4251741 4075642 4261556 4440963 4650996 4399778 4029963 4014353
5283 4014353 3644771 3631349 3634184 3513550 3493641 3397162 3319550 3354730 3108122 3125492 3214872
5272 3214872 3362195 3361805 3183141 3101499 2919829 2996792 3287931 3026305 2855861 3432201
5262 3432201 3264900 2891960 3245383 3068562 2789293 3056587 2744743 2592626 2570785 2650897
5252 2650897 3011738 2863514 2398408 2398995 2234042 2228521 2164074 1885991 2035430 2056548 2061313
5241 2061313 2361183 1987836 1767309 2070982 2076000 2178843 2077671 2048314 2012882 2074649
5231 2074649 2094191 2274013 2364416 2194560 2301516 2145445 2307959 2482217 2423044 2270668
5221 2270668 2273677 2117132 1962222 2137833 2229841 1957901 1782334 1911644 1755326 1488156
5211A488156L83410M5032j79843n9369k10306m6851J26962j21546N6284J51920
5201A633849k00226J96700n1322k48568O3981J17833q933K48253l70245K34233
5191A615555K19923l00565N2006J72696q2550q0701o4944j92933p96L65460j43383
5180A559768P6684Q6697l32421R4887L3810J92293L7449J28056j36163n8818l34990
5169A347252K87483l40215N0525J78920r1173R3777j42394L5744P9930K59745
5159A759594O9471p8673q412k20150Q4083J11904j6234L43938r4203k22297k00748
5148A528273K06235j81767J86672R0370k17096j8817N2716N4606K93j00933o2027
5137A538525P5132L39604M551j32185P1989R6906J93250o8840l6152j39843j5394
$$ plain form
5211 1488156 1871566 1916598 1736755 1677386 1467080 1420229 1547191 1425645 1481929 1633849
5201 1633849 1433623 1630323 1579001 1330433 1394414 1512247 1503314 1751567 1381322 1615555
5191 1615555 1835478 1534913 1586919 1759615 1677065 1596364 1531420 1338487 1337691 1703151 1559768
5180 1559768 1636452 1723149 1390728 1485615 1519425 1711718 1749167 1877223 1741060 1682242 1347252
5169 1347252 1634735 1294520 1345045 1523965 1432792 1526569 1384175 1419919 1499849 1759594
5159 1759594 1829065 1750392 1741980 1521830 1605913 1717817 1701583 2045521 1951318 1729021 1528273
5148 1528273 1734508 1552741 1739413 1829783 1612687 1593870 1646586 1701192 1701485 1600552 1538525
5137 1538525 1613657 1953261 1957812 1825627 1897616 1994522 2187772 2118932 2082780 1942937 1927543
5126A927543M2506r367J15102N3246J56830n7824r0445K08006Q0382K53546q9625
5115B589900m4978L4544l32429J82501m0755K37938J12518J54907k68941m8805
5105B576400l50195J25353R2272j55736O4241j20857j18349J31874J63253k7657
5095B380599L6959k99796K7740j28660m9727J2013J79306R048K73228J7817k15603
5084B242924J03943J04712r5854J34682n7222k28803j28111J42123p0295l4637
5074B113462K23526n9162J25122j60162j62096O5581J1684m2147J08119L45656
5064B569583j58114m3839P9126j82271N6902O7557j39832J9043k92089p4560K55375
5053B156881k4967K51578r1283k28239M1662J50729j35975N3155L06566j84093
$$ plain form
5126 1927543 1970049 1960682 2075784 2129030 2285860 2228036 2137591 2345597 2425979 2679525 2589900
5115 2589900 2544922 2579466 2247037 2429538 2388783 2626721 2739239 2894146 2625205 2576400
5105 2576400 2226205 2351558 2443830 2288094 2352335 2231478 2113129 2245003 2408256 2380599
5095 2380599 2417558 2117762 2145502 2016842 1967115 1979128 2158434 2167482 2440710 2458527 2242924
5084 2242924 2346867 2451579 2355725 2490407 2433185 2204382 2076271 2218394 2148099 2113462
5074 2113462 2336988 2277826 2402948 2242786 2080690 2146271 2157955 2115808 2223927 2569583
5064 2569583 2411469 2367630 2446756 2264485 2321387 2388944 2249112 2268155 1976066 1901506 2156881
5053 2156881 2131914 2383492 2292209 2063970 2105632 2256361 2120386 2173541 2480107 2296014
5043B296014J70805K16108j23290J2175J51673L923M5131R5642j46943k4761j36486
5032B559991J63781L30545N7711q2965j73068r102L0636j19732j60947J24697
5022B721547J67215L258J0726K3645j23665m3224J7767J10735o638n5858r0372
5011B735136K06754j07582J52342K25085k91641o4095O5846q9185P0100l0234
5001B872526P1727r3550R7002j10649J65144K22917j41029K91119j93437j35476
4991C046294K71277o7159O6168K64479p4934M038K79001n7364j30934K76177R2506
4980C969549M03405k50871l77246J57081K41537j2096K7512M5690k05593J32265
4970D131233j1368J86074K6233L6212K08660j13991j17624J83846j15546L27373
$$ plain form
5043 2296014 2466819 2682927 2559637 2571812 2723485 2727408 2772539 2868181 2721238 2696477 2559991
5032 2559991 2723772 3054317 3112028 3029063 2855995 2846893 2877529 2757797 2596850 2721547
5022 2721547 2888762 2892020 2902746 2926391 2802726 2759502 2777269 2888004 2881366 2825508 2735136
5011 2735136 2941890 2834308 2986650 3211735 2920094 2855999 2921845 2832660 2902760 2872526
5001 2872526 2944253 2850703 2947705 2837056 3002200 3225117 3084088 3375207 3181770 3046294
4991 3046294 3317571 3250412 3316580 3581059 3506125 3510163 3789164 3731800 3600866 3877043 3969549
4980 3969549 4372954 4122083 3744837 3901918 4143455 4131359 4158871 4204561 3998968 4131233
4970 4131233 4119865 4305939 4332172 4368384 4577044 4463053 4345429 4529275 4413729 4741102
4960D741102K06384M1053j00202N167J75478k78940J22824R3365J27559Q093J60052
4949E301935m6527l133J51032K4512J74051K61396j68081M41026K40047j14592
4939F261666K41202J92098o004K02288n4421J77154J61015k47053R8066M16943
4929G442954k00648j06216L78789n0021m3653l655P5940K36019m6614Q0054L71155
4918H134104j83601K71068N71924j14070j58068L12807L00997K64686k363J47526
4908I545010L09038m152j2254R9465K05419M87554M50175k00073K53008J46177
4898A1279367N5426L56682L41941K81390p6767N4565M28939N0739J23853M88406
4888A3384541N61580J18596j52865M01673N21965k3308K34627M97487K02438Q6495
$$ plain form
4960 4741102 4947486 4988539 4888337 4893504 5068982 4790042 4912866 5006231 5133790 5141883 5301935
4949 5301935 5255408 5252275 5403307 5427819 5601870 5863266 5695185 6136211 6376258 6261666
4939 6261666 6502868 6694966 6688962 6891250 6836829 7013983 7174998 6927945 7026011 7442954
4929 7442954 7242306 7136090 7514879 7464858 7421205 7417550 7493490 7729509 7682895 7762949 8134104
4918 8134104 7950503 8221571 8793495 8679425 8521357 8834164 9135161 9399847 9397484 9545010
4908 9545010 9854048 9849896 9837642 9937107 10142526 10630080 11080255 10880182 11133190 11279367
4898 11279367 11334793 11691475 12033416 12314806 12238039 12292604 12721543 12772282 12896135 13384541
4888 13384541 13946121 14064717 13911852 14313525 14835490 14812182 15046809 15544296 15746734 15833229
4878A5833229M79906M94452J35347M86715L95073K52521J34387K20243N36603
4869A8968476O40075L05542O93721O42641K50464N63961N95024L56384Q52617
4860B3868905P14259L83337P81208L70592P21276Q47663O57001R68196R92984
4851C0305421Q55344J250354J167121J039231J395718J367195J680638J723947
4843D0784969J875509J984135K281589K287294K769524K852072K997291L323513
4835F1155896L573719L661231L621660M028704M206427L949693M303677M841876
4827I3342883N326249N782644O002913O352977O197798N360796M392980M220191
4819A36979431M062302M562337N699820O387676P084648P128840N928833L829563
$$ plain form
4878 15833229 16313135 16807587 16942934 17429649 17824722 18077243 18211630 18431873 18968476
4869 18968476 19608551 19914093 20607814 21250455 21500919 22064880 22659904 23016288 23868905
4860 23868905 24583164 24966501 25747709 26118301 26839577 27687240 28344241 29312437 30305421
4851 30305421 31160765 32411119 33578240 34617471 36013189 37380384 39061022 40784969
4843 40784969 42660478 44644613 46926202 49213496 51983020 54835092 57832383 61155896
4835 61155896 64729615 68390846 72012506 76041210 80247637 84197330 88501007 93342883
4827 93342883 98669132 104451776 110454689 116807666 123005464 128366260 132759240 136979431
4819 136979431 141041733 145604070 151303890 157691566 164776214 171905054 177833887 181663450
4811A81663450Q73301k893181o590546q665121j0059579j0006876r018308q269993
4803A27033147o698644n663669m761420l708647k944826k254925j690311j045606
4795I8265099o97651n52206L37015L63460P17116Q72167J517508J617434J840471
4786A04280413K090559J794034J672830J101857J050042L67095m90833j430325
4778A10435672k015269k664646l024426k632982l130882k632992j861582k114454
4770I0358439j508419j441621j487598j628253j751621j915624k196284k150732
4762G6278287k446765k243939k397946k660785k472880k403970k195474j864403
4754E7592125j515564j516078j330797j087216j072869j209471q31026m35944
$$ plain form
4811 181663450 182536751 179643570 173053024 164387903 154328324 144321448 135303140 127033147
4803 127033147 120334503 114670834 109909414 106200767 103255941 101001016 99310705 98265099
4795 98265099 97567448 97015242 97352257 97715717 98432833 99305000 100822508 102439942 104280413
4786 104280413 106370972 108165006 109837836 110939693 111989735 112356830 111865997 110435672
4778 110435672 108420403 105755757 102731331 100098349 96967467 94334475 92472893 90358439
4770 90358439 88850020 87408399 85920801 84292548 82540927 80625303 78429019 76278287
4762 76278287 73831522 71587583 69189637 66528852 64055972 61652002 59456528 57592125
4754 57592125 56076561 54560483 53229686 52142470 51069601 49860130 49029104 48593160
4746D8593160n55549n46646o61331o24844n64898o31892j85719j60799l7626K56472
4736D4880328K42652N45101O70071K37527L50595k57027r58552j336414j205873
4727D3168408j563404j938049j955858j535829j395177j904352j335610j160240
4719C0379889j364809j154558q03457j050474j147081o74027n29628p46992r00730
4710B2008133m38314p17149o05851m17062l25834m50901m83258l06335k55041
4701A8008388l82403k13702k34205o72248k22469k31038l52809k10308l56957
4692A5132249l48393j42775L6016k75192n0672l54919r7540Q6763n39373j79964
4682A3266200L6792k63629n7959O5182l77609j40024k76235P3032O9020q8361
$$ plain form
4746 48593160 48037611 47490965 46829634 46204790 45639892 45008000 44822281 44661482 44623856 44880328
4736 44880328 45122980 45668081 46338152 46575679 46926274 46669247 45710695 44374281 43168408
4727 43168408 41605004 39666955 37711097 36175268 34780091 32875739 31540129 30379889
4719 30379889 29015080 27860522 27057065 26006591 24859510 24185483 23655855 22908863 22008133
4710 22008133 21569819 20852670 20246819 19829757 19503923 19053022 18569764 18263429 18008388
4701 18008388 17625985 17412283 17178078 16505830 16283361 16052323 15699514 15489206 15132249
4692 15132249 14783856 14641081 14677097 14401905 14351233 13996314 13898774 13985537 13446164 13266200
4682 13266200 13302992 13039363 12981404 13046586 12668977 12528953 12252718 12325750 12394770 12306409
4672A2306409Q5930Q8758l0642J49737K2515J09229K61646j36993M80K22164j46474
4661A2932759k62510J83648j63800j46389k82702m05771J57852k26349k32983
4652A1553755P5726J19038q3823k216K88158k329J33434N93905K48443q7390K31345
4641A3068046r8291l70414L19435K1225n2934j38709k12421m42857l19858R8266
4631A1871488l02745k17968K71202Q5209N7671N6981K07581J26415q3449R099
4621A2081484K31679L67752l4859M3547N9917o8240k60982l17127k39651l98905
4611A1464615j74419j15419k11030p4575j4185k41870K14666J75407j56957J9844
4601A0886077J33318n4992n9916M6710J01186m2769k28059k59781K6630m44741
$$ plain form
4672 12306409 12392339 12481097 12450455 12600192 12622707 12731936 12993582 12856589 12857069 13079233 12932759
4661 12932759 12670249 12853897 12690097 12543708 12261006 11855235 12013087 11786738 11553755
4652 11553755 11629481 11748519 11664696 11662480 11950638 11948309 12081743 12675648 12924091 12836701 13068046
4641 13068046 12969755 12599341 12918776 12940001 12887067 12748358 12535937 12093080 11773222 11871488
4631 11871488 11568743 11350775 11621977 11707186 11764857 11821838 12029419 12155834 12072385 12081484
4621 12081484 12313163 12680915 12646056 12689603 12749520 12681280 12420298 12103171 11863520 11464615
4611 11464615 11290196 11174777 10963747 10889172 10874987 10633117 10847783 11023190 10866233 10886077
4601 10886077 11019395 10964403 10904487 10951197 11052383 11009614 10781555 10521774 10548404 10103663
4591A0103663k88371j28975l69645j25826n5193o6968j54009j31663J03342L28048
4581I214403j63264j98858P4719K97025K20265p5600J22545L77546j95677j69474
4571I503630n8192J9889n43160k56286k59396j22127j14317k65074J00932k84869
4561G721030j4076R9612P8272j36687m93950J33708R8509M1450p0942J06507o5662
4550G497771q4067L2183J3915O56665J15525J92510J58042l67243O05078L7992
4540H858371N03865N30829J5290m7182j99080j55990p85124k05728N7421j14555
4530H458117j85929k24716J07700j83387J55121N7866j25888k29471j65489L199
4520G667123o0589N42494P6528k0519l348K50038J58863k45795O92818J87273
$$ plain form
4591 10103663 9815292 9686317 9316672 9190846 9135653 9068685 8914676 8783013 8886355 9214403
4581 9214403 9051139 8852281 8927000 9224025 9444290 9368690 9491235 9868781 9673104 9503630
4571 9503630 9445438 9465327 8922167 8665881 8406485 8284358 8170041 7904967 8005899 7721030
4561 7721030 7706954 7806566 7884838 7748151 7254201 7387909 7486418 7527868 7456926 7563433 7497771
4550 7497771 7413704 7445887 7459802 8116467 8231992 8424502 8582544 8215301 8820379 8858371
4540 8858371 9362236 9893065 9908355 9861173 9662093 9506103 8720979 8515251 8572672 8458117
4530 8458117 8272188 8047472 8155172 7971785 8126906 8184772 8058884 7829413 7663924 7667123
4520 7667123 7606534 8149028 8225556 8205037 8201689 8451727 8610590 8364795 9057613 9244886
4510I244886o8850P59686J9432K04942k1052N00397L10160j50484j76759m69814
4500A0152544j86454l40539m0270j90786k06210Q5574j47616O0795o1911J81482
4490I306609N2398j19401K24771R816k00815J12099J29067j1263L01387K07377
4480A0012045l76018N10l8485J33123k87903K00503L40369j03874K50997K01974
4470A0333241K14851j28264m06295J40420k8116j23740k2978J34911j74331m0505
4460I899194N6522J30619Q4562k06911K35807J8885K26251k57220Q5358L02626
4450A0575693K42614j94414l5087J03171J74120m6066J33917L16130j39093l02518
4440A0828467N53933j5233l25321K86101O970j17948P1500N3791l6690Q7466O9744
$$ plain form
4510 9244886 9176036 9935722 9955154 10160096 10139044 10639441 10949601 10799117 10622358 10152544
4500 10152544 9966090 9625551 9585281 9394495 9188285 9273859 9126243 9187038 9125127 9306609
4490 9306609 9359007 9239606 9464377 9474193 9273378 9385477 9514544 9503281 9804668 10012045
4480 10012045 9636027 9636537 9598052 9731175 9443272 9643775 9984144 9880270 10131267 10333241
4470 10333241 10548092 10419828 10013533 10153953 10125837 10002097 9979119 10114030 9939699 9899194
4460 9899194 9955716 10086335 10170897 9963986 10199793 10218678 10444929 10187709 10273067 10575693
4450 10575693 10818307 10623893 10588806 10691977 10866097 10820031 10953948 11270078 11130985 10828467
4440 10828467 11382400 11367167 11041846 11327947 11334917 11216969 11288469 11342260 11305570 11393036 11462780
4429A1462780J27867J9377q7794K68759N3088K8047Q293j35075L59096Q7844J68208
4418A2360490K40823K6166K16452J59249O7991L25285P45842L946L77208O98464
4408A5221916j07244K3362j14842j57566l38657l0834j33577k3327J11540k32956
4398A4217815N3389J39498l47487L54842J68476j56680N35324M79886r9302M05049
4388A5750810M71590l39651R4105j99218k05198l0631m4186j07142l48192j05853
4378A4936434m9885K7788J38918K89189Q672j98033K99494r2560K13604L23800
4368A5897421J59111N43795K09170M55627J25414K98600O13490N61362N58158
4359A9422148P37495J111559Q07501R70934J070639Q24138p5078q65906n83156
$$ plain form
4429 11462780 11590647 11610024 11522230 11790989 11844077 11872124 11880417 11745342 12104438 12192282 12360490
4418 12360490 12601313 12627479 12843931 13003180 13071171 13396456 14142298 14146244 14523452 15221916
4408 15221916 15114672 15138034 15023192 14865626 14526969 14496135 14362558 14339231 14450771 14217815
4398 14217815 14271204 14410702 14063215 14418057 14586533 14429853 14965177 15445063 15345761 15750810
4388 15750810 16222400 15882749 15976854 15777636 15572438 15541807 15497621 15390479 15042287 14936434
4378 14936434 14886549 14914337 15053255 15342444 15351116 15153083 15452577 15360017 15573621 15897421
4368 15897421 16056532 16600327 16809497 17265124 17390538 17689138 18302628 18863990 19422148
4359 19422148 20159643 21271202 22078703 23049637 24120276 24944414 24869336 24003430 23420274
4350B3420274p97585q53105m61268n48261k53814l70982K22018j00561K005L96200
4340B0654921M46379O05754M47471Q28818P55599P26676O82643K75653j16581
4331B5307333k74821m07548l43141J37139J22098K10772Q07610J43439j83854
4322B5519027m09832q19830p48630j206963j234172m46234q82579j176620k96570
4313A8297597k2603n11411k61073j00952j64126l84359j71470L02704K8091J12483
4303A7124881O64148J32866J71959O25629L94091P22865O46308L00097j1303l83155
4293B0388386r59562j019798o28202q57366n29162q16244o47451j12039n58863
4284A4259699k87630q0651p6218q0315j96430J65648o5580K379K0516K3254k67665
$$ plain form
4350 23420274 22622689 21769584 21308316 20760055 20506241 20135259 20357277 20256716 20258721 20654921
4340 20654921 21101300 21707054 22154525 22983343 23738942 24465618 25148261 25423914 25307333
4331 25307333 25032512 24624964 24281823 24418962 24541060 24751832 25559442 25702881 25519027
4322 25519027 25109195 24289365 23540735 22333772 21099600 20653366 19770787 18594167 18297597
4313 18297597 18274994 17763583 17502510 17401558 17237432 16853073 16681603 16984307 17012398 17124881
4303 17124881 17789029 17921895 18093854 18719483 19113574 19836439 20482747 20782844 20771541 20388386
4293 20388386 19428824 18409026 17780824 16923458 16394296 15578052 14930601 14818562 14259699
4284 14259699 13972069 13891418 13815200 13734885 13538455 13704103 13638523 13640902 13661418 13684672 13417007
4273A3417007R4315K68270l6182P108l10076J48927j90825o10128l94237n58492
4263A1835687k91263j04692M2512l83169j17842M121m48742M0551j24813J1243
4253A0463593l61021L4621L70886j57832r8247J8538J00901R1345J66178K46758
4243A0875720L0307p5087j81613P3959l66725k83471l61761o45715J463j28814
4233H938263l37273o9192K45601l63138j58382K17439l84099n5801L3048j39808
4223G926658j67798j56094J2948q2496k65283Q4601L3502n2923r1895l18995K07384
4212G129609Q4328j59981l512K7583l32290n4511J06731O5180j06098K09602j73830
4201F792811k10861K6672k43243J48637P5212p5817j34077J4688j09765j75205
$$ plain form
4273 13417007 13511322 13779592 13743410 13750518 13440442 13589369 13398544 12788416 12394179 11835687
4263 11835687 11544424 11439732 11482244 11099075 10981233 10985354 10536612 10577163 10452350 10463593
4253 10463593 10102572 10137193 10508079 10350247 10252000 10270538 10371439 10462784 10628962 10875720
4243 10875720 10906027 10830940 10649327 10723286 10356561 10073090 9711329 9065614 9067077 8938263
4233 8938263 8600990 8531798 8777399 8414261 8255879 8473318 8089219 8033418 8066466 7926658
4223 7926658 7758860 7602766 7615714 7533218 7267935 7352536 7386038 7333115 7241220 6922225 7129609
4212 7129609 7213937 7053956 7050444 7078027 6745737 6691226 6797957 6863137 6757039 6966641 6792811
4201 6792811 6581950 6608622 6365379 6514016 6589228 6513411 6379334 6394022 6284257 6109052
4191F109052j36838L07768p4938n3360k38735O5238m7711n5101J23364M000l50236
4180E652503L75114Q4859l34479P2145L04562j46543j60730k9457k79443k1463
4170E517068o7262j811k21458J64538l2461J55469k7458k46365L46749k9800n8435
4159E498774j43755j80694K37748l50824J79412M0242j9500J57526l08135Q9837
4149E200631L0255N1573q3329K13845l3440j42497K19030k32825k66194m7353
4139D909696Q4620k12903K15845Q7461j78432L3909k0331K06139R6794k17232
4129E005566K2898k80904J1803k93903K48664K13734k30180Q168j20592L7550
4119D622804O0736R0383K05634j88782j12883O0395M8618j87574p9003J93986
$$ plain form
4191 6109052 5972214 6279982 6205044 6151684 5912949 5978187 5930476 5875375 5998739 6002739 5652503
4180 5652503 6027617 6112476 5777997 5850142 6154704 6008161 5847431 5817974 5538531 5517068
4170 5517068 5449806 5447995 5226537 5391075 5358614 5514083 5486625 5240260 5587009 5557209 5498774
4159 5498774 5355019 5174325 5412073 5061249 5240661 5280903 5261403 5418929 5110794 5200631
4149 5200631 5230886 5282459 5199130 5412975 5379535 5237038 5456068 5223243 4957049 4909696
4139 4909696 4994316 4781413 4997258 5084719 4906287 4940196 4919865 5126004 5222798 5005566
4129 5005566 5028464 4747560 4759363 4465460 4714124 4927858 4697678 4705846 4585254 4622804
4119 4622804 4683540 4773923 4979557 4790775 4677892 4738287 4786905 4599331 4520328 4714314
4109D714314m1919k120j01783j98193K95281J24921j58596J52513O9007l7109
4099D816316j54276j7873J40374J79573j19388K6181j95810j66437K53983L9319
4089D801962j79531k68123J82611J52291j24055r4162J28425l0152J08104j88488
4079D488882J64604j54531K2627J90354j73767R0247r3287L31138j23620l9861
4069D702786J73342J94953J55253j70123j93812n6787p2861K35561n5307Q5492
4059D998497p7569N834j21480k14670Q4647p5194J54041l517j07592j57360J34246
4048D619883K11834q1083L01614n9095k67600O4242k63540R537j33365J66280
4038D568707J07695j29124M3398k5641K04201j67470K39710k87263k31982J43654
$$ plain form
4109 4714314 4672395 4670275 4568492 4370299 4665580 4790501 4631905 4784418 4853425 4816316
4099 4816316 4662040 4644167 4784541 4964114 4844726 4870907 4675097 4508660 4762643 4801962
4089 4801962 4622431 4354308 4536919 4689210 4565155 4470993 4599418 4569266 4677370 4488882
4079 4488882 4653486 4498955 4521582 4711936 4538169 4628416 4535129 4866267 4742647 4702786
4069 4702786 4876128 5071081 5226334 5056211 4862399 4805612 4732751 4968312 4913005 4998497
4059 4998497 4920928 4926762 4805282 4590612 4675259 4600065 4754106 4750589 4642997 4485637 4619883
4048 4619883 4831717 4750634 5052248 4993153 4725553 4789795 4526255 4535792 4402427 4568707
4038 4568707 4676402 4547278 4590676 4565035 4769236 4601766 4841476 4554213 4322231 4465885
4028D465885j11134k618N8235k83680J02341L08679l7105j21487K1806j21149
4018D279773J00278j55943k11456k3823J4550o1894j50458J82523N1312J21239
4008D146101j35196n7829r4224J54069K6798j82179J31679N6918m57826J21932
3998C710243J69679n0601n3678m257p4578M4340J24309R8694o7339k14281L14574
3987C997105o4179L4410k00087j30090L13658j09751l74J40233j55002k13839
3977C612084j0246N0601r1027L28883j19690l7640L11173k51407K31179K6495
3967D050405k4335M1792k61582J50646o1534j44647J58074K28562k51604L7162
3957C922939J84449l26654J65470J47989R0425j66305j05103L28456M0402k31594
$$ plain form
4028 4465885 4354751 4352133 4410368 4126688 4229029 4537708 4500603 4379116 4400922 4279773
4018 4279773 4380051 4224108 4012652 3988829 4003379 3941485 3791027 3973550 4024862 4146101
4008 4146101 4010905 3953076 3858852 4012921 4039719 3857540 3989219 4046137 3588311 3710243
3998 3710243 3879922 3829321 3775643 3771386 3696808 3741148 3865457 3964151 3896812 3682531 3997105
3987 3997105 3932926 3967336 3767249 3637159 3950817 3841066 3840692 3980925 3825923 3612084
3977 3612084 3601838 3652439 3561412 3890295 3770605 3732965 4044138 3792731 4023910 4050405
3967 4050405 4026070 4067862 3806280 3956926 3895392 3750745 3908819 4137381 3885777 3922939
3957 3922939 4107388 3780734 3946204 4094193 4184618 4018313 3913210 4241666 4282068 4050474
3947D050474p8035L30445j84175K78418J75059k24548l1027j62227L31166M2164
3937D527714J33116j31822k95041Q6379J71571o9131k4995k24845J34481K58440
3927D565867k89793K36910O0221j95744K09245K51524o2145j73870Q0162K33653
3917D916030j72247j13357J10099j36024p8309L60463j28916l39626K81562J13408
3907D813083j31511J26105J8566J27533J37405P92o7820P8726j98971R7706M03197
3896E404811n3671J56847j25667k63260K3290M08216P9757L6756Q301k15427J72347
3885E632300Q1325j75888L81193K9846j2096p94N6729j01342j27326J31349J25681
3874F020977p5140q4011P4549M1040j06252R973M55043J03526j33717k2338M6127
$$ plain form
3947 4050474 3972439 4302884 4118709 4397127 4572186 4347638 4316611 4154384 4485550 4527714
3937 4527714 4660830 4529008 4233967 4320346 4491917 4422786 4397791 4172946 4307427 4565867
3927 4565867 4276074 4512984 4573205 4377461 4586706 4838230 4776085 4602215 4682377 4916030
3917 4916030 4743783 4630426 4740525 4604501 4526192 4886655 4757739 4418113 4699675 4813083
3907 4813083 4681572 4807677 4826243 4953776 5091181 5091973 5024153 5102879 4903908 5001614 5404811
3896 5404811 5351140 5507987 5382320 5119060 5142350 5550566 5630323 5667079 5675380 5459953 5632300
3885 5632300 5713625 5537737 5918930 5948776 5936680 5935886 5992615 5891273 5763947 5895296 6020977
3874 6020977 5945837 5861826 5936375 5977415 5871163 5881136 6336179 6439705 6305988 6283650 6329777
3863F329777r3746K46798j5431J12422M3360j45758L69632J54419j4859Q1663
3853G068277K03634k41400M7276J44188j39818J56399M0944p6031o7329k53Q8350
3842G224237j54199K06422K97845n1393L4498J95748J22043r9515l7149J26529
3832G865066K22551J28477Q9697J05543j47386J79531J93648J48725K07603K44577
3822I238032N9613j09425K25769J36281M11357R0835r958J45436K26547J97731
3812A0612218K45611L52854R1675k3022L34975J50059K11070M44800K08735j28393
3802A2500582M88162J40770R2028K58466K2944O08025J15125N3232N41557K62684
3792A5083575K30673M10346L55419K20291M79728L59088J13307P13057J64260
$$ plain form
3863 6329777 6236031 6482829 6467398 6579820 6623180 6477422 6847054 7001473 6986614 7068277
3853 7068277 7271911 7030511 7077787 7221975 7082157 7238556 7279500 7203469 7136140 7135887 7224237
3842 7224237 7070038 7276460 7574305 7522912 7557410 7753158 7875201 7775686 7738537 7865066
3832 7865066 8087617 8216094 8305791 8411334 8263948 8443479 8637127 8785852 8993455 9238032
3822 9238032 9297645 9188220 9413989 9550270 9961627 10052462 10042504 10187940 10414487 10612218
3812 10612218 10857829 11210683 11302358 11279336 11614311 11764370 11975440 12420240 12628975 12500582
3802 12500582 12988744 13129514 13221542 13480008 13502952 14110977 14226102 14279334 14820891 15083575
3792 15083575 15314248 15724594 16080013 16300304 16780032 17139120 17252427 17965484 18129744
3783A8129744K68964N32540M38478M34288L75866P72529M34537O43692M08533
3774B2439171L72416N96915M42892P10082O28746P88310O19826P11573Q35364
3765B8145295O13000R33635J028052R26119N45370P09786R11739M71325J013197
3756C5297518R92248J006637J116295Q70030J595260J459045J284576J592010
3748D5213619K089920J796753J578291J888129K018531K166824K505099L084088
3740F2341254L468463L657563M341359M494342M543253N246375N223663N341868
3732I8658140N349932N117180M338782L501802K325711R43663k19706j660465
3724A18355039j813988k101686k034976j807322j596233r35576o87811O7076O37660
$$ plain form
3783 18129744 18398708 18931248 19369726 19804014 20179880 20952409 21386946 22030638 22439171
3774 22439171 22811587 23408502 23851394 24561476 25190222 25978532 26598358 27309931 28145295
3765 28145295 28758295 29691930 30719982 31646101 32191471 32901257 33812996 34284321 35297518
3756 35297518 36289766 37296403 38412698 39282728 40877988 42337033 43621609 45213619
3748 45213619 47303539 49100292 50678583 52566712 54585243 56752067 59257166 62341254
3740 62341254 65809717 69467280 73808639 78302981 82846234 88092609 93316272 98658140
3732 98658140 104008072 109125252 113464034 116965836 119291547 120235210 120015504 118355039
3724 118355039 116541051 114439365 112404389 110597067 109000834 108065258 107377447 107444523 108082183
3715A08082183J059419K378450K853279M116278M912702N857809P211024P928458
3707A44399602R784494J0390160J1677789J2832070J3113074J3454180J2644277
3700B28295646J1183632Q679474M860906R36225l851961q672296j2566861j4557934
3692B14306831j5880895j5421948j5173365j3485961j1919747j0880734q980217
3685A22563964p965743o914362n814091n070496m406040m160045l377152l053631
3677H1802404k492474k014504k266064j279767j523439j087770r41125p62906
3669F9434355n27541j72013r8758k97100O8761j35522k14304k1487j19184k41817
3659F7675390M3764n8484m17096j36492m7924j85314J2166m76863j43363q4673
$$ plain form
3715 108082183 109141602 111520052 114373331 118489609 123402311 129260120 136471144 144399602
3707 144399602 154184096 164574256 176252045 189084115 202197189 215651369 228295646
3700 228295646 239479278 248158752 253019658 253955883 250103922 241431626 228864765 214306831
3692 214306831 198425936 183003988 167830623 154344662 142424915 131544181 122563964
3685 122563964 114598221 107683859 101869768 96799272 92393232 88233187 84856035 81802404
3677 81802404 79309930 77295426 75029362 73749595 72226156 71138386 70197261 69434355
3669 69434355 68906814 68734801 68636043 68338943 68407704 68272182 68057878 68036391 67917207 67675390
3659 67675390 67719154 67660670 67243574 67107082 67059158 66873844 66886010 66409147 66265784 66181111
3649F6181111m89309l23556k94795l11147l56928m21934l48177k00449j44280
3640F3290536L67481N46503N14291P55991J104290Q68644J652919J545511J597407
3631G2243573J986719J729146J695555J527854J389911J156441J268817J034579
3623H4032595Q82844R61491Q91457N09865J62751m03256j127906j737133j906288
3614H2266420k429869k557931k103014k141896k445035j877702j647656j319815
3606F5743502j105206r98421l75969l00523k49033n8598J89751j8628N69890J60758
3596F3557523N3208K80580O7590M2401J89204k35956j79157j17272l98261r00021
3586F2359839j132451j240522j520568k270697k108555k048187k430428k084633
$$ plain form
3649 66181111 65691802 65368246 65073451 64762304 64405376 63983442 63635265 63434816 63290536
3640 63290536 63658017 64204520 64718811 65474802 66579092 67447736 69100655 70646166 72243573
3631 72243573 74230292 75959438 77654993 79182847 80572758 81729199 82998016 84032595
3623 84032595 84915439 85876930 86768387 87278252 87441003 87037747 85909841 84172708 82266420
3614 82266420 79836551 77278620 75175606 73033710 70588675 68710973 67063317 65743502
3606 65743502 64638296 63639875 63263906 62963383 62714350 62655752 62845503 62826875 63396765 63557523
3596 63557523 63610731 63891311 63958901 64001302 64190506 63954550 63775393 63658121 63259860 62359839
3586 62359839 61227388 59986866 58466298 56195601 54087046 52038859 49608431 47523798
3578D7523798j975725j579050j699634j602888j480623j166435j317008j032498
3570C5669937q67701o63567j038272r75669p69518p74561o06027m36994o09981
3561B8927647k74998k16766m17479l03183m70348m06543n04089l70685k54696
3552B5708860k73478k15529j50214j57506j14699o4636j50196k30909J2372r5816
3542B4268249n1782j45039n2209K5197m35161l539J30705j15243q4196k8139j82205
3531B3326638Q092q2533k8012J65066j28532K46864L24505k04194p366J64988
3521B3785516n4745J39126K06065K8853J43495o2343j93926K87057J1039K11647
3511B4501784J92712J22059J91313K8922j17300P86649J84586L4576L81272J78770
$$ plain form
3578 47523798 45548073 43969023 42269389 40666501 39185878 38019443 36702435 35669937
3570 35669937 34802236 34138669 33100397 32124728 31355210 30580649 29974622 29537628 28927647
3561 28927647 28652649 28435883 28018404 27715221 27244873 26838330 26334241 25963556 25708860
3552 25708860 25435382 25219853 25069639 24912133 24797434 24732798 24582602 24351693 24364065 24268249
3542 24268249 24216467 24071428 24019219 24044416 23609255 23605716 23736421 23621178 23536982 23508843 23326638
3531 23326638 23334730 23252197 23224185 23389251 23260719 23507583 23832088 23627894 23620528 23785516
3521 23785516 23730771 23869897 24075962 24104815 24248310 24185967 23992041 24279098 24290137 24501784
3511 24501784 24694496 24816555 25007868 25036790 24919490 25706139 25890725 25925301 26306573 26485343
3501B6485343K85611P48597M70522K75961O64011M13412O59394N61793l986j3316
3491C0547342J96131k94637m71405l78434k95446k64848J02215j16361P104j58565
3481B8873096r0877K12189K34293L09555O1367J02824L50001N0614K69338O36585
3471C1008985L05561P26512L17105N32882Q63339N80876O72319Q29998J70411
3462C6007988j91202K36638k23314k48172K40122L7986J77373j4854n7073L62206
3452C6327698L05550K89878L42261M00649P43287O07259L14775J106623N86344
3443D1024324J030499J040002J093307J508256J423585J272530J534561J705099
3435E1632163J263859J109570R31186N14952M97391L14385K2314K21102K50958
$$ plain form
3501 26485343 26770954 27519551 27990073 28266034 28930045 29343457 30002851 30564644 30560658 30547342
3491 30547342 30743473 30448836 29977431 29598997 29303551 29038703 29140918 29024557 29031661 28873096
3481 28873096 28782219 28994408 29228701 29538256 29599623 29702447 30052448 30103062 30372400 31008985
3471 31008985 31314546 32041058 32358163 32891045 33754384 34335260 35007579 35837577 36007988
3462 36007988 35816786 36053424 35830110 35581938 35822060 35860046 36037419 36022565 35965492 36327698
3452 36327698 36633248 36923126 37265387 37666036 38409323 39016582 39331357 40437980 41024324
3443 41024324 42054823 43094825 44188132 45696388 47119973 48392503 49927064 51632163
3435 51632163 52896022 54005592 54936778 55451730 55949121 56263506 56285820 56506922 56757880
3426E6757880K41222L74088P13789M31076J047369J481842J301082J536853J610168
3417F5495369K470018K083877K153198K761269L044800L181929L346646L819442
3409H8356548L757804M410205N143090N310508N985089O426505P330363P330331
3401A34050443O317772N278824L692377J963957j629500n423042q088457r263904
3393A26898470q127373o887463n668228l920864k919970j926898r58240m09459
3385I6079975l98594M52290J071714J491774J640809J810696K511858K357841
3377A07018363K766692L368581L828280M407651M996707N762917O140126P025512
3369A45314829P979724R449201J0977114J2786710J5362178J7834895J9699882
$$ plain form
3426 56757880 56999102 57373190 58086979 58518055 59565424 61047266 62348348 63885201 65495369
3417 65495369 67965387 70049264 72202462 74963731 78008531 81190460 84537106 88356548
3409 88356548 92114352 96524557 101667647 106978155 112963244 119389749 126720112 134050443
3401 134050443 140368215 145647039 149339416 151303373 149673873 144250831 136162374 126898470
3393 126898470 118771097 111883634 106215406 102294542 99374572 97447674 96489434 96079975
3385 96079975 95681381 96133671 97205385 98697159 100337968 102148664 104660522 107018363
3377 107018363 109785055 113153636 116981916 121389567 126386274 132149191 138289317 145314829
3369 145314829 153294553 162743754 173720868 186507578 201869756 219704651 239404533
3362B39404533J9843540J6580849Q253632m696886j6770719k3057406k3443868
3355B16113675k0710218j8021643j4903169j2508733j0399672q652673p538698
3348A23378869o510958n370821m786053m236324l207936l090569k526826j819539
3340I1829843j668149j523367j303019j303241p40389j242950o37370n08375n81847
3331H2321136n53276m38923j36668Q1087k84840J87168K92945n40693n16806m31540
3321G9979590r40395j203027r48434j521868j496577j769570j615498j717834
3313F8766387j357155j252780j209715r34113j166209j092338p51005j041532
3305E9961540q07117o53786o85572n74313k14985p14782l82790k18968o13463
$$ plain form
3362 239404533 259248073 275828922 284082554 279385668 262614949 239557543 216113675
3355 216113675 195403457 177381814 162478645 149969912 139570240 130917567 123378869
3348 123378869 116867911 111497090 106711037 102474713 99266777 96176208 93649382 91829843
3340 91829843 90161694 88638327 87335308 86032067 85291678 84048728 83411358 82902983 82321136
3331 82321136 81767860 81328937 81192269 81273356 80988516 81175684 81468629 80927936 80411130 79979590
3321 79979590 79039195 77836168 76887734 75365866 73869289 72099719 70484221 68766387
3313 68766387 67409232 66156452 64946737 64012624 62846415 61754077 61003072 59961540
3305 59961540 59154423 58500637 57815065 57240752 57025767 56310985 55928195 55709227 55095764
3296E5095764n11228l42671k83239p48763o36349r99686p57018p78680r47407
3287D9090723p70238o57868p73742m17397k47240j93774m3232K12724O7054j07128
3277D6159882N4253j95194n73956p13355k06043m40578m32827j31445r6864J53411
3267D3577284J69490K58014M18542K30180O2256j5232K2512p01687n48114k80017
3257D3193228o34171l29320o4055o7686p9548J22298k32909m5871L1692k39660
3247D1653998K54594K03420j6119K18821k5922n39924j89202R8487k69973K17613
3237D1605793L18876N38441Q57827O88763J129738J126341J541240J738675J632773
3228E1178467J862983J637569J525761J317070P83981M43333n3082m83500j004858
$$ plain form
3296 55095764 54584536 54241865 53958626 53209863 52573514 51573828 50816810 50038130 49090723
3287 49090723 48320485 47662617 46888875 46471478 46224238 46030464 45987232 46199956 46267010 46159882
3277 46159882 46214135 46018941 45444985 44731630 44525587 44085009 43652182 43520737 43423873 43577284
3267 43577284 43746774 44004788 44423330 44653510 44715766 44700534 44723046 44021359 43473245 43193228
3257 43193228 42559057 42229737 42165682 42097996 42018448 42140746 41907837 41861966 41893658 41653998
3247 41653998 41908592 42112012 42095893 42314714 42288792 41748868 41559666 41658153 41388180 41605793
3237 41605793 41924669 42463110 43320937 44009700 45139438 46265779 47807019 49545694 51178467
3228 51178467 53041450 54679019 56204780 57521850 58305831 58749164 58696082 58212582 57207724
3219E7207724r89621j008962j075570j94477m53173m09293K15705K07092j28628
3210E3370797Q2022M67682J28242n1992q10807n98344j230946j395219r13860
3201D9047575j439527r43646j106027q05531m85791p83931k74990K28693k8185
3192D3408640p9450L61116L25614K52262N77008M78946Q72287N39580O03160O58393
3182D7997556J86074P66196O71201M49538P53563R07522J176294J456640J487156
3173E5851740J579739J687844K098826K000328K544998K400022K896318L034427
3165G4094242L394224L870297L738769L982724M368477M917184N114766N425600
3157A08906283O150636P247047P884667Q674435J0218516J1462794J3469771J6160859
$$ plain form
3219 57207724 56218103 55209141 54133571 53939094 53485921 53076628 53292333 53499425 53370797
3210 53370797 53452819 53920501 54048743 53996751 53185944 52587600 51356654 49961435 49047575
3201 49047575 47608048 46664402 45558375 44752844 44267053 43483122 43208132 43436825 43408640
3192 43408640 43329190 43690306 44015920 44268182 44845190 45324136 46196423 46736003 47339163 47997556
3182 47997556 48183630 48949826 49621027 50070565 50824128 51731650 52907944 54364584 55851740
3173 55851740 57431479 59119323 61218149 63218477 65763475 68163497 71059815 74094242
3165 74094242 77488466 81358763 85097532 89080256 93448733 98365917 103480683 108906283
3157 108906283 115056919 122303966 130188633 138863068 149081584 160544378 174014149 190175008
3149A90175008J9576122K4079080K7519206K8260825K1255475N712378j4100209
3142C02477885k8409357l2903433k9472506k3606381j8420266j4115181j0921212
3135A44629549q327701o577809m757299l556828k595746j055809K33651O44501
3127A18636509J509643K485561L015173L826836N293729O140465P208094Q682418
3119A56798428R955637J1596229J3965463J6240154J7943295J9644275J9556901
3112B65700382J7363567J2060892N152815l744955j2653994j9742127k3268293
3105B40868287k4151268k2928859k0330657j7292455j4595290j2615453j0561749
3098A18392556q847013p463887o399086n412047n028047m497420l785735l567358
$$ plain form
3149 190175008 209751130 233830210 261349416 289610241 310865716 316578094 302477885
3142 302477885 274068528 241165095 211692589 188086208 169665942 155550761 144629549
3135 144629549 136301848 129724039 124966740 121409912 118814166 117758357 117992008 118636509
3127 118636509 120146152 122631713 125646886 129473722 134767451 140907916 148116010 156798428
3119 156798428 166754065 178350294 192315757 208555911 226499206 246143481 265700382
3112 265700382 283063949 295124841 300277656 296532701 283878707 264136580 240868287
3105 240868287 216717019 193788160 173457503 156165048 141569758 128954305 118392556
3098 118392556 109545543 102081656 95682570 90270523 85242476 80745056 76959321 73391963
3090G3391963l349666k860989l000106k311105k291493k356888k220077j810258
3082E3191381j728712j663137j416593j456057j206083p86968j262752j122634
3074D2548445q93670j181810j243134q94394j133905j318605r44408j326791o79297
3065C2932431o68601o87057r74728m91635p06514r61030k32224o09003o88666
3056B6912973k10902n94187o11590p67211p68792l93059m76863m98470l79178
3047B2212721j64573q07472m2099m59305k74773k25013m19693k01036k27258j15486
3037A9276013k11820J87209N2638j86924k23850k74582l47769k99557m92712j05280
3027A7373366m36141m20040k89110k98760l98667l71705q0072j91763j00246k28667
$$ plain form
3090 73391963 70042297 67181308 64181202 61870097 59578604 57221716 55001639 53191381
3082 53191381 51462669 49799532 48382939 46926882 45720799 44933831 43671079 42548445
3074 42548445 41654775 40472965 39229831 38335437 37201532 35882927 34938519 33611728 32932431
3065 32932431 32263830 31576773 30602045 30110410 29403896 28442866 28210642 27601639 26912973
3056 26912973 26702071 26107884 25496294 24729083 23960291 23567232 23090369 22591899 22212721
3047 22212721 22048148 21240676 21198577 20739272 20464499 20239486 19819793 19618757 19391499 19276013
3037 19276013 19064193 19251402 19304040 19117116 18893266 18618684 18270915 17971358 17478646 17373366
3027 17373366 16937225 16517185 16228075 15929315 15530648 15158943 15078871 14887108 14786862 14558195
3017A4558195l49384l50776o2935l09297j12552n2304j89643K00619k64366k33302
3007A2834255M8904o9863J71562l48172R0153j06485K45525o1333k52833Q0302
2997A2632015l86016k19712j98087J4824l90604j472k03159L06625j61359j77341
2987A1215714m3431j01701j22875j29857J23746k71546n6836J39630k47064J15876
2977A0621656J69944l41846J45603k91299j53741J86949R4546m18153K00215j90318
2967A0023556l19604J90372J15443q7103K15664r637k15201n2726J50096J60873
2957A0171733j29704J7325M39928l3468j17178J25270m16421J36223k03688J3489
2947A0003509Q9736j84281m5002J59293O8986Q6124R1298j87496j05555K27689
$$ plain form
3017 14558195 14208811 13858035 13795100 13485803 13373251 13320947 13131304 13331923 13067557 12834255
3007 12834255 12883159 12813296 12984858 12636686 12726839 12620354 12865879 12804546 12551713 12632015
2997 12632015 12245999 12026287 11828200 11843024 11452420 11450948 11247789 11554414 11393055 11215714
2987 11215714 11172283 11070582 10947707 10817850 10941596 10670050 10613214 10752844 10505780 10621656
2977 10621656 10791600 10449754 10595357 10304058 10150317 10337266 10431812 10013659 10213874 10023556
2967 10023556 9703952 9894324 10009767 9922664 10138328 10128691 9913490 9860764 10010860 10171733
2957 10171733 10042029 10059354 10499282 10465814 10348636 10473906 10057485 10193708 9990020 10003509
2947 10003509 10093245 9908964 9863962 10023255 10092241 10178365 10269663 10082167 9976612 10204301
2937A0204301k84508j06804R983k30223J3115j83693j03549L37458r8112k27479
2927I330489N4329q3302p4921q1621l96440j98610N3325j22644j20445k50058
2917H110102p2723j77557N7171p7279j57154Q6063O7686j79305Q8793J43798k88955
2906G600640J59198o1141k99435m6819k81692k07185P6580m19981l818P3935j62825
2895F427457j61178J32333k39671o0610M3741k24542l3577j22315l1096J4872
2885E745414j30553l04297N8220l8835l47186K6571l9269k20775L92753j64162
2875D977881R2791K8645j81844K48451j32442k14005J37587N4056n3488K95545
2865E253177L343l13161L01400l40769L9603L24096l01275Q8837J54038j03800
$$ plain form
2937 10204301 9919793 9812989 9822972 9592749 9605864 9422171 9318622 9656080 9557968 9330489
2927 9330489 9384818 9301516 9226595 9144974 8748534 8549924 8603249 8480605 8360160 8110102
2917 8110102 8037379 7859822 7916993 7839714 7682560 7768623 7836309 7657004 7745797 7889595 7600640
2906 7600640 7759838 7698697 7399262 7352443 7070751 6863566 6940146 6520165 6516347 6590282 6427457
2895 6427457 6266279 6398612 6158941 6098331 6142072 5917530 5883953 5761638 5730542 5745414
2885 5745414 5614861 5310564 5368784 5329949 4982763 5009334 4970065 4749290 5142043 4977881
2875 4977881 5070672 5099317 4917473 5165924 5033482 4819477 4957064 5011120 4957632 5253177
2865 5253177 5256520 4943359 5244759 4903990 4943593 5267689 4966414 5055251 5209289 5105489
2855E105489Q5640J41236j17174k7332N8297L9568l2827J36417J892j58374J19784
2844E352616K29528J01774K44154o9250J8234K69857P0923j42869L17632P6301
2834F468900q7928L8799k71020r9325j46545N3754N1315j22733m1379O1937j19516
2823E786259k29262L35615L4242r0043n4369r258R7948k17412K21311J31753m1438
2812E965346l4841J89041K7512k72239J23386r5250K25739J16921j24187J33594
2802F255022l7130o870J95138J21851j31352J28311N3152l43909N37697J75089
2792F946999q343N06538n7235J68008Q6117J68944M1765r1293q2663J02051O8517
2781G849405j75611O6023p0531k05188J34881k66330J59599k68620K11645J46528
$$ plain form
2855 5105489 5191129 5332365 5215191 5187859 5246156 5285724 5252897 5389314 5391206 5232832 5352616
2844 5352616 5582144 5683918 5928072 5858822 5877056 6146913 6217836 6074967 6392599 6468900
2834 6468900 6380972 6419771 6148751 6049426 5902881 5956635 6007950 5885217 5843838 5905775 5786259
2823 5786259 5556997 5892612 5926854 5836811 5782442 5773184 5871132 5653720 5875031 6006784 5965346
2812 5965346 5930505 6119546 6147058 5874819 5998205 5902955 6128694 6245615 6121428 6255022
2802 6255022 6217892 6211022 6406160 6528011 6396659 6524970 6578122 6234213 6771910 6946999
2792 6946999 6938656 7445194 7387959 7555967 7642084 7811028 7852793 7761500 7678837 7780888 7849405
2781 7849405 7673794 7739817 7669286 7464098 7598979 7332649 7492248 7223628 7435273 7581801
2771G581801l50419L186j17819K55087m0624j0214L5785k3425Q5830p4771J32174
2760G476591o8569q9658J61401j43341J06495O820l0274k23300M5308J26767K44893
2749G613133k29450m1922J78043n3613P4214l85940j28406K71993j59084J45359
2739G284327q0247k76399O0238n8904k32495j1354K31980j44409M8569n9319k66913
2728F495074J87483l8405l40988j42568J35850n9792j8773j68094Q5852J14465
2718F250104j78229k69856J1731Q220J066P129k02J06937l3338j10365k24080
2707E569117o4649k66001m339o8909K53240l18089k24149L2411k53882l9831P1415
2696D686334k17597J86723j41634l31110L8491L4585k40700o4902m6597j65611
$$ plain form
2771 7581801 7231382 7234568 7116749 7371836 7331212 7320998 7356783 7333358 7419188 7344417 7476591
2760 7476591 7408022 7318364 7479765 7336424 7442919 7449739 7419465 7196165 7241473 7368240 7613133
2749 7613133 7383683 7341761 7519804 7466191 7540405 7154465 7026059 7298052 7138968 7284327
2739 7284327 7204080 6927681 6987919 6929015 6696520 6685166 6917146 6772737 6821306 6761987 6495074
2728 6495074 6682557 6644152 6303164 6160596 6296446 6236654 6217881 6049787 6135639 6250104
2718 6250104 6071875 5802019 5813750 5821970 5823036 5830165 5829963 5936900 5903562 5793197 5569117
2707 5569117 5504468 5238467 5234128 5165219 5418459 5100370 4876221 4908632 4654750 4614919 4686334
2696 4686334 4468737 4655460 4513826 4182716 4221207 4255792 4015092 3950190 3903593 3737982
2686C737982J62638K0904j55302n6451J72205j1365j77943q798j09036o9953Q2266
2675C587147k50177N424k2015k3106k23225K36832l230j1282O5844o6394J51796
2664C447614j56444N1065J08001l27867r4445J07867j40724L327j99295J20467
2654B919566l2903K60017l00182k14602J46717J9245L07372k34106q5530j34485
2644B651109j27458M9814R9761R2084Q8009q2390q8343j79260j6644K69185K30467
2633B986334k80604J10486j16225M3965J51734n4961J68664o7176j02152j87864
2623B652201P8277J71294n2693K10527K62048j528K48488o6333J64891r3611P7863
2612C651424j24601p5195J93921l64378j7119L74742O3088J79592J82099k04743
$$ plain form
2686 3737982 3900620 3921524 3766222 3709771 3881976 3870611 3692668 3683870 3574834 3504881 3587147
2675 3587147 3336970 3342394 3320379 3297273 3074048 3310880 3307650 3296368 3362212 3295818 3447614
2664 3447614 3291170 3342235 3450236 3122369 3027924 3135791 2995067 2998394 2799099 2919566
2654 2919566 2886663 3146680 2846498 2631896 2778613 2797858 3105230 2871124 2785594 2651109
2644 2651109 2523651 2573465 2673226 2765310 2853319 2770929 2682586 2503326 2486682 2755867 2986334
2633 2986334 2705730 2816216 2699991 2743956 2895690 2840729 3009393 2942217 2840065 2652201
2623 2652201 2730478 2901772 2849079 3059606 3321654 3320126 3568614 3502281 3667172 3573561 3651424
2612 3651424 3526823 3451628 3645549 3281171 3264052 3638794 3701882 3881474 4063573 3858830
2602C858830j41224K55807N8181k09361L17600o1669K091J56048J00949l29643
2592D007609J02480j974M7254P6395J15575n5779j89508L79166J35444k38648
2582D378014j06025K31442J7751M8602J62703K23562k86712j58514J55166J40003
2572D805992K5326L17261J32332N0620K91939K44555K94145K24498l7036J60788
2562F510420K96752l214J42213K63380K63686L62038M49410J59774L54718K13423
2552I012600L92974J77314J13706o809L12995L74420r2389J80694L87231J59295
2542A1012031M3136J74697O1265j12133k0042J50445j63622J99211j84288j36523
2532A1024177k6154k37034J527k56222j25975J4536l17235r6629j91287Q3134
$$ plain form
2602 3858830 3717606 3973413 4031594 3822233 4139833 4078164 4080255 4236303 4337252 4007609
2592 4007609 4110089 4108115 4155369 4231764 4347339 4291560 4102052 4481218 4616662 4378014
2582 4378014 4271989 4503431 4521182 4569784 4732487 4956049 4669337 4510823 4665989 4805992
2572 4805992 4831318 5148579 5280911 5331531 5623470 5868025 6162170 6386668 6349632 6510420
2562 6510420 6807172 6803958 6946171 7209551 7473237 7835275 8284685 8444459 8799177 9012600
2552 9012600 9405574 9582888 9696594 9689785 10002780 10377200 10284811 10465505 10852736 11012031
2542 11012031 11055167 11229864 11291129 11178996 11158954 11309399 11145777 11344988 11160700 11024177
2532 11024177 10998023 10760989 10762516 10506294 10380319 10394855 10077620 9980991 9789704 9872838
2522I872838l10359n49489k48990q3122O0687m51733j68950r5298k87218k54591
2512G483775o8789l42693j10416n6874l73070L7744L110J3529j21202R852n7761
2501F417205m2132J40096j34249j29394J34222j62747J44200j23611j4026K89207
2491F518771K42579R8050J42586R1071L0040K448J30302J16194j05320O7050L8565
2480G372336P119k26226J45873J85813l26018k39312M2820j60623n9618p0694
2470F671470M5588l08006l10561k33378k75004R6193k52350q2460K43275n13766
2460E081001k47633P983p9197k11709j33597j56937m9760j67767k80271J52905
2450C915018p6128Q470O604k62041j29075n5618J06230J41466m3984m0041m8605
$$ plain form
2522 9872838 9562479 9012990 8764000 8680878 8741565 8289832 8120882 8025584 7738366 7483775
2512 7483775 7414986 7072293 6961877 6905003 6531933 6569677 6572787 6586316 6465114 6474966 6417205
2501 6417205 6375073 6515169 6380920 6251526 6385748 6223001 6367201 6243590 6229564 6518771
2491 6518771 6761350 6859400 7001986 7093057 7123097 7125545 7255847 7372041 7266721 7333771 7372336
2480 7372336 7379455 7153229 7299102 7484915 7158897 6919585 6962405 6801782 6742164 6671470
2470 6671470 6717058 6409052 6098491 5865113 5590109 5686302 5433952 5351492 5594767 5081001
2460 5081001 4833368 4841351 4762154 4550445 4416848 4259911 4210151 4042384 3762113 3915018
2450 3915018 3838890 3847360 3853964 3591923 3462848 3407230 3513460 3654926 3610942 3570901 3522296
2439C522296l7358m8232j21500j74649L01444m4026l5508J77626k41065M7091
2429C346119O4137k03017J19003j83689P821M7764k5241j5109K578Q5829j02264
2418C143931J573J1050o7602K8854L6929p0182Q7836m6841J6842P5092j6821p7819
2406C122842O3315j44504J26727K36356K31070N54L6131K34078J11781o9856l07434
2395C641060j52120J024j12962j29823k07370r1380l65847j30954J27832j2693
2385B566767m4582m8850j63799j18392k2147k941j30706p6144j37662L8236k32008
2374A627772r1946L2629J1180q7595j58916K41493j43032j38606R5626L9665p5998
2363A352272K50487K9763l16328J26699M6220l66364L58702p1000j84800L03841
$$ plain form
2439 3522296 3484938 3436706 3315206 3140557 3442001 3397975 3362467 3540093 3299028 3346119
2429 3346119 3410256 3207239 3326242 3142553 3150374 3198138 3172897 3157788 3160366 3246195 3143931
2418 3143931 3145504 3156554 3088952 3117806 3154735 3084553 3172389 3125548 3142390 3217482 3200661 3122842
2406 3122842 3186157 3041653 3168380 3404736 3635806 3636360 3672491 3906569 4018350 3948494 3641060
2395 3641060 3488940 3489964 3377002 3247179 3039809 2948429 2582582 2451628 2579460 2566767
2385 2566767 2522185 2473335 2309536 2191144 2168997 2166056 2035350 1959206 1821544 1859780 1627772
2374 1627772 1535826 1568455 1579635 1492040 1333124 1574617 1431585 1292979 1388605 1428270 1352272
2363 1352272 1602759 1632522 1316194 1442893 1489113 1122749 1481451 1410451 1225651 1529492
2353A529492j96032J01735K72127k26643p4911J26859l4445K9247J43910j25058
2343A546281l7450o46j7242n6749P138m2345q1490N2181O9045P0584k17561k2283
2331A269463k5377q7500j7037j61659J99466k62558J47806L2489m15429O8819
2321G48483K24179q3266J08909J69559n0087l93857K06150J31693M3018k07251
2311H97530L5498K44894k22309J04619J56833J17980k90531k94223J39932K0339
2301I10562j06195K09666J29590j66969J07728k4945l83198L13596J09390J32525
2291A231750m4293j19665j60096m9336J69187j01062K17443j921P4938j26552
2281A090393l02467J83301L4239K5573O9155n6511Q7676j41483q541Q6563J03963
$$ plain form
2353 1529492 1333460 1435195 1707322 1480679 1405768 1532627 1498182 1527429 1671339 1546281
2343 1546281 1508831 1508185 1490943 1434194 1441332 1398987 1317497 1369678 1438723 1509307 1291746 1269463
2331 1269463 1244086 1156586 1139549 977890 1177356 914798 1062604 1095093 679664 748483
2321 748483 972662 889396 998305 1167864 1117777 723920 930070 1061763 1104781 897530
2311 897530 933028 1177922 955613 1060232 1217065 1335045 1044514 750291 890223 910562
2301 910562 804367 1014033 1143623 976654 1084382 1059437 676239 989835 1099225 1231750
2291 1231750 1187457 1067792 907696 858360 1027547 926485 1143928 1142007 1216945 1090393
2281 1090393 787926 971227 1005466 1031039 1100194 1043683 1131359 989876 981335 1067898 1171861
2270A171861J810j42200r9278j96733J82804R0514J52274j67999L13945o0323
2260A246675q8468J22460p5389o0317J91810j18790J2885l9340r266K2220K88002
2249A492482m1838j60948Q4945J02568n6064j34185L91946j01110l1336j36513
2239A409947j4786L7997K19061r5008m1195N4716J93328n9560j32286J31437J51087
2228A854738j01102j1564K7790j71448J96883n1386J59792M5077m8271K94595
2218B195104O2224k75797J44950K9389k2602j9657p7895r4011K53745p9875J37381
2207B252956L55538k60808M18541J06831j68660K17251Q0719m7393K82890R0056
2197C327921L48864Q0438l2423J07164j44690N1553L47414m37021N375J78488
$$ plain form
2270 1171861 1173671 1031471 932193 735460 918264 1008778 1161052 993053 1306998 1246675
2260 1246675 1158207 1280667 1205278 1144961 1336771 1217981 1230866 1191526 1182260 1204480 1492482
2249 1492482 1450644 1289696 1374641 1477209 1421145 1286960 1678906 1577796 1546460 1409947
2239 1409947 1395161 1433158 1652219 1557211 1516016 1570732 1764060 1704500 1572214 1703651 1854738
2228 1854738 1753636 1742072 1769862 1598414 1795297 1743911 1903703 1948780 1900509 2195104
2218 2195104 2257328 1981531 2126481 2155870 2133268 2113611 2035716 1941705 2195450 2115575 2252956
2207 2252956 2608494 2347686 2766227 2873058 2704398 2921649 3002368 2954975 3237865 3327921
2197 3327921 3676785 3757223 3724800 3831964 3687274 3738827 4086241 3649220 3654595 3833083
2187C833083m8397j74988M3270L9536K15488j4507J3437J58002J6179J71893O0958
2176D313954L33214J82171M29663K30236p5039o33841n49432k05738k78697j64031
2166C582460j63529l22432q8331j68040k00296J07903o0382j59939J15186K65532
2156B908132l59271N6162R7074j15331o3025J96240K31614P7747O0308J57724
2146C247374K73366R8833N19851N04910O43768Q06167Q54190J62733m59080j052634
2136E599478r14506q37170n29647l90781m62474j66767L10158m14971k39772N2965
2126B006513P1938j51465j37620J9368J71256k53673J3268N4090p7645R2126P1636
2115A879792J31045k98688K84964J74042j6960R5070N44594k5715K02734P47248
$$ plain form
2187 3833083 3784686 3609698 3652968 3692504 3907992 3893485 3906922 4064924 4081103 4252996 4313954
2176 4313954 4647168 4829339 5259002 5489238 5414199 4780358 4230926 4025188 3746491 3582460
2166 3582460 3418931 3096499 3008168 2840128 2639832 2747735 2687353 2527414 2642600 2908132
2156 2908132 2548861 2605023 2702097 2586766 2523741 2719981 2951595 3029342 3089650 3247374
2146 3247374 3520740 3619573 4139424 4644334 5288102 6094269 6948459 7111192 6652112 5599478
2136 5599478 4684972 3847802 3318155 2927374 2464900 2298133 2608291 2193320 1953548 2006513
2126 2006513 2078451 1926986 1789366 1808734 1979990 1726317 1739585 1793675 1716030 1808156 1879792
2115 1879792 2010837 1712149 1997113 2171155 2154195 2249265 2793859 2768144 2970878 3718126
2105C718126j11354m70316L8627m92790o07353n5650l05645k12513k24599l46833
2095I29700L8067K15084j43062Q4267M5425n5687k6819l0122k1839r1705j5338
2084I27971J8279m8189k03876n255J29771j89956l01609J69714J29312m8490m2934
2073E34738L4409K0335K50759j76777k4442J26595j92249j46109K66683k32275
2063D61667R5862K93234j69957j03409k46145l0950K82993J25713p9220L9166
2053F68954n8871j68480j6884P1745O952Q8627k06886j53957K40588J8121r2550
2042C97359K23275k6460N2027j14376p4792J28001l81851K28435o3370J29155
2032D97403m2833j18122J19237o0043j07678J30218J57114n9473q6899O6486j88469
$$ plain form
2105 3718126 3606772 3136456 3175083 2682293 2074940 2019290 1713645 1501132 1276533 929700
2095 929700 967767 1182851 1039789 1124056 1169481 1113794 1086975 1056853 1035014 943309 927971
2084 927971 946250 898061 694185 688930 818701 628745 327136 496850 626162 577672 534738
2073 534738 569147 589482 840241 663464 639022 765617 573368 427259 693942 461667
2063 461667 557529 850763 680806 577397 331252 300302 583295 709008 629788 668954
2053 668954 610083 441603 424719 496464 503416 592043 385157 231200 471788 489909 397359
2042 397359 620634 594174 646201 531825 457033 585034 203183 431618 368248 497403
2032 497403 454570 336448 455685 395642 287964 418182 575296 515823 428924 495410 306941
2021C06941k1999P5009k20828P3862k71693R9377J98576J09096p7374K4433j6804
2010B78596j5543J00k7032K22274q5380k24220J34308J15349K15090l58477M6859
1999C01924J56815k02619m5990J39721J66736k45330K1685o2544k85725L03507
1989B48180J3040j41082o8643n6232K30252j36245J5525j63391O4101J87364J12580
1978C05449j61357J5364J81641k4852P3377j79199j85111O8840J85672n6553J00523
1967C23794q3616j21288K05227r4362k67217M45807j31214l7285J54611j44532
1957B49925o3737n4451n441P9061r005m8858J70779p8642n7945Q0080J30358m9679
1945C42445j10978j9563o3591j6981j51540J10553K0858J34683J63463j5503j64081
$$ plain form
2021 306941 284942 359951 139123 212985 -58708 40669 239245 348341 270967 295400 278596
2010 278596 263053 263153 236121 458395 373015 148795 283103 398452 613542 255065 301924
1999 301924 458739 256120 210130 349851 516587 271257 292942 230398 -55327 248180
1989 248180 261220 120138 51495 -4737 225515 89270 104795 -58596 5505 192869 305449
1978 305449 144092 159456 341097 316245 389622 210423 25312 94152 279824 223271 323794
1967 323794 240178 118890 324117 229755 -37462 408345 277131 239846 394457 249925
1957 249925 186188 131737 126296 205357 196352 147494 318273 239631 181686 261766 392124 342445
1945 342445 231467 211904 148313 131332 -20208 90345 111203 245886 409349 393846 229765
1934B29765k14140L65101M292j68607k44988Q6928M17824k03638K48095j25303
1924C95329k43032o0665R227j59133r6784K96345k90400N4316m329P5181J87367
1913A63422M5830R5191k5332J32993k05189k28102K12485j72314J37548j44659
1903A1873k67K68077n1511R4527k50212K97000j81936J16179K24913l31002r0157
1892A07484Q8518J90913j64601K801r764j84375j50719J34694L91815j8289J31411
1881E19888Q8914j94247O4937j64581K89378m9446P7661k13860P4121n4894k47064
1870A90807J49358o12R6942J36195k29424n7915J07279J93952r9788J3545p6522
1859D23817r4067k3933j58870L60165q5463L6867k7074J37176j3929r545O865
$$ plain form
1934 229765 15625 380726 385018 216411 -28577 58351 476175 272537 520632 395329
1924 395329 152297 91632 100859 -58274 -155058 141287 -149113 -94797 -99126 -23945 163422
1913 163422 209252 304443 279111 412104 206915 -21187 191298 18984 156532 11873
1903 11873 11606 279683 228172 322699 72487 369487 187551 303730 528643 197641 107484
1892 107484 196002 386915 222314 225115 215351 30976 -119743 14951 406766 388477 519888
1881 519888 608802 414555 479492 314911 604289 554843 632504 418644 492765 437871 190807
1870 190807 340165 339553 436495 572690 343266 285351 392630 586582 486794 500339 423817
1859 423817 329750 305817 146947 507112 421649 458516 431442 568618 554689 545144 552009
1848E52009l24041N13935j07794n6756R2429j12113J23609o3989o1102j14409
1838D41778L1254J43774K7768P6818o1725L30253q639k51177K18527j32606J15857
1827I31882J07236k30l49678J75901K777m5147p6527k16962O8003Q3410k8022
1816F52643j31837l4492L25847j0667k65186L2367K87443k05571j08999K16303
1806G57851o9220K328j12412Q3937j13743n2429J3796K38674M8963j50681r1778
1795E55286l6264j16199k67184J59721o2916j57042M28604P185m6368J11532j08197
1784D68158Q5273j41638J81567M572J10144l29487J36787K79447k80474q5796
1774D28553q293j07660K4843k13977N0204O3197J02271j03137L7119P7202j68645
$$ plain form
1848 552009 227968 741903 634109 577353 669782 557669 681278 617289 556187 441778
1838 441778 473032 616806 644574 721392 659667 989920 981281 730104 948631 816025 931882
1827 931882 1039118 1038888 689210 865111 867888 822741 746214 529252 597255 680665 652643
1816 652643 520806 486314 812161 801494 536308 568675 856118 650547 541548 757851
1806 757851 688631 690959 578547 662484 548741 496312 510108 748782 797745 647064 555286
1795 555286 519022 402823 135639 295360 232444 75402 504006 511191 464823 576355 468158
1784 468158 553431 411793 593360 597932 708076 378589 515376 794823 514349 428553
1774 428553 420260 312600 337443 123466 173670 236867 339138 236001 273120 350322 181677
1763A81677j30125J09523M11616m54130j1957J75404o1752n1067r803N6813N3959
1752B70158P0616J74669j88J5219k46229K23966j07828l41705J98643j00946j47801
1741H574J80587j09783j09666n8822K38557N5762O3614k58316J41588L00300k80274
1730A72121o8360o8452J66492j94061Q3241N8942j57217J16271l31919j43588
1720c66530L37391j1831K9845M07977j48157l13185L33650K1335j78838n9801
1710E1856j61745J48343m6580J63006J21277l23536l2704J01247J01381l16386
1700a93841K16617J55814j90032J09305j16107p0025O9691K3105L8713j22445
1690g9205M8864n2459j2469K7426J50304o6766J42140Q4463l32518m8799O1395
$$ plain form
1763 181677 51552 161075 572691 118561 106604 282008 220256 169189 159386 216199 270158
1752 270158 340774 515443 515255 530474 284245 508211 400383 58678 257321 156375 8574
1741 8574 189161 79378 -30288 -89110 149447 205209 268823 10507 152095 452395 172121
1730 172121 103761 35309 201801 7740 90981 149923 -7294 108977 -222942 -366530
1720 -366530 -29139 -40970 -11125 396852 248695 -64490 269160 290495 111657 51856
1710 51856 -109889 38454 -8126 154880 276157 -47379 -80083 21164 122545 -193841
1700 -193841 22776 178590 -11442 97863 -18244 -88269 -18578 4527 43240 -79205
1690 -79205 -30341 -82800 -95269 -67843 82461 15695 157835 242298 -90220 -139019 -77624
1679g7624j49500J58526M2025J51582q465k01647K50673j84755l0736j15822L03283
1668A37540J2975k86452j1367J35241m08153p871O65222K3605m21572j79152J6156
1657c23828K72052N6477k89827L43873j10360j94400J76099J2612k32352K25139
1647f4515L74214k84344k3921r8949N4649J62854j36154k3478J02922J49866n5821
1636A57323J4383N3791q0398j83649j85013R9650N674J94133j60087N0241l2179
1625f6131p4064J0760K12217r1297k7154J50020k39983K20491j81036k19104R8141
1614b07140j81008p4022L25127l113j13881j14316K18686j19143J57601N4282
1604e6927J91962r5146n2631k3155j04034P1015j3070K24820J5083k17876o1903
$$ plain form
1679 -77624 -227124 -68598 -26573 125009 116544 -85103 165570 -19185 -49921 -165743 137540
1668 137540 150515 -135937 -147304 -12063 -420216 -428087 237135 260740 -160832 -339984 -323828
1657 -323828 -51776 4701 -285126 58747 -51613 -246013 -69914 -57302 -289654 -64515
1647 -64515 309699 25355 1434 -97515 -42866 119988 -16166 -39644 63278 213144 157323
1636 157323 171706 225497 145099 -38550 -223563 -123913 -118239 75894 -84193 -33952 -66131
1625 -66131 -140195 -129435 82782 -8515 -35669 114351 -125632 94859 -86177 -305281 -207140
1614 -207140 -388148 -462170 -137043 -140156 -254037 -368353 -149667 -268810 -111209 -56927
1604 -56927 135035 39889 -12742 -35897 -139931 -68916 -81986 142834 157917 -59959 -121862
1593a21862J79355k66611Q441L34164j14537r9875J12260o5668K32196k76672
1583g8809Q2681Q8814j08498J40424j72391k39273J29852M58152k13090l9140
1573D8722L0172L7152k37786o0192K83892k36078j43273J12894k21577J04775
1563b81299k8248K12205J82761j62041J0994J04758p7039j22524L29208j37850
1553C0925j0657j02491m6355J47971j41780Q2696K38213m24201M4766j06719n6267
1542c43899J74914J48445Q8266L8854j31373N9731J63870r4958N7963m59561K86546
1531a1202P1692l61161K40276J22585j98540j16067M1380J56029j84402j3114
1521b52524m0924J42860q9295K21585M3303m31472J03229l6373K63135J14765
$$ plain form
1593 -121862 57493 -209118 -200677 133487 18950 -80925 31335 -34333 197863 -78809
1583 -78809 3872 92686 -15812 124612 -47779 -287052 -157200 300952 87862 48722
1573 48722 78894 116046 -121740 -181932 101960 -134118 -277391 -164497 -386074 -281299
1563 -281299 -309547 -97342 85419 -76622 -65628 39130 -37909 -160433 168775 30925
1553 30925 20268 -82223 -128578 19393 -122387 -39691 198522 -225679 -180913 -287632 -343899
1542 -343899 -168985 -20540 67726 106580 -24793 34938 198808 103850 161813 -297748 -11202
1531 -11202 60490 -300671 -60395 62190 -136350 -252417 -211037 -55008 -239410 -252524
1521 -252524 -293448 -150588 -239883 -18298 25005 -406467 -303238 -339611 -76476 38289
1511C8289o0434M8656L02335k68141k39463K70855k74702J92353J12234j80348
1501e8366j1203j88664K15976J69717J54740k27716j22074J04660j08984J13145
1491D1231L2621N7343n7972j88777P6243j2964j79794O027K21587r4908j29088
1480b28451K62777j29817k18566J2252O3290Q1651k19792J79093K14681J4412
1470C1530j71779J3246M882J51616k2129j16423o6207J78649N0201k10148k0400
1459a76962J78311M8564j0394M628o4337q7173M5275o6391N3071J00337n7586
1448c2657J42644k96961J03055n432r2708J6407M5163P3157R2650q1601k18734
1437b55017J26196m0121k57119M21665R896q9584j46597K7847K08087o7536k60891
$$ plain form
1511 38289 -22145 26511 328846 60705 -178758 92097 -182605 9748 121982 -58366
1501 -58366 -69569 -258233 -42257 127460 282200 54484 -67590 37070 -71914 41231
1491 41231 73852 131195 73223 -115554 -39311 -52275 -232069 -226042 -4455 -99363 -228451
1480 -228451 34326 -95491 -314057 -301805 -238515 -156864 -376656 -197563 17118 31530
1470 31530 -140249 -127003 -122121 29495 7366 -109057 -175264 3385 53586 -156562 -176962
1459 -176962 1349 49913 39519 44147 -20190 -107363 -62088 -128479 -75408 24929 -32657
1448 -32657 109987 -186974 -83919 -89351 -182059 -165652 -120489 -47332 45318 -36283 -255017
1437 -255017 -128821 -168942 -426061 -4396 5500 -84084 -230681 -202834 5253 -62283 -323174
1426c23174K62397J20351l54007K8555l6758O7805J89060o1713o4287J71087j00936
1415a01620j32573p2335k5849K77239L16298n6231j59631o7677N775J77072l7549
1404A22919n502P8478N8383j81639k60288K39259n1699k07322J03533M7597J05607
1393D9326j5041l06349P9381J97141j37787p8533m5257q6723K68653l8817k15685
1382c29691J53J74446O0835N0951J61029j80902O7455m880j11774N6578P042J23549
1370G4791j25585J67174K17940k56349M3305N8561j71695M0751J00983j57995
1360h119J16689j9325R7855M0499j90978k94340R2644O6044l1221k747k33727
1349c66726p8041J08997J4238J7067j9049j28373P6738K76533j50872j58602L00065
$$ plain form
1426 -323174 -60777 59574 -294433 -265878 -302636 -234831 -45771 -107484 -171771 -684 -101620
1415 -101620 -234193 -306528 -332377 -55138 261160 204929 45298 -22379 -16604 160468 122919
1404 122919 117417 195895 254278 72639 -187649 51610 -89 -207411 -103878 -56281 49326
1393 49326 34285 -272064 -192683 4458 -133329 -211862 -257119 -343842 -75189 -114006 -329691
1382 -329691 -329538 -155092 -94257 -43306 117723 -63179 4276 -604 -112378 -55800 -48758 74791
1370 74791 -50794 116380 334320 77971 121276 179837 8142 48893 149876 -8119
1360 -8119 108570 89245 187100 227599 36621 -257719 -165075 -99031 -130252 -132999 -366726
1349 -366726 -444767 -335770 -321532 -304465 -323514 -451887 -375149 -98616 -249488 -408090 -108025
1338a08025m8019K0194K12610j501m769K30355m96367J04228J26650j06258J30132
1327E9230Q2901j81992K31205k2080l54729K59510j50596j72918L44858j37896
1317d2507k44631K27350N3181O0531O5763k04752l4868O7119m7000P3411J73692
1306A47289j95621n8445L70421j93182k64040N1738R8345j44473J95478j94983
1296a87473j79798J0998K0930L32456n0070J2098j43888N693K40185j4518k4231
1285B2382q4570N9251R8778j12611K17134j3364Q7830j64412K38463J42875j88121
1274C03635k4652p2427R6919j30942J57453P4007l5419O1469P1949P6537j15210
1263D63319j33658j23649K5266R5441l09064K78128L8271k84865N1144R5003O8112
$$ plain form
1338 -108025 -156044 -135850 76760 75259 70490 300845 -195522 -91294 35356 -70902 59230
1327 59230 142131 -39861 191344 169264 -185465 74045 -76551 -249469 95389 -42507
1317 -42507 -287138 -59788 -6607 53924 119687 -85065 -119933 -52814 -99814 -26403 147289
1306 147289 -48332 -106777 263644 70462 -193578 -141840 -43495 -187968 7510 -187473
1296 -187473 -367271 -356273 -335343 -2887 -52957 -40859 -184747 -179054 61131 46613 22382
1285 22382 -62188 -2937 95841 -16770 200364 187000 274830 110418 348881 491756 303635
1274 303635 278983 206556 303475 172533 329986 403993 368574 430043 501992 578529 463319
1263 463319 329661 206012 231278 326719 17655 295783 334054 49189 100333 195336 263448
1252B63448l74968K96857P8124j60604M7820l6210L4553K9003k07870l635J05859
1241G2377k37461J01611J73875r4837j79968J64436K91936o460j55514O5267j10457
1230H4805J47590J78807k44921L4217K00886j0455O7219q5990o5182O9829k11676
1219A65129k20770M53225m06792q7614L34935n0335j69122Q9091j06955k29719
1209b28927J14020o237K42694j2329j21463J54506j875P5876m4299L0514L8186
1198B40666j32680j49657r7524R9428P9527j41248J66656J12610q9097Q2670P2277
1187B43628k35043j10289K37841k106J25598K2259j60103K86525k51434l4560
1177A22316L09396J49634j80232R8296j338l28138J89941j35241q9277j87788
$$ plain form
1252 263448 -111520 185337 263461 102857 150677 114467 149020 178023 -29847 -33482 72377
1241 72377 -165084 -63473 110402 15565 -164403 33 291969 285509 129995 195262 84805
1230 84805 232395 411202 166281 200498 401384 390929 458148 372158 306976 376805 165129
1219 165129 -55641 397584 -9208 -96822 238113 187778 18656 107747 792 -228927
1209 -228927 -114907 -121144 121550 109221 -12242 142264 140389 216265 171966 202480 240666
1198 240666 107986 -41671 -139195 -39767 39760 -101488 65168 177778 88681 171351 243628
1187 243628 8585 -101704 136137 134031 259629 281888 121785 408310 156876 122316
1177 122316 431712 581346 401114 499410 498072 169934 359875 224634 135357 -52431
1167e2431k1672L42195O2631j81759K0374M3293L5435P2880k15114k32675K96565
1156A69722j16387n4704L0246n0785j59659L30792K18209p0941J0208R7759j39299
1145B65161k9362J28687m0612j63772j56763R7755K4080L9836K27055j18699J39975
1134D13341J83721k72228R7552K72142m13894J24328m4931j43263K6143J8746
1124B61657L8388K29032j64417j57774N5703n5245L8704j1314p3681J71630J4864
1113C47547J74981L9489j18119R4358K02240m2510r8014R935j07736J31775j26962
1102E06984M21193L62664j50332L58565K79284j98814J58596J25695o6796k23726
1092A573313l8263o0077j82579k59272n9501n0580k04653Q9108J71800q1616J68297
$$ plain form
1167 -52431 -74103 268092 330723 148964 169338 212631 248066 320946 105832 -126843 169722
1156 169722 53335 -1369 28877 -21908 -181567 149225 367434 296493 306701 404460 265161
1145 265161 235799 364486 323874 160102 3339 101094 125174 165010 392065 273366 413341
1134 413341 597062 324834 422386 694528 280634 404962 360031 216768 242911 261657
1124 261657 300045 529077 364660 206886 262589 207344 246048 234734 161053 332683 347547
1113 347547 522528 562017 443898 538256 740496 697986 599972 609907 502171 633946 506984
1102 506984 928177 1290841 1140509 1499074 1778358 1579544 1738140 1863835 1797039 1573313
1092 1573313 1535050 1474973 1292394 1033122 973621 923041 718388 807496 979296 897680 1065977
1081A065977j14201P3869J45558L5275n1892R9051p7267P9271K19950J10510K12745
1070A798846r2678k0191J30757j23501n2107k19854L54160r9325j18627M7674
1060A605154p0460J64453J20186J31582o1378n4397K45285N143K56188M5304J18483
1049B505543o3068l230m318N1729J95890k28524K15876L1261p1364l1807J57691
1038B755679R371K4584J43694k1133K06576K86735r3940R0664J10438m4949J9927
1027C487646K36191J42135j24552N82943J87922j3488K14581K75902K3990Q7073
1017E100343L29974L08571K94855K75126O52648L24015j0227N81054O26287M02900
1007H885546Q94482R88362O44624Q60865J268396J143166J655432J349138P26224
$$ plain form
1081 1065977 951776 1025645 1171203 1206478 1154586 1253637 1176370 1255641 1475591 1586101 1798846
1070 1798846 1706168 1685977 1816734 1693233 1641126 1421272 1775432 1676107 1557480 1605154
1060 1605154 1534694 1699147 1819333 1950915 1889537 1835140 2080425 2085568 2341756 2387060 2505543
1049 2505543 2442475 2439245 2434927 2486656 2682546 2454022 2669898 2701159 2629795 2597988 2755679
1038 2755679 2765050 2789634 2933328 2912195 3118771 3405506 3311566 3402230 3512668 3467719 3487646
1027 3487646 3723837 3865972 3741420 4324363 4512285 4498797 4713378 4989280 5013270 5100343
1017 5100343 5430317 5738888 6033743 6308869 6961517 7285532 7275305 7856359 8482646 8885546
1007 8885546 9780028 10768390 11413014 12273879 13542275 14685441 16340873 17690011 18416235
998A8416235J363302J357037J428637J972317K430503K713083L594737M621161
990C7897012N127852O898985R627207J4208856K1186747K1700417m803026j8103815
982I3740235q875826j0357179j4196467j1305447p988870o137248m474262l352927
974B7052009k919053k552784j471401j301387p96313q02510j003296j499292j072291
965A3633682q02474q03496q62567j029029n08020l83246m31382j86506m60903
956H166059m43661m14420j83588K9131k71385m53485k91329k33433k90440k31836
946E381613l3783l09838Q6083k28433k86491R7241j67715l99688L1649J0483k77414
935C903707j76648l65402o2861j5092k43353K13830k04629j00160j36566l4563
$$ plain form
998 18416235 19779537 21136574 22565211 24537528 26968031 29681114 33275851 37897012
990 37897012 43024864 49923849 59551056 73759912 94946659 116647076 111844050 93740235
982 93740235 84864409 74507230 60310763 49005316 41016446 34879198 30404936 27052009
974 27052009 24132956 21580172 20108771 18807384 18011071 17208561 16205265 14705973 13633682
965 13633682 12831208 12027712 11165145 10136116 9628096 9244850 8813468 8626962 8166059
956 8166059 7722398 7307978 7124390 7153521 6882136 6428651 6137322 5903889 5613449 5381613
946 5381613 5347830 5037992 5124075 4895642 4609151 4706392 4538677 4138989 4170638 4181121 3903707
935 3903707 3727059 3361657 3298796 3283704 3040351 3254181 3049552 2949392 2812826 2778263
925B778263j01636l55706L7118K0496J73841j34125k50257J41506k87891J41758
915B163367Q0660l6500j63446k85948J65974p6420M7934l5726k8070J30217l04479
904A657563p2107m3896p7009k63458L25536k36645k1276l335n18797K99026k594
893A043008O3411K35473j25951j27096l7798J10399j49875L61827l35008k68851
883G69539M89059n42549q3254L94475K1092j31094J91737m7070o338j94662j4926
872H46009L21397N5898m67100l7223J07789j6029k56062J77871k24592m5011J17316
861E80263N5445M25157m20150j63502J92604k02602P0211J41601o6247k6287J33987
850G20480j80221j13794J23115k96997L27242M8034j21863R8977j48370p4198
$$ plain form
925 2778263 2676627 2320921 2358039 2378535 2552376 2418251 2167994 2309500 2021609 2163367
915 2163367 2244027 2207527 2044081 1758133 1924107 1847687 1895621 1859895 1831825 1962042 1657563
904 1657563 1585456 1541560 1464551 1201093 1526629 1289984 1268708 1265373 746576 1045602 1043008
893 1043008 1106419 1341892 1215941 1088845 1051047 1161446 1011571 1373398 1038390 769539
883 769539 1258598 716049 632795 1027270 1048362 917268 1109005 1061935 1055597 860935 846009
872 846009 1167406 1223304 756204 718981 826770 810741 554679 732550 507958 462947 580263
861 580263 635708 1060865 640715 477213 669817 467215 537426 679027 612780 586493 720480
850 720480 540259 426465 549580 252583 579825 627859 505996 604973 456603 382405
840C82405l0216P044o668J87893k35356j16383Q2535j603j72466J0174J13318
829B20677N1138j07301J15751P9310J20588K5784N9841J07344k23026O5632o4615
818D51123j52210j7417q9454p3472M2513n7422j00455O7192R1420j79720J84796
807A66894j27674k10215M19444l7770J3522L53902k64452j26009J51999n2666
797B86975o4272J15463r8894j75459K35484n6726p4454j49046n1453P0671n4408
786a6119J22095l1013j63606K17974j25522Q8591M140Q5602l7229J68427l1638
775B81702k53661K66585j78978J8346Q2059k12630k0329J17350m16516O2014M70403
764B16345k87418l9597M84152k59623j9950k27875k8183P9386M3443j36677K62841
$$ plain form
840 382405 352189 359233 352565 540458 305102 188719 271254 269651 97185 107359 220677
829 220677 271815 164514 280265 359575 480163 505947 565788 673132 450106 515738 451123
818 451123 298913 281496 192042 118570 161083 103661 3206 70398 161818 -17902 166894
807 166894 39220 -170995 248449 210679 224201 578103 313651 187642 339641 286975
797 286975 222703 338166 239272 63813 299297 242571 168117 19071 -32382 38289 -16119
786 -16119 105976 74963 -88643 129331 3809 92400 96540 182142 144913 313340 281702
775 281702 28041 294626 115648 133994 216053 3423 -16906 100444 -316072 -254058 216345
764 216345 -71073 -110670 373482 113859 93909 -133966 -162149 -82763 -39320 -175997 86844
753H6844K99828l60598J19973J42384j97956J11441j37381l09891M6706P9227
743a19423n8076M8932O5837j44171J3911J55519o4305j08361m9620O1253J02796
732i5708J57997N6732Q7594k55513k4350L73985p0294k28222K04929K98319j90787
721C14682j88470M3922n5229k8399k63414K60484j5626k06890J74263O1206q2977
710A3552K40303Q8786k69506K65144k22411O8029K21933p3745Q3073N1685J20492
699E87335J23799p3013o2619q3592j69231k72765M90104j48118k44085J43363
689B91178l62370q386p6357M6656l9267O3164J40179P4096k5632K3561j76540
678d9718P5926r3067j10983K02357j63596J7676J92758p3779j97837J97597J1061
$$ plain form
753 86844 386672 26074 146047 288431 90475 201916 64535 -245356 -198650 -119423
743 -119423 -177499 -128567 -62730 -206901 -192990 -37471 -101776 -210137 -259757 -198504 -95708
732 -95708 62289 119021 206615 -48898 -73248 300737 230443 2221 207150 505469 314682
721 314682 126212 170134 114905 86506 -176908 83576 67950 -138940 35323 96529 13552
710 13552 253855 342641 73135 338279 115868 183897 405830 332085 415158 466843 587335
699 587335 711134 638121 575502 491910 322679 49914 540018 391900 147815 291178
689 291178 -71192 -79578 -155935 -109279 -148546 -85382 54797 128893 103261 126822 -49718
678 -49718 26208 -66859 -177842 24515 -139081 -121405 71353 -2426 -200263 -2666 8395
667H395j62581m4558J83657j03412M9993J39987j5442j563M151J06013k07825
656d3185J9041K37693k60692k5847l8435J11716j76177J15986R8153j28245j08362
645a98354J66035R7539p3457N9732l953k11490M3292J24203k6578k10828K38900
634E041J96465j71235J23065j65220J19754j30153k02237K64019j85424K9499
624a16426J5054P0045k40273m5577L2851J02967J98484j4007N2880j68624L6596
613g6030q6447J06502K16360k13350j56683L52536q5715l1524J72719j10113o2556
602B5699l08179J00361J04122j69670K95543J47621l46072j84114L64164l19386
592b89911j2163K05447Q2113P5462n1210Q9428N6840m94398K40057K50052k20636
$$ plain form
667 8395 -154186 -198744 -15087 -118499 -68506 71481 56039 54476 58627 164640 -43185
656 -43185 -24144 213549 -47143 -72990 -111425 291 -175886 -59900 38253 -89992 -198354
645 -198354 -32319 65220 -8237 51495 47542 -163948 -120656 3547 -23031 -233859 5041
634 5041 201506 30271 153336 -11884 107870 -22283 -224520 39499 -145925 -116426
624 -116426 -101372 -31327 -271600 -317177 -284326 -181359 17125 3118 55998 -112626 -76030
613 -76030 -162477 -55975 160385 -52965 -209648 142888 57173 25649 198368 88255 25699
602 25699 -282480 -182119 -77997 -247667 47876 195497 -150575 -334689 29475 -289911
592 -289911 -302074 -96627 -14514 60948 9738 99166 156006 -338392 -98335 151717 -68919
581f8919j27242M6206O9422j42522N3726K9781K0256j56626J58917L4362k22204
570c04843K87008M381k94442P2575J09937k1607q5635N6107R535k72092N9191
559c79885J20655J24465n2515J56557j98284j93502K02960j33647M0097J88099
549a25000k9164J04699l16645p2629K15036j9533J03037J17423k34831M1469J7082
538a99056m0141R2583O4672o1902q2677J39387k3577L7954J59194j60451O2148
527a1866J1798k16406R4667k90846K16715J52892j02043k08920J912J67833p4531
516b58795o9993J16113j12934L1194P6256j69007Q942J2818J89746r8480j37799
505d11939J73965L33586m45898k3537M04432l12743q2093K86521j02138q1748
$$ plain form
581 -68919 -196161 -149955 -80533 -223055 -169329 -139548 -119292 -275918 -117001 -82639 -304843
570 -304843 -17835 -13454 -307896 -235321 -125384 -146991 -232626 -176519 -166984 -439076 -379885
559 -379885 -259230 -134765 -187280 -30723 -229007 -422509 -219549 -353196 -313099 -125000
549 -125000 -154164 -49465 -366110 -438739 -223703 -243236 -140199 -22776 -257607 -216138 -199056
538 -199056 -239197 -146614 -81942 -143844 -226521 -87134 -110711 -72757 86437 -74014 -11866
527 -11866 -68 -216474 -121807 -412653 -195938 -43046 -145089 -354009 -352097 -184264 -258795
516 -258795 -328788 -212675 -325609 -294415 -218159 -387166 -378224 -365406 -175660 -274140 -411939
505 -411939 -237974 95612 -350286 -373823 30609 -282134 -364227 -77706 -179844 -261592
495b61592K83894j1659p4970m9715l5042J05832j71977p6979J90827l38325M22180
484a7526j45151o5412J48629k4055k8517j96240J49855q5810J29907o1271j3948
473b09539K47910l24531J19480K37789l92662k1599L78550q6929j45216K14034
463A7287J0776l1220j19579K4043j20973l5057M6635q0196K74976j80544N4199
452a39653K91640k27864Q0270J29547R1553p0195k42008J90161l87717K42868
442d1398r7638j05262L54338L0958j0566k19137M6898J83775l18857j76223J15023
431b38089k61268L30134J11801k08988J2437P5963M8384J10437j45132J01996
421f2325m899j64751N4955k0773j67410j03295K06298j3455M0102Q1246j52927
$$ plain form
495 -261592 22302 10643 -64327 -114042 -149084 -43252 -215229 -292208 -101381 -439706 -17526
484 -17526 -162677 -228089 -79460 -103515 -132032 -328272 -178417 -264227 -134320 -195591 -209539
473 -209539 38371 -286160 -166680 71109 -321553 -343152 35398 -51531 -196747 17287
463 17287 28063 -3157 -122736 -98693 -219666 -254723 -208088 -288284 -13308 -193852 -139653
452 -139653 151987 -75877 4393 133940 225493 155298 -86710 103451 -284266 -41398
442 -41398 -139036 -244298 110040 140998 130432 -88705 -41807 141968 -176889 -353112 -238089
431 -238089 -499357 -169223 -57422 -266410 -253973 -178010 -129626 -19189 -164321 -62325
421 -62325 -67224 -231975 -177020 -197793 -365203 -468498 -262200 -275655 -235553 -154307 -307234
410c07234J34722M8245k933L24336j77798K9358j86814K14037k12159k37120L79335
399E975k96044L20922J07703k74543L082Q7793M0309O7560l9782q4696K0821p9951
387a20851J43172N1504L7727j71296j58468J95699j66969J8280J940m5091J50151
376f4202j32274J62672J32443L251q3707l3247L7810k48650K8943J04837m3042
365a35166J95157l434l66729Q9960K3956J19275Q6998K60803j39388j65673K09360
354A75119l6817k66669Q1787l10301J97072J70405N9857J33265m01030K00304
344B992J67179l87612K34204j2408N2633O1610j96132k4836j3407j09878P299
333b18356L84899j40368k13019L6811m8069j56342Q9983n6q3517L80020j58485
$$ plain form
410 -307234 -172512 -124267 -127200 197136 19338 48696 -138118 75919 -136240 -373360 5975
399 5975 -290069 30853 138556 -135987 -132905 -45112 -4803 62757 22975 -61721 -40900 -120851
387 -120851 22321 73825 111552 -59744 -218212 -22513 -189482 -171202 -169262 -214353 -64202
376 -64202 -196476 -33804 98639 101890 18183 -15064 22746 -225904 -196961 -92124 -135166
365 -135166 59991 56557 -310172 -220212 -196256 -76981 10017 270820 131432 -34241 175119
354 175119 138302 -128367 -46580 -356881 -159809 10596 70453 203718 -197312 2992
344 2992 170171 -217441 16763 4355 56988 118598 -77534 -102370 -115777 -225655 -218356
333 -218356 166543 26175 -186844 -150033 -198102 -354444 -264461 -264517 -348034 31986 -126499
322a26499o1632J80104j83525K13260K25596k17409j87050O1723J0594O0291n9803
311h4350j21083L0172q1231r7768Q7279j1366j15505O0513J60696p4362l8376
300b85381K4860l1517J03570j0078j50511K80175J020m42567L42627R3106J7583
289e7113N3616k58308M15169j78899j30047J2675L9909k79683k04757K15672N6889
278c14877K39208J5159l5520J49335j64315K90550j16460j16209m6895j00932
268b00956K3146j20861O9262j5556K00919n8142p9546J94595j92470L13403o1143
257G2651L7936l6196R4270k20383j75877L23889l75525L7066K28160l46654K99737
246f0926j92414j56131K37072J61382n5099k9004K08772k98324K71467j70053
$$ plain form
322 -126499 -188131 -8027 -191552 21708 247304 29895 -157155 -95432 -84838 -24547 -84350
311 -84350 -205433 -175261 -256492 -354260 -266981 -278347 -393852 -333339 -172643 -247005 -285381
300 -285381 -260521 -292038 -188468 -198546 -349057 -68882 -67862 -510429 -167802 -74696 -57113
289 -57113 -3497 -261805 153364 -25535 -155582 -142907 -102998 -382681 -587438 -371766 -314877
278 -314877 -75669 -60510 -96030 53305 -111010 179540 63080 -53129 -100024 -200956
268 -200956 -177810 -298671 -229409 -244965 -44046 -102188 -181734 12861 -179609 133794 72651
257 72651 110587 74391 168661 -51722 -227599 96290 -279235 -242169 -14009 -360663 -60926
246 -60926 -253340 -409471 -172399 -11017 -66116 -95120 113652 -184672 86795 -83258
236h3258L0470J26655j9429k43007l681M6109j58983J70924L4111k34909K34455
225a00543o9716j19586O8063P7590r3560j42776K03901k69904K20770k3201J1154
214b37808K58007q0924M5903j9091p1184k06591j31379N4316J10736j02837k6318
203d07170J48984J13419J05312j11013j86163L21994j27383j62593L69967m2085
193B3269l78076J15847J87142J7180j25372j11287J27021J69779k54605k19592
183d48694P6417J68729m6667J72047R3790k65964R6024n6979j30350P4120J5261
172b52266q3891L3148R2834m0486R8247m4636j66116J24111q9431l9055J13953
161b53588j34451J4055k6368J0570J46850j4877p0692K08513j67450n7188J69114
$$ plain form
236 -83258 -52788 73867 54438 -188569 -192250 -146141 -305124 -134200 -100089 -334998 -100543
225 -100543 -170259 -289845 -221782 -144192 -237752 -380528 -176627 -446531 -225761 -248962 -237808
214 -237808 20199 -60725 -14822 -33913 -105097 -311688 -443067 -388751 -278015 -380852 -407170
203 -407170 -258186 -144767 -39455 -150468 -336631 -14637 -142020 -304613 65354 23269
193 23269 -354807 -238960 -51818 -34638 -160010 -271297 -144276 25503 -229102 -448694
183 -448694 -372277 -203548 -250215 -78168 15622 -250342 -154318 -211297 -341647 -267527 -252266
172 -252266 -336157 -303009 -210175 -250661 -152414 -197050 -363166 -239055 -328486 -367541 -253588
161 -253588 -388039 -373984 -400352 -389782 -242932 -257809 -328501 -119988 -287438 -344626 -175512
150a75512n396n1090m9793P3997P2580L7484j8836j34639P1217q7795r8979j7141
138c83903L341K19726j7626j26231Q9052K5810k65893O8829K38871K3576J0464
127a13984J08106l5002k7035j32491k4434n2140n3633m5219N0821k61321R4362
$$ plain form
150 -175512 -180908 -231998 -281791 -207794 -135214 -97730 -116566 -251205 -179988 -267783 -366762 -383903
138 -383903 -380562 -160836 -178462 -304693 -215641 -189831 -455724 -386895 -148024 -124448 -113984
127 -113984 -5878 -40880 -67915 -200406 -224840 -276980 -330613 -375832 -325011 -586332 -491970
$$ [...]
##END NTUPLES=NMR SPECTRUM
##END=
