##TITLE=1H_TG-2315-1
 CDCl3,8 sc, 
 5.02.2021
##JCAMPDX= 6.0         $$ Bruker NMR JCAMP-DX V2.0
##DATA TYPE= NMR SPECTRUM
##DATA CLASS= NTUPLES
##ORIGIN= UXNMR, Bruker Analytische Messtechnik GmbH
##OWNER= root
$$ XWIN-NMR		Version 3.5
$$ Fri Feb  5 12:08:03 2021 Russian Standard Time (UT+4h)  she@DPX200
##.OBSERVE FREQUENCY= 200.1315066352
##.OBSERVE NUCLEUS= ^1H
##.ACQUISITION MODE= SIMULTANEOUS
##.ACQUISITION SCHEME= undefined
##.AVERAGES= 8
##.DIGITISER RES= 18
##SPECTROMETER/DATA SYSTEM= spect
##.PULSE SEQUENCE= zg30
##.SOLVENT NAME= CDCl3
##.SHIFT REFERENCE= (INTERNAL, CDCl3, 0, 15.9657)
##AUDIT TRAIL= $$ (NUMBER, WHEN, WHO, WHERE, WHAT)
$$ ##TITLE= Audit trail, XWIN-NMR		Version 3.5
$$ ##JCAMPDX= 5.01
$$ ##ORIGIN= Bruker BioSpin GmbH
$$ ##OWNER= she
$$ F:/spectra/data/she/nmr/H-F/1/pdata/1/auditp.txt
$$ ##AUDIT TRAIL=  $$ (NUMBER, WHEN, WHO, WHERE, WHAT)
(   1,<2021-02-05 12:06:45.56 +0400>,<she>,<DPX200>,
      <created by zg, POWCHK disabled, PULCHK disabled
       configuration hash MD5:
       00 E9 B6 7A A2 85 ED C7 34 08 36 98 17 FE 4E 26
       data hash MD5: 16K
       BE 5F 2D FF BE 5E 14 FA 65 50 4B EA A9 D1 EE 47>)
(   2,<2021-02-05 12:06:48.29 +0400>,<she>,<DPX200>,
      <Start of raw data processing
       efp BC_mod = 2 LB = 0.24 FT_mod = 6 PKNL = 1 PHC0 = -10757.82 PHC1 = 4.800944 SI = 16K 
       data hash MD5: 16K
       AD 5A 88 38 FC B6 26 93 54 E0 C5 9E F4 43 D6 E3>)
(   3,<2021-02-05 12:07:07.89 +0400>,<she>,<DPX200>,
      <pk PHC0 = -0.9293334 PHC1 = 4.399998 
       data hash MD5: 16K
       D7 B2 4C 40 96 0C 72 B9 26 64 0A 07 9C CD D1 6C>)
(   4,<2021-02-05 12:07:11.18 +0400>,<she>,<DPX200>,
      <abs ABSG = 5 
       data hash MD5: 16K
       56 6C AF 87 11 6D 6B B0 B2 62 66 DE 5B EB 37 DA>)
$$ ##END=
$$ 
$$ hash MD5
$$ 57 1C C1 59 8F 80 77 11 38 E3 02 F7 90 9A 53 17
##$RELAX= 
##$RELAX= 
##$RELAX= 
##$RELAX= 
##$RELAX= 
##$RELAX= 
$$ Bruker specific parameters
$$ --------------------------
##$DU= <F:/spectra>
##$EXPNO= 1
##$NAME= <H-F>
##$PROCNO= 1
##$TYPE= <nmr>
##$USER= <she>
##$AMP= (0..31)
100 100 100 100 100 100 100 100 100 100 100 100 100 100 100 100 100 100 
100 100 100 100 100 100 100 100 100 100 100 100 100 100 
##$AQSEQ= 0
##$AQ_mod= 1
##$AUNM= <au_zg>
##$AUTOPOS= <>
##$BF1= 200.13
##$BF2= 200.13
##$BF3= 200.13
##$BF4= 200.13
##$BF5= 200.13
##$BF6= 200.13
##$BF7= 200.13
##$BF8= 200.13
##$BYTORDA= 1
##$CFDGTYP= 0
##$CFRGTYP= 5
##$CHEMSTR= <none>
##$CNST= (0..31)
1 1 145 1 1 1 1 1 1 1 1 1 1 1 1 1 1 1 1 1 1 1 1 1 1 1 1 1 1 1 1 1 
##$CPDPRG= <>
##$CPDPRG1= <>
##$CPDPRG2= <>
##$CPDPRG3= <>
##$CPDPRG4= <mlev>
##$CPDPRG5= <mlev>
##$CPDPRG6= <mlev>
##$CPDPRG7= <mlev>
##$CPDPRG8= <mlev>
##$CPDPRGB= <>
##$CPDPRGT= <>
##$D= (0..31)
0 1.2 0 0 0 0 0 0 0 0.06 0 0.03 0 0 0 0 0.0002 0 0 0 0 0 0 0 0 0 0 0 0 
0 0 0 
##$DATE= 1612512405
##$DBL= (0..7)
120 120 120 120 120 120 120 120 
##$DBP= (0..7)
150 150 150 150 150 150 150 150 
##$DBP07= 0
##$DBPNAM0= <>
##$DBPNAM1= <>
##$DBPNAM2= <>
##$DBPNAM3= <>
##$DBPNAM4= <>
$$ [...]
##$SUBNAM3= <"">
##$SUBNAM4= <"">
##$SUBNAM5= <"">
##$SUBNAM6= <"">
##$SUBNAM7= <"">
##$SUBNAM8= <"">
##$SUBNAM9= <"">
##$SW= 16.9725356469052
##$SWIBOX= (0..15)
0 0 2 0 0 0 0 0 0 0 0 0 0 0 0 0 
##$SW_h= 3396.73913043478
##$TD= 16384
##$TD0= 1
##$TE= 0
##$TE2= 300
##$TE3= 300
##$TEG= 300
##$TL= (0..7)
0 120 120 120 120 120 120 120 
##$TP= (0..7)
150 150 150 150 150 150 150 150 
##$TP07= 0
##$TPNAME0= <>
##$TPNAME1= <>
##$TPNAME2= <>
##$TPNAME3= <>
##$TPNAME4= <>
##$TPNAME5= <>
##$TPNAME6= <>
##$TPNAME7= <>
##$TPOAL= (0..7)
0.5 0.5 0.5 0.5 0.5 0.5 0.5 0.5 
##$TPOFFS= (0..7)
0 0 0 0 0 0 0 0 
##$TUNHIN= 0
##$TUNHOUT= 0
##$TUNXOUT= 0
##$USERA1= <user>
##$USERA2= <user>
##$USERA3= <user>
##$USERA4= <user>
##$USERA5= <user>
##$V9= 5
##$VALIST= <valist>
##$VCLIST= <CCCCCCCCCCCCCCC>
##$VD= 0
##$VDLIST= <DDDDDDDDDDDDDDD>
##$VPLIST= <PPPPPPPPPPPPPPP>
##$VTLIST= <TTTTTTTTTTTTTTT>
##$WBST= 1024
##$WBSW= 4
##$XGAIN= (0..3)
0 0 0 0 
##$XL= 0
##$YL= 0
##$YMAX_a= 592025
##$YMIN_a= -321211
##$ZGOPTNS= <>
##$ZL1= 120
##$ZL2= 120
##$ZL3= 120
##$ZL4= 120
##$ABSF1= 15.98335
##$ABSF2= -0.9893122
##$ABSG= 5
##$ABSL= 3
##$ALPHA= 0
##$AQORDER= 0
##$ASSFAC= 0
##$ASSFACI= 0
##$ASSFACX= 0
##$ASSWID= 0
##$AUNMP= <proc_1d>
##$AZFE= 0.1
##$AZFW= 0.1
##$BCFW= 0
##$BC_mod= 2
##$BYTORDP= 0
##$COROFFS= 0
##$CY= -3
##$DATMOD= 1
##$DC= 0
##$DFILT= <>
##$DTYPP= 0
##$F1P= 0
##$F2P= 0
##$FCOR= 1
##$FTSIZE= 16384
##$FT_mod= 6
##$GAMMA= 0
##$GB= 0
##$INTBC= 1
##$INTSCL= 2.992141e-10
##$ISEN= 128
##$LB= 0.24
##$LEV0= 0
##$LPBIN= 0
##$MAXI= 10000
##$MC2= 0
##$MEAN= 0
##$ME_mod= 0
##$MI= 1.114404
##$NCOEF= 0
##$NC_proc= -5
##$NLEV= 6
##$NOISF1= 3.799351
##$NOISF2= 2.8
##$NSP= 0
##$NTH_PI= 0
##$NZP= 0
##$OFFSET= 15.96574
##$PC= 1
##$PHC0= -10758.75
##$PHC1= 9.200942
##$PH_mod= 1
##$PKNL= yes
##$PPARMOD= 0
##$PSCAL= 0
##$PSIGN= 0
##$REVERSE= no
##$SF= 200.130009780358
##$SI= 16384
##$SIGF1= 3
##$SIGF2= 2
##$SINO= 5.538805
##$SIOLD= 16384
##$SREGLST= <1H.CDCl3>
##$SSB= 0
##$STSI= 16384
##$STSR= 0
##$SW_p= 3396.73913043478
##$SYMM= 0
##$S_DEV= 0
##$TDeff= 16384
##$TDoff= 0
##$TI= <>
##$TILT= no
##$TM1= 0
##$TM2= 0
##$TOPLEV= 0
##$USERP1= <user>
##$USERP2= <user>
##$USERP3= <user>
##$USERP4= <user>
##$USERP5= <user>
##$WDW= 1
##$XDIM= 16384
##$YMAX_p= 344670750
##$YMIN_p= -205442
$$ End of Bruker specific parameters
$$ ---------------------------------
##NTUPLES= NMR SPECTRUM
##VAR_NAME=  FREQUENCY,     SPECTRUM/REAL,   SPECTRUM/IMAG
##SYMBOL=    X,             R,               I
##VAR_TYPE=  INDEPENDENT,   DEPENDENT,       DEPENDENT
##VAR_FORM=  AFFN,          ASDF,            ASDF
##VAR_DIM=   16384,         16384,           16384
##UNITS=     HZ,            ARBITRARY UNITS, ARBITRARY UNITS
##FACTOR=    0.207333158178281, 1,           1
##FIRST=     3195.22374314864, 0,            0
##LAST=      -201.515387286139, 0,           0
##MIN=       -201.515387286139, -205442,     0
##MAX=       3195.22374314864, 344670750,    0
$$ Real data points
##PAGE= N=1
##DATA TABLE= (X++(R..R)), XYDATA
$$ [...]
6243I508805M39559N54429N07149O44216O49434P43003Q34592R05113J072355
6234A5858655J175975J274313J513484J810738K056552K363789K638380L041936
6226C1733822L616908M481788N481149O530025P624304Q878182R589390R150644
6218H7086212P239881L957481p0117l290113m975585n868151o370842p046933
6210G0661833p849265q365308p833813o669208n521054m548017l630083k903569
6202B3341516k277090j801255j520211j384307j116423r73276q73879p54242p44795
6193A1896038p36313o05948m33290m62509m48455l73230l96806l72890k63676
6184G802921l28261l30803l36987k69174j72618k44751k16565j84356k30333l40378
$$ y = [9508805, 9948364, 10502793, 11009942, 11654158, 12303592, 13046595, 13881187, 14786300, 15858655, 17034630, 18308943, 19822427, 21633165, 23689717, 26053506, 28691886, 31733822, 35350730, 39832518, 45313667, 51843692, 59467996, 68346178, 77935568, 87086212, 94326093, 98283574, 98213457, 94923344, 89947759, 84079608, 77708766, 70661833, 62812568, 54447260, 46613447, 39944239, 34423185, 29875168, 26245085, 23341516, 21064426, 19263171, 17742960, 16358653, 15242230, 14268954, 13395075, 12640833, 11896038, 11159725, 10553777, 10120487, 9657978, 9209523, 8836293, 8439487, 8066597, 7802921, 7474660, 7143857, 6806870, 6537696, 6365078, 6120327, 5903762, 5719406, 5489073, 5148695]
6174E148695k44519j60452j03501j03076j40278j83141j68473j62819j50507j10609
6164C621320j04896j57150j69080m7975r2079o6423p8932p6419q3353m8001m0060
6153B656952q7153m1559K1750k4912p1789j2647J2274l8287n1769J5134R0884
6142B468878M2731q016K1167K5198R1125J18208J42487J78614J18536k7407q7819
6131C083702r9843j26907j36478j78436q5894j27503k01895k08769j84695k4004
6121A709278p3784j13596p5401o5531r8403j01074j0135j4996J5523q7452q4785
6110I99644N473j5260p1948m2966j37L2761k1020p0494J7252l0701j64383p2470
6098E65751J01750R7459l4659k7417j49k8842j2114l6653k698j191j347l6129
$$ y = [5148695, 4904176, 4743724, 4640223, 4537147, 4396869, 4213728, 4045255, 3882436, 3731929, 3621320, 3516424, 3359274, 3190194, 3142219, 3050140, 2983717, 2904785, 2828366, 2745013, 2697012, 2656952, 2569799, 2528240, 2549990, 2525078, 2453289, 2440642, 2452916, 2414629, 2362860, 2377994, 2468878, 2511609, 2503593, 2524760, 2549958, 2641083, 2759291, 2901778, 3080392, 3198928, 3171521, 3083702, 2983859, 2856952, 2720474, 2542038, 2456144, 2328641, 2126746, 1917977, 1733282, 1709278, 1635494, 1521898, 1446497, 1380966, 1282563, 1181489, 1171354, 1156358, 1171881, 1084429, 999644, 1005117, 989857, 917909, 874943, 874806, 907567, 886547, 816053, 833305, 802604, 638221, 565751, 667501, 764960, 730301, 702884, 702735, 673893, 661779, 625126, 622428, 621237, 619890, 583761]
6086E83761Q3221J02123k9936j07830m7408M5897P5396J8625n3121J2216M1484
6075G24428L1758J7399o7826j01445k1553J8165J37505J47254r6083j65744M2804
6064F66662M4909J1949m898M3353j5273k5920J680Q8156L523r9689Q354K2161
6052G44967K2608J9184M1429K005K2243M8026M35K9952Q0829m3765p0719M7049
6040I44243K1083j57722o1196o3236q3063O846o602n3628q650L592J0726m8170
6028E04223q229L4505q8903L3365R7971n9382n8793j8847J4001J6130M5858r958
6016E01941m1727j0937P0303J16177O0837q9128q6956m5802k895J17840M6161
6005F35814L819o034K662k1267R07L6463m647j8829O8706Q4049l2834k0714L7827
$$ y = [583761, 666982, 769105, 739169, 631339, 583931, 629828, 705224, 723849, 670728, 682944, 724428, 756186, 773585, 705759, 604314, 582761, 600926, 738431, 885685, 789602, 623858, 666662, 711571, 723520, 718622, 761975, 746702, 720782, 722462, 810618, 814141, 714452, 722806, 744967, 767575, 786759, 828188, 830193, 852436, 900462, 900897, 930849, 1011678, 967913, 897194, 944243, 965326, 807604, 746408, 683172, 600109, 606955, 600353, 546725, 538075, 541667, 552393, 504223, 495994, 530499, 441596, 474961, 572932, 513550, 454757, 435910, 449911, 466041, 511899, 501941, 460214, 449277, 519580, 635757, 696594, 607466, 520510, 474708, 471813, 589653, 635814, 639633, 633599, 636261, 614994, 615901, 652364, 647717, 628888, 697594, 781643, 748809, 728095, 765922]
5992G65922m894j4752P4860O0271l9352j8010k346n3450j4376r9950k02224M6472
5980D98171N6651p3413n8489K0625p149p9100n39M9074p4300m6793K7997O3662
5968C76397p290l2587j8341j6838j6440M7219K3023K5230L0248q448q7723l1990
5956B82460L6241o4009l4573L6473J06361j7163l1475J4031n2075k3674M2279
5945B94876k9266j166O1444m2421n367k0327L890m7394n6789N31L5055J5011L6903
5932B44980k0705p0596J2017O711j2009p048K6713j9202K4685J4405l1690k295
5920A65966K2760j5180J6213j2569L0808N9890l8583k7272L4574q69m1812R656
5908B03582k394l3905K14K5894J7787M411L8186j7438j2009q6933j3721J6509
$$ y = [765922, 761028, 746276, 821136, 881407, 842055, 824045, 821699, 768249, 753873, 653923, 451699, 498171, 554822, 481409, 422920, 443545, 436396, 357296, 356757, 405831, 331531, 284738, 312735, 376397, 369107, 336520, 318179, 301341, 284901, 332120, 355143, 380373, 410621, 402173, 314450, 282460, 318701, 254692, 220119, 256592, 362953, 345790, 314315, 328346, 276271, 252597, 294876, 265610, 264444, 325888, 283467, 278100, 257773, 261663, 214269, 157480, 158011, 193066, 208077, 244980, 224275, 153679, 165696, 172407, 160398, 153350, 180063, 160861, 185546, 199951, 168261, 165966, 188726, 173546, 189759, 177190, 207998, 267888, 229305, 202033, 236607, 235738, 193926, 203582, 201188, 167283, 167497, 193391, 211178, 215589, 253775, 236337, 224328, 137395, 123674, 140183]
5896A40183O4906P796l9390p08M6158n2324k8070M0676Q446o3217J3591N9559
5884A97606O910n962J4015K2124q2177n27O2182k1109j2067J3498J4812j4341
5872A94964m765j8424p1995J2648K8878L2399P797L2346J802l4955j1366Q7356
5860B56685P719n7359k7454N4122K2188k3635k9668n853m4078k1234k1458O3704
5848A73679R7384O18k2596m522L3221q1862m115O8199J9196k7206K1633P6285
5836C49914q5217m5748o3480l5341O2607N0638N009K548K6929k0084m4544m8513
5824A54718P611L1379J7809j4364J06412m0673r4879L0506j535J6267k6299J4274
5812B01226O6042N617j4066N5701o4370k7318j8497k6956P5707J03361J920J9909
$$ y = [140183, 205089, 212885, 173495, 172787, 218945, 166621, 138551, 179227, 187673, 124456, 138047, 197606, 204516, 198554, 212569, 234693, 152516, 151989, 214171, 193062, 180995, 194493, 209305, 194964, 190199, 171775, 99780, 112428, 141306, 173705, 181502, 213848, 215650, 180695, 169329, 256685, 264404, 207045, 179591, 233713, 255901, 232266, 202598, 196745, 152667, 131433, 109975, 173679, 271063, 271681, 249085, 244563, 277784, 195922, 191807, 260006, 279202, 251996, 273629, 349914, 264697, 218949, 155469, 120128, 182735, 233373, 238382, 240930, 267859, 247775, 203231, 154718, 162329, 193708, 211517, 197153, 303565, 262892, 168013, 198519, 196984, 213251, 186952, 201226, 267268, 272885, 258819, 314520, 250150, 222832, 204335, 177379, 253086, 356447, 358367, 378276]
5800C78276L114p3733k3740L6513R4443J13540j0210P8192P5785k448k963j50852
5788E15917J5682J39971k5733p8268o399j8321q4788l2777M0375j8344p4894m3387
5776C29034L2294N4228m2840r4708n1646K0920j1748M939P9139p023m4520q164
5764B59905p214k0930l1800j07320P7312N5142O9639m8198o0444j5651j8030L6767
5752A89178M6577j0474k7456L1881L1364J3007k5332l2741l2257L1083P2274p3554
5740B13550J9447M2055j06222n4117K9730P9423L900n3839k9067O1591K7081J11
5728B33643J4820r829N232o083j830m8375k8622K1076J654J0053O8424K0193j66298
5715A14058j9349J04651J3273j4458j4677n6415K9452M9332N6951L2166j3170
$$ y = [378276, 381390, 307657, 283917, 320430, 414873, 528413, 518203, 596395, 672180, 669732, 666769, 515917, 531599, 671570, 645837, 567569, 561170, 542849, 458061, 425284, 465659, 447315, 372421, 329034, 361328, 415556, 372716, 278008, 226362, 247282, 235534, 240473, 319612, 312589, 268069, 259905, 252691, 231761, 199961, 92641, 169953, 225095, 294734, 246536, 186092, 170441, 152411, 189178, 235755, 225281, 197825, 229706, 261070, 274077, 248745, 216004, 183747, 214830, 287104, 213550, 232997, 275052, 168830, 114713, 144443, 223866, 227766, 173927, 144860, 206451, 233532, 233643, 248463, 238634, 243866, 237783, 235953, 187578, 158956, 180032, 181686, 191739, 260163, 280356, 114058, 94709, 199360, 212633, 198175, 183498, 127083, 156535, 205867, 262818, 294984, 281814]
5704B81814o1686j14369K2477M9924L9148N6371N627l2916N941l71j2936l7446
5692B01578l9857K0074p278J2812J8776k9518n0118O8053P7218L89o9081q8895
5680A14153q64Q4237N3687K2871k4876n6605j4026M1460L3721j8816m6128l1567
5668A57247M0685J8747J9960K5888l8593j08861R848Q3385K5746J230l0819K3439
5656B27902o3774m9728O1627J6497p3146P3755L5730n814L3102o495o8164k6476
5644A55016O9694l0102k3181j5030J573j547K9504M3559o6583o4107r628M2348
5632A31516J05375L249p8030m6998j6013O0274M1133l2749K1273m2835m7543L9853
5620A38505K603q0874J2612O2524K8465j3227l4555k374j3927j2571P8182j0037
$$ y = [281814, 220128, 105759, 128236, 178160, 217308, 273679, 279306, 246390, 252331, 251960, 239024, 201578, 161721, 181795, 174517, 187329, 206105, 176587, 126469, 194522, 271740, 272129, 203048, 114153, 113289, 197526, 251213, 274084, 249208, 192603, 178577, 220037, 253758, 234942, 188814, 157247, 197932, 216679, 236639, 262527, 223934, 115073, 124921, 208306, 234052, 235282, 204463, 227902, 164128, 114400, 176027, 192524, 119378, 193133, 228863, 223049, 256151, 249656, 181492, 155016, 224710, 194608, 171427, 156397, 157970, 156423, 185927, 229486, 162903, 98796, 89168, 131516, 236891, 240140, 162110, 115112, 99099, 159373, 200506, 167757, 189030, 146195, 98652, 138505, 141108, 60234, 72846, 135370, 163835, 150608, 116053, 113679, 99752, 87181, 165363, 155326]
5608A55326k7227K564k6039L1324N0981l3284P46k4158m7504L6782M6247Q3319
5596B49077j112q2349k6532J3824m9992J5973J27208K1539j06850m4697K9820
5585A45909L507p247K3139O795P163r398J7002k3455j6439J1613o27N3005j1877
5572A99090q6736j6761o145K7557L4965j5743j9173j4157q658j3951N1530l8707
5560I3111J371L5859m24M4311j3373k0343k8146j4982L5775j3481k9432Q9587
5548A79833j6907l149L2993k8705L8918N6045K125m7970o7851k4500Q1640l7808
5536A64664k6843P7117q956o9564m817J8209L9633K9288n3156K8923j6999n7818
5524A19681L5320Q2703O9072m2545j06858J9506R5326n466l3916J0533l3720r89
$$ y = [155326, 128099, 130663, 104624, 135948, 186929, 153645, 154391, 130233, 82729, 119511, 165758, 249077, 247965, 165616, 139084, 152908, 102916, 118889, 246097, 267636, 160786, 116089, 145909, 149416, 142169, 165308, 172103, 179266, 169868, 186870, 163415, 146976, 158589, 157962, 210967, 199090, 112354, 95593, 89448, 117005, 151970, 136227, 117054, 102897, 94239, 80288, 131818, 93111, 94482, 130341, 129917, 174228, 160855, 140512, 112366, 97384, 133159, 119678, 90246, 179833, 162926, 159777, 192770, 164065, 202983, 259028, 261153, 213183, 145332, 120832, 202472, 164664, 137821, 214938, 205982, 136418, 131601, 149810, 189443, 218731, 165575, 194498, 177499, 119681, 155001, 237704, 306776, 264231, 157373, 176879, 272205, 266739, 232823, 243356, 209636, 208647]
5512B08647m1439k5882M3170Q821N5147M4483k7852k2480o9165p8920L6161P6275
5500B06966K3405k946M6035R984o9525l4335M7639L8327m221m4759k716N9373
5488B73227O6370l2843n2273j6242o3387j9244P7046J29539l144o8445M301j2964
5476B81941J6502j3860o1832K7156N8941K2316j0382J8804K3333o3894j0474M4306
5464C32857L2328j8157L2056O7388L3370m7739n4639L5546M6788J9328K1109N635
5452E05870L3457L181k8920k3931M5321Q3111n3094q844Q7532K8151N102O7903
5440G44839J7983l1403J1430P9904J08430M5641K8439P509L2867P6237J30541
5429A252417L1604N4979J45005J03547J21537O7482m7603j0972J34900J10487
$$ y = [208647, 167208, 141326, 184496, 193317, 248464, 292947, 265095, 242615, 173450, 94530, 130691, 206966, 230371, 227425, 273460, 283444, 213919, 179584, 227223, 265550, 261329, 216570, 213854, 273227, 339597, 306754, 254481, 238239, 174852, 155608, 232654, 362193, 359049, 290604, 294905, 281941, 298443, 284583, 222751, 249907, 308848, 331164, 320782, 339586, 362919, 299025, 288551, 332857, 365185, 347028, 379084, 446472, 479842, 432103, 377464, 413010, 459798, 479126, 500235, 505870, 539327, 542508, 513588, 489657, 534978, 618089, 564995, 556151, 643683, 671834, 676936, 744839, 762822, 731419, 742849, 822753, 931183, 976824, 1005263, 1012772, 1045639, 1121876, 1252417, 1284021, 1339000, 1484005, 1587552, 1709089, 1776571, 1728968, 1717996, 1852896, 1963383]
5419A963383L027n2271q427q3658n6224O6382M7272j34919j19253m6605m6371
5408A532336n5956n9790r5960p8173m7898j00993q4778k2354m0215m4643J0161
5397I11737J1497j3587l707p4665J0068p2286k2726P9141Q344L9512o1211j00688
5385G11429k4542Q3515r202o1102o388M8890O4252m5384J6798Q5729n5026l3022
5373G75947M1408O7692O682q1760o780J4067J3453n6380J9663Q7822L2165m0482
5361H73497o2274R1688N9771K2227M0404P511j19900l1192J029m0673j02576l2025
5349G07487l5116J6425L6574M137k8985j9695N1381k0628l200l0814J377L1920
5337G10863N1430k3471k9715m1217j3984J6664K602K0782n61o3380J2530N4165
$$ y = [1963383, 1966410, 1914139, 1905712, 1822054, 1765830, 1832212, 1879484, 1744565, 1625312, 1578707, 1532336, 1476380, 1416590, 1320630, 1242457, 1194559, 1093566, 1008788, 986434, 946219, 901576, 911737, 923234, 909647, 905940, 831275, 841343, 769057, 746331, 825472, 833816, 873328, 812117, 711429, 686887, 770402, 761200, 700098, 693710, 742600, 806852, 761468, 778266, 863995, 808969, 775947, 817355, 885047, 891729, 809969, 803189, 817256, 830709, 774329, 793992, 881814, 913979, 873497, 811223, 902911, 962682, 984909, 1025313, 1032824, 912924, 881732, 882761, 842088, 739512, 707487, 672371, 688796, 725370, 729507, 700522, 680827, 732208, 711580, 708380, 677566, 678943, 710863, 762293, 738822, 709107, 667890, 653906, 670570, 673172, 693954, 693393, 630013, 642543, 696708]
5325F96708K484J4209j5260n0151J0842j0890O632K0802j0741O4258M3563p1053
5313G01403m5109J8803l5110M4485J15045j4450p5874j1778N3658J218k4693M1958
5301G69556Q351j2701K0819K7042N9493K9940m1693l9723J0637K5495J2348P2082
5289I41646K5067l5110p3102O9889k893m7199l0395L6660Q015O9190J08861j8871
5277A051758r9555l2790R9087L6096j3875j1238M4400M0894N5500N6492k852l4176
5265A189741L1611K8654J16222L8531m506l074n4744P4135K7329L4134J2940k5211
5253A465762k6760K9519K552r0194j9235N3913L4109m622O277l5202L4299J0958
5241A461376K2099j9674j0926j7749k0599M4831P7131o5383r7822o6323O0698
$$ y = [696708, 699192, 713401, 698141, 647990, 658832, 647942, 654574, 675376, 664635, 728893, 772456, 701403, 656294, 675097, 639987, 684472, 799517, 785067, 709193, 697415, 751073, 752291, 727598, 769556, 777907, 765206, 786025, 813067, 872560, 902500, 860807, 821084, 831721, 857216, 869564, 941646, 966713, 931603, 858501, 928390, 925497, 878298, 847903, 884563, 892578, 961768, 1070629, 1051758, 952203, 919413, 1018500, 1054596, 1040721, 1029483, 1073883, 1114777, 1170277, 1226769, 1223917, 1189741, 1221352, 1250006, 1366228, 1404759, 1400253, 1397179, 1342435, 1416570, 1443899, 1478033, 1490973, 1465762, 1439002, 1468521, 1471073, 1380879, 1361644, 1415557, 1449666, 1445044, 1451321, 1416119, 1450418, 1461376, 1483475, 1463801, 1452875, 1435126, 1414527, 1459358, 1536489, 1471106, 1373284, 1306961, 1367659]
5230A367659j5254m7837P8807L8925r2557n9451J2431l699l5050k5188P2911Q7484
5218A379181k1776j18671q878N5173k4358o3591N0169J29812J0399o1996K5257
5207A350721M1582q9450m5595P1205O518R734l2435P634P938q645o6035L0647
5195A283819P6452l1192l2259L9447L7146k79k7135K4869L3785M4273K1423J5516
5183A485865K8275K019O4909M3267M1248Q932M9131R1761L4992L1314p4222r6553
5171A710938k8226l4292K5384J913m6716n441M2854L5240k144o9464n525M8685
5159A673206j0250j2297J951L9437J1547j7788m730N3367J1273k2915J4555N9893
5147A797249Q4372M1194m3287j8933M0820Q402p314R7658J01200K7557N499M6355
$$ y = [1367659, 1352405, 1304568, 1383375, 1422300, 1329743, 1270292, 1282723, 1279024, 1243974, 1218786, 1291697, 1379181, 1357405, 1238734, 1229856, 1285029, 1260671, 1197080, 1247249, 1377061, 1387460, 1325464, 1350721, 1392303, 1302853, 1257258, 1328463, 1334981, 1344715, 1312280, 1319914, 1327852, 1319207, 1253172, 1283819, 1360271, 1329079, 1296820, 1336267, 1373413, 1373134, 1345999, 1370868, 1404653, 1448926, 1470349, 1485865, 1514140, 1516159, 1581068, 1624335, 1665583, 1674515, 1723646, 1815407, 1850399, 1881713, 1807491, 1710938, 1682712, 1648420, 1673804, 1675717, 1629001, 1623560, 1666414, 1701654, 1699510, 1630046, 1624521, 1673206, 1662956, 1650659, 1652610, 1692047, 1703594, 1685806, 1681076, 1734443, 1745716, 1722801, 1737356, 1797249, 1881621, 1922815, 1879528, 1860595, 1901415, 1909817, 1902503, 2000161, 2101361, 2128918, 2134417, 2180772]
5135B180772N4884K7760K3676J4469P5669N6709R324K7363J6657J502j9115o6668
5123B403002o4935p0549q7010K604J06895L6295q9576r5762M4371P374N927N761
5111B204397J07683R8076O254k9276j5307R415K7575m1865Q528J48979J8096l2110
5099B510445M7131O9318l8696J0726L9107J22342o3m5326R4633O2527n7064j428
5087B813652M1778P4444N2221K2860N6655P3441R69o9249k8293K513N8197J8491
5075C117679M1811P7285j8237m0198M17J27407O2645J1978J7943Q8977Q8623M3754
5063C620084L1098Q9964O7056R09Q0006J70736J53551K0783M1610R9174J15751
5052D490722M7686R6597L0403P5386J18706P6534K5456J15465K413m961Q6864
$$ y = [2180772, 2235656, 2263416, 2287092, 2301561, 2377230, 2433939, 2443263, 2470626, 2487283, 2488785, 2469670, 2403002, 2338067, 2267518, 2180508, 2183112, 2290007, 2326302, 2236726, 2140964, 2185335, 2192709, 2198636, 2204397, 2312080, 2410156, 2416410, 2387134, 2371827, 2381242, 2408817, 2366952, 2375480, 2524459, 2542555, 2510445, 2557576, 2626894, 2588198, 2598924, 2638031, 2760373, 2760310, 2714984, 2809617, 2872144, 2815080, 2813652, 2855430, 2929874, 2982095, 3004955, 3061610, 3135051, 3136020, 3066771, 3038478, 3040991, 3099188, 3117679, 3159490, 3236775, 3218538, 3178340, 3178757, 3306164, 3368809, 3380787, 3398730, 3487707, 3576330, 3620084, 3651182, 3741146, 3808202, 3809111, 3889117, 4059853, 4213404, 4234187, 4275797, 4374971, 4490722, 4538408, 4635005, 4665408, 4740794, 4859500, 4936034, 4961490, 5076955, 5079368, 5074407, 5161271]
5041E161271J54638N3959Q2916O5735O4891O6127Q9847J03931N4012J28310J03127
5030F128764J43391J03836Q5637P4551P5480J64666J84022J10708Q7354J63362
5020G321771J65257J33275J13273J52081J50313N2022P8881R9768P7844J06880
5010H451365N6820N3637K16009J94910J31750J42412K12801K21184J89859J57784
5000A0028531K17478J52200J77687K55822K03785J89798J72274J06862K07819
4991A1712256K73354K13259K11427K12769K87669J97276J69916K29552K17608
4982A3725086K97550K71144K57008L17992K89440K77892K50065L08012K96267
4973A6290456L16374L37891L51966L35959K54375K36494L24519L05331K69183
$$ y = [5161271, 5315909, 5369868, 5452784, 5518519, 5583410, 5649537, 5739384, 5843315, 5897327, 6025637, 6128764, 6272155, 6375991, 6461628, 6536179, 6611659, 6776325, 6960347, 7071055, 7158409, 7321771, 7487028, 7620303, 7733576, 7885657, 8035970, 8087992, 8166873, 8266641, 8344485, 8451365, 8508185, 8561822, 8777831, 8972741, 9104491, 9246903, 9459704, 9680888, 9870747, 10028531, 10246009, 10398209, 10575896, 10831718, 11035503, 11225301, 11397575, 11504437, 11712256, 11985610, 12198869, 12410296, 12623065, 12910734, 13108010, 13277926, 13507478, 13725086, 14022636, 14293780, 14550788, 14868780, 15158220, 15436112, 15686177, 15994189, 16290456, 16606830, 16944721, 17296687, 17632646, 17887021, 18123515, 18448034, 18753365, 19022548]
4964A9022548K79613L01298L53774L15447L57331M05332K46321L08804M37044
4955B2027512M33043M65430L86521L67968M08676N02967M02501M85435N19379
4946B5999432N40463N27320O74910O81300P12485P75625Q12594P90473Q62524
4937C2377126R01863R64678R20710R34532J041650J012612J087464J109233J158548
4928D1508416J144238J275630J422240J559347J655420J827635K105943K251358
4920E4750227K538183K814848L012227L363597L647176M105103M604715N058591
4912H3894667N662328O318040P054844P754094Q352375Q788497R061621Q993136
4904A45879602Q856577Q500729P962562P088909N753051M252254K248812N8028
$$ y = [19022548, 19302161, 19603459, 19957233, 20272680, 20630011, 21035343, 21281664, 21590468, 22027512, 22460555, 22925985, 23312506, 23680474, 24089150, 24592117, 24994618, 25480053, 25999432, 26539895, 27067215, 27742125, 28423425, 29135910, 29911535, 30724129, 31514602, 32377126, 33278989, 34243667, 35164377, 36098909, 37140559, 38153171, 39240635, 40349868, 41508416, 42652654, 43928284, 45350524, 46909871, 48565291, 50392926, 52498869, 54750227, 57288410, 60103258, 63115485, 66479082, 70126258, 74231361, 78836076, 83894667, 89556995, 95875035, 102929879, 110683973, 119036348, 127824845, 136886466, 145879602, 154736179, 163236908, 171199470, 178288379, 184041430, 188293684, 190542496, 190600524]
4896A90600524k084364l774980n058991n782651o398725p115155p563146p936050
4888A44886462q218209q222923q100294p797280p555282p017091o378614n869089
4880H5727680n289635m668998m200492l797601l373867l048182k759418k469714
4872E6119773k375212k159289j916344j726280j600744j460875j265438j145706
4864D2469885j126509r49063q88510r76995j016901r95893r27427q88566r80357
4855C3719664r13633p99944q38607p83613q38346q81198p61314p09372p65844
4846B6427793o20250o14573o10126n50444m47449m87386n02755m02153k40464
4837B1952193l56996l99628l44061l34663k86443k46688k87253k79228k52180
$$ y = [190600524, 188516160, 184741180, 179682189, 173899538, 167500813, 160385658, 152822512, 144886462, 136668253, 128445330, 120345036, 112547756, 104992474, 97975383, 91596769, 85727680, 80438045, 75769047, 71568555, 67770954, 64397087, 61348905, 58589487, 56119773, 53744561, 51585272, 49668928, 47942648, 46341904, 44881029, 43615591, 42469885, 41343376, 40394313, 39505803, 38528808, 37511907, 36516014, 35588587, 34700021, 33719664, 32806031, 32006087, 31167480, 30383867, 29545521, 28664323, 27903009, 27193637, 26427793, 25807543, 25192970, 24582844, 24032400, 23584951, 23097565, 22594810, 22192657, 21952193, 21595197, 21195569, 20851508, 20516845, 20230402, 19983714, 19696461, 19417233, 19165053]
4828A9165053k92036j74103k11641k82832l05546k76437k47508k04529k73159
4819A6897262k78143k19395k07694j82608j89708k18095k20672k08292j89713
4810A4982942j05121j31928j84031j23789o0658j49661k08003j63775o9168p7113
4800A3709695j39378j33178j00163j69351j32626j06353j25635j14374j41415
4791A2547222q8404j44266j94871r4978p8301r2860o2514r1319j16187p5427l4676
4780A1473419l132n4717q9247m6435n2156m1935m5502j48513j02435p554o2434
4769A0819359o7820j18370j60965m5646p6290j9749q3515j71455j08565l5225
4759I931759K8969k4012j34454j07864n3174q455p1454j14202j32385j16139p0061
$$ y = [19165053, 18873017, 18698914, 18487273, 18204441, 17898895, 17622458, 17374950, 17170421, 16897262, 16619119, 16399724, 16192030, 16009422, 15819714, 15601619, 15380947, 15172655, 14982942, 14877821, 14745893, 14561862, 14438073, 14377415, 14227754, 14019751, 13855976, 13786808, 13709695, 13570317, 13437139, 13336976, 13167625, 13034999, 12928646, 12803011, 12688637, 12547222, 12458818, 12314552, 12119681, 12024703, 11946402, 11853542, 11791028, 11699709, 11583522, 11508095, 11473419, 11470287, 11415570, 11326323, 11279888, 11227732, 11185797, 11140295, 10991782, 10889347, 10881793, 10819359, 10751539, 10633169, 10472204, 10426558, 10350268, 10330519, 10247004, 10075549, 9966984, 9931759, 9960728, 9936716, 9802262, 9694398, 9641224, 9632769, 9561315, 9447113, 9314728, 9198589, 9128528]
4748I128528q1551q9264j13595j12205j02595p1252j68081j59009j28767q6444
4738H015765j13427j58739j53879j08406j25184j55513j45074j02284p2675r4791
4728F785793q9883m3205n7986j92611j49387j25769k5192p0897j21020k7645o8291
4717E813907j15441j11450n4064r2082q6473r8432L373p6111r8015l1903p2424
4706D980885j11696n1370j03489k3461L7261p8957r1331o2128n5994r671p2274
4695D357775p4680j00761o4351P5587J078j14996r8510n7j3394L7341k1084o6556
4683C917392j06837o2598L8726j1084p0682r9290o9881N4822R9938J6724j54064
4672C553166n0606j0480J990J0399N6713R252j31195j2828L5399N0598j2080m8280
$$ y = [9128528, 9046977, 8957713, 8844118, 8731913, 8629318, 8558066, 8389985, 8230976, 8102209, 8015765, 7902338, 7743599, 7589720, 7481314, 7356130, 7200617, 7055543, 6953259, 6880584, 6785793, 6695910, 6652705, 6594719, 6402108, 6252721, 6126952, 6101760, 6030863, 5909843, 5882198, 5813907, 5698466, 5587016, 5532952, 5440870, 5354397, 5255965, 5259338, 5183227, 5085212, 5053309, 4980885, 4869189, 4817819, 4714330, 4690869, 4728130, 4649173, 4557842, 4495714, 4439720, 4430049, 4357775, 4283095, 4182334, 4117983, 4193570, 4194648, 4079652, 3981142, 3981085, 3967691, 4005032, 3983948, 3917392, 3810555, 3747957, 3786683, 3775599, 3704917, 3605627, 3535746, 3590568, 3690506, 3707230, 3553166, 3502560, 3492080, 3494070, 3504469, 3561182, 3570434, 3439239, 3426411, 3461810, 3512408, 3500328, 3452048]
4660C452048l1215J1130N840L9923K5980r43m1229l1760j5179J3857L8601n9653
4648C407400O219J10211n6275l9219n7645p9564M768N9686M3675j9897L7676j02476
4636C314559r2714J1338J3561n3741K3599l4357M9210M2671m57p8093n6062k6737
4624C112777l8353J13010j8306o316o383l7980p424J1515n5219j9300k3287l1441
4612B993293L2115O4511j0699n2219n1871Q615R3119J7768K8615j4840m5595o1005
4600C001807M7824M4428m7220l7703N1953N5625J4766N6900j22259j02137M8098
4589C012082M2521K5355K3645n9787m9311J2394N4586p4888j12983q504J29382
4578B994492L8519m9586K8435n5867n0777m5068L7975Q082k925j06N3194K2010
$$ y = [3452048, 3420833, 3431963, 3437803, 3477726, 3503706, 3502763, 3461534, 3429774, 3414595, 3428452, 3467053, 3407400, 3413619, 3523830, 3467555, 3428336, 3370691, 3291127, 3295895, 3355581, 3399256, 3379359, 3417035, 3314559, 3221845, 3233183, 3246744, 3193003, 3216602, 3182245, 3231455, 3274126, 3273669, 3195576, 3139514, 3112777, 3074424, 3187434, 3169128, 3162812, 3156429, 3118449, 3111025, 3122540, 3067321, 3048021, 3024734, 2993293, 3025408, 3089919, 3079220, 3027001, 2975130, 2983745, 3076864, 3094632, 3123247, 3108407, 3062812, 3001807, 3049631, 3094059, 3046839, 3009136, 3061089, 3116714, 3131480, 3188380, 3066121, 2963984, 3012082, 3054603, 3079958, 3103603, 3043816, 2994505, 3006899, 3061485, 2986597, 2873614, 2865110, 2994492, 3033011, 2983425, 3011860, 2955993, 2905216, 2860148, 2898123, 2906205, 2903280, 2903174, 2956368, 2978378]
4566B978378m4197q07K6883l7257o5866M5041J47662J13023K4711l654r0445l6065
4554C057407P9943N2311q806k2918L6697O3822Q9571J3809r7008l2706M4988J68357
4542C445467K1595n4975k97N6818J9718P6069L7397J6311k6921j3788J40929R6144
4530C814467o600n6665L4182J27941K3539n5667k889j1735J8133P8677P2333n7434
4518C978282K528m053P9746Q4201k3788l2333M3884J06262J09685P4903M0873
4507D460190N2899M3832M3289J21728J34197J00706J02150J15929J18458J18268
4497E411646Q2047P3428R1092N6017O5332J19289J87174J70345O3434J08022J27106
4486F554932K00490K37000J68537J54135K34284K79446L18411K96218K20161K99950
$$ y = [2978378, 2934181, 2933374, 2960257, 2923000, 2857134, 2902175, 3049837, 3162860, 3187571, 3183917, 3093472, 3057407, 3137350, 3189661, 3180855, 3157937, 3194634, 3258456, 3348027, 3361836, 3264828, 3232122, 3277110, 3445467, 3467062, 3412087, 3411790, 3468608, 3488326, 3564395, 3601792, 3618103, 3591182, 3577394, 3718323, 3814467, 3807867, 3751202, 3785384, 3913325, 3936864, 3881197, 3878308, 3866573, 3884706, 3963383, 4035716, 3978282, 3980810, 3976757, 4056503, 4140704, 4116916, 4084583, 4128467, 4234729, 4344414, 4419317, 4460190, 4513089, 4556921, 4600210, 4721938, 4856135, 4956841, 5058991, 5174920, 5293378, 5411646, 5493693, 5567121, 5658213, 5714230, 5779562, 5898851, 6086025, 6256370, 6319804, 6427826, 6554932, 6755422, 6992422, 7160959, 7315094, 7549378, 7828824, 8147235, 8443453, 8663614, 8963564]
4476H963564L47801M45719M77892L88000L20570L51840M21892M02724M10602L45505
4466A2876109M23069M60816N20508N99181N61695M93198N05610N59228N92197
4457A7591611O03385O03452P35875Q21735Q61145R95326J155326J440167J708483
4448B6516505J875715K161474K411535K438872K062093J297037L32552k64469
4440C8831314p08712q82926o98821n71780n80261n10285n32317l97624k37509
4431C3711079Q5727L90200O92342R64606J196779J552083K013015K354898K715705
4422D5676434L280618L705456L794871L655725L409365K844179K038587J347426
4414F9752661Q99738N57263L18251M08646O66795Q67368J124920J354621J492854
$$ y = [8963564, 9311365, 9757084, 10234976, 10622976, 10943546, 11295386, 11717278, 12120002, 12530604, 12876109, 13299178, 13759994, 14280502, 14879683, 15441378, 15934576, 16440186, 16999414, 17591611, 18194996, 18798448, 19534323, 20356058, 21217203, 22212529, 23367855, 24808022, 26516505, 28392220, 30553694, 32965229, 35404101, 37466194, 38763231, 39095783, 38831314, 38122602, 37239676, 36540855, 35969075, 35388814, 34878529, 34346212, 33948588, 33711079, 33796806, 34187006, 34879348, 35843954, 37040733, 38592816, 40605831, 42960729, 45676434, 48957052, 52662508, 56457379, 60113104, 63522469, 66366648, 68405235, 69752661, 70652399, 71209662, 71527913, 71936559, 72603354, 73470722, 74595642, 75950263, 77443117]
4405G7443117J643333J623900J472459J377488J373006J378090J269219J185667
4397H8766279J077035P80389L41105j58055o01516j144134j684108k202573k532226
4388H2642196k645382k800697k776258k671279k596554k651160k669207k585988
4380F1245671k600020k746756k687712k609285k468520k304262k173937k124594
4372D1530585k131131k026513k002929k050374k047031j925305j856621j745819
4364B5744862j463932j228036j114791j112376r93008o80430o71824o62450n56516
4355A7261499n57907m17154k40471k39441l16693k64908l16525k14820k58112
4346A4435468l11256l62064l42435k68441k15604k10875j87187k85189k47221
$$ y = [77443117, 79086450, 80710350, 82182809, 83560297, 84933303, 86311393, 87580612, 88766279, 89843314, 90623703, 90964808, 90806753, 90205237, 89061103, 87376995, 85174422, 82642196, 79996814, 77196117, 74419859, 71748580, 69152026, 66500866, 63831659, 61245671, 58645651, 55898895, 53211183, 50601898, 48133378, 45829116, 43655179, 41530585, 39399454, 37372941, 35370012, 33319638, 31272607, 29347302, 27490681, 25744862, 24280930, 23052894, 21938103, 20825727, 19832719, 19152289, 18480465, 17818015, 17261499, 16703592, 16286438, 16045967, 15806526, 15489833, 15224925, 14908400, 14693580, 14435468, 14124212, 13762148, 13419713, 13151272, 12935668, 12724793, 12537606, 12252417, 12005196]
4337A2005196j39935j86828k43537j76763j68883k50468j25672j29524k46289
4328A0337297l04747k71502k65807l51189l48919l28677l88972l82635l91782
4319G303067k61884k31362l00661l01654k76920j41420k49683k67723k29588k40797
4309D801375k35100j67190j00079o0808k09805k09022r8947m2573o0399j48042
4299C469410q9477j60075o4602o1569k3406q8053q9278m7407o3852k2652n5243
4288B703796j96899j37385p05K8949k0173q6221j03193j06579j01313P3973O8385
4277B122635j24748j25893l3795k3383K0689l3708p3018l5440j14793n795L1109
4266A603860j3557o5899l6322N1017m793n0747l9957j9131n8481k8009K9835m9264
$$ y = [12005196, 11865261, 11678433, 11434896, 11258133, 11089250, 10838782, 10713110, 10583586, 10337297, 10032550, 9761048, 9495241, 9144052, 8795133, 8466456, 8077484, 7694849, 7303067, 7041183, 6809821, 6509160, 6207506, 5930586, 5789166, 5539483, 5271760, 5042172, 4801375, 4566275, 4399085, 4299006, 4238198, 4028393, 3819371, 3720424, 3677851, 3617452, 3469410, 3379933, 3219858, 3155256, 3093687, 3070281, 2982228, 2892950, 2845543, 2781691, 2759039, 2703796, 2506897, 2369512, 2368807, 2397756, 2377583, 2291362, 2188169, 2081590, 1980277, 2054250, 2122635, 1997887, 1871994, 1838199, 1814816, 1835505, 1801797, 1728779, 1693339, 1578546, 1572751, 1603860, 1590303, 1524404, 1488082, 1539099, 1534306, 1483559, 1443602, 1424471, 1365990, 1337981, 1367816, 1318552]
4254A318552m683k9185k5070N2739K8774k505o9861q7086q752p058n2364L2283
4242A145784j467o7895l7510L6884M6789q154j15512M283Q3202R173k8015n856
4230A061706k0879m6106j4201J3276M4653o1341o9989n107L4172m336m9477l2182
4218H50189m0768L4640N7621L5300r5887k7977p38J210Q99n16r083m7359j6723
4205G40808J8392R8865p920m1313j2533J9130k316J7645M715l7544l4541N6740
4193H20128j9495O926j7399J0046J0623N9689Q3089n6754q6248o4858k6624J79
4181G19302Q7570K1524n5831k8102j2744m421O1716m334K5712n015o455R655K1023
4168H29600J6374o2881n1861K1918O7220j8063l7384L6542M1939n7585j7761M4435
$$ y = [1318552, 1313869, 1284684, 1259614, 1312353, 1341127, 1338622, 1268761, 1181675, 1172923, 1165865, 1113501, 1145784, 1144317, 1076422, 1038912, 1075796, 1122585, 1114431, 998919, 1003202, 1086404, 1095577, 1067562, 1061706, 1040827, 994721, 980520, 993796, 1038449, 977108, 907119, 902012, 936184, 931848, 882371, 850189, 809421, 844061, 901682, 936982, 841095, 813118, 812380, 813590, 814489, 813973, 804890, 757531, 740808, 759200, 858065, 850145, 808832, 796299, 815429, 813113, 830758, 835473, 797929, 763388, 820128, 800633, 807559, 790160, 800206, 810829, 870518, 953607, 896853, 810605, 745747, 719123, 719302, 806872, 828396, 772565, 744463, 731719, 727298, 789014, 784680, 810392, 805377, 798922, 808577, 829600, 845974, 783093, 731232, 753150, 820370, 802307, 764923, 801465, 843404, 785819, 768058, 812493]
4156H12493m9457n1764J7368R1683L884p9097m1982L5235J5414M4872R9302M9982
4144I47933J5744k9776m828q972m7796p2973K4289N0413Q7410J759o2134j9975
4132H81094j8j03994K8138Q2641N6223J8358m3695K5678M8438n5004p7212J3013
4120H73660L5018M0167J7918M1564l34q8664j23465P5564O419l3003j3261j680
4108H29903M280N9689N3222n4147j04049l9287N9746R9708O5577P456n1865o9659
4096H60574m476J1371O9386k2257m263l7111n489O8123k8651r4070k6529Q976
4084G95584L4290J5887N5035k1433m661K2171J1398Q995j0073k1723k5800O6216
4072I25886J21095K503r1330j3974L9359l5068M5575L2342k9117l1374p3221L8345
$$ y = [812493, 763036, 711272, 728640, 820323, 824207, 745110, 703128, 738363, 753777, 798649, 897951, 947933, 963677, 933901, 929073, 920101, 872305, 799332, 823621, 874034, 961444, 963203, 901069, 881094, 881076, 777082, 805220, 887861, 944084, 962442, 918747, 944425, 992863, 937859, 860647, 873660, 908678, 948845, 966763, 1008327, 1007993, 919329, 795864, 871428, 877847, 844844, 831583, 829903, 834183, 893872, 947094, 892947, 788898, 749611, 809357, 909065, 974642, 982098, 930233, 860574, 856098, 867469, 936855, 914598, 910335, 873224, 867735, 935858, 907207, 813137, 786608, 795584, 829874, 845761, 900796, 879363, 874702, 896873, 908271, 917266, 907193, 885470, 859670, 925886, 1046981, 1049484, 958154, 944180, 983539, 948471, 994046, 1026388, 997271, 965897, 892676, 931021]
4060I31021K1683o2657j3851J2254j3720R7630K5480m2489R172P256M9495k3386
4048I97888j9839L6911k4353M2227L3507L8196m1053p0015p1069L2643Q2271j006
4036A036308M598j2906o8414j1849N3414J9056j9018k0691k8926J2109k7115K8879
4024I65445n2415m5885J9283L8539j0310j7634n2171k5735L916n4326M5943k5421
4012G89229q9134j6694n396J6484J4738j8241j02480K222k3414K5788k9533p0191
4000D93378L6968o679J431j5467o0576n900L1046M7905N4236j6392k7543o9950
3988D62457n398o3348M8220M5280j0369k6246l6753P029J5110o3655k9536M6578
3976C89369J101l7700K7845O1510j3215j30000N456M8475L3576j8562o2327q009
$$ y = [931021, 952704, 890047, 876196, 888450, 874730, 972360, 997840, 955351, 964523, 971779, 1021274, 997888, 978049, 1014960, 990607, 1032834, 1066341, 1104537, 1063484, 993469, 922400, 955043, 1037314, 1036308, 1040906, 1028000, 959586, 947737, 1001151, 1020207, 1001189, 980498, 951572, 963681, 936566, 965445, 913030, 867145, 886428, 924967, 914657, 897023, 844852, 819117, 823033, 768707, 814650, 789229, 700095, 683401, 678005, 694489, 709227, 690986, 588506, 590728, 567314, 593102, 563569, 493378, 530346, 523667, 525098, 509631, 449055, 443155, 474201, 522106, 576342, 559950, 532407, 462457, 457059, 393711, 441931, 487211, 476842, 450596, 413843, 420872, 435982, 372327, 342791, 389369, 390470, 352770, 380615, 442125, 428910, 298910, 304366, 352841, 386417, 367855, 305528, 297519]
3964B97519P0039N1910n2432n1167n1505J499O0493L2291j1872k4850p972J4383
3952C28336J1283n0420n1260k7376K8995R9019k6186j8130j6902n8746j0200L9775
3940B48188M0861j0368l8933Q163N6653m8695p3442j6644N9606j5873j9401J6985
3928B07100M2573o028m5517J1000L9435J3900M996j4334r249P515R976J3138m3000
3915B31505r347J5827M2080K3674m3335p6972K6987O8795l9395K4600n565n0180
3903B08674k0910J4206K2021k818o3714q0302O9298P9433q645l939N33r9783J1479
3890A25533O4943P531k1266R233j6796N2837K3792m939o5733p9513L9295P0775
3878B05692m6481L8971K8870p4644J1644L2844K8521j0757l5202l6078K8239P7204
$$ y = [297519, 367558, 419468, 367036, 315869, 264364, 265863, 326356, 358647, 346775, 321925, 313953, 328336, 339619, 289199, 237939, 210563, 239558, 338577, 312391, 294261, 277359, 218613, 208413, 248188, 289049, 278681, 239748, 247911, 304564, 255869, 182427, 165783, 225389, 209516, 190115, 207100, 249673, 243645, 198128, 209128, 248563, 262463, 267459, 253125, 243876, 251391, 261367, 274505, 231505, 222158, 237985, 280065, 303739, 260404, 183432, 210419, 279214, 239819, 264419, 258854, 208674, 187764, 201970, 223991, 221173, 157459, 77157, 146455, 225888, 217243, 213304, 213837, 114054, 125533, 190476, 198007, 176741, 185974, 169178, 222015, 245807, 240868, 175135, 95622, 134917, 205692, 159211, 198182, 227052, 152408, 164052, 196896, 225417, 214660, 179458, 143380, 171619, 248823]
3866B48823k9536p3359L7990Q362j1732K3794L4389m7291o0980K5173K5323J6715
3854A97671o723j5197o8090q888L0716j4706L798j2443N2571K4526j671P291p610
3841A81245j0126k7829j5101O1955K7911k4836j7989J7131J1602k0778k0210M123
3829A67098l6542J3580Q2852O1272k2317m3293j8072J4851O7655l404K5592p245
3817C02027j8628l4092Q990L937L7169J5255r7642M9552O7629l6542j3061J125
3805B85719k1178L4670o4636j3886P9461K8034j5756l5099l0744K0677K7822k3918
3793B71166N2701j3665j0870R201Q023J1563k4748r761J41253k9873n5429n4098
3781B95463J1430J26124k37K324J2385N017o4082P4733M0160l8450o0735J9969
$$ y = [248823, 219287, 145928, 183918, 192280, 180548, 204342, 238731, 191440, 130460, 155633, 180956, 197671, 190948, 175751, 107661, 98773, 129489, 114783, 118581, 106138, 158709, 183235, 181564, 188855, 181245, 171119, 143290, 128189, 190144, 218055, 193219, 175230, 192361, 203963, 183185, 162975, 167098, 130556, 144136, 226988, 288260, 265943, 222650, 204578, 219429, 287084, 283680, 309272, 302027, 283399, 249307, 258297, 262234, 299403, 314658, 217016, 266568, 334197, 297655, 284594, 285719, 264541, 299211, 234575, 220689, 300150, 328184, 312428, 277329, 246585, 267262, 295084, 271166, 323867, 310202, 299332, 308533, 316556, 328119, 303371, 293610, 434863, 404990, 349561, 295463, 306893, 433017, 432780, 435104, 447489, 452506, 388424, 463157, 503317, 464867, 404132, 424101]
3769D24101K2808J3200J1277L8126M4465m490J2531J1487n4088k6404N5487L5747
3757E84247L8782M9354K5999l460J1853L0538l2026N3703k3715l2271j306K1270
3745G22968L0442m173Q6584L6252m456j813N4863R604N8147M3703O6057Q7727
3733A185905J6951Q466O8493O181k520r396n5195M4946L8445j0124M2270o311
3721A328111m2128r76n98N563N4580N8682L8258R2437N9841N959q3752J10579
3709A626556J01557j7061M6194j2875j7579j06650m2221P8198l9983j26482K7989
3698A517643m3184l1533j0470k9173n9806j31763j746k6093j9512k3733l0803
3687A109827J4803K5443J2225m4773k0048j6009r4844n2344M2000l070o8084M4796
$$ y = [424101, 446909, 460109, 471386, 509512, 553977, 549487, 562018, 573505, 519417, 493013, 548500, 584247, 623029, 672383, 698382, 694922, 706775, 737313, 705287, 758990, 735275, 703004, 701698, 722968, 753410, 749237, 835821, 872073, 867617, 865804, 920667, 930271, 988418, 1032121, 1098178, 1185905, 1202856, 1211322, 1279815, 1285996, 1283476, 1274080, 1218885, 1263831, 1302276, 1292152, 1334422, 1328111, 1285983, 1285007, 1284409, 1289972, 1344552, 1403234, 1441492, 1533929, 1593770, 1599729, 1515977, 1626556, 1728113, 1711052, 1757246, 1744371, 1726792, 1620142, 1577921, 1656119, 1616136, 1489654, 1517643, 1474459, 1442926, 1432456, 1403283, 1343477, 1211714, 1209968, 1183875, 1164363, 1140630, 1109827, 1124630, 1150073, 1162298, 1117525, 1097477, 1081468, 986624, 934280, 976280, 973210, 905126, 949922]
3675I49922l3640p9063o5379l9475n4498k7457O4317l3122k6300K4738m1058q3545
3663E55440M9861j761k0788L7411J777j1481K0093J1854l4616L8084j1019q939
3651F25916l6010k1806K4978k9374N628L2457l3015q6327O9543J4675r892M7941
3639F04714j8647j01968j5949K1080M9464L7373q02n771j4473k9651L242j3043
3627E15569o7548L0198R641N7785J5198o8385l5640J6187K1439J9623K6242l3581
3615E06728R979o279M1652M6667n7514o8613M4770n267J8251Q3640O5069j2291
3603F66792p6795M5831j2693j07104J2994Q1315K5413L6871j7705k8871m6299
3592E79749j1477J3900M8351N5904O276p9103L1894J5388M3954J1812K0065j0
$$ y = [949922, 916282, 837219, 771840, 732365, 677867, 650410, 714727, 681605, 655305, 680043, 638985, 555440, 605301, 603540, 582752, 620163, 621940, 610459, 630552, 642406, 607790, 645874, 634855, 625916, 589906, 568100, 593078, 563704, 569332, 601789, 568774, 482447, 551990, 566665, 556773, 604714, 586067, 484099, 468150, 489230, 538694, 576067, 575265, 569494, 555021, 525370, 528612, 515569, 448021, 478219, 487860, 545645, 560843, 492458, 456818, 473005, 494444, 514067, 540309, 506728, 516707, 510428, 552080, 598747, 541233, 472620, 517390, 512123, 530374, 614014, 679083, 666792, 589997, 635828, 623135, 516031, 529025, 610340, 635753, 672624, 654919, 626048, 579749, 568272, 582172, 630523, 686427, 692703, 613600, 645494, 660882, 704836, 716648, 736713, 736703]
3580G36703J2714Q9975R758J2420n675j19232k4689N4856R2684L634l6750k7858
3568G98540J5709J4774j7440O5925J7134n0176J8126M2741L4425N048r139P470
3556I43137j0243P3322L9651m0478M5281N5577q3240k6655K1421L87o7963Q8928
3544A039125J16801K3193J7918k4465k7974Q607M4532O3349K177L0198P881q4182
3532A217160N3998Q7634r1444n9574l4302k2127o7478q271P6293R493k8357K3030
3520A156055k9109k8050K579L7363q502Q6128j7305l9413k7011J4402M4161r3440
3508A097858L6478J26217k9559j02073N3015N0900J0877k5579L246l6888M5393
3497A229885j1552N1165L0138n1207j2495k841O6299j2364p2210m219L9379k2857
$$ y = [736703, 749417, 839392, 849150, 861570, 855895, 736663, 711974, 766830, 859514, 863148, 826398, 798540, 814249, 829023, 811583, 877508, 894642, 844466, 862592, 905333, 939758, 944806, 935667, 943137, 932894, 1006216, 1045867, 1005389, 1050670, 1106247, 1023007, 996352, 1017773, 1018160, 950197, 1039125, 1155926, 1179119, 1197037, 1172572, 1144598, 1153205, 1197737, 1261086, 1263263, 1293461, 1301342, 1217160, 1271158, 1358792, 1267348, 1207774, 1173472, 1151345, 1083867, 1075596, 1151889, 1161382, 1133025, 1156055, 1126946, 1098896, 1101475, 1138838, 1130336, 1216464, 1199159, 1159746, 1132735, 1147137, 1191298, 1097858, 1134336, 1260553, 1230994, 1128921, 1181936, 1232836, 1243713, 1218134, 1221380, 1184492, 1229885, 1218333, 1269498, 1299636, 1248429, 1235934, 1233093, 1299392, 1287028, 1214818, 1210599, 1249978, 1227121]
3485A227121l2831J7860N35k3225M2040O7295N3262o2253q6745n1285N3474L8989
3473A244237n0193o2231P6620J00679k7181K1453r780m3011n8803m8039P7848
3462A221599N7878n2832o7244j6565K5798J8511j2483K907J13871K4038m7573
3451A267905L3134O725J074K9073Q2786J53496J6414j1141Q3364M1599Q5290Q9674
3439A879393Q709M0262J16234J47016K03073K05512J62368J83425J42726O9017
3429C157735j7866k34918j80785j71012k15878j39039j51017j16754p7694k0162
3419A832610L0871l7533j27975m2728m5599q614O2661l2147p3968K3751m3463
3408A537866l3135k0073K2501j18461o5121N1109M4551O2309k9289m4404p620
$$ y = [1227121, 1194290, 1212150, 1212685, 1189460, 1231500, 1298795, 1352057, 1289804, 1203059, 1151774, 1205248, 1244237, 1194044, 1131813, 1208433, 1309112, 1281931, 1303384, 1293604, 1250593, 1191790, 1143751, 1221599, 1279477, 1226645, 1159401, 1142836, 1168634, 1187145, 1174662, 1177569, 1291440, 1315478, 1267905, 1301039, 1307764, 1308838, 1337911, 1420697, 1574193, 1590607, 1579466, 1662830, 1704429, 1789719, 1879393, 1888102, 1928364, 2044598, 2191614, 2394687, 2600199, 2762567, 2945992, 3088718, 3157735, 3139869, 2904951, 2724166, 2553154, 2337276, 2198237, 2047220, 1930466, 1852772, 1832610, 1863481, 1825948, 1697973, 1655245, 1609646, 1601032, 1663693, 1631546, 1557578, 1581329, 1537866, 1504731, 1484658, 1507159, 1388698, 1323577, 1374686, 1419237, 1481546, 1452257, 1407853, 1400233]
3397A400233N7236j0492p203M4052L6150K4786O826O7955J9494k4333N8266J14383
3385A787353M9261K7517K3654Q1764l2384N1184J83159J52983L578j2208Q6969
3374B402830J33997R1333N8522J85917K22287J81526J38302Q2770M0722l7566
3364C500640j05060r4642p1139j44561j64956j43450p6143j29404k44527j27292
3354B199466j18226j15539l1317j03622m0177j5089q8756M798L9420l7515o5199
3343A628244L2491K5267Q3757k3231l0401P0179O0372p3737K9984N9322P3013
3332A935260K1529j6315L8567J7663l2421M0441J6591M9693K7821L5494R4220
3321B228543L740r1972J3847N923q106n851l5523M0806L4779K8812L3202r235
$$ y = [1400233, 1457469, 1446977, 1439774, 1483826, 1519976, 1544762, 1551588, 1619543, 1639037, 1614704, 1672970, 1787353, 1836614, 1864131, 1887785, 1969549, 1937165, 1988349, 2171508, 2324491, 2328069, 2315861, 2402830, 2536827, 2628160, 2686682, 2872599, 3094886, 3276412, 3414714, 3497484, 3538206, 3500640, 3395580, 3300938, 3229799, 3085238, 2920282, 2776832, 2700689, 2571285, 2326758, 2199466, 2081240, 1965701, 1934384, 1830762, 1790585, 1775496, 1686740, 1691538, 1730958, 1693443, 1628244, 1660735, 1686002, 1769759, 1746528, 1716127, 1786306, 1846678, 1772941, 1802925, 1862247, 1935260, 1956789, 1940474, 1979041, 1996704, 1964283, 2004724, 2021315, 2071008, 2098829, 2134323, 2228543, 2232283, 2140311, 2154158, 2160081, 2151975, 2146124, 2110601, 2151407, 2186186, 2214998, 2248200, 2238965]
3309B238965K6506l5095p1252J2942N1048l2346k1408o076J821l3146o9661L1801
3297B094099P0745P1307k2100J0647Q7750R8582J8033J09950P0646K7541R359
3286B646559M7318J4956K8054Q6048M8632R3870R1585N7704j5359P5472J13355
3275C288194Q2123L7229L9299J04113Q4187Q4829R2235J48880J25841M1236J19735
3264D247901J71503J37871Q7613J22129J46598J39675J97806K02123J29995K47139
3254E830353K49658J99734L01019L64937L40757L60099M38622O01120O01178N90264
3244I877741O67069P85017R10862J056968J161857J474756J889402K389786L130423
3235B3343881L568929L665628L443616K626673J385644r3962j476758k610355
$$ y = [2238965, 2265471, 2230376, 2159124, 2172066, 2223114, 2190768, 2169360, 2163284, 2165105, 2131959, 2062298, 2094099, 2164844, 2236151, 2214051, 2224698, 2312448, 2411030, 2429063, 2539013, 2609659, 2637200, 2646559, 2693877, 2708833, 2736887, 2822935, 2871567, 2965437, 3057022, 3114726, 3099367, 3174839, 3288194, 3370317, 3407546, 3446845, 3550958, 3635145, 3719974, 3812209, 3961089, 4086930, 4128166, 4247901, 4419404, 4557275, 4644888, 4767017, 4913615, 5053290, 5251096, 5453219, 5583214, 5830353, 6080011, 6279745, 6580764, 6945701, 7286458, 7646557, 8085179, 8686299, 9287477, 9877741, 10544810, 11329827, 12240689, 13297657, 14459514, 15934270, 17823672, 20213458, 23343881, 26912810, 30578438, 34022054, 36648727, 38034371, 37940409, 36463651, 33853296]
3227C3853296l490197l646711l526154l149070k621217k029409j526242j037029
3219A2827267q04086n57130m41540m23060l63905k36702j96572r7807o3350k8865
3209I614250n1249r1538j2126M5480J0629j5893N9091J46019J38828Q6132P0599
3198A0000222P4310K8327O2299L6719J24072J37159R9454J42903J48071J30119
3188A0983655J66146J50543J38663J94003K46212K67317K47016K17527K29114
3179A2840196K76720K09304K79287L24796L32219L46725M19862L86164L00963
3170A5716236L55526M34972M53341M81826O05402O64584O57830N83612P07100
3161B0660429Q77690R48294R35700J024224J189056J190043J169842J275968J340931
$$ y = [33853296, 30363099, 26716388, 23190234, 20041164, 17419947, 15390538, 13864296, 12827267, 12023181, 11466051, 11024511, 10601451, 10237546, 10000844, 9804272, 9706465, 9643115, 9614250, 9563001, 9471463, 9459337, 9504817, 9515446, 9499553, 9558644, 9704663, 9843491, 9929623, 10000222, 10074532, 10102859, 10165158, 10201877, 10325949, 10463108, 10562562, 10705465, 10853536, 10983655, 11149801, 11300344, 11439007, 11633010, 11879222, 12146539, 12393555, 12611082, 12840196, 13116916, 13326220, 13605507, 13930303, 14262522, 14609247, 15029109, 15415273, 15716236, 16071762, 16506734, 16960075, 17441901, 18047303, 18711887, 19369717, 19953329, 20660429, 21538119, 22486413, 23422113, 24446337, 25635393, 26825436, 27995278, 29271246, 30612177]
3152C0612177J429713J443182J601136J852159J926025K134804K435351K816497
3144D6251044L163184L380733L618130L984564M644648N210091N850738O585180
3136H2688312P448502Q493173R909334J1824295J4390980J7640661K1666753K6528426
3128B00590436L2346674L7453602L8497341K7775657Q007040j2368842k9880542
3121C02421366l6893450l8961211l6671332l0122466k3582523j8063344j4267457
3114A03859583j1623798r584799q083616o750003n564611m816928m130921l509523
3106D9795384l076857k745226k503723k261355j985796j830100j676607j462977
3098C2252743j425025j420707j234999j071404r35126r02194r59385r60893r67512
$$ y = [30612177, 32041890, 33485072, 35086208, 36938367, 38864392, 40999196, 43434547, 46251044, 49414228, 52794961, 56413091, 60397655, 65042303, 70252394, 76103132, 82688312, 90136814, 98629987, 108539321, 120363616, 134754596, 152395257, 174062010, 200590436, 232937110, 270390712, 308888053, 336663710, 344670750, 332301908, 302421366, 265527916, 226566705, 189895373, 159772907, 136190384, 118127040, 103859583, 92235785, 82650986, 74567370, 67817367, 62252756, 57435828, 53304907, 49795384, 46718527, 43973301, 41469578, 39208223, 37222427, 35392327, 33715720, 32252743, 30827718, 29407011, 28172012, 27100608, 26165482, 25263288, 24303903, 23343010, 22375498]
3089B2375498q72242p78445q20074o88960p06066p76173p56149o77547o91015
3080A5608827o51570o39763m97141m73085n68387m99161l97756m32848m60050
3071A0989066m04215l10307l14774l94396k89801k21277k74644k26253k94272
3062H259127j96930k53508j23058n4806n3367j64067j96379j85558j44369j26015
3052F761070j46346j49874p4333m8608o2865o8358j46556j77603r5512j25542
3042E665473j34865q0025j23021k07899j88249j03533q7498j86231r9161j08853
3032D346138r4657r4642k1184j6854r5419j52710r5931q5658j24302p1439O3367
3021C556709K241j22839o5174p6615l7494l6112q7565l4669J0364K3478p331n4174
$$ y = [22375498, 21503256, 20724811, 19904737, 19215777, 18509711, 17733538, 16977389, 16299842, 15608827, 14957257, 14317494, 13820353, 13347268, 12778881, 12279720, 11881964, 11449116, 10989066, 10584851, 10274544, 9959770, 9565374, 9275573, 9054296, 8779652, 8553399, 8259127, 8062197, 7808689, 7685631, 7630825, 7577458, 7413391, 7217012, 7031454, 6887085, 6761070, 6614724, 6464850, 6390517, 6341909, 6279044, 6210686, 6064130, 5886527, 5791015, 5665473, 5530608, 5450583, 5327562, 5119663, 4931414, 4827881, 4740383, 4554152, 4454991, 4346138, 4251481, 4156839, 4135655, 4118801, 4023382, 3870672, 3774741, 3689083, 3564781, 3493342, 3556709, 3558950, 3436111, 3370937, 3294322, 3256828, 3220716, 3133151, 3098482, 3108846, 3132324, 3124993, 3070819]
3009C070819j01329m5712P5357M4214L5320M9413K8195k2609L8143J19545N3624
2998C344980L3331J45751K26189K93042K49581L32858M20561N04403N11778N47962
2988F610436J26461l86294l89960m61480n57512n40478m83811m19297k79628j92266
2978C026171j73156n9157j04657j14010j18102q4928o1048n5747l9631N219M502
2967B225456m5224j0602p2505o7509o682j2745l4804q875O683j01016n2044O4303
2955A884436P3557p0137j33576o0124r0779p6862R842O9470p6430p6415l8428
2944A414554k4174k968m1655m6886k9588K5033m8175K6938L1807j7716M0057N9312
2932A386539J7254p398q7457M6510Q4863N00J2217M24J43o3837j4730N9968l2313
$$ y = [3070819, 2969490, 2923778, 2999135, 3043349, 3078669, 3128082, 3156277, 3133668, 3171811, 3291356, 3344980, 3378311, 3524062, 3750251, 4043293, 4292874, 4625732, 5046293, 5550696, 6062474, 6610436, 6736897, 6350603, 5960643, 5499163, 4941651, 4401173, 3917362, 3498065, 3218437, 3026171, 2853015, 2793858, 2689201, 2575191, 2457089, 2372161, 2311113, 2255366, 2215735, 2220954, 2225456, 2180232, 2169630, 2097125, 2029616, 2022934, 2010189, 1975385, 1966510, 1973193, 1872177, 1820133, 1884436, 1957993, 1887856, 1754280, 1694156, 1603377, 1526515, 1536357, 1605827, 1529397, 1452982, 1414554, 1390380, 1387412, 1345757, 1298871, 1269283, 1294316, 1246141, 1273079, 1304886, 1287170, 1327227, 1386539, 1403793, 1396395, 1308938, 1355448, 1440311, 1440811, 1453028, 1453452, 1453595, 1389758, 1375028, 1434996, 1402683]
2919A402683p2092p2287m6006J7168M0063j00873o5403J6761o6256n4092K0998
2908A020664j5115l6273j0935J1938N4392j10631p7552J9573L93N8734n71n4265
2896H60352l3852l5554M42P8823l0402r118n0512o5209N8535O6343m7113O6319
2884H59054j5541k4143L4555j4452j4531N7038N805K72P8593J9482K6614j01177
2872I11569m8708K9338J2798M3903O4365j5610m2607M104J3488J0168l749o0973
2860I18086j2722r387N2382L7867n2010M393J3850J5561P260m3301J3012m1570
2848I03421o4645J6573N9874j7696N70K8675k229q764l8779p2975Q3796J9364
2836I07185m4812N6728K7224K0433O9762N8772K4379m2083L7992J20162K5227
$$ y = [1402683, 1330591, 1258304, 1212298, 1229466, 1269529, 1168656, 1103253, 1120014, 1053758, 999666, 1020664, 1005549, 969276, 958341, 970279, 1024671, 914040, 836488, 856061, 856454, 915188, 914617, 860352, 826500, 790946, 791388, 870211, 839809, 830691, 780179, 714970, 773505, 839848, 792735, 859054, 843513, 819370, 853925, 839473, 824942, 881980, 887785, 888057, 966650, 986132, 1012746, 911569, 862861, 892199, 904997, 948900, 1013265, 997655, 955048, 959152, 972640, 982808, 979059, 918086, 905364, 895977, 948359, 986226, 934216, 938609, 952459, 968020, 975280, 931979, 944991, 903421, 838776, 855349, 915223, 897527, 898097, 926772, 924543, 915779, 877000, 804025, 887821, 907185, 862373, 919101, 946325, 966758, 1036520, 1095292, 1119671, 1077588, 1115580, 1235742, 1260969]
2825A260969r658J42570Q1944J75894J51423J23556J12071J74325K26283J84694
2815B624071M9726r0277j23558k15985j56579j84808k44684j74870j09442q0339
2805A293255j5526p7251o6577p425l5529n1426j8641l4366j07426o2381P4041
2794H90748R1041q9146q6978K4101P342l8381L8789J6346J8624J4668p919Q0410
2782I59645o9940j10564m5991J4175M5950O6612J1147M4433N299j9675k3820K0059
2770H97330L7382L933r9569N6198J26038p156p0128o9814n0418J0550K7680J4280
2758H76306N8891Q961o3007j3088Q0256J3507q2492J525Q4233P3307o3762q6337
2746H88300n2448k6934j4107l0515N9723L9032j08550m9808L3492L2542j3602
$$ y = [1260969, 1251311, 1393881, 1475825, 1651719, 1803142, 1926698, 2038769, 2213094, 2439377, 2624071, 2673797, 2583520, 2459962, 2243977, 2087398, 1902590, 1657906, 1483036, 1373594, 1293255, 1277729, 1200478, 1133901, 1126476, 1090947, 1039521, 1020880, 986514, 879088, 816707, 890748, 981789, 892643, 805665, 829766, 837108, 798727, 837516, 853862, 872486, 887154, 879235, 959645, 889705, 779141, 733150, 747325, 793275, 859887, 871034, 915467, 920766, 901091, 877271, 897330, 934712, 938645, 839076, 895274, 1021312, 1014156, 944028, 874214, 823796, 834346, 862026, 876306, 935197, 944158, 881151, 868063, 948319, 961826, 879334, 880859, 965092, 1038399, 974637, 888300, 835852, 808918, 794811, 764296, 824019, 863051, 754501, 704693, 738185, 770727, 757125]
2735G57125o3795K5354K9134p528m254K9346o1189j8802l1823q565L5158J5418
2723F95579l9738j5572M0623P191P510m539m3926q91L9513O0708l0801q8183k4794
2710F02680K1428K7936n6137L4048L9761k4929m0888L7579k0562r8295l9343J04979
2698E88257J6912o0241m5694m964p780N470m0633l1608K3396J885m845m212N578
2685D41521r7843j7792M109K513M626o869J68P4958j6662n7682m5549Q6374N283
2672C77155q5873n3684P6084N172n6898k4262Q0602N2062q9373k5612R3825O8002
2660D17200m6645m0580k5503N2237j3466j9383L8262J5093o8709m3724j9460R0545
2648C35867J1566l6166m3988m9501O0374O2661k5857l0142k057j750l1336N6908
$$ y = [757125, 693330, 718684, 747818, 740290, 736036, 765382, 704193, 685391, 653568, 645003, 680161, 695579, 655841, 640269, 680892, 688083, 695593, 691054, 647128, 646237, 685750, 746458, 715657, 627474, 602680, 624108, 652044, 595907, 629955, 669716, 644787, 603899, 641478, 620916, 522621, 483278, 588257, 605169, 544928, 499234, 494270, 486490, 491960, 451327, 419719, 443115, 445000, 440155, 435943, 441521, 343678, 325886, 329995, 332508, 337134, 330265, 330433, 405391, 388729, 331047, 285498, 371872, 377155, 291282, 237598, 313682, 318854, 261956, 237694, 318296, 370358, 280985, 255373, 349198, 417200, 370555, 329975, 304472, 356709, 343243, 323860, 362122, 377215, 308506, 264782, 245322, 335867, 347433, 311267, 267279, 217778, 278152, 340813, 314956, 284814, 282757, 281007, 249671, 306579]
2636C06579M8810r2962q6318P6245O5948m3860q5697j5360K6571J7096N3631K3660
2624B94343m7457p8666l338R4549N5785m6873q2751n5065O4794N9173K8930k452
2612B80972l6535R202J4731j4002l9265M838L687J9763P0786N7040n0742M990
2600C25465K5168J5195J5192l5430o5218k1393M7117Q2394J0546l1367m9310n8006
2588B60353K9208L6098l2808l0604l1860l2736O0914K1095n3442n9351o841J5893
2576A75919O2916L4464M4339m3765o2836J0317M0633J6657l5754j5795N9686P4097
2564C60878M240j6518n4173j07726K6779M3507r467J9557J7246o7899k0037N9147
2552B55534L3931m0244Q789p132J3840J6547O2032j768r4329r218k897L444M0815
$$ y = [306579, 355389, 262427, 176109, 252354, 318302, 274442, 188745, 173385, 199956, 217052, 270683, 294343, 246886, 168220, 164882, 259431, 315216, 268343, 185592, 130527, 195321, 254494, 283424, 280972, 244437, 253639, 268370, 254368, 215103, 219941, 223628, 243391, 314177, 371217, 320475, 325465, 350633, 365828, 381020, 345590, 280372, 258979, 306096, 388490, 399036, 367669, 318359, 260353, 289561, 325659, 292851, 262247, 230387, 197651, 258565, 279660, 226218, 166867, 160026, 175919, 238835, 273299, 317638, 273873, 211037, 221354, 261987, 278644, 242890, 227095, 286781, 360878, 365118, 348600, 294427, 186701, 213480, 256987, 247520, 267077, 284323, 216424, 196387, 255534, 289465, 249221, 258010, 250878, 264718, 281265, 343297, 341529, 247200, 237982, 235085, 238529, 279344]
2539B79344J2766K7984K1389l8511l0105M7532O88m0388j9748K1618Q7407n0885
2527C19091l5383q613o0883K4944n971L248O1152l0095o255J3980L2554m083n5170
2514B48516j0332N597M127L3518J7615K1247j2492n4243m7470N5778N1953J761
2502C15575n483L0K6592l2376K2267k0229j410Q000j7437K4677J5217J0017m9550
2489B95890J3976J8212m2836m8094N3896K6735N9936L656o4114m5918J5087j417
2477B85009K2555M1389p726j8523q7358j733O0827m0836j7645N5348L0897N3372
2465C75576l2462l950J8100k9282k0643K9352l2131L2082K6147l9342N815O0119
2453C89381K523o5390K1064j4862k6723j4833N3696M0231l3464j6507n9691M1339
$$ y = [279344, 292110, 320094, 341483, 302972, 272867, 320399, 321087, 280699, 260951, 282569, 369976, 319091, 283708, 275095, 214212, 239156, 233185, 236433, 297585, 267490, 261235, 275215, 307769, 303686, 248516, 238184, 243781, 247908, 281426, 299041, 320288, 307796, 253553, 206083, 261861, 313814, 315575, 310092, 310122, 336714, 304338, 326605, 306376, 304966, 312966, 295529, 320206, 335423, 345440, 295890, 309866, 328078, 285242, 237148, 291044, 317779, 377715, 381371, 317257, 271339, 286426, 285009, 307564, 348953, 341227, 322704, 235346, 233613, 294440, 253604, 235959, 291307, 322204, 375576, 343114, 339164, 357264, 327982, 307339, 336691, 304560, 336642, 362789, 323447, 329262, 389381, 391904, 326514, 347578, 332716, 305993, 291160, 344856, 385087, 351623, 335116, 275425, 316764]
2441C16764J05674N2844m9917l9117L4111l8341N1864L4893j1162n8606O772L6801
2429D42580L0895k6845O869K2668L5310l8483p7507O5506Q8201j8932p2069j5071
2417D43122Q4656R546r1168l733M6835k490j8291j293M7522j1939m0477k0853
2405D41437N5962N3042l3782k484L0606O3770m7323n5123K1992L6454j1389l4225
2393E18937j2139K9625j5641M1594L3426n4883J0664J1020P977M2279n3511q844
2381E50504k4199N0107P3120J0862l2375j9539R519J2956J5098P459k5031k2663
2369F05818O6924J07139K4520n0414l4872o5667K1448M1215M4217L9604k593m2760
2357G54579n0913j4733j1395K7720L5662N9585L8209m6786j3233j9907M3397J01878
$$ y = [316764, 422438, 475282, 425365, 386248, 420359, 382018, 433882, 468775, 457613, 399007, 405779, 442580, 473475, 446630, 453499, 476167, 511477, 472994, 395487, 460993, 549194, 530262, 458193, 443122, 527778, 537324, 446156, 442423, 489258, 486768, 468477, 467184, 514706, 502767, 462290, 441437, 497399, 550441, 516659, 514175, 544781, 608551, 561228, 506105, 528097, 564551, 553162, 518937, 506798, 536423, 520782, 562376, 595802, 540919, 551583, 562603, 570580, 612859, 559348, 550504, 526305, 576412, 649532, 660394, 628019, 608480, 617999, 630955, 646053, 653512, 628481, 605818, 672742, 779881, 804401, 753987, 719115, 653448, 674896, 716111, 760328, 799932, 797339, 754579, 703666, 688933, 677538, 705258, 740920, 800505, 838714, 791928, 778695, 758788, 802185, 904063]
2345I04063M0614R5970J23659k4416n7485q0877p0885K0951k1780J0687n3913
2334H86588M558P4499K4463j9828p4850j1018N1102K7226J6268k9579L001p3839
2322H78591p0421j044M2691r592l9292K3543R7185p71q6257o7949J9699L9006
2310H25389P860M6009N3713K6206n0537M8540M3193J794n0045O7217L7341j152
2298A055528K4329j8048m7773N511K2581M1965O4839p7532p6212j4351M9677J912
2286A032426m215J2929J2657n185k8242M7297O4622l3832j2549J5877L6032j8540
2274A119277J1746P7004Q2832K7809n999K6356L7560P178j0146P3129J09897K4645
2262A581288n6061p392J5203o516L2250J01215N7433K4003n6469N9941N9771M1252
$$ y = [904063, 944677, 1040647, 1164306, 1139890, 1082405, 1001528, 930643, 951594, 929814, 940501, 886588, 891146, 965645, 990108, 970280, 895430, 884412, 935514, 962740, 979008, 949429, 952430, 878591, 808170, 807126, 849817, 840225, 800933, 824476, 921661, 920890, 834633, 766684, 786383, 825389, 833249, 879258, 932971, 959177, 908640, 957180, 1000373, 1002167, 952122, 1019339, 1056680, 1055528, 1079857, 1061809, 1014036, 1019547, 1042128, 1084093, 1148932, 1071400, 995188, 980837, 1030514, 1032426, 1028211, 1041140, 1053797, 1048612, 1020370, 1067667, 1132289, 1098457, 1085908, 1101785, 1137817, 1119277, 1131023, 1208027, 1290859, 1318668, 1312669, 1339025, 1376585, 1383763, 1373617, 1446746, 1556643, 1581288, 1525227, 1517835, 1533038, 1526522, 1558772, 1659987, 1717420, 1741423, 1684954, 1744895, 1804666, 1845918]
2250A845918j0298N1293J21312Q0463m6103l5413P3417p07k3387j1517p8808l6087
2238A930083K9496r51k5412j1843K4755J2115O7826j5560j9425k6180k2558r297
2226A933049P7445L9690j5752k5699K013N1154P0282K4647k6582Q446N0213j1529
2214B177377L9941J23724r906j862N7215J69327M1770m6401P2992J12209J47045
2203B883431J00442K0754J16775J26562J35437J61017J65497J70353J10481J40886
2193D131635K52169J25381N0923Q9129J77110J15923M3292p9621q4811j29229
2183D691901j44426j87792k00037k25608k54122k44262j79843p8088j43035j64721
2173B869967j38573r2731p3971j49987m9925j9932j56498j17451N16k2833n2214
$$ y = [1845918, 1835620, 1886913, 2008225, 2088688, 2042585, 2007172, 2080589, 2079882, 2056495, 2044978, 1966170, 1930083, 1959579, 1958628, 1933216, 1921373, 1946128, 1958243, 2026069, 2010509, 1991084, 1964904, 1942346, 1933049, 2010494, 2050184, 2034432, 2008733, 2010746, 2061900, 2132182, 2156829, 2130247, 2138693, 2188906, 2177377, 2217318, 2341042, 2331136, 2329274, 2386489, 2555816, 2597586, 2551185, 2624177, 2736386, 2883431, 2983873, 3004627, 3121402, 3247964, 3383401, 3544418, 3709915, 3880268, 3990749, 4131635, 4383804, 4509185, 4560108, 4649237, 4826347, 4942270, 4985562, 4905941, 4821130, 4691901, 4547475, 4359683, 4159646, 3934038, 3679916, 3435654, 3255811, 3177723, 3034688, 2869967, 2731394, 2638663, 2564692, 2414705, 2364780, 2344848, 2188350, 2070899, 2071415, 2048582, 1996368]
2162A996368q6194n3728l395k5110k9270n3539R434n5345m3807m42j2102q6394
2150A556476l9225K9897p397l7932n0393m4528j3319l9287L3416k8440R035k64
2138A368039p0452j07528L3384M3042p598l535j8599k2800L3839L9716l6679n6715
2126A194114j2248K8697M0310r5050n2880J3060J0724J8541p2094q3773q2417
2115I06984J3478M4511k8596p4431o5920M9987L3436L749m8524j0222J13207O0515
2103I98174n8757M873O214O222M0072j9752L376J3872k1054P0279J02966K7232
2091A173717n9667r4377l1973K3619m8708j7509M1167l8476m5639o5285k4535
2080H12334K624p7508o2172M9430J7560m2057k393O524K9463l7295n6469M3179
$$ y = [1996368, 1910174, 1856446, 1853051, 1827941, 1798671, 1745132, 1754566, 1699221, 1655414, 1654972, 1642870, 1556476, 1517251, 1547148, 1539751, 1501819, 1451426, 1406898, 1393579, 1354292, 1387708, 1359268, 1368303, 1368039, 1297587, 1190059, 1223443, 1266485, 1258887, 1255352, 1236753, 1213953, 1247792, 1287508, 1250829, 1194114, 1181866, 1210563, 1250873, 1155823, 1102943, 1116003, 1126727, 1145268, 1073174, 989401, 906984, 920462, 964973, 936377, 861946, 796026, 846013, 879449, 883198, 834674, 824452, 937659, 998174, 939417, 944290, 950504, 956726, 996798, 977046, 980422, 994294, 973240, 1043519, 1146485, 1173717, 1114050, 1019673, 987700, 1011319, 962611, 945102, 986269, 947793, 902154, 836869, 812334, 814958, 737450, 675278, 724708, 742268, 700211, 697818, 704342, 733805, 696510, 640041, 683220]
2068F83220L8080k8880P902j8196Q459M5425l4019k5211J418N0817P9052l0288
2056G77779j13145k5303k7668K3189K9417K3071L065j19415n8922N9660k1869
2045E49859p0033J1189M1381O474J1753k1270j658l3734o3562P753M3799k885
2033D79066o92o8624L2515q847K514k743j8906L0377M339l6203Q2250P7238q2319
2020D89965n5863o8945k1281O0297j6787J347M4892N2841o7894l6834N9469k2495
2008D18712p3696k0669L0872Q6810n6882l797j8475l6955k5613k5493N6472M7369
1996C78655n1469j4913L2841J7854k5152m6691j7838O3810L9576l4080K959k1009
1984C24543O3624j2782M1006M0538q4226q3485K2589J8565M7988P281m3847l709
$$ y = [683220, 721300, 692420, 700322, 682126, 690585, 736010, 701991, 676780, 678198, 729015, 808067, 777779, 664634, 639331, 611663, 634852, 664269, 687340, 690405, 570990, 512068, 571728, 549859, 479826, 491015, 532396, 538870, 550623, 529353, 527695, 493961, 430399, 438152, 481951, 479066, 478374, 409750, 442265, 433418, 435932, 433189, 414283, 444660, 448999, 412796, 495046, 572284, 489965, 434102, 365157, 343876, 404173, 387386, 388733, 433625, 486466, 418572, 381738, 441207, 418712, 345016, 324347, 355219, 442029, 385147, 381350, 362875, 325920, 300307, 274814, 331286, 378655, 327186, 312273, 345114, 362968, 337816, 291125, 273287, 337097, 376673, 342593, 345552, 324543, 388167, 375385, 416391, 456929, 372703, 289218, 311807, 330372, 378360, 385641, 341794, 338085]
1972C38085O9700K541l3106k4458K753M8564J8350j7709l9912m4221O0300K6253
1960D07140P44J15p1691o9880L4443l7416K8569Q6236k5832k3119Q020M7781J4038
1947C99148k3287K1504l231J4163L3182J2946k4330j3890j5247j9146p96J991
1935C83007M4537P4272m5489j0628J06762l6620l0868k3036p049L4848K1223K6403
1923E37362l6751l0241K2950J8178Q49L5826j128k7287M7567L6011n2716N9193
1911F09813J9502j1325J6704q911o911O3780M8412K5104O746N2838K2089J638
1899H39479O794K5706Q891j8792K0754O3562Q0210M832J5550j2500J6382j08244
1887I42624o444P5860p945p141n337n8765j3538N348K2870J3724j1116Q335L8033
$$ y = [338085, 407785, 410326, 377220, 352762, 355515, 404079, 422429, 404720, 364808, 320587, 380887, 407140, 407884, 407999, 336308, 266428, 300871, 263455, 292024, 378260, 352428, 329309, 337329, 385110, 399148, 375861, 397365, 394134, 408297, 441479, 454425, 430095, 416205, 400958, 381812, 381016, 383007, 427544, 501816, 456327, 445699, 552461, 515841, 484973, 461937, 454888, 489736, 510959, 537362, 500611, 470370, 493320, 511498, 512347, 548173, 547045, 519758, 567325, 603336, 550620, 609813, 629315, 617990, 634694, 625783, 618872, 682652, 731064, 756168, 762914, 815752, 837841, 839479, 846273, 871979, 880870, 862078, 882832, 946394, 1026604, 1031436, 1046986, 1034486, 1050868, 942624, 936180, 1012040, 1004095, 996954, 991617, 932852, 919314, 924662, 947532, 961256, 950140, 958475, 996508]
1874I96508P3213R329n4569j1345M6368P1142N1365J3714o700P6968Q8265N9956
1862A414214O3610j5283L6806N9836P7256J94238J17325K521J4074L4799L3167
1851B032563j9659n6687J3598l8379n9l2693l8506o0895r583P686k9621P9196
1839A846961q509L7374p741N0417N4136J08915N4403j2146p763N1538O7464m641
1827B230408J3453J0974O3313Q9055J27946J35000K5479j2324K5670k6121p8583
1816B604270j75054j61297q6305l9524j19129m7908k9820n5092l4888N4391K4690
1805A934334o6281k1323n498P9949L6013k6455p3640J0418J05701m14k6471J5752
1793A962085K2524k6049l6271J4346J9559l6110j16200m9481P129r1831q3034
$$ y = [996508, 1069721, 1079050, 1024481, 1013136, 1059504, 1130646, 1182011, 1195725, 1189025, 1265993, 1354258, 1414214, 1477824, 1462541, 1499347, 1559183, 1636439, 1830677, 1948002, 1950523, 1964597, 1999396, 2032563, 2012904, 1956217, 1969815, 1931436, 1931377, 1898684, 1860178, 1799283, 1789700, 1797386, 1767765, 1846961, 1838452, 1875826, 1868085, 1918502, 1972638, 2081553, 2135956, 2123810, 2116047, 2167585, 2235049, 2230408, 2243861, 2254835, 2318148, 2407203, 2535149, 2670149, 2695628, 2683304, 2708974, 2682853, 2604270, 2429216, 2267919, 2181614, 2142090, 2022961, 1975053, 1945233, 1890141, 1855253, 1909644, 1934334, 1868053, 1846730, 1841232, 1921181, 1957194, 1930739, 1857099, 1867517, 1973218, 1972804, 1946333, 1962085, 1984609, 1958560, 1922289, 1936635, 1956194, 1920084, 1803884, 1754403, 1761532, 1669701, 1586667]
1782A586667p4664q984n3851l1644m9728j7037O4027p3311o3108j1013M4927l2711
1770A279570m921k8429r6394q0084n3867L6739o0412l6785j20481j5250L6807
1759H56493l8146m9761l1169n974l4633n4762Q3504K1931j48778l1075j9837K5456
1747E73249M1812k3549l3423m9840l0969O910L6204J7662n2147J380n3004N6870
1735D91155M4791n1124l5111l6006M007j8975P4805K1611m3060p0735J4502M9251
1723D45111n7439o5507k3498O0983L437Q045l2608m6184k1563l3294R6794M4851
1711C79128j10810q1950J6672P4291L678O7726k1493l9966n0604n6793l155J0573
1699A87297O583q7549o38J06230l337j7823n7738J2167K1571P759n403k0289m292
$$ y = [1586667, 1512003, 1503019, 1449168, 1417524, 1367796, 1350759, 1414786, 1341475, 1278367, 1267354, 1312281, 1279570, 1274649, 1246220, 1149826, 1069742, 1015875, 1052614, 992202, 955417, 834936, 819686, 856493, 818347, 768586, 737417, 731443, 696810, 642048, 725552, 747483, 598705, 567630, 547793, 573249, 615061, 591512, 558089, 508249, 477280, 484190, 520394, 538056, 485909, 487289, 434285, 491155, 535946, 484822, 449711, 413705, 417712, 398737, 473542, 495153, 452093, 381358, 395860, 445111, 387672, 322165, 298667, 359650, 363087, 371132, 338524, 292340, 270777, 237483, 334277, 379128, 268318, 186368, 203040, 277331, 281009, 348735, 327242, 287276, 236672, 179879, 176724, 187297, 193880, 106331, 105693, 211923, 208586, 190763, 133025, 145192, 166763, 174522, 169119, 148830, 144538]
1686A44538l3615L359M2674j8696o9372l9500L7814N3242M7242M918J0010k7322
1674A55292k6802L9236o730L565l9647P12k1939N2596K3510n6057k4823j3898
1662H5015R6782J7514n5158r534o1961j4687K5450k2657m858m632k4436J9048
1650D5886L6516n71l8275n8422L1487j8758n0751O6911O2511n6755k0264L5464
1638C4979m2518K9663K3828j3327J053k4490K5690j7996n7856l0053k0341j069
1626i2437Q1996O6963n0286l7442j5062K9877L21L7565l9370J0415K1398L3700
1614D7638k9666k0069m80k3060n524r792L6943M0256N617K4844j000q8582l9722
1601f2597k181K0657M942K9764J8494M216K2787n7003n7343P8634J8665r1506
$$ y = [144538, 110923, 114282, 156956, 138260, 68888, 29388, 67202, 120444, 167686, 172604, 182614, 155292, 128490, 167726, 160996, 164561, 124914, 125626, 103687, 156283, 179793, 123736, 98913, 85015, 181797, 199311, 144153, 134619, 72658, 57971, 83421, 60764, 55906, 51274, 26838, 45886, 82402, 81831, 43556, -14866, 16621, -2137, -52888, 14023, 76534, 19779, -485, 34979, -7539, 22124, 45952, 32625, 33678, 9188, 34878, 16882, -40974, -71027, -91368, -92437, -10441, 56522, 6236, -31206, -46268, -16391, -16070, 21495, -17875, -7460, 13938, 47638, 17972, -2097, -2577, -25637, -31161, -40953, -4010, 36246, 41863, 66707, 65707, -22875, -62597, -64778, -44121, -39179, -9415, 9079, 13295, 36082, -20921, -78264, 370, 19035, -72471]
1589g2471J2632P1491k0457n8563k3597j5670N4666j1818J7481q107K1497n4580
1577h7496q3158R5417J21318n1912j2756r795K464j0788m6332Q1296M2970o7853
1565b6625j16802K2258O0520L8292l8665n339O6336M6614k5780L686J2958k2503
1553A4950m7967j3498M8668J8368n9591k54M9474O2024o2220o0197p323L2070
1541b5496K2869L9735l3614K4463k9136r5047j562N4864K4769l5735L7803O2807
1529D6720M711m0019n1145m336M5950j3278j0082N1380L4875q1420n6706R123
1517f4227Q2679j8073r1192L8139O7404J9065j8017J840K0699k6558p0505M5271
1505a3475K7418p5869L3002L9451L4981j3335j0401J4129j1775Q16N0162J0688
$$ y = [-72471, -59839, 11652, -8805, -67368, -90965, -106635, -51969, -63787, -46306, -54413, -32916, -87496, -170654, -75237, 46081, -5831, -18587, -28382, -25918, -36706, -83038, -1742, 41228, -26625, -143427, -121169, -60649, -22357, -61022, -66361, -25, 46589, 20809, 24495, 37453, 14950, -33017, -46515, 2153, 20521, -39070, -39324, 10150, 72174, 9954, -50243, -57566, -25496, -2627, 37108, 3494, 27957, -1179, -96226, -97788, -42924, -18155, -53890, -16087, 46720, 51431, 11412, -39733, -44069, 1881, -11397, -21479, 29901, 64776, -16644, -73350, -64227, 18452, 379, -90813, -52674, 14730, 33795, 15778, 17618, 38317, 11759, -58746, -13475, 13943, -61926, -28924, 10527, 45508, 32173, 21772, 35901, 24126, 24942, 75104, 85792]
1493H5792m9728l0769l8649Q0536K4563m795n1466n1762r57K3035K7110m95q080
1480D335k5866P368O359m296l1424j9975Q08L8446M8272L3968k1621l8517o1289
1467f3432q707Q4660k5290o7566J3492M344l7935R171N7519q315l9472k697J10733
1454B6505J707j3141k490k4462p337m3219J406N8614J2376j8887k0718M8370M7863
1441F6587n5898p8253L9989J3756r93m699m5399L2217J203l9407J8336M1522p1290
1428h2329n0646P8533L1351k7942p0334q428O7465l7754l4654j0952J05285K3877
1416a6528o6277K484M6666n8567p1073J6028K1229N5434q285j0235L5968j5384
1404f8540m3440j2440J1008L0141j2521N0070P2150o9987l8422J451K3243L9021
$$ y = [85792, 36064, 5295, -33354, 47182, 71745, 66950, 15484, -36278, -37235, -14200, 12910, 12415, 4335, -21531, -14163, -7804, -12100, -43524, -63499, -62691, -24245, 24027, 57995, 36374, -2143, -63432, -72139, 12521, -12769, -80335, -66843, -62499, -100434, -91263, -33744, -42059, -81531, -84228, 26505, 28212, 15071, 12581, -11881, -19218, -62437, -61031, -2417, 9959, -8928, -29646, 18724, 66587, 10689, -67564, -27575, -13819, -14812, -19511, -64910, -32693, -31490, -70897, -52561, -11039, -82329, -132975, -54442, -23091, -51033, -121367, -129795, -62330, -100084, -134738, -145690, -40405, -16528, -82805, -80321, -33655, -92222, -163295, -147267, -126038, -70604, -78889, -89124, -53156, -68540, -111980, -124420, -113412, -83271, -95792, -45722, 26428, -43559, -81981, -80530, -57287, -18266]
1392a8266j2119q1836j2604O5792N4630o4483m0719N2589J6878k3393k36L3179
1380c0588n4993L5202K0046J4n1734q2912N676J6864R2411M9490n9279o9254j8689
1367a47746Q1840J6562n0289J1308P356n00M17J2118n2545j5744j2272N8361O6037
1354b5097N201l6586o7059J4671J2044l754O884J7211J5323j4008k3333L079L8605
1341e6819m6241l4686M7465L8695J5337k2812o3202k203M6968l7975k9758L5427
1329a09804L2347m7889L7267J19605m8689j19382o134L7265P8057M5158p5592
1318e7791k6288r960l5049N6423L0467j1161n6617k9969J09890L9503j22299l7060
1306a49911N9351P4224j5706l9571r1953Q829P0993j298m4076o08K2766r237N2050
$$ y = [-18266, -30385, -112221, -124825, -59033, -4403, -68886, -109605, -57016, -40138, -63531, -63767, -30588, -85581, -50379, -30333, -30319, -82053, -164965, -159289, -142425, -50014, -524, -59803, -129057, -147746, -65906, -49344, -99633, -88325, -80969, -81469, -81052, -68934, -121479, -137223, -149495, -91134, -25097, -19896, -56482, -123541, -108870, -96826, -100580, -93696, -76485, -61162, -75170, -98503, -95424, -56819, -103060, -137746, -90281, -51586, -36249, -59061, -122263, -124466, -77498, -115473, -145231, -109804, -77457, -125346, -88079, 31526, -17163, -136545, -142679, -105414, -27357, 17801, -57791, -84079, -94039, -129088, -72665, -42198, -53359, -109976, -139945, -30055, 9448, -112851, -149911, -90560, -16336, -32042, -71613, -163566, -154737, -83744, -85042, -129118, -129726, -106960, -116197, -64147]
1293f4147P2826m8924p7548M9204J2691L4683n782k2848k7369N3068l0840j7768
1281g2754J5899J6019j1718k6369M128n0753M3825O4537J4770K0247J6400p6396
1269d2165l0265M5198K555k6549O6182l8377k0746j7540J5153M0875L4671k5164
1257C828L1541O1461o8033k7635o867j351J6346J5532k6016j9768l6486J5918
1245d1530L2337N0455J8350j19283j24750J02178O1730J6345q621j249L720o8213
1233g8531O664K9475P500n1685K1709P9678K9335o7077m8675N6809m965m8767
1221f8530R4158J09j60363k0384J27399J13339K72q6340j6788L5199m3122l8694
1209f3745K9908J5674N221o1153P97L0869O2132M782p0570J1225K2821p1336k8025
$$ y = [-64147, 8679, -40245, -117793, -68589, -55898, -21215, -26997, -49845, -77214, -24146, -54986, -72754, -56855, -40836, -52554, -78923, -74795, -125548, -81723, -17186, -2416, 17831, 34231, -42165, -72430, -27232, -24677, -51226, 14956, -23421, -44167, -61707, -46554, -5679, 28992, 3828, 35369, 96830, 28797, 1162, -5705, -7056, 9290, 24822, -1194, -20962, -57448, -41530, -9193, 41262, 59612, -59671, -184421, -82243, -20513, -4168, -12789, -14038, -10318, -78531, -71867, -42392, -34892, -86577, -64868, 14810, 44145, -22932, -71607, -14798, -19763, -68530, 25628, 25737, -134626, -155010, -27611, 85728, 86000, -340, -17128, 18071, -25051, -63745, -33837, -18163, -12942, -74095, -73298, -42429, 19703, 24485, -46085, -34860, -12039, -83375, -111400]
1196a11400Q4661J9142q9398K5779P4985M8795r3266j6128J13302o8472l7445
1185d9445m6926O9433K4984l5929N043P7997n7318o9967M4648M7219J7488m1364
1173a4137m0405J3968m1986O561N7834K7148J0903K1636j5521j8382n859o2785
1161f1025L1317N6409j0076m7139M749K5077J7414Q100j4810K2550p1613j310
1149d0357K1600J2388N3707R102k6044r741m1758m5040j534J5587N5730m0127
1137c6487J691O9034N984l7411m0465n334o5970k6223R0248R2711K9482q5610
1125h350M015J7165K6696K3004m1699N2662O0908r8002j1408Q3136J2412m6906
1113G3633n6100K6311K8104p302l5236J4681O8736k8421p2079n5647L6443J6062
$$ y = [-111400, -26739, -7597, -96995, -71216, 3769, 52564, -40702, -56830, 56472, -12000, -49445, -96371, -26938, -1954, -37883, -32840, 45157, -12161, -82128, -37480, 9739, 27227, -14137, -54542, -40574, -82560, -75999, -18165, 8983, 19886, 41522, 26001, 7619, 1760, -61025, -29708, 26701, 16625, -30514, -25765, -688, 16726, 24826, 10016, 32566, -39047, -40357, -18757, -6369, 47338, 56440, 30396, 20655, -21103, -66143, -67677, -52090, 3640, -36487, -34796, 34238, 40222, 2811, -37654, -42988, -108958, -135181, -44933, 47778, 77260, -8350, -4335, 12830, 39526, 62530, 20831, 73493, 134401, 36399, 24991, 108127, 120539, 73633, 17533, 43844, 71948, 64646, 29410, 44091, 112827, 84406, 12327, -43320, -6877, 9185]
1101I185K9989P9574N0175k831o3453r5387Q4877j4211m2061P0887O0983q251
1089A59476n9519M2037k7011K3079L0377k631o100K0251j6114m3742J8005N5077
1077A93185k9592j4N9812J0450m1744k60j3476M8297j4648n966R6240N3251m5388
1064C10147p636R935m0134M272N3818J8083p786J4380Q2553P5370k8672L4112
1052E18442p5891K8265P311J0198M6919j8458p3730K3391J5793l3511k7685M3065
1040D64109L1787l7008j2301J00539k775L662L6063m900J2960J8908J1665K6103
1028F48812j6403j3046N1060M4737N5415M0185l7530p8817O2021J16605N252k4958
1016H53333K4275j6848O18L5461K7499R541j7957L8312R5099J00507L1112M2855
$$ y = [9185, 39174, 118748, 168923, 166092, 102639, 7252, 92129, 77918, 35857, 106744, 167727, 159476, 99957, 141994, 114983, 138062, 168439, 165808, 159708, 179959, 163845, 120103, 138108, 193185, 163593, 163579, 223391, 233841, 192097, 191837, 178361, 226658, 212010, 206044, 302284, 355535, 310147, 302511, 312446, 272312, 276584, 330402, 348485, 340699, 355079, 437632, 513002, 484330, 518442, 442551, 470816, 478127, 488325, 535244, 516786, 443056, 466447, 482240, 448729, 421044, 464109, 495896, 458888, 446587, 547126, 544351, 548013, 584076, 579176, 592136, 611044, 622709, 648812, 632409, 619363, 670423, 715160, 770575, 810760, 773230, 694413, 756434, 873039, 878291, 853333, 877608, 860760, 861378, 896839, 924338, 933879, 915922, 954234, 1049333, 1149840, 1180952, 1223807]
1004A223807M4029R9613N5519J08404J74709J54586Q7468Q5871J54932Q1233J64099
993B434270K25034J90573K17739K57445L15176L76883L68724K82103K35063L54999
983E258009L67149M68021M97197O38678Q67597J090512J399491J783187K301451
974A4671292K995893M265304O074765L582336k395217o637057n693535l469269
966A3394512k405291j696819j420863j138909q75418o26438n16093l70463l06295
957D037923j36127j03668j21906l03502k87324k49787k36693j67142k6528j22133
947B283113j45668j38415m5970j37818j97956m8245q886n145m3725o4975p4373
936A371937n4076q3491p9018P253R484n1080j23133l7398k2671o8050q5729N7217
$$ y = [1223807, 1267836, 1367449, 1422968, 1531372, 1706081, 1860667, 1948135, 2034006, 2188938, 2270171, 2434270, 2659304, 2849877, 3067616, 3325061, 3640237, 4017120, 4385844, 4667947, 4903010, 5258009, 5625158, 6093179, 6590376, 7229054, 8096651, 9187163, 10586654, 12369841, 14671292, 17667185, 21932489, 28007254, 31589590, 29194373, 22557316, 16863781, 13394512, 10989221, 9292402, 7871539, 6732630, 5857212, 5230774, 4714681, 4344218, 4037923, 3901796, 3798128, 3676222, 3372720, 3085396, 2835609, 2598916, 2431774, 2405246, 2283113, 2137445, 1999030, 1953060, 1815242, 1617286, 1569041, 1560155, 1555010, 1511285, 1446310, 1371937, 1317861, 1234370, 1155352, 1162605, 1172089, 1121009, 997876, 960478, 937807, 869757, 784028, 841245]
924H41245k4191j24413j2941P3799k5266q5450p8471O667M4744k9919q8028l1777
912D65999K2425l3037l9444N3450J6312p1121n2869O7237L2352o1061M0345L4929
900D75517q1483m4497m645J492K4774L4007Q456q5456q2684n589J1683N3950M7840
887C53365P602n6965p1524k5518L3447L412N261q18m631m6784n8347j8611K131
874A22020J8790K8651L8425j2967p6471J0846J6436n9428J1082K9371M9138n6287
862A19606j12991P1137K1929k8925j672N0201n1611m6461M1780L0296k3872k1868
850D7549K9883k1977L4595K071k0619m2409M7649K3869p8320R918P2899n009j6314
837H3785P210j9867j1848J6689l321j3286j6611m6769L3287Q0965K1873k0783
$$ y = [841245, 817054, 692641, 679700, 753499, 728233, 642783, 564312, 570979, 615723, 585804, 497776, 465999, 488424, 455387, 415943, 469393, 485705, 414584, 361715, 428952, 461304, 400243, 440588, 475517, 394034, 349537, 344892, 346384, 371158, 405165, 413621, 328165, 245481, 239892, 251575, 305525, 353365, 360967, 304002, 232478, 206960, 240407, 243819, 249080, 248262, 243631, 196847, 138500, 119889, 122020, 140810, 169461, 207886, 194919, 118448, 129294, 145730, 86302, 97384, 126755, 175893, 119606, 6615, 77752, 99681, 70756, 69084, 119285, 67674, 21213, 62993, 93289, 69417, 47549, 77432, 55455, 90050, 92121, 71502, 29093, 76742, 100611, 22291, 32209, 105108, 100099, 83785, 90995, 71128, 59280, 75969, 72648, 59362, 42751, -4018, 29269, 110234, 132107, 111324]
825A11324m8876m8789K2730k0550J7299J0773J6274m3563k1881L2796K8485k9364
813B6658n9059J09647J6092L0869m6655l4560K2889J0373k1562m076J6189j4089
801E2716n8083N0176N5809j3631q8958Q285p407N618Q2132M7396n2704r7817K3148
788F680N8414m3618j3848M2561J7144n778l1274l8279K5065k4277r421N1280k4414
775A0235m5914K1675L5333K7275j6551q9057L2527k141J9789L4892P3669l3644
763F8088j4350k3717q7338K1875P9334M534l7714J5328p543m4924j1095P6793
751C9271k4421l1349P1310O5933p4641n3369q032j5635N5103N2787O553q5931
739b421m4759K0195K5150K9532K8098o0234j478K0755j4121L2852M2591m2911
$$ y = [111324, 62448, 13659, 36389, 15839, 33138, 43911, 60185, 16622, -5259, 27537, 56022, 26658, -32401, 77246, 93338, 124207, 77552, 42992, 65881, 76254, 54692, 50616, 66805, 52716, -5367, 44809, 100618, 86987, -1971, 6314, -1093, 4525, 86657, 134053, 81349, -16468, 6680, 65094, 21476, 7628, 50189, 67333, 61555, 30281, -7998, 17067, -7210, -16631, 34649, 10235, -35679, -14004, 21329, 48604, 32053, -57004, -24477, -26618, -6829, 28063, 101732, 68088, 53738, 30021, -57317, -35442, 43892, 48426, 10712, 26040, 18497, -26427, -37522, 39271, 14850, -16499, 54811, 120744, 46103, -7266, -15298, -30933, 24170, 76957, 83510, -2421, -47180, -26985, -1835, 27697, 55795, -4439, -5917, 14838, 717, 33569, 76160, 33249]
727C3249o6180J1164L6951L2689k1500k012J961m7159J9602J8100O603j5862n2503
714d4897K7245J09K2784O5293j7266n4089l320r086p542P0904l7089n8976M1682
701d248l4206J3378O0183L2053k8562L307m74Q703m1894m222J5362J2756L8494
688G0630l170q234l64R7279Q044Q609k3268p6680n5759m4999K6917J15466K1275
675A35746n5648k3790j2360q4372m2053O2948l252k1293O8362J7874n7159N00
663a4497J4721J2570K9059l6809l2488L6726K9256j5646K4454L6626p7784l8534
651c2346k5509O1810N2495m1829l9012L9563j8599k3693K0502M4044M8632k4285
639F1773j5127M6719m4316q9722O9093J8315l9999o6667M0002J2954l2415O985
$$ y = [33249, -32931, -21767, 15184, 47873, 26373, 24361, 26322, -20837, -1235, 16865, 23468, 7606, -44897, -17652, -17543, 5241, 70534, 53268, -821, -4141, -13227, -20769, 50135, 13046, -45930, -4248, -38454, -25076, 35107, 67160, 38598, 41905, 41431, 50134, 8240, 4018, 19380, 32136, 70630, 67460, 59226, 58862, 156141, 164185, 172794, 149526, 72846, 17087, -27912, -995, 114471, 135746, 80098, 56308, 43948, -40424, -82477, -19529, -22781, -44074, 24288, 42162, -14997, -14497, 224, 12794, 41853, 5044, -27444, 9282, 38538, 22892, 47346, 83972, 6188, -32346, -57855, 3955, 56450, 14621, -24391, 15172, -3427, -27120, -6618, 37426, 86058, 61773, 46646, 93365, 49049, -40673, 28420, 46735, 6736, -59931, -19929, -6975, -39390, -32405]
627c2405N9245l9218K8100m6193J4819L6435K2340k372j0104l4006m7228j2558
615f3145L3571J15870N0129r2185p2863O3394K338k7449j5668k634j6206J0852
603a3996K0030O9880k174q2659l1257K7150j8336j2903J0687K7851K6896m104
591A7065k9444L62o0941L066P3908M6478k3390n1500L8747K1885l9659K9385J3534
578C9496l9100l0534J6372M6266N5953m0742p8841o595L2244p645L5475r104M7694
565F0939N1841j37528j1769M4889m7926n2530K0492J21400n453l2662k5241k24
553a3772L3094O121L382l1195o7792Q586J19509O5375o0899r0072j21534N4780
541i4417J01996L558K8611K9560q7001q2591L0560J4474j450M7010L7461L6327
$$ y = [-32405, 26840, -12378, 15722, -30471, -15652, 20783, 43123, 40751, 30647, -3359, -50587, -63145, -29574, 86296, 136425, 44240, -28623, 34771, 37109, 9660, -6008, -8642, -24848, -13996, 6034, 75914, 73740, -8919, -40176, -13026, -31362, -44265, -33578, -5727, 21169, 17065, -12379, -12017, -72958, -69892, 4016, 50494, 27104, -24396, 14351, 36236, -3423, 25962, 39496, 396, -30138, -13766, 32500, 88453, 47711, -31130, -37725, -5481, -13126, 22349, 13245, 60939, 112780, -24748, -36517, 8372, -39554, -92084, -71592, 49808, 44355, 11693, -13548, -13772, 19322, 25443, 28825, -2370, -70162, -61576, 57933, 123308, 62409, -27663, -149197, -94417, 7579, 11137, 39748, 69308, -17693, -100284, -69724, -55250, -56700, -9690, 27771, 64098]
529F4098k3362r6777l5587L6258K3870n8023M6856L2953m4193n193K0135M2230
517C265k2053o6285N1403k013J5919O1748M5575K7569l9722j03073n8534K2386
505f3815M4649M5514m1017M6527N0665m9480p254p0098m7126M3554m926n753Q8706
492C0146l2407k8702L4566M664O447o1554o4993N6302L6151j7949O9414m1967
480i882p9853m463J00111P6157r4120l7533J7582m3663L179P6500k4492J9052
468a425m0558p2106L2219P6133K5584O462k1452j0648l0010q220M262J4210k1602
455d7151j4343M6344L5774L0462q9942m5132N0092Q8434q324n8472L2356l9402
443a9304m5302P2484O3851r3588j22885j35Q7137M6944k8775j7108k8384k1175
$$ y = [64098, 40736, -56041, -91628, -55370, -31500, -89523, -42667, -9714, -53907, -59100, -38965, 3265, -18788, -85073, -33670, -35683, -19764, 41984, 87559, 115128, 75406, -27667, -86201, -63815, -19166, 26348, -14669, 31858, 82523, 33043, 25789, -44309, -91435, -47881, -52807, -58560, 30146, -2261, -30963, 3603, 8267, 14714, -46840, -111833, -55531, -19380, -37329, 32085, -9882, -89735, -94198, 5913, 82070, -12050, -49583, -32001, -75664, -72485, 4015, -20477, -1425, -41983, -114089, -81870, -5737, 19847, 26309, 4857, -5791, -35801, -44021, -39759, -25549, -47151, -61494, -15150, 20624, 51086, -38856, -83988, -33896, 54538, 46214, -12258, 20098, -19304, -64606, 7878, 71729, -21859, -144744, -144879, -57742, -10798, -39573, -56681, -85065, -106240]
431a06240K8774O9876N4239o3334m1171L4068j8581N756k0327m5271N942j191
419i7460j1385Q5495K4691k9599J1970N462k0263o1102P3809N4335k4151K1655
407C3457M664o5951l8342k812l0980N2511J14804J7730l4957n8012o1931p2603
395a42422L0737J11228K474j0890k203L5493o785l0354n4208K4272m456l4627
383h1741L2925P2329J4462l6471n5416m6571K6195l5433j8479N5175O4592n6j1490
370a9979P3J311k8763J0025L7265j7303R936k5604k7648j8825O0486K824l5798
357e2000Q234L0092j4014L5815l1067l5786J1977L0661J846j4549K8733L5801
345C5743n2604n2407R4993j5095l1221O1035J4579j03190P013m763O0049J9245
$$ y = [-106240, -77466, -7590, 46649, -16685, -57856, -23788, -42369, -36613, -56940, -102211, -96269, -97460, -108845, -23350, 1341, -28258, -16288, -10826, -31089, -92191, -18382, 35953, 11802, 33457, 38121, -27830, -66172, -68984, -99964, -47453, 67351, 85081, 50124, -7888, -69819, -142422, -111685, -457, 2017, -8873, -11076, 24417, 17632, -12722, -66930, -42658, -47114, -81741, -48816, 23513, 37975, 1504, -53912, -100483, -74288, -109721, -128200, -73025, -8433, -8489, -19979, -19906, -18595, -47358, -37333, -68, -17371, -7435, -33039, -60687, -79512, -19026, -16202, -52000, -43766, -13674, -27688, 8127, -22940, -58726, -46749, -16088, -14242, -28791, -58, 35743, -16861, -69268, 25725, 10630, -20591, 40444, 55023, -48167, -41154, -45917, 14132, 33377]
333C3377l9557N0202l877l4314l9664r4327l519P0865L8805k2555q90L7130m4884
320e3208M2109M925p2324K3447q33l1483O3443M2604j08929j9709Q4409J2667
308a2882p7310o847P5168N9123j6317n2136P760p9249o2468M8088J14976j5308
296a7402k1213j0488j4307K5868p961j7764P273J6321k9614O7139j1629k2582
284c6359J1308k2206J6457N324J4223L667n369k7561N1361j7112l2620L200k282
271c7969m8245K3752P8860j3584o1592k423L7458k1104k3027N442k1404n1986
259a35822Q4128M3248J1922o0706p6632L0672K8383O3448J8102o2007j4491l4632
247a04387L9887L8964K6698n1585k7742L3089L1714j7350n449n1610K046K4749
$$ y = [33377, -6180, 44022, 40145, 5831, -33833, -128160, -131679, -60814, -22009, -44564, -45454, -8324, -53208, -11099, -6174, -78498, -55051, -55884, -87367, -23924, 18680, -90249, -109958, -25549, -12882, -90192, -97039, -21871, 37252, 20935, -31201, -23441, -102690, -165158, -117070, -2094, -17402, -38615, -49103, -63410, -37542, -45503, -63267, -55994, -39673, -69287, -2148, -13777, -36359, -25051, -47257, -30800, -25476, -11253, -7586, -12955, -40516, 10845, -6267, -38887, -35687, -37969, -86214, -62462, 16398, 2814, -58778, -61201, -23743, -44847, -67874, -62432, -83836, -135822, -51694, -8446, 3476, -57230, -133862, -103190, -74807, -11359, 6743, -55264, -69755, -104387, -64500, -25536, 1162, -50423, -78165, -45076, -13362, -30712, -36161, -87771, -85725, -60976]
235f0976Q390M1057r270l0543m6680O8717M8926k7145o5257k2931P8071K4333
223F692O975k8823M0548l5923j10521n336N5400k0012k5612P6618K395j7258O663
210d8194j6657k0907K9758k7103L2375M1559k9283o2422k8777K522K0859j1011
198a17281j2716M5102Q3326k4783n8088j6779j0962j2971L0204N8861K6800r23
186a0210j7862M902K4123q1314l1190K5302P1764K7683l9669l5383k6219j3134
174a01207N8377O507l6997J4244M8570N844k306k9515j9991m9422J764P0757j7988
161e1363j0139M1334n631l2457J2461o4870L2748M1758P283j4806L7063o4898
149g1517j7902K756j7589J0293L9956P0886k6415m9651m9934K8473m4524J0241
$$ y = [-60976, -52586, -11529, -20799, -51342, -98022, -29305, 19621, -7524, -72781, -95712, -17641, 6692, 13667, -15156, 25392, -10531, -121052, -126388, -70988, -91000, -116612, -39994, -37599, -54857, -48194, -64851, -85758, -56000, -83103, -50728, -9169, -38452, -100874, -129651, -127129, -106270, -117281, -129997, -84895, -1569, -26352, -84440, -101219, -112181, -125152, -94948, -36087, -9287, -10210, -28072, -23170, 953, -80361, -111551, -86249, -14485, 13198, -26471, -61854, -88073, -101207, -42830, -36323, -73320, -59076, -10506, -4662, -6968, -36483, -56474, -105896, -104132, -33375, -51363, -61502, -20168, -25799, -58256, -45795, -110665, -77917, -36159, -28876, -43682, -6619, -71517, -89419, -86663, -104252, -93959, -54003, 16883, -9532, -59183, -109117, -80644, -125168, -114927]
137a14927J7975M624L375M853M9153n1026m0156k540m880M1275M5790K6920k3866
124d3430j2826L5002P145l4962l6005L7228j6528o728J5341N3992k6911J799j4998
111d1881J1482q380k7498J8413Q5650m6015q2497M577j9407j819L3324M5536k2912
98e1427j0486J0847o098k1667O692l8308N791M3468J727q888k7225J4069L0086
85e1419j3366l9292M952K0900k9302M352L903K6564k2845j2143Q518M7915j558
72e2821m4908j5584K9001k589k6811k0259L0984N44j3599K7750K9298K0914R42
59c7138m1199m3757j2342K5868J9771L1660K3207l7646K7188P0065l2950p0495
47g7768k7415L1388M0386J334m8120l0748m016k2782M6612M2675n434n0196k0134
$$ y = [-114927, -96952, -92328, -88953, -84100, -34947, -85973, -126129, -128669, -133549, -92274, -46484, -19564, -43430, -56256, -21254, -14109, -49071, -85076, -47848, -64376, -71104, -55763, -1771, -28682, -26883, -41881, -30399, -38779, -66277, -47864, 37786, -8229, -90726, -86149, -105556, -107375, -74051, -28515, -51427, -61913, -51066, -57164, -78831, -72139, -110447, -104656, -61188, -59461, -68349, -95574, -81505, -51419, -64785, -104077, -99125, -78225, -107527, -103175, -99272, -72708, -95553, -107696, -99178, -51263, -52821, -97729, -113313, -84312, -86901, -113712, -133971, -102987, -102443, -116042, -88292, -58994, -38080, -37138, -78337, -122094, -134436, -108568, -88797, -57137, -33930, -71576, -44388, 25677, -7273, -77768, -105183, -73795, -33409, -32075, -80195, -110943, -114959, -137741, -91129, -48454, -53888, -104084, -124218]
34a24218N0010L8820n655k6463m8909k6330J0410r992K0983L3363k28J1994j3480
21h9695m7245N812J1981m462N9038M1574r466m0596l0926J0843j4507J7528L7264
8e2857k4468m7785J4198L7597R859K5793k9009P357
0e9315
$$ y = [-124218, -74208, -35388, -41043, -67506, -116415, -142745, -132335, -142327, -121344, -87981, -88209, -76215, -89695, -136940, -131128, -119147, -123609, -64571, -22997, -32463, -73059, -103985, -93142, -107649, -90121, -52857, -77325, -125110, -110912, -73315, -63456, -37663, -66672, -59315]
$$ Imaginary data points
##PAGE= N=2
##DATA TABLE= (X++(I..I)), XYDATA
16383i57766O0106K3843J1531j781j0268N9533P1043r188l609P354P5644Q815
16371f64743j4234k6734M2300M1460k0977J2115J0992R377K2428M7182O6611M3961
16359d30262n5802k585P8707J8867q2373m521J34259j7093k9415M9930J9268j742
16347c22762j3028J8687J2490j1678K3799N1502L6842N153j7311p271N5840K8770
16335a38967J3883k7385M5191J6611k0191J7458J1746K5199J6176J5476J0860
16324a3943N58m1873J6433O1230N9817L364J3317m161N828J9635L2597p239k1500
16311A24063m650N4584M8137j5828k2462M5617P8405k1857j2243M2531O015j0472
16299C11840M3376J6455J17l1403K4601L0423j056M544N517N5058J6518k7635
$$ y = [-957766, -897660, -873817, -862286, -864067, -874335, -814802, -743759, -752947, -756556, -749202, -673558, -664743, -678977, -705711, -663411, -621951, -642928, -630813, -619821, -610444, -588016, -540834, -474223, -430262, -486064, -488649, -409942, -391075, -473448, -477969, -343710, -360803, -390218, -340288, -321020, -322762, -335790, -317103, -304613, -316291, -292492, -240990, -204148, -198995, -216306, -223577, -167737, -138967, -125084, -152469, -107278, -90667, -110858, -93400, -81654, -56455, -40279, -24803, -13943, -13385, -55258, -38825, 22405, 82222, 85586, 98903, 94742, 100570, 120205, 152802, 145563, 124063, 119413, 173997, 222134, 206306, 183844, 229461, 307866, 286009, 273766, 316297, 322312, 311840, 355216, 371671, 371788, 340385, 364986, 395409, 394353, 398897, 404414, 459472, 475990, 448355]
16287D48355J4480L8802p877k6126j2474M5316l153M9900L6666m3916N4514n636
16275E88851n2495O0624P3314k9167Q101K5796J8303q120k8815K5451O2443j2318
16263G31968m181j8913j5819l287N8984Q7789J9989m0955m282K5286j3410L7527
16251H60696N3660K0535n3041K3235L4003j0311l0438o729O28K5489K7014k8947
16239I15794M5827P5544m3783J712K1297l4425L9759J8903N694K3996j2508L505
16227A061315l1540j1006J6937L0026K1056K5997k4988r2799N4836k372j5225
16216A032237J9068J9460M8988K0913J2343o2600J8563O780r910K7872L9851K5409
16204A198974k1246k0963M1515k3786l4476N826P6905Q2228l387k5807k9804n8456
$$ y = [448355, 462835, 501637, 493760, 467634, 455160, 500476, 497323, 547223, 583889, 539973, 594487, 588851, 536356, 596980, 670294, 641127, 649228, 675024, 693327, 685207, 656392, 681843, 744286, 731968, 727787, 708874, 693055, 689768, 748752, 836541, 856530, 815575, 811293, 836579, 823169, 860696, 914356, 934891, 881850, 905085, 939088, 928777, 898339, 891610, 892238, 917727, 944741, 915794, 961621, 1037165, 993382, 995094, 1016391, 981966, 1021725, 1040628, 1046322, 1070318, 1057810, 1061315, 1029775, 1018769, 1035706, 1065732, 1086788, 1112785, 1087797, 994998, 1049834, 1047462, 1032237, 1051305, 1070765, 1119753, 1140666, 1153009, 1090409, 1108972, 1115752, 1105842, 1133714, 1173565, 1198974, 1177728, 1156765, 1198280, 1174494, 1140018, 1145844, 1222749, 1304977, 1301590, 1275783, 1245979, 1187523]
16192A187523M9469P3751l563M3359k9901l8485J5698J0220O827j9496J9195K5641
16180A340238k325o045J1867M8576J9011l7029j7845q601j1626J9700m3304j7789
16168A294828N0107L3497o6813j2858J03283J4846k254M4020m5633q6443L768
$$ y = [1187523, 1236992, 1310743, 1307180, 1350539, 1320638, 1282153, 1297851, 1308071, 1314898, 1295402, 1314597, 1340238, 1337913, 1331868, 1343735, 1392311, 1411322, 1374293, 1356448, 1347847, 1336221, 1355921, 1312617, 1294828, 1344935, 1378432, 1311619, 1298761, 1402044, 1416890, 1414636, 1458656, 1413023, 1326580, 1330348]
$$ [...]
##END NTUPLES=NMR SPECTRUM
##END=
