##TITLE=1H_TG-2314
 CDCl3,8 sc, 
 4.02.2021
##JCAMPDX= 6.0         $$ Bruker NMR JCAMP-DX V2.0
##DATA TYPE= NMR SPECTRUM
##DATA CLASS= NTUPLES
##ORIGIN= UXNMR, Bruker Analytische Messtechnik GmbH
##OWNER= root
$$ XWIN-NMR		Version 3.5
$$ Thu Feb  4 11:12:18 2021 Russian Standard Time (UT+4h)  she@DPX200
##.OBSERVE FREQUENCY= 200.1315066352
##.OBSERVE NUCLEUS= ^1H
##.ACQUISITION MODE= SIMULTANEOUS
##.ACQUISITION SCHEME= undefined
##.AVERAGES= 8
##.DIGITISER RES= 18
##SPECTROMETER/DATA SYSTEM= spect
##.PULSE SEQUENCE= zg30
##.SOLVENT NAME= D2O
##.SHIFT REFERENCE= (INTERNAL, D2O, 0, 15.9823)
##AUDIT TRAIL= $$ (NUMBER, WHEN, WHO, WHERE, WHAT)
$$ ##TITLE= Audit trail, XWIN-NMR		Version 3.5
$$ ##JCAMPDX= 5.01
$$ ##ORIGIN= Bruker BioSpin GmbH
$$ ##OWNER= she
$$ F:/spectra/data/she/nmr/H-F/1/pdata/1/auditp.txt
$$ ##AUDIT TRAIL=  $$ (NUMBER, WHEN, WHO, WHERE, WHAT)
(   1,<2021-02-04 11:11:07.68 +0400>,<she>,<DPX200>,
      <created by zg, POWCHK disabled, PULCHK disabled
       configuration hash MD5:
       00 E9 B6 7A A2 85 ED C7 34 08 36 98 17 FE 4E 26
       data hash MD5: 16K
       21 97 CA 73 3A 04 86 C1 09 C2 96 5A F2 E9 07 48>)
(   2,<2021-02-04 11:11:11.12 +0400>,<she>,<DPX200>,
      <Start of raw data processing
       efp BC_mod = 2 LB = 0.24 FT_mod = 6 PKNL = 1 PHC0 = -10406.73 PHC1 = 21.60095 SI = 16K 
       data hash MD5: 16K
       0B 43 8F 78 1A 80 38 CC DD A9 28 E0 68 FF 94 AE>)
(   3,<2021-02-04 11:11:32.14 +0400>,<she>,<DPX200>,
      <pk PHC0 = 9.0891 PHC1 = -14.4 
       data hash MD5: 16K
       01 0C 40 BC D5 A2 FE E9 D9 CF F7 46 11 8B 94 B3>)
(   4,<2021-02-04 11:11:35.28 +0400>,<she>,<DPX200>,
      <abs ABSG = 5 
       data hash MD5: 16K
       03 05 A4 69 8B 65 D9 16 2C 3D 8D C8 4A FB 73 CC>)
$$ ##END=
$$ 
$$ hash MD5
$$ 8B 0D FC F5 0D EB 75 CE 0E 34 77 A0 B1 6B 02 37
##$RELAX= 
##$RELAX= 
##$RELAX= 
##$RELAX= 
##$RELAX= 
##$RELAX= 
$$ Bruker specific parameters
$$ --------------------------
##$DU= <F:/spectra>
##$EXPNO= 1
##$NAME= <H-F>
##$PROCNO= 1
##$TYPE= <nmr>
##$USER= <she>
##$AMP= (0..31)
100 100 100 100 100 100 100 100 100 100 100 100 100 100 100 100 100 100 
100 100 100 100 100 100 100 100 100 100 100 100 100 100 
##$AQSEQ= 0
##$AQ_mod= 1
##$AUNM= <au_zg>
##$AUTOPOS= <>
##$BF1= 200.13
##$BF2= 200.13
##$BF3= 200.13
##$BF4= 200.13
##$BF5= 200.13
##$BF6= 200.13
##$BF7= 200.13
##$BF8= 200.13
##$BYTORDA= 1
##$CFDGTYP= 0
##$CFRGTYP= 5
##$CHEMSTR= <none>
##$CNST= (0..31)
1 1 145 1 1 1 1 1 1 1 1 1 1 1 1 1 1 1 1 1 1 1 1 1 1 1 1 1 1 1 1 1 
##$CPDPRG= <>
##$CPDPRG1= <>
##$CPDPRG2= <>
##$CPDPRG3= <>
##$CPDPRG4= <mlev>
##$CPDPRG5= <mlev>
##$CPDPRG6= <mlev>
##$CPDPRG7= <mlev>
##$CPDPRG8= <mlev>
##$CPDPRGB= <>
##$CPDPRGT= <>
##$D= (0..31)
0 1.2 0 0 0 0 0 0 0 0.06 0 0.03 0 0 0 0 0.0002 0 0 0 0 0 0 0 0 0 0 0 0 
0 0 0 
##$DATE= 1612422667
##$DBL= (0..7)
120 120 120 120 120 120 120 120 
##$DBP= (0..7)
150 150 150 150 150 150 150 150 
##$DBP07= 0
##$DBPNAM0= <>
##$DBPNAM1= <>
##$DBPNAM2= <>
##$DBPNAM3= <>
##$DBPNAM4= <>
##$DBPNAM5= <>
$$ [...]
##$SUBNAM3= <"">
##$SUBNAM4= <"">
##$SUBNAM5= <"">
##$SUBNAM6= <"">
##$SUBNAM7= <"">
##$SUBNAM8= <"">
##$SUBNAM9= <"">
##$SW= 16.9725356469052
##$SWIBOX= (0..15)
0 0 2 0 0 0 0 0 0 0 0 0 0 0 0 0 
##$SW_h= 3396.73913043478
##$TD= 16384
##$TD0= 1
##$TE= 0
##$TE2= 300
##$TE3= 300
##$TEG= 300
##$TL= (0..7)
0 120 120 120 120 120 120 120 
##$TP= (0..7)
150 150 150 150 150 150 150 150 
##$TP07= 0
##$TPNAME0= <>
##$TPNAME1= <>
##$TPNAME2= <>
##$TPNAME3= <>
##$TPNAME4= <>
##$TPNAME5= <>
##$TPNAME6= <>
##$TPNAME7= <>
##$TPOAL= (0..7)
0.5 0.5 0.5 0.5 0.5 0.5 0.5 0.5 
##$TPOFFS= (0..7)
0 0 0 0 0 0 0 0 
##$TUNHIN= 0
##$TUNHOUT= 0
##$TUNXOUT= 0
##$USERA1= <user>
##$USERA2= <user>
##$USERA3= <user>
##$USERA4= <user>
##$USERA5= <user>
##$V9= 5
##$VALIST= <valist>
##$VCLIST= <CCCCCCCCCCCCCCC>
##$VD= 0
##$VDLIST= <DDDDDDDDDDDDDDD>
##$VPLIST= <PPPPPPPPPPPPPPP>
##$VTLIST= <TTTTTTTTTTTTTTT>
##$WBST= 1024
##$WBSW= 4
##$XGAIN= (0..3)
0 0 0 0 
##$XL= 0
##$YL= 0
##$YMAX_a= 720452
##$YMIN_a= -318311
##$ZGOPTNS= <>
##$ZL1= 120
##$ZL2= 120
##$ZL3= 120
##$ZL4= 120
##$ABSF1= 16.02479
##$ABSF2= -0.9478741
##$ABSG= 5
##$ABSL= 3
##$ALPHA= 0
##$AQORDER= 0
##$ASSFAC= 0
##$ASSFACI= 0
##$ASSFACX= 0
##$ASSWID= 0
##$AUNMP= <proc_1d>
##$AZFE= 0.1
##$AZFW= 0.1
##$BCFW= 0
##$BC_mod= 2
##$BYTORDP= 0
##$COROFFS= 0
##$CY= -3
##$DATMOD= 1
##$DC= 0
##$DFILT= <>
##$DTYPP= 0
##$F1P= 0
##$F2P= 0
##$FCOR= 1
##$FTSIZE= 16384
##$FT_mod= 6
##$GAMMA= 0
##$GB= 0
##$INTBC= 1
##$INTSCL= 2.992141e-10
##$ISEN= 128
##$LB= 0.24
##$LEV0= 0
##$LPBIN= 0
##$MAXI= 10000
##$MC2= 0
##$MEAN= 0
##$ME_mod= 0
##$MI= 1.114404
##$NCOEF= 0
##$NC_proc= -5
##$NLEV= 6
##$NOISF1= 3.799351
##$NOISF2= 2.8
##$NSP= 0
##$NTH_PI= 0
##$NZP= 0
##$OFFSET= 15.98232
##$PC= 1
##$PHC0= -10397.64
##$PHC1= 7.200951
##$PH_mod= 1
##$PKNL= yes
##$PPARMOD= 0
##$PSCAL= 0
##$PSIGN= 0
##$REVERSE= no
##$SF= 200.130006464681
##$SI= 16384
##$SIGF1= 3
##$SIGF2= 2
##$SINO= 5.538805
##$SIOLD= 16384
##$SREGLST= <1H.CDCl3>
##$SSB= 0
##$STSI= 16384
##$STSR= 0
##$SW_p= 3396.73913043478
##$SYMM= 0
##$S_DEV= 0
##$TDeff= 16384
##$TDoff= 0
##$TI= <>
##$TILT= no
##$TM1= 0
##$TM2= 0
##$TOPLEV= 0
##$USERP1= <user>
##$USERP2= <user>
##$USERP3= <user>
##$USERP4= <user>
##$USERP5= <user>
##$WDW= 1
##$XDIM= 16384
##$YMAX_p= 360627764
##$YMIN_p= -308244
$$ End of Bruker specific parameters
$$ ---------------------------------
##NTUPLES= NMR SPECTRUM
##VAR_NAME=  FREQUENCY,     SPECTRUM/REAL,   SPECTRUM/IMAG
##SYMBOL=    X,             R,               I
##VAR_TYPE=  INDEPENDENT,   DEPENDENT,       DEPENDENT
##VAR_FORM=  AFFN,          ASDF,            ASDF
##VAR_DIM=   16384,         16384,           16384
##UNITS=     HZ,            ARBITRARY UNITS, ARBITRARY UNITS
##FACTOR=    0.207333158178281, 1,           1
##FIRST=     3198.54177126837, 0,            0
##LAST=      -198.197359166411, 0,           0
##MIN=       -198.197359166411, -308244,     0
##MAX=       3198.54177126837, 360627764,    0
$$ Real data points
##PAGE= N=1
##DATA TABLE= (X++(R..R)), XYDATA
$$ [...]
6095A132058n7689p9208n7694j3740K1737j11145P9386n4065Q810q6319J01868
$$ 1132058 1074369 995161 937467 923727 945464 834319 913705 859640 868450 782131 883999
6084H83999j5817M7378J6582K8384n8612l7180K8129o9945k5841m5133n7850N6089
$$ 883999 868182 915560 932142 960526 901914 864734 892863 822918 797077 751944 694094 750183
6072G50183J1835j48546N8425l1773r793N9803K1159o5857O9354l4960k624k0311
$$ 750183 762018 613472 671897 640124 630331 690134 711293 645436 714790 679830 677206 656895
6060F56895m7028m2548n329o3477K2209r682m4204p66K0142N5110l3790j32205
$$ 656895 609867 567319 561990 498513 520722 511040 466836 466070 486212 541322 507532 375327
6048C75327M7608Q4334M2317l4661p9389J58107m5759m9127n7907J48671r4401
$$ 375327 422935 507269 549586 514925 435536 593643 547884 498757 440850 589521 495120
6037D95120l9573J19583n933L795K2775N7537K3640m4186R2034o0952O380m9142
$$ 495120 455547 575130 569197 572992 595767 653304 676944 632758 724792 663840 670220 621078
6025F21078J4777m8643KJ7332O1362o7295k7588k353l7750j6872m6954l172m8806
$$ 621078 635855 587212 587214 604546 665908 598613 571025 568672 530922 514050 467096 463924 415118
6012D15118J02845l6637J19334K5431Q614J17511M7743j26019j122L538K8263
$$ 415118 517963 481326 600660 626091 634705 752216 799959 673940 672818 676356 704619
6001G04619m226R1569O490J05596p1960o7511l4589O0985p8871m8520q411p3511
$$ 704619 700393 791962 798452 904048 832088 764577 729988 790973 712102 663582 655171 581660
5989E81660j7493L6030n5141Q8784m944m2389J06916l8028j22827k1766P9696
$$ 581660 564167 600197 545056 633840 628896 586507 693423 655395 532568 510802 590498
5978E90498q7028L3375Q050j03007k2261L4900k3171l3703Q2902R71o1824L8939
$$ 590498 503470 536845 544895 441888 419627 454527 431356 397653 480555 481526 419702 458641
5966D58641J0943R53k8836k8383m252O3507q7580o0038Q7209M8669o3013M1832
$$ 458641 469584 470537 441701 413318 409066 472573 384993 324955 412164 460833 397820 439652
5954D39652P3948m9644O1438K0955Q8508K2777N278R1580K1922n6456Q990L6946
$$ 439652 513600 463956 525394 546349 634857 657634 662912 754492 776414 719958 728948 765894
5942G65894j01956j7570L6293K7584m0784M3450J21558O6144k9481q7382j1086
$$ 765894 663938 646368 682661 710245 669461 712911 834469 900613 871132 783750 772664
5931G72664K792j01450K5363l6700o9618N3317p7519l3984j3445L792k3203m2100
$$ 772664 775456 674006 699369 662669 593051 646368 568849 534865 521420 525212 502009 459909
5919D59909k6866J8114K2164j45822N6756L2239o369p8760l8622R1343M1245j1224
$$ 459909 433043 451157 473321 327499 384255 416494 410125 331365 292743 384086 425331 414107
5907D14107L7424m0688M2011k0425q360j7343K4159m9659j8496r1094l0488N6580
$$ 414107 451531 410843 452854 432429 424069 406726 430885 381226 362730 271636 241148 297728
5895B97728m3253K4930m2833n2990j3921N0691k669L5621J7403m133J9061n2062
$$ 297728 254475 279405 236572 183582 169661 220352 217683 253304 270707 266574 285635 233573
5883B33573k2624q4845j2586N9514j4124O4660O8500n187O4567L7935l1967O8305
$$ 233573 210949 126104 113518 173032 158908 223568 292068 286881 351448 389383 357416 425721
5871D25721j09847j51120K5354j5693j28993P2990M6192N4610P9811k7372j0127
$$ 425721 315874 164754 190108 174415 45422 118412 164604 219214 299025 271653 261526
5860B61526J9046M0586k7592p541K7920O0193N2209j09128J5180j8333J7594r0416
$$ 261526 280572 321158 293566 286025 313945 374138 426347 317219 332399 314066 331660 241244
5848B41244L508Q8527k2963m7020N6595O0940j0570m4081Q2594M3893o3373Q1692
$$ 241244 244752 333279 310316 263296 319891 380831 370261 326180 408774 452667 389294 470986
5836D70986N0709l0164p6014R117m236p2426J071p0738n9794K7232o675L0222
$$ 470986 521695 491531 415517 424634 420398 347972 349043 278305 218511 245743 239068 269290
5824B69290k6615N6780P0240P6893l6527l2177L8168q9520j36652J853M0405p0987
$$ 269290 242675 299455 369695 446588 410061 377884 416052 326532 189880 191733 232138 161151
5812A61151M1429J5544Q771R6589k1321j3797P5115J0335o0444o6743L6101L8876
$$ 161151 202580 218124 226895 323484 302163 288366 363481 373816 313372 246629 282730 321606
5800C21606o0208r7801Q5779O5166r3387M6564O761J8947j8252K1037j0351J1536
$$ 321606 261398 163597 249376 314542 221155 267719 274480 293427 275175 296212 285861 297397
5788B97397R5420K4219o3234k7781l0055R108R114j08183O9348J33986N662P87
$$ 297397 392817 417036 353802 326021 295966 305074 314188 206005 275353 409339 415001 415788
5776D15788O3898Q9305K4124j8229R3922j7046J0303N0529q75m9806M7026l8569
$$ 415788 479686 568991 593115 574886 668808 651762 662065 712594 711719 661913 708939 670370
5764F70370j00231j5294k7219q5851k0845l4586J9050r305l5699K5077K7518J17107
$$ 670370 570139 554845 527626 441775 420930 386344 405394 396089 360390 385467 412985 530092
5752E30092n8391k2166L912J7372j15861k0884M994m8213K5881O3614l6185p9160
$$ 530092 471701 449535 453447 470819 354958 334074 339068 290855 316736 380350 344165 265005
5740B65005J2123p340M885L442j5722l418L3415j05332O0222O5334m1893o742
$$ 265005 277128 269788 274673 278115 262393 258975 292390 187058 247280 312614 270721 263979
5728B63979K192p3115K4162K969q443n0420k2153J25717o954k9847L1405P4168
$$ 263979 266171 193056 217218 220187 211744 161324 139171 264888 257934 228087 259492 333660
5716C33660k4375m6210J6153N9340l7974j31407O6781J45574j02395M0346O3680
$$ 333660 309285 263075 279228 338568 300594 169187 235968 381542 279147 319493 383173
5705C83173j1209r8051R2192o5695j059K8825o975R562O5640J07085o474P9927
$$ 383173 371964 273913 366105 300410 299351 328176 321201 330763 396403 503488 497014 576941
5693E76941J4382p0833L2010r4582j72489P0705r413k9416P976Q0938r750J52644
$$ 576941 591323 520490 552500 457918 285429 356134 346721 317305 325281 406219 396469 549113
5681E49113J05562n9440j4567P4791o1840m1106P993j4210q8148J3364L1588j202
$$ 549113 654675 595235 580668 655459 593619 552513 560506 546296 458148 471512 503100 501898
5669E01898K0356l2205J6740L6654O4228l1546Q0493m8116j3978N5880p464j12960
$$ 501898 522254 490049 506789 543443 607671 576125 656618 608502 594524 650404 642940 529980
5657E29980j3747L1925o5760R064P6909l7748j7797m358L9097P6849k5484l0570
$$ 529980 516233 548158 482398 491462 568371 530623 512826 508468 547565 624414 598930 568360
5645E68360j7326K6560L6583j7038k1613j1630K8558o9841J1005j6329j1406O7114
$$ 568360 551034 577594 614177 597139 575526 563896 592454 522613 533618 517289 505883 572997
5633E72997M4776J3565N394P6717k8089j1696q4925q7580m4818l363r3609Q6711
$$ 572997 617773 631338 636732 713449 685360 673664 588739 501159 456341 452978 359369 446080
5621D46080N1065J23582k051P6799M6720n0870l6478q192q1950Q2977q713k7641
$$ 446080 497145 620727 618676 695475 742195 691325 654847 646655 564705 647682 638969 611328
5609F11328l9539p050q905J1325N574K1485R6021m129j907J4514M624l9291j1528
$$ 611328 571789 564739 555834 567159 572733 594218 690239 686110 684203 698717 703341 664050 652522
5596F52522M8014M5345k6697l308p2067M4174j4000p628K3713J45721p9164L422
$$ 652522 700536 745881 719184 715876 643809 687983 673983 666355 690068 835789 756625 760047
5584G60047J07361j15152k60m9729N5341L6881r2158M1556j7105J4525M8769o9945
$$ 760047 867408 752256 751996 702267 757608 794489 702331 743887 726782 741307 790076 720131
5572G20131N9235J12318n7870l9475Q432r721o4563O9989j44839M2286M6784p1835
$$ 720131 779366 891684 833814 794339 802771 793050 728487 798476 653637 695923 742707 670872
5560F70872K0784J5290j7758L5211l1264K7185r09J09242o5555j3108M3955R7075
$$ 670872 691656 706946 689188 724399 693135 720320 719411 828653 763098 749990 793945 891020
5548H91020k6467n3805L7241k3653R187j0125o262q6355J29944j4561R0472J1868
$$ 891020 864553 810748 847989 824336 833523 823398 817136 730781 860725 846164 936636 948504
5536I48504O1995l189k4530m7103M4859M7648j66910J3940N1275r553L5807P4627
$$ 948504 1010499 1007310 982780 935677 980536 1028184 861274 875214 926489 916936 952743 1027370
5524A027370P1329Q3792m255R694k6563o1849o5540J505J5966M2922L2934j8794
$$ 1027370 1098699 1182491 1178236 1187930 1161367 1099518 1033978 1035483 1051449 1094371 1127305 1108511
5512A108511N8501p3783o757M1662j7173M9377o3716p1922p768L7385K0311M1590
$$ 1108511 1167012 1093229 1086472 1128134 1110961 1160338 1096622 1024700 1016932 1054317 1074628 1116218
5500A116218O6773J40635L6888j18993Q6065n1824n4985Q241k2043M3860J57862
$$ 1116218 1182991 1323626 1360514 1241521 1327586 1275762 1220777 1229018 1206975 1250835 1408697
5489A408697l5571k4763Q1150k986K9215k4046L691L7450L3436j05483O5220Q35
$$ 1408697 1373126 1348363 1429513 1426527 1455742 1431696 1435387 1472837 1506273 1400790 1466010 1466845
5477A466845o9308P9629J17461K1467L8678k2849N3751N0004o150P8528j0618
$$ 1466845 1397537 1477166 1594627 1616094 1654772 1631923 1685674 1735678 1729528 1808056 1797438
5466A797438Q4785J5460P0709l7013N9857N6906J7076R9529K077j7131R3579m0222
$$ 1797438 1882223 1897683 1968392 1931379 1991236 2048142 2065218 2164747 2166824 2149693 2243272 2203050
5454B203050J3184j1373M1692n802q121R1569r704J05957J76799Q432K3607J50080
$$ 2203050 2216234 2204861 2246553 2240751 2232630 2324199 2314495 2420452 2597251 2605683 2629290 2779370
5442B779370J8353p8453K3514p9758N3102P5603K5675O5233J3113J8753j1921
$$ 2779370 2797723 2719270 2742784 2663026 2716128 2791731 2817406 2882639 2895752 2914505 2902584
5431B902584L7490K8284L8682N8323R598j3061J16177k4662P0319P7652J14801
$$ 2902584 2940074 2968358 3007040 3065363 3074961 3061900 3178077 3153415 3223734 3301386 3416187
5420C416187o4879R1833P213j3450K6548k7674J00488J04250N0604N9402J15270
$$ 3416187 3351308 3443141 3450354 3436904 3463452 3435778 3536266 3640516 3691120 3750522 3865792
5409C865792M2352L9720J38483M4540j4670J56635K3126M3771j30667N2287J02027
$$ 3865792 3908144 3947864 4086347 4130887 4116217 4272852 4295978 4339749 4209082 4261369 4363396
5398D363396J12600q19R3799J33661J35509J07747n763P9391R5721l4514Q2465
$$ 4363396 4475996 4475177 4568976 4702637 4838146 4945893 4940130 5019521 5115242 5080728 5163193
5387E163193P9951j4152J14660o2529J37893P1225J24679R0188J29458N0371J77406
$$ 5163193 5243144 5228992 5343652 5281123 5419016 5490241 5614920 5705108 5834566 5884937 6062343
5376F062343k9964O85J20700J06339J26688P1319K9004J00034J70859K961J46249
$$ 6062343 6032379 6033064 6153764 6260103 6386791 6458110 6487114 6587148 6758007 6760968 6907217
5365F907217Q3440J13569P8998J32704L6386J17642M2384J42583J33304R4740
$$ 6907217 6990657 7104226 7183224 7315928 7352314 7469956 7512340 7654923 7788227 7882967
5355G882967J10393J25489J50851J05761Q1714J42587J41447K3626J37128J64486
$$ 7882967 7993360 8118849 8269700 8375461 8457175 8599762 8741209 8764835 8901963 9066449
5345I066449Q5416J63928O0720M1277K00367L5230M2811R9658O1910K9118R1869
$$ 9066449 9151865 9315793 9376513 9417790 9618157 9653387 9696198 9795856 9857766 9886884 9978753
5334I978753R7719J26279L7972Q8527P180P8006J2100N8691Q5786R0871M5763
$$ 9978753 10076472 10202751 10240723 10329250 10336430 10414436 10426536 10485227 10571013 10661884 10707647
5323A0707647N8778M8159N8362O0982l6728R657K0873l1181J01658J2406K5565
$$ 10707647 10766425 10814584 10872946 10933928 10897200 10906857 10927730 10896549 10998207 11010613 11036178
5312A1036178R9074p0848p6946m4521N9146m3385o3138k5913N220o7541m5455
$$ 11036178 11135252 11064404 10987458 10942937 11002083 10958698 10895560 10869647 10874867 10807326 10761871
5301A0761871m1763q5583q4452l202q8421L3222j52108n2688P503l7024r5898
$$ 10761871 10720108 10634525 10550073 10546871 10458450 10491672 10339564 10286876 10294379 10257355 10161457
5290A0161457o8054o3696L4620j68680l7523R737j77128j5511j24583q8134p4129
$$ 10161457 10093403 10029707 10064327 9895647 9858124 9867861 9690733 9675222 9550639 9462505 9388376
5279I388376J31340j33273J3801p1111j5548n1490m417j09521L8139N0267r715
$$ 9388376 9519716 9386443 9400244 9329133 9313585 9262095 9257678 9148157 9186296 9236563 9226848
5268I226848L2295L2644J2159r702M7464p5390j5053j2799K0977r7871J1594n1997
$$ 9226848 9259143 9291787 9303946 9294244 9341708 9266318 9251265 9238466 9259443 9161572 9173166 9121169
5256I121169j5673o155j7238L0001n284j25478L8817J10963k4893n7380J47091
$$ 9121169 9105496 9099341 9082103 9112104 9106820 8981342 9020159 9131122 9106229 9048849 9195940
5245I195940o7697O1081n8957p3389j3552j7728o2046L9669k5236j5761M6097
$$ 9195940 9128243 9189324 9130367 9056978 9043426 9025698 8963652 9003321 8978085 8962324 9008421
5234I008421k6824q0314o8437k1549p0320N351k4809J7165n0318r1q011k8626
$$ 9008421 8981597 8901283 8832846 8811297 8740977 8746328 8721519 8738684 8688366 8688275 8680264 8651638
5222H651638j35638N4418J6969j62466l8404J24387j23121k8928r6032q3243q5112
$$ 8651638 8516000 8570418 8587387 8424921 8386517 8510904 8387783 8358855 8262823 8179580 8094468
5211H094468j14133p0411R065j07406p7380j1923j01941K8672n0158p0934j1514
$$ 8094468 7980335 7909924 7918989 7811583 7734203 7722280 7620339 7649011 7598853 7527919 7516405
5200G516405j0198n3085k5344j48182k760j7793j20050J9955Q7743J10635k6869
$$ 7516405 7506207 7453122 7427778 7279596 7276836 7259043 7138993 7158948 7246691 7357326 7330457
5189G330457m9518O9080j3111j74870k8254J4734r8519J4140J3829J06722O0103
$$ 7330457 7280939 7350019 7336908 7162038 7133784 7148518 7049999 7064139 7077968 7184690 7244793
5178G244793Q5244J30742J94618J50679J28527J70437J73508J70723K19682L05549
$$ 7244793 7330037 7460779 7655397 7806076 7934603 8105040 8278548 8449271 8668953 8974502
5168H974502M18009N96413O14992P73752J061091J250737J326863Q67697J46601
$$ 8974502 9392511 9988924 10603916 11377668 12438759 13689496 15016359 15884056 16030657
5159A6030657k01449l38430m53667n50256n08371l42635j11293K77365O85397
$$ 16030657 15829208 15490778 15037111 14486855 13978484 13635849 13524556 13801921 14487318
5150A4487318Q58755P74462K49465k74959p77463q54229r95032j032396j160197
$$ 14487318 15346073 16120535 16370000 16095041 15317578 14463349 13468317 12435921 11275724
5141A1275724j004673q57462o41081l80127m39559j78985j89604k15253j65731
$$ 11275724 10271051 9413589 8772508 8392381 7952822 7773837 7584233 7368980 7203249
5132G203249j05433r9264q3367L3885R169k4758n2839L8057J21037k4656P8425
$$ 7203249 7097816 6998552 6915185 6949070 6958239 6933481 6880642 6918699 7039736 7015080 7093505
5121G093505J76038L23574K50152L06478M00794L92834M43518M70492O19140P83159
$$ 7093505 7269543 7593117 7843269 8149747 8550541 8943375 9386893 9857385 10476525 11259684
5111A1259684R75042J118572J356481J748864J672683R88452J91762l56514m04025
$$ 11259684 12234726 13353298 14709779 16458643 18131326 19119778 19311540 18955026 18551001
5102A8551001n06797p76074q10741l74991j83635K50971P99786J012526Q77585
$$ 18551001 18044204 17268130 16457389 16082398 15898763 16149734 16949520 17962046 18839631
5093A8839631J60853p12931j162362j225124j231141j535481j450830j200632
$$ 18839631 19000484 18287553 17125191 15900067 14668926 13133445 11682615 10481983
5085A0481983r52576q63740o78307l90690m60777l76290k75781k18252k85830
$$ 10481983 9529407 8665667 7987360 7596670 7135893 6759603 6483822 6265570 5979740
5076E979740j49672j11038n1011j42980j65218j62574p0300j45419j45992K2984
$$ 5979740 5830068 5719030 5668019 5525039 5359821 5197247 5126947 4981528 4835536 4858520
5066D858520L5265q3264P5184o6227j58070l6076L9501o8288k52258J6001k7386
$$ 4858520 4893785 4810521 4885705 4819478 4661408 4625332 4664833 4596545 4344287 4360288 4332902
5055D332902n1767n0449m398M9550o4952j4467q5633J6320n8911j8730N7685q7205
$$ 4332902 4281135 4230686 4226288 4275838 4210886 4196419 4110786 4127106 4068195 4049465 4107150 4019945
5043D019945j8351J6987J9942m7940k9345L9195r44j04592n3463M9145n2385o8351
$$ 4019945 4001594 4018581 4038523 3990583 3961238 4000433 3999489 3894897 3841434 3890579 3838194 3769843
5031C769843J45090l8606p1229K4229N1659j16685k0626R2811K0593l9609Q28
$$ 3769843 3914933 3876327 3805098 3829327 3880986 3764301 3743675 3836486 3857079 3817470 3818298
5020C818298J50563l9454q9857m2345K8432m3288l5459j4531M4075N5336k3390
$$ 3818298 3968861 3929407 3839550 3797205 3825637 3782349 3746890 3732359 3776434 3831770 3808380
5009C808380M0007J99735K2467O4640J6444j2574R4803J89480l1035K7114L02524
$$ 3808380 3848387 4048122 4070589 4135229 4151673 4139099 4233902 4423382 4392347 4419461 4721985
4998D721985J15879J05621J57163J43284J58063O405o195J07983K738m5458J33857
$$ 4721985 4837864 4943485 5100648 5243932 5401995 5408400 5402205 5510188 5512926 5467468 5601325
4987E601325P6495J02999K93136J10527K23764J4084J99852O1703r116P2466J43061
$$ 5601325 5677820 5780819 6073955 6184482 6408246 6422330 6622182 6683885 6674769 6747235 6890296
4976F890296j034m2267J13283P359J08457k991Q2742J95550M4232R1582J93839
$$ 6890296 6889262 6846995 6960278 6967637 7076094 7073103 7155845 7351395 7395627 7487209 7681048
4965G681048M6014J27936J43122K12351P8816J78814J28327J81569J40936J34188
$$ 7681048 7727062 7854998 7998120 8210471 8289287 8468101 8596428 8777997 8918933 9053121
4955I053121K65092J47943K28067L27889K51003K15336K27628K34489J73221K13994
$$ 9053121 9318213 9466156 9694223 10022112 10273115 10488451 10716079 10950568 11123789 11337783
4945A1337783L28673J17330K72390K05038K53643J44442K68586K29983L45535
$$ 11337783 11666456 11783786 12056176 12261214 12514857 12659299 12927885 13157868 13503403
4936A3503403L08425L67068M48068L99694L62476M75424N53540L88611N75208
$$ 13503403 13811828 14178896 14626964 15026658 15389134 15864558 16418098 16806709 17381917
4927A7381917N42098O16583M30647O38910P74210P02224P51464R83051J071000
$$ 17381917 17924015 18540598 18971245 19610155 20384365 21086589 21838053 22821104 23892104
4918B3892104R08872R19623P90942N50407M63135N74055O92681O44528O20627
$$ 23892104 24800976 25720599 26511541 27061948 27525083 28099138 28791819 29436347 30056974
4909C0056974Q59115Q21750Q25469J074417J239812J236278J258908J407647J605657
$$ 30056974 30916089 31737839 32563308 33637725 34877537 36113815 37372723 38780370 40386027
4900D0386027J727561J778449K081097K368136K522068K903343L253648L713745
$$ 40386027 42113588 43892037 45973134 48341270 50863338 53766681 57020329 60734074
4892F0734074M358164M844641N561721O080842O829323P503501P744829P842420
$$ 60734074 65092238 69936879 75498600 81579442 88408765 95912266 103657095 111499515
4884A11499515P878796P833673P612098P433627O713894N308457L220812R04152
$$ 111499515 119378311 127211984 134824082 142257709 148971603 154280060 157500872 158405024
4876A58405024j103824k525590l540862m535888n719485o914904p864035q368244
$$ 158405024 157301200 154775610 151234748 146698860 140979375 134064471 126200436 117832192
4868A17832192q382885q051708p564989p227516o659113o146631n569415n048810
$$ 117832192 109449307 101397599 93832610 86605094 79945981 73799350 68229935 63181125
4860F3181125m509100l991342l477816l072630k780454k317784k035012j811725
$$ 63181125 58672025 54680683 51202867 48130237 45349783 43031999 40996987 39185262
4852C9185262j569399j428734j305922j192957j111276q98879q99807p59659o42652
$$ 39185262 37615863 36187129 34881207 33688250 32576974 31678095 30778288 30018629 29375977
4843B9375977n72804m67710l86952n77946p61902p28458q23547q87987p29956
$$ 29375977 28803173 28335463 27948511 27370565 26608663 25880205 25056658 24168671 23438715
4834B3438715p71594q69606r18770r47726q05282o70723n94400o53326m73218
$$ 23438715 22667121 21797515 20878745 19931019 19125737 18455014 17860614 17207288 16734070
4825A6734070m06557l99244m72624l71327k66830l21799j28331j71370j53479
$$ 16734070 16327513 15928269 15455645 15084318 14817488 14495689 14367358 14195988 14042509
4816A4042509L4344j12708N693R6757N3329M1339J71070L12153M02096N07061
$$ 14042509 14076853 13964145 13969838 14066595 14119924 14161263 14332333 14644486 15046582 15553643
4806A5553643P18640R11758J095591Q82269N78832j03792m90742r85342q09668
$$ 15553643 16272283 17184041 18279632 19161901 19740733 19636941 19146199 18160857 17351189
4797A7351189p10676q22911j105031j232994j012126r48847o81603n44275l25861
$$ 17351189 16640513 15817602 14712571 13479577 12467451 11518604 10837001 10292726 9966865
4788I966865l27075p6501r6792l6256P2841J16447J35634L07426M27502O59317
$$ 9966865 9639790 9563289 9466497 9430241 9503082 9619529 9755163 10062589 10490091 11149408
4778A1149408O12522R95338J238639J209112Q87820L65812j67116o30066q24686
$$ 11149408 11761930 12757268 13995907 15205019 16092839 16458651 16291535 15661469 14836783
4769A4836783n81874m92217p76714j006099j038974r12042o93427n61870m05504
$$ 14836783 14254909 13762692 12985978 11979879 10940905 10028863 9335436 8773566 8368062
4760H368062j33302j21953N849O3711J53011K36078L77510L65308M48105O81017
$$ 8368062 8234760 8112807 8118656 8182367 8335378 8571456 8948966 9314274 9762379 10443396
4750A0443396P36155Q61861P68003L94863l6842l56472o33178n63569l95705m93770
$$ 10443396 11179551 12041412 12809415 13204278 13167436 12810964 12177786 11614217 11218512 10724742
4740A0724742p09697p60938q11857n55450m70242l93647k51540j53139m6009k9028
$$ 10724742 10015045 9254107 8442250 7886800 7416558 7022911 6771371 6618232 6572223 6543195
4730F543195L0057J12486J21932J46025L66923K75867M23688O12315P15913R78531
$$ 6543195 6573252 6685738 6807670 6953695 7320618 7596485 8020173 8632488 9348401 10326932
4720A0326932Q50770O13540K49603k68671o35897n52548m31233n24970m94903
$$ 10326932 11177702 11791242 12040845 11772174 11136277 10583729 10152496 9627526 9132623
4711I132623q56888q78761r05423o95585m56274m87786k97264k52588k41998j73677
$$ 9132623 8275735 7396974 6491551 5795966 5339692 4851906 4554642 4302054 4060056 3886379
4701C886379j59935k44253j66956j14925j18949o9816j90278o4703J02710k52507
$$ 3886379 3726444 3482191 3315235 3200310 3081361 3011545 2821267 2756564 2859274 2606767
4691B606767j26441P884n9461J7810l0303n4777n1480k351l1600p8396r2198q5857
$$ 2606767 2480326 2488210 2428749 2446559 2416256 2361479 2309999 2307648 2276048 2197652 2105454 2019597
4679B019597N1506r2846j44186j00442P4575m3957j35254N6601K7698m0610j08628
$$ 2019597 2071103 1978257 1834071 1733629 1808204 1764247 1628993 1685594 1713292 1672682 1564054
4668A564054o8643K1026m7964k7191L344M7777P6409m1686m1269J9865Q0433o0237
$$ 1564054 1495411 1516437 1468473 1441282 1444626 1492403 1568812 1527126 1485857 1505722 1586155 1525918
4656A525918j17558r8176q0190j03355L1178k3218K9844J16353M2546o9813M8541
$$ 1525918 1408360 1310184 1229994 1126639 1157817 1134599 1164443 1280796 1323342 1253529 1302070
4645A302070m6349J7236l7202K9708o7708J13J4114o945k2999r216J4340j12379
$$ 1302070 1255721 1272957 1235755 1265463 1197755 1197868 1211982 1205037 1182038 1172822 1187162 1074783
4633A074783J0365N7097j17812J9527J49077j04793J04107L6788M1471p5698L6761
$$ 1074783 1085148 1142245 1024433 1043960 1193037 1088244 1192351 1229139 1270610 1194912 1231673
4622A231673m3325L6328j6748m3436O9833P4359L2204n4055K7236K7552o0575
$$ 1231673 1188348 1224676 1207928 1164492 1234325 1308684 1340888 1286833 1314069 1341621 1281046
4611A281046o6401J49039j4673J05035j8133N8397L397n349q2680Q8571j2610
$$ 1281046 1214645 1363684 1349011 1454046 1435913 1494310 1497707 1492358 1409678 1498249 1485639
4600A485639J381Q6643l390P1313n1800o0056P7633N0917q6384L2553J5403O1355
$$ 1485639 1487020 1573663 1570273 1641586 1589786 1529730 1607363 1658280 1571896 1604449 1619852 1681207
4588A681207L389J31496P8015K2273n2667N5589l736L1874p5696m6782j1650K4038
$$ 1681207 1684596 1816092 1894107 1916380 1863713 1919302 1915566 1947440 1871744 1824962 1813312 1837350
4576A837350L8208K2298K5733j0856J43670o460j7284K1439O5279M1545l2720
$$ 1837350 1875558 1897856 1923589 1912733 2056403 2049943 2032659 2054098 2119377 2160922 2128202
4565B128202j9120J02061K3196k6648K3025O9630l8349m2016r7857M8639O4949
$$ 2128202 2109082 2211143 2234339 2207691 2230716 2300346 2261997 2219981 2122124 2170763 2235712
4554B235712p0341K4961K3919M0080j9773r0634O904M1627J4326l1878O0315J41377
$$ 2235712 2165371 2190332 2214251 2254331 2234558 2143924 2150828 2192455 2206781 2174903 2235218 2376595
4542B376595p35J05355j8637J44865k3778K1909m5534k5738R4942j2451j03477
$$ 2376595 2375860 2481215 2462578 2607443 2583665 2605574 2560040 2534302 2629244 2616793 2513316
4531B513316K1526k9613O8801P5584L5188k4737r311J0761q4017K1517J6985N019
$$ 2513316 2534842 2505229 2574030 2649614 2684802 2660065 2650754 2661515 2577498 2599015 2616000 2621019
4519B621019M1792O5301M0017R1690M1816N069Q2569J43532m701O7580N5115J42309
$$ 2621019 2662811 2728112 2768129 2859819 2901635 2906704 2989273 3132805 3128104 3195684 3250799 3393108
4507C393108N8029M6657o9517M6384N2008j1458J35433j2875N8026M7314O3406
$$ 3393108 3451137 3497794 3428277 3474661 3526669 3515211 3650644 3637769 3695795 3743109 3806515
4496C806515k4316P4043O0595M1523j6685J11364J37595L4345M6644Q4086Q4497
$$ 3806515 3782199 3856242 3916837 3958360 3941675 4053039 4190634 4224979 4271623 4355709 4440206
4485D440206J48143P4593O2956K29199Q9448P9422J70274R7955l9183J39551O4549
$$ 4440206 4588349 4662942 4725898 4955097 5044545 5123967 5294241 5392196 5353013 5492564 5557113
4474E557113K5639R334J21234N2495N6036M6499J02642l5785J42020P6665R8350
$$ 5557113 5582752 5592086 5713320 5765815 5821851 5868350 5970992 5935207 6077227 6153892 6252242
4463F252242J81571K20883J14449K26931J59350J15860J92507J27240K06756K59238
$$ 6252242 6433813 6654696 6769145 6996076 7155426 7271286 7463793 7591033 7797789 8057027
4453H057027L16107K57021M73528M33614O82249M32261L42656L46844J00754M8975
$$ 8057027 8373134 8630155 9103683 9537297 10219546 10651807 10994463 11341307 11442061 11491036
4443A1491036Q8589J47629J25283P3235O308J36748J64490P2403J91726K05778
$$ 11491036 11579625 11727254 11852537 11925772 11932080 12068828 12233318 12305721 12497447 12703225
4433A2703225K55490K82886K39029L27325K61241K98226L64448L58881N72288
$$ 12703225 12958715 13241601 13480630 13807955 14069196 14367422 14731870 15090751 15663039
4424A5663039N29339N58946L17811K29103J67830J38909P9455J56830L65380R6340
$$ 15663039 16192378 16751324 17069135 17298238 17466068 17604977 17684432 17841262 18206642 18302982
4414A8302982J66806K48999L46068K84136L05051N52553O75271P15446Q00002
$$ 18302982 18469788 18718787 19064855 19348991 19654042 20206595 20881866 21597312 22397314
4405B2397314Q80019J280254J317115J459902J635240J941489K230874K570732
$$ 22397314 23277333 24557587 25874702 27334604 28969844 30911333 33142207 35712939
4397C5712939K855564L287299L686392L759723L327479L114663K720415J968098
$$ 35712939 38568503 41855802 45542194 49301917 52629396 55744059 58464474 60432572
4389F0432572J165188J074396J516033J248909R63772J210577J677928J800326
$$ 60432572 61597760 62672156 64188189 65437098 66400870 67611447 69289375 71089701
4381G1089701J896616J567844J299637J138231J051574J182796J238001O87486
$$ 71089701 72986317 74554161 75853798 76992029 78043603 79226399 80464400 81151886
4373H1151886L72382j34740l97206j26490J8310j33644o30168j287683k232615
$$ 81151886 81524268 81389528 80992322 80865832 80884142 80750498 80120330 78832647 76600032
4364G6600032l050277l022833k942976k977641l064537k767594k374764j919013
$$ 76600032 73549755 70526922 67583946 64606305 61541768 58774174 56399410 54480397
4356E4480397j776777j859137j875663k123335k274890j987837j654567j495403
$$ 54480397 52703620 50844483 48968820 46845485 44570595 42582758 40928191 39432788
4348C9432788j592733j843717k161651k333816k276870k022064j763864j613721
$$ 39432788 37840055 35996338 33834687 31500871 29224001 27201937 25438073 23824352
4340B3824352j483248j313842j281585j054402p97705p26300o20634n28308m98953
$$ 23824352 22341104 21027262 19745677 18691275 17893570 17167270 16546636 16018328 15519375
4331A5519375m74231k57163j59711j41685j60116j46642j89728k86705k44914
$$ 15519375 15045144 14787981 14628270 14486585 14326469 14179827 13990099 13703394 13458480
4322A3458480j77483j22211j44264k53658j40329k31656k88678k53182k27907
$$ 13458480 13280997 13158786 13014522 12760864 12620535 12388879 12100201 11847019 11619112
4313A1619112k13817k46416j83727l36810l53623j80438k20442l53248k21035
$$ 11619112 11405295 11158879 10975152 10638342 10284719 10104281 9883839 9530591 9309556
4304I309556q3758j82217j01824j56359j00908j41914l27656l77294k28247l09426
$$ 9309556 9225798 9043581 8941757 8785398 8684490 8542576 8214920 7837626 7609379 7299953
4294G299953k09935k48361j60830k04401k38738k37955k63466k60734j59723j78324
$$ 7299953 7090018 6841657 6680827 6476426 6237688 5999733 5736267 5475533 5315810 5137486
4284E137486j89572k20318k12815l27137j92207j00226j63703k5142p1643j38004
$$ 5137486 4947914 4727596 4514781 4187644 3995437 3895211 3731508 3706366 3634723 3496719
4274C496719r7528K638j65789j03542o2267j24145j12340n027j07891j5257J9236
$$ 3496719 3399191 3401829 3236040 3132498 3070231 2946086 2833746 2828719 2720828 2705571 2724807
4263B724807R1818j7855L1594k7532j07263L7824j04237p2198m0436k1679J4460
$$ 2724807 2816625 2798770 2830364 2802832 2695569 2733393 2629156 2556958 2516522 2494843 2509303
4252B509303j13812P5952K2165j9344P2664l999q850J7381L4189k08847L4534
$$ 2509303 2395491 2471443 2493608 2474264 2546928 2542929 2534079 2551460 2585649 2376802 2411336
4241B411336J23474j30053N4783J6155k8531J01800K6899m588M0920p716k8910
$$ 2411336 2534810 2404757 2459540 2475695 2447164 2548964 2575863 2571275 2612195 2604479 2575569
4230B575569Q6392M1177l1587O7743Q842K2560O0479q526m8647Q1294J49942P5165
$$ 2575569 2661961 2703138 2671551 2739294 2748136 2770696 2831175 2822649 2774002 2855296 3005238 3080403
4218C080403l9622J1873J31549R6928l1128J19344J59790J19381n1828J02727
$$ 3080403 3040781 3052654 3184203 3281131 3250003 3369347 3529137 3648518 3596690 3699417
4208C699417J87022J83449K18754L31909K53169K28525L74178L37642K84691L48577
$$ 3699417 3886439 4069888 4288642 4620551 4873720 5102245 5476423 5814065 6098756 6447333
4198F447333N83189L69922M10079L73180K88139J50601O3028M2144L2231j30321
$$ 6447333 7030522 7400444 7810523 8183703 8471842 8622443 8685471 8727615 8759846 8629525
4188H629525k35158j25579l5764k11854j49981j5088J33209P7340J86201J22456
$$ 8629525 8394367 8268788 8233024 8021170 7871189 7856101 7989310 8066650 8252851 8375307
4178H375307j07531l0782m5230o0205Q7299P0766J16387J90422L28653N53266
$$ 8375307 8267776 8236994 8191764 8131559 8218858 8289624 8406011 8596433 8925086 9478352
4168I478352O44875N77934M00495R2272j17519O2781K64313K52202J46053m5607
$$ 9478352 10123227 10701161 11101656 11193928 11076409 11139190 11403503 11655705 11801758 11756151
4158A1756151J59519L4843J18322L42387L24715L21328K73137K15839K83302K91106
$$ 11756151 11915670 11950513 12068835 12411222 12735937 13057265 13330402 13546241 13829543 14120649
4148A4120649K24895L18203L5650j68754l43624l51456K2610l8039j0588K19806
$$ 14120649 14345544 14663747 14699397 14530643 14187019 13835563 13858173 13820134 13809546 14029352
4138A4029352n1356k1079j00143Q375K5676J93891j95156l14706k79376l62301
$$ 14029352 13977996 13956917 13856774 13865149 13890825 14084716 13889560 13574854 13295478 12933177
4128A2933177m26379l08144j33772j01650k45939k60675m6232J55949L00585J88915
$$ 12933177 12506798 12198654 12064882 11963232 11717293 11456618 11410386 11566335 11866920 12055835
4118A2055835J1187k56075n54344p19965l52407l78766o41080o11306m41962k59101
$$ 12055835 12067022 11810947 11256603 10536638 10184231 9805465 9164385 8553079 8111117 7852016
4108G852016o8910N0985L3734J20582p5046j59644k12877j64341k07270k79453
$$ 7852016 7783106 7834091 7867825 7988407 7913361 7753717 7540840 7376499 7169229 6889776
4098F889776k95759j50080r8221m9202l4680l122K7513q2497j80084j33002j22123
$$ 6889776 6594017 6443937 6345716 6296514 6261834 6258712 6286225 6203728 6023644 5890642 5768519
4087E768519k56016j04902j05971j34205r7965J335O8792K16757J77608K02462
$$ 5768519 5512503 5407601 5301630 5167425 5069460 5070795 5139587 5356344 5533952 5736414
4077E736414J12801M6458N5848J55240j6O1677P9734j92083j16625J08003O2313
$$ 5736414 5849215 5895673 5951521 6106761 6106745 6168422 6248156 6056073 5939448 6047451 6109764
4066F109764N7610n2956K8129J0698L4936k1903N7171J02360p7037j11363O602
$$ 6109764 6167374 6114418 6142547 6153245 6188181 6166278 6223449 6325809 6248772 6137409 6144011
4055F144011J2720J34762M1494j01821n1985Q7663M6595j29268J4342n0543j8874
$$ 6144011 6156731 6291493 6332987 6231166 6179181 6266844 6313439 6184171 6198513 6147970 6129096
4044F129096k34424k15415j61247r7319j8115m1825q697P6005j1608J34417N2189
$$ 6129096 5894672 5679257 5518010 5420691 5402576 5360751 5352054 5428059 5416451 5550868 5603057
4033E603057p4241j14443k22588k22744k17012M0555j09378q9761j79129j70798
$$ 5603057 5528816 5414373 5191785 4969041 4752029 4792584 4683206 4593445 4414316 4243518
4023D243518j45804q9789L929j24461j02838k37189j68584m3366M1203r7817q9440
$$ 4243518 4097714 4007925 4011854 3887393 3784555 3547366 3378782 3335416 3376619 3278802 3189362
4012C189362j14895n0969o5162J74855o9914r0502L5194r9883m2569O1837j40197
$$ 3189362 3074467 3023498 2958336 3133191 3063277 2972775 3007969 2908086 2865517 2927354 2787157
4001B787157j04821j0954k20132j56186q7889q4978k29556l7530n2343L8094l9187
$$ 2787157 2682336 2671382 2451250 2295064 2207175 2122197 1892641 1855111 1802768 1840862 1801675
3990A801675l204J8107j48409j66r7749j19841P4078k0752l4006K5218O0182p7141
$$ 1801675 1798471 1816578 1668169 1668003 1570254 1450413 1524491 1503739 1469733 1494951 1555133 1477992
3978A477992J5812r2494p7574M1411r5776p2304O9873R200O156k9371J9239O7008
$$ 1477992 1493804 1401310 1323736 1365147 1269371 1197067 1266940 1276140 1282296 1252925 1272164 1339172
3966A339172p7350m8280L2250K3899p9464j0210n9199m8897l3591J3185Q1912
$$ 1339172 1261822 1213542 1245792 1269691 1190227 1180017 1120818 1071921 1038330 1051515 1133427
3955A133427p2755L8604J20365j33597k7426R7716l2470k5719O1047n0029j4842
$$ 1133427 1060672 1099276 1219641 1086044 1058618 1156334 1123864 1098145 1159192 1109163 1094321
3944A094321P0718q6030L8317l5708l3999J3237m4486n890J05869J14981o2563
$$ 1094321 1165039 1079009 1117326 1081618 1047619 1060856 1016370 1010480 1116349 1231330 1168767
3933A168767j36525N4766J33594r0513l0805O9258l982m8934o4003l7094Q9567
$$ 1168767 1032242 1087008 1220602 1130089 1099284 1168542 1164560 1115626 1051623 1014529 1104096
3922A104096n6031J17216Q867n9787j2736M4543n2260o5443J23691K0854j29891
$$ 1104096 1048065 1165281 1174148 1114361 1101625 1146168 1093908 1028465 1152156 1173010 1043119
3911A043119L5276N2191L8871l3336N1405J03083n5876q349n6409j8301l3889
$$ 1043119 1078395 1130586 1169457 1136121 1187526 1290609 1234733 1226384 1169975 1151674 1117785
3900A117785m2064M3744L1596l4286l2955M9034K3077k5094O8648R5745n0071
$$ 1117785 1075721 1119465 1151061 1116775 1083820 1132854 1155931 1130837 1199485 1295230 1245159
3889A245159r8238L3802m0908m1597O7704P6626l1141K9969N5090l6250j34909
$$ 1245159 1146921 1180723 1139815 1098218 1165922 1242548 1211407 1241376 1296466 1260216 1125307
3878A125307Q7551O6002L7088l2561K8812P5277L40j29479n6455N1651k9862o0151
$$ 1125307 1212858 1278860 1315948 1283387 1312199 1387476 1387816 1258337 1201882 1253533 1223671 1163520
3866A163520n6097O3126O0712l7295P9062Q49L2861R3799L1043p0302K3638N6036
$$ 1163520 1107423 1170549 1231261 1193966 1273028 1273877 1306738 1400537 1431580 1361278 1384916 1440952
3854A440952l3406o9880n1976R9427m4978o8750J63040l7452M2431M5903p0886
$$ 1440952 1407546 1337666 1285690 1385117 1340139 1271389 1434429 1396977 1439408 1485311 1414425
3843A414425M7944J5402p966k9628J10761J4623m3652J17524K0203n5716R2796
$$ 1414425 1462369 1477771 1469805 1440177 1550938 1565561 1521909 1639433 1659636 1603920 1696716
3832A696716K2962J6880N7853R7993p4309J9950L5249m466o887p149R4007M5388
$$ 1696716 1719678 1736558 1794411 1892404 1818095 1838045 1873294 1868828 1861941 1854792 1948799 1994187
3820A994187O7094k6178r0308J34387J7708J0527o465n95J4866K1311L9975R5329
$$ 1994187 2061281 2035103 1944795 2079182 2096890 2107417 2100952 2100357 2115223 2136534 2176509 2271838
3808B271838O1817N4976O5175J47482O67J05677N7807j8884N6406n5234n0569
$$ 2271838 2333655 2388631 2453806 2601288 2601955 2707632 2765439 2746555 2802961 2747727 2697158
3797B697158P0958P5004k7259J78140K17594K2249Q9670M8395K3447Q5509J2026
$$ 2697158 2768116 2843120 2815861 2994001 3211595 3233844 3323514 3371909 3395356 3480865 3492891
3786C492891R0307O7930J15367J08562N6001K00020R033J07276J74235r129P8967
$$ 3492891 3583198 3651128 3766495 3875057 3931058 4131078 4140111 4247387 4421622 4412493 4491460
3775D491460J00012J05148k7312K16484R0914J43523Q7192P7626K05159N8700
$$ 4491460 4591472 4696620 4669308 4885792 4976706 5120229 5207421 5285047 5490206 5548906
3765E548906M4435J19873J91266J36872O1095K49406K29950J89096K56549K66439
$$ 5548906 5593341 5713214 5904480 6041352 6102447 6351853 6581803 6770899 7027448 7293887
3755G293887K04193K23770L01890K54193K42264K92957K86906K52756K69906K60648
$$ 7293887 7498080 7721850 8023740 8277933 8520197 8813154 9100060 9352816 9622722 9883370
3745I883370L50422M54122M96762N09605P44439R20335J078091J172979J527748
$$ 9883370 10233792 10687914 11184676 11694281 12438720 13359055 14437146 15610125 17137873
3736A7137873J821540K091369K386508K717587L179270L967218M661997N389037
$$ 17137873 18959413 21050782 23437290 26154877 29334147 33301365 37963362 43352399
3728D3352399N782063M892952L713308J701949j50362j693329k794649l309575
$$ 43352399 49134462 54027414 57740722 59442671 59292309 57598980 54804331 51494756
3720E1494756l013286k945171k679506k742113l391551k840278j934219j048694
$$ 51494756 48481470 45536299 42856793 40114680 36723129 33882851 31948632 30899938
3712C0899938l14934O13410J293304J627211J611426J620856J157868J44392p38275
$$ 30899938 30585004 31198414 32491718 34118929 35730355 37351211 38509079 38653471 37915196
3703C7915196j234759k033002k501772k074248j822116k018080k037467j726073
$$ 37915196 36680437 34647435 32145663 30071415 28249299 26231219 24193752 22467679
3695B2467679j037396p37402m70063Q929L86660N96826Q76771J280361J469088
$$ 22467679 21430283 20692881 20222818 20231747 20618407 21215233 22092004 23372365 24841453
3686B4841453J513238J248416Q32025L0280n84533m68453N4919K06318K12265
$$ 24841453 26354691 27603107 28435132 28465412 27880879 27412426 27467345 27673663 27885928
3677B7885928L02782P42783J505339K509117L499743M150097L678171L093816
$$ 27885928 28188710 28931493 30436832 32945949 36445692 40595789 44273960 47367776
3669D7367776J613290l31685j264898j818415l692487m394215l367719l366966
$$ 47367776 48981066 48649381 47384483 45566068 41873581 37479366 34111647 30744681
3661C0744681m209530l867240l046653k451660j832662j468587j063278q50841
$$ 30744681 26535151 22667911 19621258 17169598 15336936 13868349 12805071 11954230
3653A1954230p47124p18459n03072o06500m65432m65172l54671l52090k75744
$$ 11954230 11207106 10488647 9985575 9379075 8913643 8448471 8093800 7741710 7465966
3644G465966l96227k81281k02515j73820q9571n7046j64656l4982j33553j23497
$$ 7465966 7069739 6788458 6585943 6412123 6322552 6265506 6100850 6065868 5932315 5808818
3634E808818j66488j93203j14159j90321k52144p6434l6986q7154q2666j05184
$$ 5808818 5642330 5449127 5334968 5144647 4892503 4816069 4779083 4691929 4609263 4504079
3624D504079M4646R446l2554n5933P936q4948J0133M0633j0893K5814J2551j31352
$$ 4504079 4548725 4558171 4525617 4469684 4477620 4392672 4402805 4443438 4432545 4458359 4470910 4339558
3612D339558K1849L0552j17790M5067r98O77r331L6241j56231J3938J8572r0413
$$ 4339558 4361407 4391959 4274169 4319236 4318238 4318915 4309584 4345825 4189594 4203532 4222104 4131691
3600D131691J05766M1700J8702l2000L7000m358R656M476J1020m2690k086L3526
$$ 4131691 4237457 4279157 4297859 4265859 4302859 4298501 4308157 4312633 4323653 4280963 4278877 4312403
3588D312403K3755o6031K5535O0280J18688L9757O1764P5578n3727Q2435N4257
$$ 4312403 4336158 4270127 4295662 4355942 4474630 4514387 4576151 4651729 4598002 4680437 4734694
3577D734694m2920J30142J23580J66425J13165J88474K22336K32057K13366K02044
$$ 4734694 4691774 4821916 4945496 5111921 5225086 5413560 5635896 5867953 6081319 6283363
3567F283363L87996L78790M22388M47703O93139O99536Q29673J037515J213226
$$ 6283363 6671359 7050149 7472537 7920240 8613379 9312915 10142588 11180103 12393329
3558A2393329J534736J739640J536726R88519L20160k58263m36748k04936j23128
$$ 12393329 13928065 15667705 17204431 18192950 18513110 18254847 17818099 17613163 17490035
3549A7490035k88299k87983l1163M15579P45740J068839J039668M49812m5149
$$ 17490035 17201736 16913753 16882590 17298169 18043909 19112748 20152416 20602228 20557079
3540B0557079m94224l28112j40962k4494j51571J05321M52011P27606P43308M65771
$$ 20557079 20062855 19734743 19593781 19569287 19417716 19523037 19975048 20702654 21445962 21911733
3530B1911733j68735n28715n71783o38558n06825o56805n54197k44081Q8959N59890
$$ 21911733 21742998 21214283 20642500 20003942 19497117 18840312 18286115 18042034 18130993 18690883
3520A8690883Q15159M53390k17705p05769j003120j073505q39006j056115j043142
$$ 18690883 19506042 19959432 19741727 19035958 18032838 16959333 16120327 15064212 14021070
3511A4021070j085760q56886n55559k00379k74285k96030l99776m88727k94598
$$ 14021070 12935310 12078424 11522865 11322486 11048201 10752171 10352395 9863668 9569070
3502I569070k49510l68563l23203k40527j68237M4496J4501j7035N113l13055
$$ 9569070 9319560 8950997 8627794 8387267 8219030 8263526 8278027 8260992 8266105 7953050
3492G953050m11942l42283l59957m05794l75970m99387k85350l00480k95774k22078
$$ 7953050 7541108 7198825 6838868 6433074 6057104 5557717 5272367 4971887 4676113 4454035
3482D454035j72173j72738j84816j23687n4225j10329J3625J10342l0176n8146
$$ 4454035 4281862 4109124 3924308 3800621 3746396 3636067 3649692 3760034 3729858 3671712
3472C671712k3786n6267j63833m2239j96080p5694n4534p166j16759o99o9242
$$ 3671712 3647926 3591659 3427826 3385587 3189507 3113813 3059279 3052113 2935354 2934655 2865413
3461B865413o3454r916K1791n2691j1335o6687o1925O8946K7201m805M541N7115
$$ 2865413 2801959 2792043 2813834 2761143 2749808 2683121 2621196 2690142 2717343 2712538 2717079 2774194
3449B774194N0683n5289p5591l284J3439L953L8245N3243j5391J07137k4190R9487
$$ 2774194 2824877 2769588 2693997 2690713 2704152 2708105 2746350 2799593 2784202 2891339 2867149 2966636
3437B966636J1561K1867M6799l927P4181M2181P6544Q019J39000J10937M6677
$$ 2966636 2978197 3000064 3046863 3042936 3117117 3159298 3235842 3243861 3382861 3493798 3540475
3426C540475J23356J04931J51590J13857J38485J24958J17920Q2182P0196O3681
$$ 3540475 3663831 3768762 3920352 4034209 4172694 4297652 4415572 4497754 4567950 4631631
3416D631631q4470q3775q7193j61978j26185k28825k66272j06292k09860o7991
$$ 4631631 4547161 4463386 4376193 4214215 4088030 3859205 3592933 3486641 3276781 3208790
3406C208790r5775k04287j55170N0606j40182P072R0279K180J8974K2352l1136
$$ 3208790 3113015 2908728 2753558 2804164 2663982 2671054 2761333 2763513 2782487 2804839 2773703
3395B773703K468n2370k7540R4481O7637J0876P3153L2982j12262n8502M3054
$$ 2773703 2776171 2723801 2696261 2790742 2858379 2869255 2942408 2975390 2863128 2804626 2847680
3384B847680p0287m1554k3732L3521n948j18146Q8804L5026p0042j3475J07402
$$ 2847680 2777393 2735839 2712107 2745628 2739680 2621534 2710338 2745364 2675322 2661847 2769249
3373B769249k9930Q9898K1550l5972p5792k9974J8172m6977l4605O6565Q0567
$$ 2769249 2739319 2829217 2850767 2814795 2739003 2709029 2727201 2680224 2645619 2712184 2792751
3362B792751K0327N6148L6299Q8075P4127m594M5626k71j12385k814p0090M2867
$$ 2792751 2813078 2869226 2905525 2993600 3067727 3063133 3108759 3108488 2996103 2993289 2923199 2966066
3350B966066j7250l9790N6109K6969j29102P8716Q8556p3085P1374l1927n9082
$$ 2966066 2948816 2909026 2965135 2992104 2863002 2941718 3030274 2957189 3028563 2996636 2937554
3339B937554o230K5761N4722J14886Q3355J63820O3024J45490k6107L3715P2176
$$ 2937554 2931324 2957085 3011807 3126693 3210048 3373868 3436892 3582382 3556275 3589990 3662166
3328C662166O4002p779K4667r6093o1754l5008J0304P2931J15340M7843M4965
$$ 3662166 3726168 3718389 3743056 3646963 3585209 3550201 3560505 3633436 3748776 3796619 3841584
3317C841584J79486j8462j3513m5670o3627k5467R6577l8892o4213N3067Q1932
$$ 3841584 4021070 4002608 3989095 3943425 3879798 3854331 3950908 3912016 3847803 3900870 3982802
3306C982802K3713J27658Q7980P3999n180J82310m4747P277J71816n2808L3443
$$ 3982802 4006515 4134173 4222153 4296152 4290972 4473282 4428535 4435812 4607628 4554820 4588263
3295D588263J72544l9972q0214L9054r4818m2336L3882m3340j07420l7710j26132
$$ 4588263 4760807 4720835 4640621 4679675 4584857 4542521 4576403 4533063 4425643 4387933 4261801
3284D261801l3024m0226J87701m0303O2200M1434m1367n9404r6925j27904J7070
$$ 4261801 4228777 4188551 4376252 4335949 4398149 4439583 4398216 4338812 4241887 4113983 4131053
3273D131053j23403j23189J4124K5086j45565Q8588N0952m3135L4561j8354j20114
$$ 4131053 4007650 3884461 3898585 3923671 3778106 3866694 3917646 3874511 3909072 3890718 3770604
3262C770604j6457q2495k6564K9129P090Q408M6402L0152n4338P5963j6105N7938
$$ 3770604 3754147 3671652 3645088 3674217 3681307 3689715 3736117 3766269 3711931 3787894 3771789 3829727
3250C829727q3904J65531L9844j07977L7051O4353p5907J3935M3400N1027N0604
$$ 3829727 3745823 3911354 3951198 3843221 3880272 3944625 3868718 3882653 3926053 3977080 4027684
3239D027684J07113N430J86032K3940J69375J38208K09804J23184J52784K26936
$$ 4027684 4134797 4140227 4326259 4350199 4519574 4657782 4867586 4990770 5143554 5370490
3229E370490J33342J04773J56623Q5957O9466J86028K13179J51902K52405K02614
$$ 5370490 5503832 5608605 5765228 5851185 5920651 6106679 6319858 6471760 6724165 6926779
3219F926779J72578K34325J12382J56237L61763J26275J63061K55574K18592o775
$$ 6926779 7099357 7333682 7446064 7602301 7964064 8090339 8253400 8508974 8727566 8720791
3209H720791R9019l3732J0437J53833M8872K720J53465K34690J49216K81734K10407
$$ 8720791 8819810 8786078 8796515 8950348 8999220 9001940 9155405 9390095 9539311 9821045 10031452
3198A0031452J40358K61273K04752r880J14823J41946K04924j510K04585K41304
$$ 10031452 10171810 10433083 10637835 10627955 10742778 10884724 11089648 11088138 11292723 11534027
3188A1534027K05595J09259K50433L47755L11980K34966L27721L27939M04063
$$ 11534027 11739622 11848881 12099314 12447069 12759049 12994015 13321736 13649675 14053738
3179A4053738K28670L28998K51767K95346K08974K19240K40980K98196L47826
$$ 14053738 14282408 14611406 14863173 15158519 15367493 15586733 15827713 16125909 16473735
3170A6473735L89456N25823L81531M96955M70286L79698L45892M23508M49240
$$ 16473735 16863191 17389014 17770545 18267500 18737786 19117484 19463376 19886884 20336124
3161B0336124N34331N36860N43861O38876O43676O59657P75136P72842Q24489
$$ 20336124 20870455 21407315 21951176 22590052 23233728 23893385 24668521 25441363 26265852
3152B6265852R34291R34472R99370R20610R59198R30845J050306J134981J215762
$$ 26265852 27200143 28134615 29133985 30054595 31013793 31944638 32994944 34129925 35345687
3143C5345687J344053J569103J648575J808403J772927J804511J954031J944854
$$ 35345687 36689740 38258843 39907418 41715821 43488748 45293259 47247290 49192144
3135D9192144K027749K142349K406568K669243L310469M127311M817102N595404
$$ 49192144 51219893 53362242 55768810 58438053 61748522 65875833 70692935 76288339
3127G6288339O533793P884000R355385J1160997J2723144J4767379J7707872K1478814
$$ 76288339 82822132 90706132 100061517 111222514 123945658 138713037 156420909 177899723
3119A77899723K6002882K9765866K8618547K3333946J9718764J8143224J8932804
$$ 177899723 203902605 233668471 262287018 285620964 305339728 323482952 342415756
3112C42415756J5798599K413409j2405695k2894613k9785688l2124767l4395662
$$ 342415756 358214355 360627764 348222069 325327456 295541768 263417001 229021339
3105B29021339l3673947k8204177k1964204j6889598j3448625j1234437r615238
$$ 229021339 195347392 167143215 145179011 128289413 114840788 103606351 93991113
3098I3991113q359181p268746o618970n899016n386610m533095l831525l615829
$$ 93991113 85631932 78363186 71744216 65845200 60458590 55925495 52093970 48478141
3090D8478141l343707l055251k613685k359534k008659j758273j457218j130209
$$ 48478141 45134434 42079183 39465498 37105964 35097305 33339032 31881814 30751605
3082C0751605j224847j090876q68326j018852j091918r83360j014896r02917p84020
$$ 30751605 29526758 28435882 27567556 26548704 25456786 24473426 23458530 22555613 21771593
3073B1771593r51586p00739m53828m71356l35111l33533k52948l27480l95565
$$ 21771593 20820007 20119268 19665440 19194084 18858973 18525440 18272492 17945012 17549447
3064A7549447l50404m95183m27232l93305m14090m01798j73478l27749k26950
$$ 17549447 17199043 16703860 16276628 15883323 15469233 15067435 14893957 14566208 14339258
3055A4339258j52957j37338k35089J6980j29323k52946r8262j31726l92484k61005
$$ 14339258 14186301 14048963 13813874 13830854 13701531 13448585 13350323 13218597 12826113 12565108
3045A2565108k58402m26124k98838k28737k51108k13915o1255k59815m17566k83315
$$ 12565108 12306706 11880582 11581744 11353007 11101899 10887984 10826729 10566914 10149348 9866033
3035I866033m12079m43136k39138k97108k97259n8648j79002j67557M8785N8479
$$ 9866033 9453954 9010818 8771680 8474572 8177313 8118665 7939663 7772106 7820891 7879370
3025G879370m5074J64704J66724J36131K23083L58187L69574M57695N07103N04612
$$ 7879370 7834296 7999000 8165724 8301855 8524938 8883125 9252699 9710394 10217497 10722109
3015A0722109M55256M06035K68599O7127J05787k85220l61292m10469m57271n51655
$$ 10722109 11177365 11583400 11851999 11919126 12024913 11739693 11378401 10967932 10510661 9959006
3005I959006m81738m88514m06644m56508l69383m15749k56050m33839k73358j72564
$$ 9959006 9477268 8988754 8582110 8125602 7756219 7340470 7084420 6650581 6377223 6204659
2995F204659k64995j81553o5849j37364j49910q8001n6451j23206j29935j15559
$$ 6204659 5939664 5758111 5692262 5554898 5404988 5316987 5260536 5137330 5007395 4891836
2985D891836l2950m9671q6902N468j07056n0161n5441R2450L7904j08262j5639
$$ 4891836 4858886 4809215 4722313 4727781 4620725 4570564 4515123 4607573 4645477 4537215 4521576
2974D521576J04174j05519J70178K11318K61750K65297N28944O70919O17542M46348
$$ 4521576 4625750 4520231 4690409 4901727 5163477 5428774 5957718 6628637 7246179 7692527
2964G692527J57088j86423n17284l54700j36682m42563o32277n83061m77979k81605
$$ 7692527 7849615 7663192 7145908 6791208 6654526 6211963 5579686 4996625 4518646 4237041
2954D237041l14226r9062j37554K6657j32334M3551M2412n7713m6656p222j25342
$$ 4237041 3922815 3823753 3686199 3712856 3580522 3624073 3666485 3608772 3562116 3554894 3429552
2943C429552j17515r1808k40737p2740M6859j06050k01480j8725o9812j56103
$$ 3429552 3312037 3220229 2979492 2906752 2953611 2847561 2646081 2627356 2557544 2401441
2933B401441j29211L3450j75397M0363K0009l1631n2708M5398l637L3439p3501
$$ 2401441 2272230 2305680 2130283 2170646 2190655 2159024 2106316 2151714 2148077 2181516 2108015
2922B108015j5614n5794l0171j9911l1529j7189n0515k5468M8839l7377j88053
$$ 2108015 2092401 2036607 2006436 1986525 1954996 1937807 1887292 1861824 1910663 1873286 1685233
2911A685233J6024L2121o7267j63660O8156J08528p0273m3097K09758k9426p2939
$$ 1685233 1701257 1733378 1666111 1502451 1570607 1679135 1608862 1565765 1775523 1746097 1673158
2900A673158Q1241J05630l8015L0707K0181N7795k9944n1163n5923p1667j14488
$$ 1673158 1754399 1860029 1822014 1852721 1872902 1930697 1900753 1849590 1793667 1722000 1607512
2889A607512l7894j309n5853p8013K4470P370m0302o09r636n0842o7957k9225
$$ 1607512 1569618 1568309 1512456 1434443 1458913 1466283 1425981 1425372 1415736 1364894 1296937 1267712
2877A267712J4537K7383L2594L9504m4805k6056J9335L9516M3121k6751K7878
$$ 1267712 1282249 1309632 1342226 1381730 1336925 1310869 1330204 1369720 1412841 1386090 1413968
2866A413968j0362n2387J8618m704J2914M4143K4467N5162J3155l3002L5158J4863
$$ 1413968 1403606 1351219 1369837 1365133 1378047 1422190 1446657 1501819 1514974 1481972 1517130 1531993
2854A531993M7769J1890J41300J2064J13658R3888J12368j8324N6653N3258j3162
$$ 1531993 1579762 1591652 1732952 1745016 1858674 1952562 2064930 2046606 2103259 2156517 2143355
2843B143355j05442J0382O317K1487O0893l630N9389N2963J15780J8973J24274
$$ 2143355 2037913 2048295 2054612 2076099 2136992 2133362 2192751 2245714 2361494 2380467 2504741
2832B504741O9516J49744K29233J96266K13789L54238L54047L12998O09341N83777
$$ 2504741 2574257 2724001 2953234 3149500 3363289 3717527 4071574 4384572 4993913 5577690
2822E577690P74396J062032J080560P64521L72195m3611k63750o26118p18205
$$ 5577690 6352086 7414118 8494678 9259199 9631394 9587783 9324033 8697915 7979710
2813G979710k89834J69266j70680p27995n87818o33480n36928l76526j67544k57178
$$ 7979710 7689876 7859142 7688462 6960467 6372649 5739169 5202241 4825715 4658171 4400993
2803D400993o8942m8386r6649n1442l07505k56179j37977l70192j88516j45730
$$ 4400993 4332051 4283665 4187016 4135574 3828069 3571890 3433913 3063721 2875205 2729475
2793B729475j19667j24238L9828j27014j87472p4349j82787n3761j29977K1681
$$ 2729475 2609808 2485570 2525398 2398384 2210912 2136563 1953776 1900015 1770038 1791719
2783A791719o9340r0879l2495n3050l8701J0473r6642J1905K2373m6816m3590
$$ 1791719 1722379 1631500 1599005 1545955 1507254 1517727 1421085 1432990 1455363 1408547 1364957
2772A364957K4026J10180r4625J52581p4338j14447q4094m7237j99238j0636J6786
$$ 1364957 1388983 1499163 1404538 1557119 1482781 1368334 1284240 1237003 1037765 1027129 1043915
2761A043915o5357J3905M6544K5135P8972r3131K804N2366m6314m6278J13553
$$ 1043915 978558 992463 1039007 1064142 1143114 1049983 1052787 1105153 1058839 1012561 1126114
2750A126114P2739j55003o138K3332L586r3027J4118m28M3333j9084J11269q633
$$ 1126114 1198853 1043850 1037712 1061044 1064630 971603 985721 985293 1028626 1009542 1120811 1112178
2738A112178O7634k2461Q013p0524j15123P137N5321m4360k9455P2655O3498j00597
$$ 1112178 1179812 1157351 1165364 1094840 979717 986854 1042175 997815 968360 1041015 1104513 1003916
2726A003916K474N0484Q27j09135O3158L644n2664O6531l355M8385o1836Q9555
$$ 1003916 1006390 1056874 1057701 948566 1011724 1015368 962704 1029235 1025880 1074265 1012429 1101984
2714A101984M9329r0656j3850l9352K8772q1169q5157R2813J18033q3224K2847
$$ 1101984 1151313 1060657 1046807 1007455 1036227 955058 869901 962714 1080747 997523 1020370
2703A020370P4259l1643q0595r991m6655P8997j28639J5227N6668q546j8213M8008
$$ 1020370 1094629 1062986 982391 972400 925745 1004742 876103 891330 947998 939452 921239 969247
2691I69247k8782n6582k2770r0442r933l1814J5928N8822q319K5831J0502l4656
$$ 969247 940465 883883 861113 770671 760738 728924 744852 803674 795355 821186 831688 797032
2679G97032N1750j3595R4747p7676M3715l0233O095q3267J0375K2170J07364l9178
$$ 797032 848782 835187 929934 852258 895973 865740 871835 788568 798943 821113 928477 889299
2667H89299N4655l7096L8114j10529O6687J9298J20333k3390L1351q767M1044
$$ 889299 943954 906858 944972 834443 901130 920428 1040761 1017371 1048722 1039955 1080999
2656A080999J1389o8137J3796k7053p028r2100l3449j2312L8908k5946M3761L1774
$$ 1080999 1092388 1024251 1038047 1010994 1003966 911866 878417 866105 905013 879067 922828 954602
2644I54602k240N1861N7034L3127P1627q024L1210l2087p9266r926Q651m6807
$$ 954602 952362 1004223 1061257 1094384 1166011 1157987 1189197 1157110 1077844 1067918 1076569 1029762
2632A029762P6437K3673o762P591M7506n7993k671J4n542K2156j00839L5194O2390
$$ 1029762 1106199 1129872 1123110 1130701 1178207 1120214 1117543 1117557 1112015 1134171 1033332 1068526 1130916
2619A130916q4595Q090j6183N2369j11086R5645k7763K6063k1511R9105M1474
$$ 1130916 1046321 1054411 1038228 1090597 979511 1075156 1047393 1073456 1051945 1151050 1192524
2608A192524n6972J2914M80o707q2428m7546N4404K977k1175N9983J39278l2274
$$ 1192524 1135552 1148466 1148946 1142239 1059811 1012265 1066669 1069646 1048471 1108454 1247732 1215458
2596A215458k9029M9610r0937n667J2326o4770O980K6331n273o763k1520m720
$$ 1215458 1186429 1236039 1145102 1139435 1151761 1086991 1093971 1120302 1115029 1108266 1086746 1082026
2584A082026Q7026o7314j23439M7693K4251j2545p8729j7251L7008O2804j9993
$$ 1082026 1169052 1101738 978299 1025992 1050243 1037698 958969 941718 978726 1041530 1021537
2573A021537P0335N0608k2826M9265l4843l518R9416J1755p2033O5885J06757
$$ 1021537 1091872 1142480 1119654 1168919 1134076 1130558 1229974 1241729 1169696 1235581 1342338
2562A342338j18247M1697L4443N7266k7783p1815R6365P4257j04319K7928O4424
$$ 1342338 1224091 1265788 1300231 1357497 1329714 1257899 1354264 1428521 1324202 1352130 1416554
2551A416554K9423p7873J9787j15389L6725l2196r2193J08130K5698l754l0675
$$ 1416554 1445977 1368104 1387891 1272502 1309227 1277031 1184838 1292968 1318666 1314912 1284237
2540A284237p7333j8109L1762o7324j35573Q1089J45787m7545l9733L4813P4770
$$ 1284237 1206904 1188795 1220557 1153233 1017660 1098749 1244536 1196991 1157258 1192071 1266841
2529A266841q2691m0830N4477n0289r5342P7122r966M9445L5172r5384J2562P2993
$$ 1266841 1184150 1143320 1197797 1147508 1052166 1129288 1119322 1168767 1203939 1108555 1121117 1194110
2517A194110o8508n0930Q0472M8748m5221q6070o8142J2076l5802j1425m1137
$$ 1194110 1125602 1074672 1155144 1203892 1158671 1072601 1004459 1016535 980733 969308 928171
2506I28171O3685L704n2676j18255K6342N621Q9684J2036L3168P1044k1965Q044
$$ 928171 991856 995560 942884 824629 850971 856592 946276 958312 991480 1062524 1040559 1048603
2494A048603K8968l0646M2052N3650j01903J6417O6498p0332O1970Q2782j9350
$$ 1048603 1077571 1046925 1088977 1142627 1040724 1057141 1123639 1053307 1115277 1198059 1178709
2483A178709O4419j16344m7968o0686l2944k4752L3292l9055J6733L0028M5216
$$ 1178709 1243128 1126784 1078816 1018130 985186 960434 993726 954671 971404 1001432 1046648
2472A046648L2381P3107l0531N1437m4150L3962P4477k6407P9343K3878j02611
$$ 1046648 1079029 1152136 1121605 1173042 1128892 1162854 1237331 1210924 1290267 1314145 1211534
2461A211534O793j21605j14600J12034J13274K6276J14539N5393l9307j3692j34523
$$ 1211534 1218327 1096722 982122 1094156 1207430 1233706 1348245 1403638 1364331 1350639 1216116
2450A216116j3758L6376l7417l1260M5915O828k989O1420J77398K3894q2429l840
$$ 1216116 1202358 1238734 1201317 1170057 1215972 1222800 1219811 1281231 1458629 1482523 1400094 1396254
2438A396254L8579p6495r2715J99L4395L7230J39664m5838L6694J0944J5890p0809
$$ 1396254 1434833 1358338 1265623 1265822 1300217 1337447 1477111 1431273 1467967 1478911 1494801 1423992
2426A423992m3373n0749P5805K2302j15735K1811N2723Q706p8613K7603L5700
$$ 1423992 1380619 1329870 1405675 1427977 1312242 1334053 1386776 1395482 1316869 1344472 1380172
2415A380172M2035m6143k3537J0975L4501J509M7362o6973p7106N9821j9203o3876
$$ 1380172 1422207 1376064 1352527 1363502 1398003 1399512 1446874 1379901 1302795 1362616 1343413 1279537
2403A279537O8610j1931J4468M8205o0784n0316l1946k4065K6144K9072J0796
$$ 1279537 1348147 1336216 1350684 1398889 1338105 1287789 1255843 1231778 1257922 1286994 1297790
2392A297790N6079K5730M1921M4620o4478N0743N950k9483n1131o580j17743N0200
$$ 1297790 1353869 1379599 1421520 1466140 1401662 1452405 1458355 1428872 1377741 1371161 1253418 1303618
2380A303618l1752k7642P3956L8052j3338k0939Q3712L4172r0773M7872L1103
$$ 1303618 1271866 1244224 1318180 1356232 1342894 1321955 1405667 1439839 1349066 1396938 1428041
2369A428041q229K0303j63479J27262J7068m508j22897O9543Q5639m0386k7651
$$ 1428041 1419812 1440115 1276636 1403898 1420966 1416458 1293561 1363104 1448743 1408357 1380706
2358A380706o708L2708K6742R3556k206M5942N8234j5107k1851j6437k9878Q6740
$$ 1380706 1373998 1406706 1433448 1527004 1524798 1570740 1628974 1613867 1592016 1575579 1545701 1632441
2346A632441k7759n1069j59M8135k9748j3311J46895J8651k0350j1355L6837K7944
$$ 1632441 1604682 1553613 1553454 1601589 1571841 1558530 1705425 1724076 1703726 1692371 1729208 1757152
2334A757152m0504q4623R8464J7084M1283M8538R4714l1881j800J7452J5497n8900
$$ 1757152 1716648 1632025 1730489 1747573 1788856 1837394 1932108 1900227 1898427 1915879 1931376 1872476
2322A872476l6226N5970M1079n6917N0244N5222l86N631O9413r6587N1836J00178
$$ 1872476 1836250 1892220 1933299 1876382 1926626 1981848 1981462 1987093 2056506 1959919 2011755 2111933
2310B111933n7729R5923J9410O475K3577L9708j03330M2103j825L5266j2972l683
$$ 2111933 2054204 2150127 2169537 2176012 2199589 2239297 2135967 2178070 2176245 2211511 2198539 2194856
2298B194856o0287P3266o5678L6457M0400k5892P9668k4776K1219k6957P5514
$$ 2194856 2134569 2207835 2142157 2178614 2219014 2193122 2272790 2248014 2269233 2242276 2317790
2287B317790N4496N3939M3060J2890p246M9959q6138o5873P6471j7591j6083N9882
$$ 2317790 2372286 2426225 2469285 2482175 2474929 2524888 2438750 2372877 2449348 2431757 2415674 2475556
2275B475556M7444J4339J53988M232J5424J8946l3585Q1585m165l7336l2097Q9446
$$ 2475556 2523000 2537339 2691327 2695559 2710983 2729929 2696344 2777929 2773764 2736428 2704331 2793777
2263B793777L3251o5154O8803J1484L8863K3856N1196k0073J02229J0635J0539
$$ 2793777 2827028 2761874 2830677 2842161 2881024 2904880 2956076 2936003 3038232 3048867 3059406
2252C059406N8281L9539k2000J02880Q711K8585J10744r5110O8115M8178O9020
$$ 3059406 3117687 3157226 3135226 3238106 3246817 3275402 3386146 3291036 3359151 3407329 3476349
2241C476349N9563l2963Q143J46994o690q815O2691p4915O4626O4846M3182R2244
$$ 3476349 3535912 3502949 3511092 3658086 3651396 3642581 3705272 3630357 3694983 3759829 3803011 3895255
2229C895255J13917N803N9702J06392L3238P0511l7336J9204M1084O3940M1012
$$ 3895255 4009172 4014975 4074677 4181069 4214307 4284818 4247482 4266686 4307770 4371710 4412722
2218D412722R7777R271N1681P7640k8282J27875J52400J2383l092J5709R6710
$$ 4412722 4510499 4519770 4571451 4649091 4620809 4748684 4901084 4913467 4910375 4926084 5022794
2207E022794J880L0818J35675J51190J28986N0407K7723J79829J16305j6240M4236
$$ 5022794 5024674 5055492 5191167 5342357 5471343 5521750 5549473 5729302 5845607 5829367 5873603
2196E873603J20866P3988J70929K01490J35820K54267K90704J68481J12104J87900
$$ 5873603 5994469 6068457 6239386 6440876 6576696 6830963 7121667 7290148 7402252 7590152
2186G590152K56925K35597K69442L17598L58558L90806L58949M58584M80568M23866
$$ 7590152 7847077 8082674 8352116 8669714 9028272 9419078 9778027 10236611 10717179 11141045
2176A1141045M41794L50322K45417M13499J54356J46467l6110j74219l11696l87196
$$ 11141045 11582839 11933161 12178578 12592077 12746433 12892900 12856790 12682571 12370875 11983679
2166A1983679n30134n48352n04307m80454m76580l96902l18797l18674l37528
$$ 11983679 11453545 10905193 10400886 9920432 9443852 9046950 8728153 8409479 8071951
2157H071951k22291k82457k76481j30078l05424j74068j16143o2942k53502j18113
$$ 8071951 7849660 7567203 7290722 7160644 6855220 6681152 6565009 6502067 6248565 6130452
2147F130452q9702l7850j18250r0970n6778j78106o9855l5601j32710r8670j13763
$$ 6130452 6040750 6002900 5884650 5793680 5736902 5558796 5488941 5453340 5320630 5221960 5108197
2136E108197j68488p3221r5930j38459l9339n6231j28323q8843k6124q6459J4666
$$ 5108197 4939709 4866488 4770558 4632099 4592760 4536529 4408206 4319363 4293239 4206780 4221446
2125D221446K3946m0345p0853M8326m2158r0886q8236j0361r1201q1211K1404
$$ 4221446 4245392 4205047 4134194 4182520 4140362 4049476 3961240 3950879 3859678 3778467 3799871
2114C799871N4398k5453j10403r2658M5852j47422j37381O4486n1026r4373P9091
$$ 3799871 3854269 3828816 3718413 3625755 3671607 3524185 3386804 3451290 3400264 3305891 3384982
2103C384982J5637l8863Q6667q6591L9413o7907r4394l5290Q987n5405k2863m7625
$$ 3384982 3400619 3361756 3448423 3361832 3401245 3333338 3238944 3203654 3212641 3157236 3134373 3086748
2091C086748q7878j9189l3083L210N7496k000q149q8109j07448n1789N9576l0473
$$ 3086748 2998870 2979681 2946598 2949808 3007304 3005304 2997155 2909046 2801598 2749809 2809385 2778912
2079B778912r920N0904J9722K8864k16691j01907J8493k9446J0886K0901L4752
$$ 2778912 2768992 2819896 2839618 2868482 2651791 2549884 2568377 2538931 2549817 2570718 2605470
2068B605470N5453R6025o4245j1355K1578o4783n873j03141j7075o5012l3416
$$ 2605470 2660923 2756948 2692703 2681348 2702926 2638143 2632270 2529129 2512054 2447042 2413626
2057B413626n1903m3854P1303m5755j4115P705M7982j06336Q589L2015r734o802
$$ 2413626 2361723 2317869 2389172 2343417 2329302 2337007 2384989 2278653 2287242 2319257 2309523 2302721
2045B302721k8244n4732L3577l6690M7688m2193j3368j4670m1376j4649L3158
$$ 2302721 2274477 2219745 2253322 2216632 2264320 2222127 2208759 2194089 2152713 2138064 2171222
2034B171222O086K6739m7084j09563j8532J8747j12800o9836O3832O3174m9706
$$ 2171222 2177308 2204047 2156963 2047400 2028868 2047615 1934815 1864979 1928811 1991985 1942279
2023A942279L1458K3145J4503j16943j06359j8164j22280J07919j0197J28933
$$ 1942279 1973737 1996882 2011385 1894442 1788083 1769919 1647639 1755558 1745361 1874294
2013A874294M6569N8407m3611m9624n4488k8017m0141j65298n1137K29170k0352
$$ 1874294 1920863 1979270 1935659 1886035 1831547 1803530 1763389 1598091 1546954 1776124 1755772
2002A755772l4610R3112N3519l3669p6363O117k1896m0973p4931N9880M69n5686
$$ 1755772 1721162 1814274 1867793 1834124 1757761 1763878 1741982 1701009 1626078 1685958 1686427 1630741
1990A630741O8713Q784q977l2773N6393o3201n8608J25543l2225m4525J03773
$$ 1630741 1699454 1708238 1699261 1666488 1722881 1659680 1601072 1726615 1694390 1649865 1753638
1979A753638k5573R7511m3687j46908J3036P8707j81305k0672J28322l6729m8915
$$ 1753638 1728065 1825576 1781889 1634981 1648017 1726724 1545419 1524747 1653069 1616340 1567425
1968A567425J2655L6311j0228j4881o3155M9260K7995L6484l8838n238J22012
$$ 1567425 1580080 1616391 1606163 1591282 1528127 1577387 1605382 1641866 1603028 1597790 1719802
1957A719802J6598m0203l6668o7877L2748p0412o9090m0614N7346l5089R664J4294
$$ 1719802 1736400 1696197 1659529 1591652 1624400 1553988 1484898 1444284 1501630 1466541 1476205 1490499
1945A490499J35289k9818j5942m8109L1338j6796K2208m4267n928J31739J618
$$ 1490499 1625788 1595970 1580028 1531919 1563257 1546461 1568669 1524402 1518474 1650213 1651831
1934A651831q3028L3273Q792q888K2088j35692N0788J37049j05864m3818J69042
$$ 1651831 1568803 1602076 1610868 1601980 1624068 1488376 1539164 1676213 1570349 1526531 1695573
1923A695573r0211L8661N197N3145K1157M8418J795n3055j2844J63754j06567
$$ 1695573 1605362 1644023 1649220 1702365 1723522 1771940 1773735 1720680 1707836 1871590 1765023
1912A765023k2403J22494k3860p7593P3728P8O6765J01667q8430Q3736J25197
$$ 1765023 1742620 1865114 1841254 1763661 1837389 1837467 1904232 2005899 1917469 2001205 2126402
1901B126402q6021p7677J18897K9378J096o976R4993q9372M6844j8004M308N5689
$$ 2126402 2040381 1962704 2081601 2110979 2112075 2105099 2200092 2110720 2157564 2139560 2143868 2199557
1889B199557J55720m4636j0871p674j5301k1140M5411N014M1716J09790p5331
$$ 2199557 2355277 2310641 2299770 2292096 2276795 2255655 2301066 2306080 2347796 2457586 2382255
1878B382255R973M9071Q2276k05807K9186K4261J52922q7953K6640N606N8560
$$ 2382255 2392228 2441299 2523575 2317768 2346954 2371215 2524137 2436184 2462824 2468430 2526990
1867B526990n026m5267Q1217J02534L8427k6594N367m4666P8915J19313P733L9844
$$ 2526990 2521964 2476697 2557914 2660448 2698875 2672281 2677648 2632982 2711897 2831210 2838943 2878787
1855B878787J56107J7464M5084M44J4140N3677J641j17225J00816J50689L2720
$$ 2878787 3034894 3052358 3097442 3097886 3112026 3165703 3167344 3050119 3150935 3301624 3334344
1844C334344N0101K48670J65772L8654J27014P5685j6938N7119o785M1079M3312
$$ 3334344 3384445 3633115 3798887 3837541 3964555 4040240 4023302 4080421 4073636 4114715 4158027
1833D158027N0965k5055J14164M5212Q5681Q1086O9090K5868N447J9339k3155
$$ 4158027 4208992 4183937 4298101 4343313 4428994 4510080 4579170 4605038 4610485 4629824 4606669
1822D606669K8424J42165J10278Q1428J25380J81739K29104R2972J93216J29297
$$ 4606669 4635093 4777258 4887536 4968964 5094344 5276083 5505187 5598159 5791375 5920672
1812E920672J58258J38749K15488R0865K58967J10334L9429J21582R9251j5232
$$ 5920672 6078930 6217679 6433167 6524032 6782999 6893333 6932762 7054344 7153595 7138363
1802G138363N503p2795n8442j33369k20112j72862j62170j10090j08815J47310
$$ 7138363 7143866 7071071 7012629 6879260 6659148 6486286 6324116 6214026 6105211 6252521
1792F252521n3563P822J34630Q3250L1082p2398N879P8751r5907N1171Q2742J11795
$$ 6252521 6198958 6206780 6341410 6424660 6455742 6383344 6389223 6467974 6372067 6423238 6505980 6617775
1780F617775Q4149Q3567N187o07L7487o7121j62255j78882j17984r7575j30632
$$ 6617775 6701924 6785491 6790678 6790071 6827558 6760437 6598182 6419300 6301316 6203741 6073109
1769F073109j93752j40829N7524k41449k22247R3547p8027j42406p3085p1698
$$ 6073109 5879357 5738528 5796052 5554603 5332356 5425903 5347876 5205470 5132385 5060687
1759E060687m0372r1493j24677o4284M9457j02476p9685j19132j08566p8446j60327
$$ 5060687 5020315 4928822 4804145 4739861 4789318 4686842 4607157 4488025 4379459 4301013 4140686
1748D140686j25680k03220p0181j57037p5354j87438n729o5605j78576l4617J6152
$$ 4140686 4015006 3811786 3741605 3584568 3509214 3321776 3316047 3250442 3071866 3037249 3053401
1737C053401n3563n0752j11291j17785P199o1716j65376m0455L0490J184k5941
$$ 3053401 2999838 2949086 2837795 2720010 2727209 2665493 2500117 2459662 2490152 2491336 2465395
1726B465395j11407P987j9158m9672o4533j05417L5413n5170j02070k4472k4104
$$ 2465395 2353988 2361975 2342817 2293145 2228612 2123195 2158608 2103438 2001368 1976896 1952792
1715A952792O9622l9382o8469J3208M1749q1208j94633o5518o7406O4324j05921
$$ 1952792 2022414 1983032 1914563 1927771 1969520 1888312 1693679 1628161 1560755 1625079 1519158
1704A519158j9972O5170n9277N5539k794o9353M5654j03164j38292l1882L6991
$$ 1519158 1499186 1564356 1505079 1560618 1557824 1488471 1534125 1430961 1292669 1260787 1297778
1693A297778r5101m378R6274n0296J15431j4734q0800k3299p6711l5054Q360q0632
$$ 1297778 1202677 1198299 1294573 1244277 1359708 1344974 1264174 1240875 1164164 1129110 1137470 1056838
1681A056838N3615m5979j4221l1736J7574k862L8659l1930m0762Q4598n8554j04747
$$ 1056838 1110453 1064474 1050253 1018517 1036091 1033229 1071888 1039958 999196 1083794 1025240 920493
1669I20493J3604k0290P4330K1431j6575k2034m6717o3895k7641P8679n7435J2982
$$ 920493 934097 913807 988137 1009568 992993 970959 924242 860347 832706 911385 853950 866932
1657H66932m9769J4988m4010j4114Q911k3525j20593J39967l0143n0156j8914
$$ 866932 817163 832151 788141 774027 782938 759413 638820 778787 748644 698488 679574
1646F79574l0919j9879J5504m992K4743Q1291j77667K7324O4306n8582p9359O2383
$$ 679574 648655 628776 644280 639288 664031 745322 567655 594979 659285 600703 521344 583727
1634E83727r926j39239Q2743j013m0955N9180o8789k9920O8553o2192j99609Q1407
$$ 583727 573801 434562 517305 516292 475337 534517 465728 435808 504361 442169 242560 323967
1622C23967K3612r8170J35476L1481p8225m9396N4681O595r5280J18783o4060
$$ 323967 347579 249409 384885 416366 338141 288745 343426 350021 254741 373524 309464
1611C09464j4326p7682Q837K7060k4832j683l9628N4358k7646j22151J985Q2530
$$ 309464 295138 217456 226293 253353 228521 226838 187210 241568 213922 91771 93756 176286
1599A76286p520m9272J22369j02325j5560P751j02261l2595O1399K5036L4843
$$ 176286 168766 119494 241863 139538 123978 131729 29468 -3127 58272 83308 118151
1588A18151m35J9231L3199R0026j05975k7545J6759l5577p7651l500P4634k1472
$$ 118151 117716 136947 170146 260172 154197 126652 143411 107834 30183 26683 101317 79845
1576G9845P9075p5145j554J06331q6543j31412J13161o6527r2049O4773N6422
$$ 79845 158920 83775 82221 188552 102009 -29403 83758 17231 -74818 -10045 46377
1565D6377p3844J63859k3440K004O6879K8850j19104Q021k0853j7948q972O4192
$$ 46377 -27467 136392 112952 114956 181835 210685 91581 99602 78749 60801 51829 116021
1553A16021o2930L7905J8054j03167k0513J50434q8187J8623j1983M7814N0586
$$ 116021 53091 90996 109050 5883 -14630 135804 47617 66240 54257 102071 152657
1542A52657m8693J628q150q009P2601Q0715j02557J13340O7082k2902q609k7994
$$ 152657 103964 105592 97442 89433 162034 242749 140192 253532 320614 297712 289103 261109
1530B61109j21865J5410p3289p9903O6152L8994q3220P42O706J72239p2765k898
$$ 261109 139244 154654 81365 1462 67614 106608 23388 24130 30836 203075 130310 127412
1518A27412M1150n1968p6563N3297q2432O5707J11359o3614j8181L7752q9446
$$ 127412 168562 116594 40031 93328 10896 76603 187962 124348 106167 143919 54473
1507E4473p737J9251n4457J4149R2713k6107j4911m820r759L2514o0892O0525
$$ 54473 46736 65987 11530 25679 118392 92285 77374 72554 62795 95309 34417 94942
1495I4942n3781J26268q1906m8349L1738o7685l9995L8171k910m4510J04395l2474
$$ 94942 41161 167429 85523 37174 68912 1227 -38768 -597 -3507 -48017 56378 23904
1483B3904O789J32536j1579j3517j0850j17889N6480Jj1030M8363P3927q829k876
$$ 23904 30693 163229 151650 138133 127283 9394 65874 65875 54845 103208 177135 168306 165430
1470A65430p2777j1815k098j21733k0097j2944m9520J06859m8926l8971J11818
$$ 165430 92653 80838 78740 -42993 -63090 -76034 -125554 -18695 -67621 -106592 5226
1459E226K0097l6542K8375N2644j6008M8378l6876o0947n7709P3234j446M1026
$$ 5226 25323 -11219 17156 69800 53792 102170 65294 4347 -53362 19872 18426 59452
1447E9452J6811n3577j1100K442l6936P9433l3443n1130j4561M778M1029j2906
$$ 59452 76263 22686 11586 14028 -22908 56525 23082 -28048 -42609 -37831 3198 -9708
1435i708l849j2964L4634l1007m2865L889O9162L4110J00048l3523j22550p0524
$$ -9708 -13557 -26521 8113 -22894 -65759 -61870 7292 41402 141450 107927 -14623 -85147
1423h5147n576j44670Q1361J20534o4307O7275J0995J0924k27J8183m3482Q74
$$ -85147 -90723 -235393 -154032 -33498 -97805 -30530 -19535 -8611 -8838 9345 -34137 -33263
1411c3263j9266o5446k1780J818N0372K2981r796M4935M8790J7241m8665q1957
$$ -33263 -52529 -117975 -139755 -137937 -87565 -64584 -74380 -29445 19345 36586 -12079 -94036
1399i4036q6285P6159l4719O6965P8745O5478p7706R4555j44761L7796J50156
$$ -94036 -180321 -104162 -138881 -71916 6829 72307 -5399 89156 -55605 -17809 132347
1388A32347r7483q5007L1075j6690k6054j056j6171R6798j053l1908j7646Q5670
$$ 132347 34864 -50143 -19068 -35758 -61812 -62868 -79039 17759 16706 -15202 -32848 52822
1376E2822m5354J2587M0755N8461j79235P2017l5577p1841k8464N05M280N7525
$$ 52822 7468 20055 60810 119271 -59964 12053 -23524 -95365 -123829 -123324 -119044 -61519
1364f1519l1703l0488L8974k4124K8907L0482l8166m8720L7348L0836J9847q9051
$$ -61519 -93222 -123710 -84736 -108860 -79953 -49471 -87637 -136357 -99009 -68173 -48326 -137377
1352a37377J18766P501k2532J8770J5333j1700j18129k0145k707q3616R6514k452
$$ -137377 -18611 -11110 -33642 -14872 461 -11239 -129368 -149513 -152220 -235836 -139322 -141774
1340a41774P518j4730j0892O9143N915L4888K755J4187j22512p2387O6673j6769
$$ -141774 -134256 -148986 -159878 -90735 -84820 -49932 -47177 -32990 -155502 -227889 -161216 -177985
1328a77985n632J24979O09o3952K2254P3458m3039Q3112j8928q6237N8613o4552
$$ -177985 -183617 -58638 -58029 -121981 -99727 -26269 -69308 13804 -5124 -91361 -32748 -97300
1316i7300l9151m2408K0319j8609n578N2769m0307N7725j1808R786k594O5605
$$ -97300 -136451 -178859 -158540 -177149 -182727 -129958 -170265 -112540 -124348 -114562 -117156 -51551
1304e1551l0457m6084R7063P4943j64380J14430J300k1514o628L4068j23290K117
$$ -51551 -82008 -128092 -31029 43914 -120466 -6036 -4736 -26250 -32878 1190 -122100 -119983
1292a19983P7498j32240L6070J71041O387O1118m7457q5257j666M027j11156m7551
$$ -119983 -42485 -174725 -138655 32386 38773 99891 52434 -32823 -34489 -30462 -141618 -189169
1280a89169J11486j7427l8468j8514J19063j07146R021P3614k7740J1290Q0252
$$ -189169 -77683 -95110 -133578 -152092 -33029 -140175 -131154 -57540 -85280 -73990 6262
1269F262m8325k4922k0206N441k7030N2845p8296K5619K9707N4068K3481K3872
$$ 6262 -42063 -66985 -87191 -81750 -108780 -55935 -134231 -108612 -78905 -24837 -1356 22516
1257B2516O7748p2327N2899n5899j71603J09674j08379L5459J23666m1572M0481
$$ 22516 90264 17937 70836 14937 -156666 -46992 -155371 -119912 3754 -37818 2663
1246B663N6300m4404j1356O3418r3100M9088J04458m9118K0501q6125Q7290p0117
$$ 2663 58963 14559 3203 66621 -26479 22609 127067 77949 98450 12325 99615 29498
1234B9498o3795O7563j7185k5926R8077r0592l9083O7339k4217j79999P1625N907
$$ 29498 -34297 33266 16081 -9845 88232 -2360 -41443 25896 1679 -178320 -106695 -100788
1222a00788J2871l6239k5314O0810O4788N9228o6923K6141M1524o0457j07146
$$ -100788 -87917 -124156 -149470 -88660 -23872 35356 -31567 -5426 36098 -24359 -131505
1211a31505J9003J2688L5520r5059N4269o1944J09363k7887k005o4812J03374
$$ -131505 -112502 -99814 -64294 -159353 -105084 -167028 -57665 -85552 -87557 -152369 -48995
1200d8995l2523o8288O7155J11093p3576k427q0105K8743O4841q7748Q7942m4711
$$ -48995 -81518 -149806 -82651 28442 -45134 -47561 -127666 -98923 -34082 -121830 -33888 -78599
1188g8599M3956p0510P3370j18198K8593j0478j3405J2172l0501O8922M0886j2736
$$ -78599 -34643 -105153 -31783 -149981 -121388 -131866 -145271 -133099 -163600 -94678 -53792 -66528
1176f6528P5788J487l7937J13571j34462P2208j7200n091j55973Q3446o3789j7325
$$ -66528 9260 10747 -27190 86381 -48081 24127 6927 1836 -154137 -70691 -134480 -151805
1164a51805J27839L8391M846L2872l3968j7684L1442j02866o2410J08845M302
$$ -151805 -23966 14425 19271 52143 18175 491 31933 -70933 -133343 -24498 -20196
1153b0196o7576L3414J70870k3182r7797P8601q1576N61O0898R9982p8158J26582
$$ -20196 -87772 -54358 116512 93330 -4467 74134 -7442 -6881 54017 153999 75841 202423
1141B02423r1181j23612k3052o142q970M8015q9033L4998O9895P115n5359J8687
$$ 202423 111242 -12370 -35422 -41564 -50534 -2519 -91552 -56554 13341 20456 -34903 -16216
1129a6216Q8066r6695j30327P2203P5725j1648J6115Q4152J20941j13316r9837
$$ -16216 71850 -24845 -155172 -82969 -7244 -18892 -2777 81375 202316 89000 -10837
1118a0837O9338m7787j70350J4922O491N2132k6291l653P7292l0361M2110n278
$$ -10837 58501 10714 -159636 -144714 -138223 -86091 -112382 -116035 -38743 -69104 -26994 -32272
1106c2272K3825j4650o5470O115k5601J4471M8767J6537j9759j2717M6510l2321
$$ -32272 -8447 -23097 -88567 -82452 -108053 -93582 -44815 -28278 -48037 -60754 -14244 -46565
1094d6565n9862P5306J12169p4683k8064J14975L7247j18157q273j4454L018L7088
$$ -46565 -106427 -31121 81048 6365 -21699 93276 130523 12366 4093 -10361 -7343 29745
1082B9745L9499P4401l3917L6682p0822Q7114k5933L6800L5850n998k3400J12551
$$ 29745 69244 143645 109728 146410 75588 162702 136769 173569 209419 203421 180021 292572
1070B92572K9355R049O8509Q3212j09528k4771n4047K5188m3347l6881J17759
$$ 292572 321927 330976 399485 482697 373169 348398 294351 319539 276192 239311 357070
1059C57070J13138p199o9059J57269m8465j37644k9581L5436q5681L5944J15260
$$ 357070 470208 463009 393950 551219 502754 365110 335529 370965 285284 321228 436488
1048D36488Q8635j19170R4191k9177N1026q2466Q796K8883N2594K5973j4413J4532
$$ 436488 525123 405953 500144 470967 521993 439527 448323 477206 529800 555773 541360 555892
1036E55892K965p483K0077j3988J5787N6836l6498J09894q6263J26121K2237j5685
$$ 555892 558857 551374 571451 557463 573250 630086 593588 703482 617219 743340 765577 749892
1024G49892l285K21646j04709j12409M1242l8179j23891m9970J18930K5333r2224
$$ 749892 746607 968253 863544 751135 792377 754198 630307 580337 699267 724600 632376
1013F32376R2030J09904k0381P4924o9038L3942J00724J8594J8277J49352J1417
$$ 632376 724406 834310 813929 888853 819815 853757 954481 973075 991352 1140704 1152121
1002A152121o7632n2932J0270j02277O8509K688J01492P8671J20492j124O7459
$$ 1152121 1084489 1031557 1041827 939550 1008059 1010747 1112239 1190910 1311402 1310278 1377737
991A377737J8101Q860k2682L6205Q4425J17596j4233O1999J81935N1517J00295
$$ 1377737 1395838 1404698 1382016 1418221 1502646 1620242 1606009 1668008 1849943 1901460 2001755
980B001755O8789J12002J42008R8161N2272J34964J47569J28484K98445L29424
$$ 2001755 2070544 2182546 2324554 2422715 2474987 2609951 2757520 2886004 3184449 3513873
970C513873K17119K73595M02562M32501L49991N16920O67970Q74375J155686J227738
$$ 3513873 3730992 4004587 4407149 4839650 5189641 5706561 6374531 7248906 8404592 9632330
960I632330J516211J796855K240610L146772M168096K867617k36855l056512m919863
$$ 9632330 11148541 12945396 15186006 18332778 22500874 25368491 25131636 22075124 17155261
951A7155261l911021k878052j942014j374710r63989o82070m97819n26676m43455
$$ 17155261 13244240 10366188 8424174 7049464 6085475 5403405 4905586 4378910 3935455
942C935455k28705k67909j91691r5958k73626k33794k71466r6768k40943k15445
$$ 3935455 3706750 3438841 3247150 3151192 2877566 2643772 2372306 2275538 2034595 1819150
932A819150j91534k01469k1405j7790m3417r3006o3797o1741m3448N7874n4085
$$ 1819150 1627616 1426147 1404742 1386952 1343535 1250529 1186732 1124991 1081543 1139417 1085332
921A085332n9734j6122p5567r3490o1792L5733j51948J02141R5379r3895K5881
$$ 1085332 1025598 1009476 933909 840419 778627 814360 662412 764553 859932 766037 791918
910G91918P3291q2169o00j35750P347k6684o6632j12773J30481l1250r1374K0936
$$ 791918 865209 783040 782440 646690 654037 627353 560721 447948 578429 547179 455805 476741
898D76741L4351O104n3817n143J26173r8678j0579J01799M8637j54501L4445M9840
$$ 476741 511092 517196 463379 458236 584409 485731 475152 576951 625588 471087 505532 555372
886E55372j53898L9901n4422p5824l0669N4069o0767k6824J8780J0931j02317
$$ 555372 401474 441375 386953 311129 280460 334529 273762 246938 265718 276649 174332
875A74332L4640L7481O980n1169j1048L369N4038l2430j17159J45890O5137q669
$$ 174332 208972 246453 253433 202264 191216 194585 248623 216193 99034 244924 310061 301392
863C01392l2657Q5384J8913j51313N2739l8627R516r3551p4368n1945K812N3148
$$ 301392 268735 354119 373032 221719 274458 235831 245347 151796 77428 25483 28295 81443
851H1443L6751m59J2367j0768k008K1426j5958K9209P1897o0999o679J45886p3901
$$ 81443 118194 117735 130102 119334 117326 138752 122794 152003 223900 162901 156222 302108 228207
838B28207j31767J30478m9100j32418l313j8194k2120L8883J656L4065P5409r3463
$$ 228207 96440 226918 177818 45400 42087 23893 1773 40656 42312 76377 151786 58323
826E8323M0314R3645j41837j23179J11893q6883n8948J8193o464L9767L4415N295
$$ 58323 98637 192282 50445 -72734 39159 -47724 -106672 -88479 -94943 -55176 -20761 -15466
814a5466J38360p6066p9439m4778J6556l5444k894L1851M6782n7132P7256k6417
$$ -15466 122894 46828 -32611 -77389 -60833 -96277 -99171 -67320 -20538 -77670 -414 -26831
802b6831n5006J4267O6820L8952o4047q669j0930J4980j12635N3590P3906l1049
$$ -26831 -81837 -67570 -750 38202 -25845 -34514 -45444 -30464 -143099 -89509 -15603 -46652
790d6652k6604N5367N9095Q5874l3226P3520m6957j9221P927l861j08914n778
$$ -46652 -73256 -17889 41206 127080 93854 167374 120417 101196 109123 105262 -3652 -9430
778i430k6695q832M9824J6847j308O7029J0514O6073j7698j37107Q7205j14908
$$ -9430 -36125 -44957 4867 21714 20406 87435 97949 164022 146324 9217 96422 -18486
766a8486n7748O6582R7764j3125O8276m7734J3831P9599j20777j1793P9792m8142
$$ -18486 -76234 -9652 88112 74987 143263 95529 109360 188959 68182 56389 136181 88039
754H8039j04360j3930n0648j0706O1322R3188j05721J59251Q0226j64984K5980
$$ 88039 -16321 -30251 -80899 -91605 -30283 62905 -42816 116435 196661 31677 57657
743E7657k9212m8980L0368p6516j11792J49922o552l0824R9989L4268j2698p6406
$$ 57657 28445 -20535 9833 -66683 -178475 -28553 -35105 -65929 34060 68328 55630 -20776
731b0776l5294L1694m5868m865m3120Q7477M962O516k1022J7747J832k221K3237
$$ -20776 -56070 -24376 -70244 -75109 -118229 -30752 -25790 -19274 -40296 -22549 -20717 -22938 299
718B99p684K71J1827j5291m7447N1010K1722p8670k0950P903n1867K8110q9375
$$ 299 -7385 -7114 4713 -10578 -58025 -7015 14707 -63963 -84913 -77010 -128877 -100767 -190142
705a90142J1092Q6887M0756k6770O8818J16082n7954k8266N0818j9313l5727K8259
$$ -190142 -179050 -92163 -51407 -78177 -9359 106723 48769 20503 71321 52008 16281 44540
693D4540q681L9742J7494o8146L7219k1167j9969n6331m919k3589L0745p4667
$$ 44540 35859 75601 93095 24949 62168 41001 21032 -35299 -40218 -63807 -33062 -107729
681a07729R3325q4964O4232J14699j17736N1016O9400n5647K8516j5284j8763
$$ -107729 -14404 -99368 -35136 79563 -38173 12843 82243 26596 55112 39828 21065
670B1065J12597o5255K7790l313L0574L3351N2445r3388M6491m6609j17828J5486
$$ 21065 133662 68407 96197 92884 123458 156809 209254 115866 162357 115748 -2080 13406
658A3406j14660n0796O9724j6170l2734P1525l8090J3381L0507m0250L0138L1408
$$ 13406 -101254 -152050 -82326 -98496 -131230 -59705 -97795 -84414 -53907 -94157 -64019 -32611
646c2611m1964J2928J406M4235m6572N1026r9491k531k337O8783J52787j80196
$$ -32611 -74575 -61647 -60241 -16006 -62578 -11552 -111043 -113574 -115911 -47128 105659 -74537
634g4537L5409K4170n098l8948j7182P0529O3731j46865k0760N9303O8766m6602
$$ -74537 -39128 -14958 -20056 -59004 -76186 -5657 58074 -88791 -109551 -50248 18518 -28084
622b8084J771M0367j7810o0347L4411l238o340Q6621l603k2793O1946m449N8891
$$ -28084 -26313 14054 -3756 -64103 -29692 -32930 -39270 47351 43748 20955 82901 78452 137343
609A37343q2307p2677L2488o1132m712n220R8883m4923l0036o0263O3133M9285
$$ 137343 55036 -17641 14847 -46285 -50997 -56217 42666 -2257 -32293 -92556 -29423 19862
597A9862o7050L4923O3688j6691j2783J5448L6268k3577L7669n3134q318L1446
$$ 19862 -47188 -12265 51423 34732 21949 37397 73665 50088 87757 34623 26305 57751
585E7751m3251k54R958J3849o1322k9550l382K5483l5092Q1067j2337j15932J13332
$$ 57751 14500 14246 24204 38053 -23269 -52819 -56201 -30718 -65810 15257 2920 -113012 320
572C20o4405m8066Q9854n8501P4648L1815r3302O1930L1214N183k8211r1581J3873
$$ 320 -64085 -112151 -22297 -80798 -6150 25665 -67637 -5707 25507 30690 2479 -89102 -75229
559g5229P6017m6312n346N0909q550o689n0579k6944Q816L4489p4689J35463l7929
$$ -75229 788 -45524 -50870 39 -8511 -15200 -65779 -92723 -83907 -49418 -124107 11356 -26573
546b6573m4848J05346N982K4175K5139l8481m3713J0051j2950l6765J4092l733
$$ -26573 -71421 33925 39907 64082 89221 50740 7027 17078 4128 -32637 -18545 -22278
534b2278K9404P9403m8908K2062n068M5879j35435O4727O8815j19146n3311M4008
$$ -22278 7126 86529 37621 59683 54615 100494 -34941 29786 98601 -20545 -73856 -29848
522b9848M8632o3929j1426O3414r3358r18O3213n917M6869K6269j4811M5595K3686
$$ -29848 18784 -45145 -56571 6843 -86515 -87433 -24220 -30137 16732 43001 28190 73785 97471
509I7471j09132M1422J3189j22694J081N7843k4459M029O0470P6767m5596m0481
$$ 97471 -11661 29761 42950 -79744 -78663 -20820 -45279 -41250 19220 95987 50391 9910
497I910j1566q6303q124M2951L6780K3600j5101R4210j0770L7131J0304N45Q3659
$$ 9910 -1656 -87959 -96083 -53132 -16352 7248 -7853 86357 75587 112718 123022 123567 207226
484B07226p2412m6898M2294K0673j02249j7244K2432m8436L4021k368m730l5275
$$ 207226 134814 87916 130210 150883 48634 31390 53822 5386 39407 37039 32309 -2966
472b966M4824O7662j15461L7932M6978l4168J23523r5082m8619P9103Q17r8353
$$ -2966 41858 109520 -5941 31991 78969 44801 168324 73242 24623 103726 104543 6190
460F190r1J2411N3593J58967j10685m7308J02686n9973n0177k1879m4795j0801
$$ 6190 6099 18510 72103 231070 120385 73077 175763 115790 65613 43734 -1061 -11862
448a1862J0183p3842M6545J05388q152n6080j0817J5260M098m2J01002j4210m1391
$$ -11862 -1679 -75521 -28976 76412 68260 12180 1363 16623 20721 20679 121681 107471 66080
435F6080p6492n1201N9990m0930L5488L7770n0939m817R758j46377r387p043L9698
$$ 66080 -10412 -61613 -1623 -42553 -7065 30705 -20234 -25051 -15293 -161670 -171057 -178100 -138402
422a38402J4757Q4673p1704J37679o2508j34539J6763J00729m0109j5551R7414
$$ -138402 -123645 -38972 -110676 27003 -35505 -170044 -153281 -52552 -92661 -108212 -10798
411a0798k3783o9435J35598j5672m6468J24725m9895o1736k3532n3258Q7727K06512
$$ -10798 -34581 -104016 31582 15910 -30558 94167 44272 -17464 -40996 -94254 -6527 199985
399A99985j57034L4279J10322l6781j33693Q5822p6095J558k4663l6478j1671
$$ 199985 42951 77230 187552 150771 17078 102900 26805 28363 3700 -32778 -44449
388d4449N8567N1094L4950J31323N1993J8107j06661n5649m4760P313m3288k7537
$$ -44449 14118 65212 100162 231485 283478 301585 194924 139275 94515 101828 58540 31003
376C1003p058O3245r3627L7932O6771n6999L8866L7988K5684O5413l7913r6494
$$ 31003 23945 87190 -6437 31495 98266 41267 80133 118121 143805 209218 171305 74811
364G4811L7282n6129n0216L2522R3428K8134o9226N1494K6704l5985O5393j6412
$$ 74811 112093 55964 5748 38270 131698 159832 90606 142100 168804 132819 198212 181800
352A81800n5990N9790l2399j05668O4795O1762m1924J9334L3146q4167n0223n9750
$$ 181800 125810 185600 153201 47533 112328 174090 132166 151500 184646 100479 50256 -9494
340i494k6423Q1186Q9447n2339L2214M7993K8599m1832P1615m5042j01061K4237
$$ -9494 -35917 45269 134716 82377 114591 162584 191183 149351 220966 175924 74863 99100
328I9100q5246k3576L0308K4759k2592N0151P9457m5351p3104m4697k99J384q1362
$$ 99100 13854 -9722 20586 45345 22753 72904 152361 107010 33906 -10791 -11090 -9706 -91068
315i1068k6186Q2070Q4229p031k3006J57218j38541j8255N6720m7813M6807o3005
$$ -91068 -117254 -35184 49045 42014 19008 176226 37685 19430 76150 28337 75144 12139
303A2139p2289j3991P3568k8959J5816M7828l2798Q6691O398j34088k4336M0045
$$ 12139 -60150 -74141 -573 -29532 -13716 34112 1314 88005 94403 -39685 -64021 -23976
291b3976n34l5345R6807j4135N3555M7986r7809Q768k2710j7751N4024l7285j4804
$$ -23976 -24510 -59855 36952 22817 76372 124358 26549 35317 12607 -5144 48880 11595 -3209
278c209O3218R5362r4761j1080J30874m8774m6244n3005L4646L1220p3691J3852
$$ -3209 60009 155371 60610 49530 180404 131630 85386 32381 67027 98247 24556 38408
266C8408m6252Q2666j22781R6507O5036K4255m867N0733J1212n7961j2415l1670
$$ 38408 -7844 74822 -47959 48548 113584 137839 132972 183705 194917 136956 124541 92871
254I2871p6093L2172L5245r986P2480k3794L2868m4854Q7807j0213m2427m629
$$ 92871 16778 48950 84195 74209 146689 122895 155763 110909 198716 188503 146076 141447
242A41447p3507j0888J8032j13193J01765M9599Q080k8120R1779m3847k3633j7527
$$ 141447 67940 57052 75084 -38109 63656 113255 121335 93215 184994 141147 117514 99987
230I9987p0622N2005q0762L6362M3534L1036N3541r794r685O2582k2259j3187
$$ 99987 29365 81370 608 36970 80504 111540 165081 155287 145602 208184 185925 172738
218A72738J908k8415q2323k6866l3174J1096j6513k7877J06614L2763k4047P6370
$$ 172738 174646 146231 63908 37042 3868 14964 -1549 -29426 77188 109951 85904 162274
206A62274l2900L8691j570q6735m1391N139j8185l782J3235p271J22352n398n2784
$$ 162274 129374 168065 166495 79760 38369 43508 25323 21541 34776 27505 149857 144459 91675
193I1675j7042L1893l9808o143k5171K3380m1052N5714j8110m8262L4885O4771
$$ 91675 74633 106526 66718 60575 35404 58784 17732 73446 55336 7074 41959 106730
181A06730L5796o950n1572m2598l3833P5917j3481L4893K1263m5538j1914p5587
$$ 106730 142526 135576 84004 41406 7573 83490 70009 104902 126165 80627 68713 -6874
169f874L7803J5535Q4209l5851l2269K4928q292p2866L936Q6285l5779n2893j8792
$$ -6874 30929 46464 130673 94822 62553 87481 79189 6323 10259 96544 60765 7872 -10920
156a0920K9903M8913j6796l6094M4475M2680J9579k0207k5404K2117K703j04753
$$ -10920 18983 67896 51100 15006 59481 102161 121740 101533 76129 98246 100949 -3804
144c804l7926J7934O2966L9634j636M0035P0580m7813O729M31l8865o70o0513
$$ -3804 -41730 -23796 39170 78804 77168 117203 187783 139970 146699 147130 108265 107595 47082
131D7082Q9963N406K395l7878N7340p582r062J4901m5640m3295k4501J2099j8962
$$ 47082 137045 142451 144846 106968 164308 156726 147664 162565 116925 73630 49129 61228 42266
118D2266O191N6273J471N7104j2605M4140o6461n5351l4563M7674o8676K2106
$$ 42266 48457 104730 106201 163305 150700 194840 128379 73028 38465 86139 17463 39569
106C9569j4759N2423L2231l1601Q2826k9768k034n6532l3136l6284J7172j9133
$$ 39569 24810 77233 109464 77863 160689 130921 128887 72355 39219 2935 20107 974
94I74P8515N1978o2833m8997P3533n8540P4155r760m0502P123N9304o5287l1585
$$ 974 79489 131467 68634 19637 93170 34630 108785 99025 58523 65646 124950 59663 28078
81B8078O0952o3275L8157K6772k2211j9590L3353j4715j9086O1119M5924j7213
$$ 28078 89030 25755 63912 90684 68473 48883 82236 67521 48435 109554 155478 138265
69A38265p102p3932k3971k9020m3654k4496J05740J3249n2527J8301K9255L848
$$ 138265 131163 57231 33260 4240 -39414 -63910 41830 55079 2552 20853 50108 53956
57E3956J1507Q7353j455k4928l7709M3682r1909m4239R047M3172J5991O5662m387
$$ 53956 65463 152816 151361 126433 88724 132406 40497 -3742 5305 48477 64468 130130 125743
44A25743j5943J108j5910l1596J8801P093l9196O809j2463O2893J3853l8924k9104
$$ 125743 109800 110908 94998 63402 82203 89296 50100 56909 44446 107339 121192 82268 53164
31E3164J07122r2244m061L484N6376N1611J3606j6657J5388l2130q4487l6270
$$ 53164 160286 68042 63981 67465 123841 175452 189058 172401 187789 155659 71172 34902
19C4902J0515l6158l6765O7825o672O0631k0866j8749O584O0650j7090K3173l9515
$$ 34902 45417 9259 -27506 40319 33647 94278 73412 54663 61247 121897 104807 127980 88465
6H8465J878j0621n5890L8427P9569j6329
$$ 88465 90343 79722 23832 62259 141828 125499
0A25499
$$ 125499
$$ Imaginary data points
##PAGE= N=2
##DATA TABLE= (X++(I..I)), XYDATA
16383a252270k7100J0453r524J6972Q4598P5041j9284M0827L6381J2792j3471
$$ -1252270 -1279370 -1268917 -1278441 -1261469 -1176871 -1101830 -1121114 -1080287 -1043906 -1031114 -1044585
16372a044585M4762j1639K9458O8820k3008o963Q1733L3143K8507J7660K7203
$$ -1044585 -999823 -1011462 -982004 -913184 -936192 -943155 -861422 -828279 -799772 -782112 -754909
16361g54909k3391K5949n6705L1002M8874J694j3454M3824L8352L3184L3334K5105
$$ -754909 -778300 -752351 -809056 -778054 -729180 -727486 -740940 -697116 -658764 -625580 -592246 -567141
16349e67141L6201N1310j1197L6463o620Q918N8923l0391R9105P3358L4237L2041
$$ -567141 -530940 -479630 -490827 -454364 -460984 -452066 -393143 -423534 -324429 -251071 -216834 -184793
16337a84793P953l7610K873n3576L1652K7427M4606l0380Q2255k3988P1825j2238
$$ -184793 -176840 -214450 -211577 -265153 -233501 -206074 -161468 -191848 -109593 -133581 -61756 -73994
16325g3994j7549O0449k2641j8241P2626L7037k8453K1020K7415K9357J0436O0231
$$ -73994 -91543 -31094 -53735 -71976 650 37687 9234 30254 57669 87026 97462 157693
16313A57693k3869M485O5699L604l4591P7767l9155J3852L4889j9631q1086J11233
$$ 157693 133824 138309 204008 207612 173021 250788 211633 225485 260374 240743 159657 270890
16301B70890j649J510Q5906J21795k4368l653J3093l2m6725k5245O228q641O5522
$$ 270890 269241 270751 356657 478452 454084 450431 463524 463492 416767 391522 397750 389109 454631
16288D54631L048R7184P0966L8102n3215P234J043m5554K9710J14258n0618j0639
$$ 454631 457679 554863 625829 663931 610716 617950 618993 573439 603149 717407 666789 656150
$$ [...]
##END NTUPLES=NMR SPECTRUM
##END=
