##TITLE=1H_TG-2313-1
 CDCl3, 8 sc, 
 1.02.2021
##JCAMPDX= 6.0         $$ Bruker NMR JCAMP-DX V2.0
##DATA TYPE= NMR SPECTRUM
##DATA CLASS= NTUPLES
##ORIGIN= UXNMR, Bruker Analytische Messtechnik GmbH
##OWNER= root
$$ XWIN-NMR		Version 3.5
$$ Mon Feb  1 10:55:00 2021 Russian Standard Time (UT+4h)  she@DPX200
##.OBSERVE FREQUENCY= 200.1315066352
##.OBSERVE NUCLEUS= ^1H
##.ACQUISITION MODE= SIMULTANEOUS
##.ACQUISITION SCHEME= undefined
##.AVERAGES= 8
##.DIGITISER RES= 18
##SPECTROMETER/DATA SYSTEM= spect
##.PULSE SEQUENCE= zg30
##.SOLVENT NAME= CDCl3
##.SHIFT REFERENCE= (INTERNAL, CDCl3, 0, 15.9844)
##AUDIT TRAIL= $$ (NUMBER, WHEN, WHO, WHERE, WHAT)
$$ ##TITLE= Audit trail, XWIN-NMR		Version 3.5
$$ ##JCAMPDX= 5.01
$$ ##ORIGIN= Bruker BioSpin GmbH
$$ ##OWNER= she
$$ F:/spectra/data/she/nmr/H-F/1/pdata/1/auditp.txt
$$ ##AUDIT TRAIL=  $$ (NUMBER, WHEN, WHO, WHERE, WHAT)
(   1,<2021-02-01 10:53:28.85 +0400>,<she>,<DPX200>,
      <created by zg, POWCHK disabled, PULCHK disabled
       configuration hash MD5:
       00 E9 B6 7A A2 85 ED C7 34 08 36 98 17 FE 4E 26
       data hash MD5: 16K
       D9 42 91 A0 32 AD E2 92 E9 E5 AF 03 FB 73 16 DE>)
(   2,<2021-02-01 10:53:31.15 +0400>,<she>,<DPX200>,
      <Start of raw data processing
       efp BC_mod = 2 LB = 0.24 FT_mod = 6 PKNL = 1 PHC0 = -10757.35 PHC1 = 8.80095 SI = 16K 
       data hash MD5: 16K
       80 F8 76 67 E7 F2 D9 50 BD 01 11 8B 3D 8B 5F 19>)
(   3,<2021-02-01 10:53:48.21 +0400>,<she>,<DPX200>,
      <pk PHC0 = -5.511739 PHC1 = 8 
       data hash MD5: 16K
       CB 7E 16 A2 62 83 BC 01 7F 32 36 74 1C 33 F2 4E>)
(   4,<2021-02-01 10:53:51.39 +0400>,<she>,<DPX200>,
      <abs ABSG = 5 
       data hash MD5: 16K
       50 1B 1F CB 50 05 BB 01 7E A9 8D 17 F3 75 BD 4B>)
$$ ##END=
$$ 
$$ hash MD5
$$ 28 E7 27 C3 D0 2A 82 C7 52 16 CF 4A B3 8C 02 77
##$RELAX= 
##$RELAX= 
##$RELAX= 
##$RELAX= 
##$RELAX= 
##$RELAX= 
$$ Bruker specific parameters
$$ --------------------------
##$DU= <F:/spectra>
##$EXPNO= 1
##$NAME= <H-F>
##$PROCNO= 1
##$TYPE= <nmr>
##$USER= <she>
##$AMP= (0..31)
100 100 100 100 100 100 100 100 100 100 100 100 100 100 100 100 100 100 
100 100 100 100 100 100 100 100 100 100 100 100 100 100 
##$AQSEQ= 0
##$AQ_mod= 1
##$AUNM= <au_zg>
##$AUTOPOS= <>
##$BF1= 200.13
##$BF2= 200.13
##$BF3= 200.13
##$BF4= 200.13
##$BF5= 200.13
##$BF6= 200.13
##$BF7= 200.13
##$BF8= 200.13
##$BYTORDA= 1
##$CFDGTYP= 0
##$CFRGTYP= 5
##$CHEMSTR= <none>
##$CNST= (0..31)
1 1 145 1 1 1 1 1 1 1 1 1 1 1 1 1 1 1 1 1 1 1 1 1 1 1 1 1 1 1 1 1 
##$CPDPRG= <>
##$CPDPRG1= <>
##$CPDPRG2= <>
##$CPDPRG3= <>
##$CPDPRG4= <mlev>
##$CPDPRG5= <mlev>
##$CPDPRG6= <mlev>
##$CPDPRG7= <mlev>
##$CPDPRG8= <mlev>
##$CPDPRGB= <>
##$CPDPRGT= <>
##$D= (0..31)
0 1.2 0 0 0 0 0 0 0 0.06 0 0.03 0 0 0 0 0.0002 0 0 0 0 0 0 0 0 0 0 0 0 
0 0 0 
##$DATE= 1612162408
##$DBL= (0..7)
120 120 120 120 120 120 120 120 
##$DBP= (0..7)
150 150 150 150 150 150 150 150 
##$DBP07= 0
##$DBPNAM0= <>
##$DBPNAM1= <>
##$DBPNAM2= <>
##$DBPNAM3= <>
##$DBPNAM4= <>
$$ [...]
##$SUBNAM3= <"">
##$SUBNAM4= <"">
##$SUBNAM5= <"">
##$SUBNAM6= <"">
##$SUBNAM7= <"">
##$SUBNAM8= <"">
##$SUBNAM9= <"">
##$SW= 16.9725356469052
##$SWIBOX= (0..15)
0 0 2 0 0 0 0 0 0 0 0 0 0 0 0 0 
##$SW_h= 3396.73913043478
##$TD= 16384
##$TD0= 1
##$TE= 0
##$TE2= 300
##$TE3= 300
##$TEG= 300
##$TL= (0..7)
0 120 120 120 120 120 120 120 
##$TP= (0..7)
150 150 150 150 150 150 150 150 
##$TP07= 0
##$TPNAME0= <>
##$TPNAME1= <>
##$TPNAME2= <>
##$TPNAME3= <>
##$TPNAME4= <>
##$TPNAME5= <>
##$TPNAME6= <>
##$TPNAME7= <>
##$TPOAL= (0..7)
0.5 0.5 0.5 0.5 0.5 0.5 0.5 0.5 
##$TPOFFS= (0..7)
0 0 0 0 0 0 0 0 
##$TUNHIN= 0
##$TUNHOUT= 0
##$TUNXOUT= 0
##$USERA1= <user>
##$USERA2= <user>
##$USERA3= <user>
##$USERA4= <user>
##$USERA5= <user>
##$V9= 5
##$VALIST= <valist>
##$VCLIST= <CCCCCCCCCCCCCCC>
##$VD= 0
##$VDLIST= <DDDDDDDDDDDDDDD>
##$VPLIST= <PPPPPPPPPPPPPPP>
##$VTLIST= <TTTTTTTTTTTTTTT>
##$WBST= 1024
##$WBSW= 4
##$XGAIN= (0..3)
0 0 0 0 
##$XL= 0
##$YL= 0
##$YMAX_a= 352693
##$YMIN_a= -81269
##$ZGOPTNS= <>
##$ZL1= 120
##$ZL2= 120
##$ZL3= 120
##$ZL4= 120
##$ABSF1= 15.97818
##$ABSF2= -0.994482
##$ABSG= 5
##$ABSL= 3
##$ALPHA= 0
##$AQORDER= 0
##$ASSFAC= 0
##$ASSFACI= 0
##$ASSFACX= 0
##$ASSWID= 0
##$AUNMP= <proc_1d>
##$AZFE= 0.1
##$AZFW= 0.1
##$BCFW= 0
##$BC_mod= 2
##$BYTORDP= 0
##$COROFFS= 0
##$CY= -3
##$DATMOD= 1
##$DC= 0
##$DFILT= <>
##$DTYPP= 0
##$F1P= 0
##$F2P= 0
##$FCOR= 1
##$FTSIZE= 16384
##$FT_mod= 6
##$GAMMA= 0
##$GB= 0
##$INTBC= 1
##$INTSCL= 2.992141e-10
##$ISEN= 128
##$LB= 0.24
##$LEV0= 0
##$LPBIN= 0
##$MAXI= 10000
##$MC2= 0
##$MEAN= 0
##$ME_mod= 0
##$MI= 1.114404
##$NCOEF= 0
##$NC_proc= -8
##$NLEV= 6
##$NOISF1= 3.799351
##$NOISF2= 2.8
##$NSP= 0
##$NTH_PI= 0
##$NZP= 0
##$OFFSET= 15.98439
##$PC= 1
##$PHC0= -10762.86
##$PHC1= 16.80095
##$PH_mod= 1
##$PKNL= yes
##$PPARMOD= 0
##$PSCAL= 0
##$PSIGN= 0
##$REVERSE= no
##$SF= 200.130006050228
##$SI= 16384
##$SIGF1= 3
##$SIGF2= 2
##$SINO= 5.538805
##$SIOLD= 16384
##$SREGLST= <1H.CDCl3>
##$SSB= 0
##$STSI= 16384
##$STSR= 0
##$SW_p= 3396.73913043478
##$SYMM= 0
##$S_DEV= 0
##$TDeff= 16384
##$TDoff= 0
##$TI= <>
##$TILT= no
##$TM1= 0
##$TM2= 0
##$TOPLEV= 0
##$USERP1= <user>
##$USERP2= <user>
##$USERP3= <user>
##$USERP4= <user>
##$USERP5= <user>
##$WDW= 1
##$XDIM= 16384
##$YMAX_p= 506865760
##$YMIN_p= -2259594
$$ End of Bruker specific parameters
$$ ---------------------------------
##NTUPLES= NMR SPECTRUM
##VAR_NAME=  FREQUENCY,     SPECTRUM/REAL,   SPECTRUM/IMAG
##SYMBOL=    X,             R,               I
##VAR_TYPE=  INDEPENDENT,   DEPENDENT,       DEPENDENT
##VAR_FORM=  AFFN,          ASDF,            ASDF
##VAR_DIM=   16384,         16384,           16384
##UNITS=     HZ,            ARBITRARY UNITS, ARBITRARY UNITS
##FACTOR=    0.207333158178281, 1,           1
##FIRST=     3198.95611920066, 0,            0
##LAST=      -197.783011234119, 0,           0
##MIN=       -197.783011234119, -2259594,    0
##MAX=       3198.95611920066, 506865760,    0
$$ Real data points
##PAGE= N=1
##DATA TABLE= (X++(R..R)), XYDATA
$$ [...]
$$ plain form
5777 5829305 6178995 6584967 6609028 6610445 6379552 6814845 6066876 5805089 6177001 6130598
5767 6130598 6522686 6359064 6383575 6538614 5968208 5484940 6289248 6274834 5932153 5820947
5757 5820947 6009318 6560439 6359067 6211701 5858272 5657317 5771360 6110529 6311159 5931686
5747 5931686 5708106 6077964 6189214 5751677 5399439 5676157 5983847 5609853 5212837 4839410
5737 4839410 5744246 6102531 5801595 5798432 6148986 6307451 6012388 5718546 5214471 5656961
5727 5656961 5469024 5303521 5247423 5256809 5735823 6069848 5868666 5672112 5396797 5608581
5717 5608581 6113415 6012442 5615541 5126091 5183923 5489630 5690225 5592316 5129946 5258941
5707 5258941 5328815 5343233 5115448 5333640 5234511 5369266 5368667 5146541 4938820 5293897 5330095
$$ packed form
5777E829305L49690M05972K4061J417k30893M35293p47969k61787L71912m6403
5767F130598L92088j63622K4511J55039n70406m83268Q04308j4414l42681j11206
5757E820947J88371N51121k01372j47366l53429k00955J14043L39169K00630l79473
5747E931686k23580L69858J11250m37537l52238K76718L07690l73994l97016l73427
5737D839410R04836L58285l00936l163L50554J58465k95063k93842n04075M42490
5727E656961j87937j65503n6098R386M79014L34025k01182j96554k75315K11784
5717E608581N04834j00973l96901m89450N7832L05707K00595r7909m62370J28995
5707E258941O9874J4418k27785K18192r9129J34755n99k22126k07721L55077L6198
$$ plain form
5696 5330095 4610253 4524149 4871471 5530529 5742845 5288449 5118473 4986031 5046256 4989075
5686 4989075 5111845 4682268 4958468 4578472 4278832 5231802 5232782 4990080 5036784 4739912
5676 4739912 4539244 4785124 4757513 5148690 5090488 5070949 4525714 4919572 5122488 4763284
5666 4763284 4516813 5243800 5286594 4817031 5503316 5533343 5326030 5293090 5270088 5898043
5656 5898043 5244456 4759121 5070730 6047445 6611009 5685448 5028533 5514232 5976393 5485858
5646 5485858 5458131 5168634 4660084 4782456 5419266 5498743 5455994 5278382 5996598 5654192
5636 5654192 5130426 4816509 5716630 5806901 5166712 5573780 5303684 5746893 5700751 5840037
5626 5840037 5440307 5133919 4730925 5104167 5671216 5408943 5166769 5625787 6509767 6264967
$$ packed form
5696E330095p19842q6104L47322O59058K12316m54396j69976j32442O0225n7181
5686D989075J22770m29577K76200l79996k99640R52970R80k42702M6704k96872
5676D739912k00668K45880k7611L91177n8202j9539n45235L93858K02916l59204
5666D763284k46471P26987M2794m69563O86285L0027k07313l2940k3002O27955
5656E898043o53587m85335L11609R76715N63564r25561o56915M85699M62161m90535
5646E485858k7727k89497n08550J22372O36810P9477m2749j77612P18216l42406
5636E654192n23766l13917R00121R0271o40189M07068k70096M43209m6142J39286
5626E840037l99730l06388m02994L73242N67049k62273k42174M59018Q83980k44800
$$ plain form
5616 6264967 5930059 5742072 6017049 5601797 4920813 5626567 6064720 4943100 5275932
5607 5275932 5868079 5524347 5678584 4896276 4900615 5366426 5745285 5294134 5615848 6042102
5597 6042102 5991592 5967886 5672177 5946666 6343734 6805043 6174447 5984521 5569694 5290386
5587 5290386 6193722 5582273 5124897 5065102 5171330 5484823 5757180 5496424 5669044 5644857
5577 5644857 5288908 4693411 5137561 5949001 5786008 5161854 4946278 5180722 6237446
5568 6237446 6379587 5714367 6039868 5416254 5703197 5929503 6181803 6429438 5952890 5817412
5558 5817412 5750128 5410789 5462158 6215895 5794061 4689257 4965020 5564919 5873090 5982760
5548 5982760 6615689 5930309 5625366 5195903 5110708 6347391 6062892 5337926 5534828 6057158
$$ packed form
5616F264967l34908j87987K74977m15252o80984P05754M38153j121620L32832
5607E275932N92147l43732J54237p82308M339M65811L78859m51151L21714M26254
5597F042102n0510k3706k95709K74489L97068M61309o30596j89926m14827k79308
5587E290386R03336o11449m57376n9795J06228L13493K72357k60756J72620k4187
5577E644857l55949n95497M44150Q11440j62993o24154k15576K34444J056724
5568F237446J42141o65220L25501o23614K86943K26306K52300K47635m76548j35478
5558E817412o7284l39339N1369P53737m21834j104804K75763N99899L08171J09670
5548E982760O32929o85380l04943m29463q5195J236683k84499p24966J96902N22330
$$ plain form
5538 6057158 6372649 6509533 6384175 6425493 6029688 5098806 5253451 5805249 5978507 5463601
5528 5463601 5957513 6394937 5341819 5671964 5950829 5384965 5702258 5718787 5480964 5968652
5518 5968652 6059656 6393918 7101721 7035188 6637285 6013530 5824494 5915996 6523796 6810844
5508 6810844 6371416 5937373 5852288 5829161 6806403 6188053 5355867 5323851 5021905 5552035
5498 5552035 6045732 5718253 5166466 5665586 5052365 5696786 6122283 6093517 5896518 5643356
5488 5643356 5657935 5789095 6223828 5986865 6279793 6109975 5581381 6126002 7349415 6870082
5478 6870082 6352144 6537639 6185145 6705750 6604152 6680153 6934672 6596074 5950498 6467788
5468 6467788 7600079 7153093 5957261 5827940 6520874 6645157 6665519 6293373 6450908
$$ packed form
5538F057158L15491J36884j25358M1318l95805r30882J54645N51798J73258n14906
5528E463601M93912M37424j053118L30145K78865n65864L17293J6529k37823M87688
5518E968652R1004L34262P07803o6533l97903o23755j89036R1502O07800K87048
5508F810844m39428m34043q5085k3127R77242o18350q32186l2016l01946N30130
5498E552035M93697l27479n51787M99120o13221O44421M25497k8766j96999k53162
5488E643356J4579J31160M34733k36963K92928j69818n28594N44621J223413m79333
5478F870082n17938J85495l52494N20605j01598P6001K54519l38598o45576N17290
5468F467788J132291m46986j195832j29321O92934J24283K0362l72146J57535
$$ plain form
5459 6450908 6895717 6735088 6867696 6660847 6430511 6381460 6421235 6884156 6970559 6780061
5449 6780061 6648226 6384486 6662234 7048912 7663384 7273399 6153689 6074665 6657164 7170510
5439 7170510 6920905 6546561 6537973 7014948 6252808 6126365 6259935 6415180 6798361 6868058
5429 6868058 6539934 5953231 6799804 7327518 6969678 6506774 5527486 6315319 7071905 6702330
5419 6702330 5980474 6354631 6862172 7229549 7252877 7148133 7521644 7713362 7756273 7394649
5409 7394649 7667449 7698337 7732909 8029484 7950816 7610759 7675400 7515668 7774299 7501815
5399 7501815 7975493 8446284 8241500 7863729 7746513 8504802 8270421 7759684 7632151 8163542
5389 8163542 8300426 8360789 8860757 9183530 9327927 8745974 9007937 9538172 10084536 9904538
$$ packed form
5459F450908M44809j60629J32608k06849k30336m9051L9775M62921Q6403j90498
5449F780061j31835k63740K77748L86678O14472l89985j119710p9024N82499N13346
5439G170510k49605l74344q588M76975p62140j26443J33570J55245L83181O9697
5429F868058l28124n86703Q46573N27714l57840m62904r79288P87833P56586l69575
5419F702330p21856L74157N07541L67377K3328j04744L73511J91718M2911l61624
5409G394649K72800L0888L4572K96575p8668l40057O4641j59732K58631k72484
5399G501815M73678M70791k04784l77771j17216P58289k34381n10737j27533N31391
5389H163542J36884O0363M99968L22773J44397n81953K61963N30235N46364j79998
$$ plain form
5379 9904538 9802074 10716478 10519409 10228076 10671361 11791712 12191845 12781608 14481096
5370 14481096 16140821 17049710 18151126 21123424 21673640 19719689 17288966 15390738
5362 15390738 14044392 12643995 11282974 11300044 11448481 10785313 10312996 10648872 10279530
5353 10279530 9698808 9849207 9927752 9288844 9104967 9601905 9464010 9471214 8898974 8423179
5343 8423179 8485229 8245465 8086459 8654623 9242801 8612251 8736336 9155427 9399922 8786541
5333 8786541 7863482 7827306 7858865 7796144 8087338 9301981 8971789 8682645 8437390 9172641
5323 9172641 9055537 8127046 8214482 8833458 9001856 8435044 8719197 9221404 9190685 8878703
5313 8878703 8532787 8155367 8083162 8365941 8397178 8710855 8462037 7666417 7811189 8910416
$$ packed form
5379I904538j02464R14404j97069k91333M43285J120351M00133N89763J699488
5370A4481096J659725R08889J101416K972298N50216j953951k430723j898228
5362A5390738j346346j400397j361021J7070J48437o63168m72317L35876l69342
5353A0279530n80722J50399P8545o38908j83877M96938j37895P204n72240m75795
5343H423179O2050k39764j59006N68164N88178o30550J24085M19091K44495o13381
5333H786541r23059l6176L1559o2721K91194J214643l30192k89144k45255P35251
5323I172641j17104r28491Q7436O18976J68398n66812K84153N02207l0719l11982
5313H878703l45916l77420p2205K82779L1237L13677k48818p95620J44772J099227
$$ plain form
5303 8910416 8629488 7934513 8209017 8176279 8553448 8833458 8113658 8360018 8890775 8549449
5293 8549449 8720091 8648641 8352048 8352405 8854695 8759692 8663673 9161282 9447201 9966984 9858421
5282 9858421 9040017 8291409 8884551 8883155 8654151 8711415 8716756 8869143 9168552 8825012
5272 8825012 8962503 9246178 9033972 9378133 9300353 8550834 8284832 9217464 9554688 9008375
5262 9008375 8470193 8188489 8271591 8429312 8347658 8328753 8527212 8291218 8222251 8833036
5252 8833036 8612026 8322504 8170844 8582641 8769895 8429353 8394760 9311198 9870033 9251491
5242 9251491 8819964 9003613 8740523 8974631 8792981 8781528 9064073 8679166 9023650 9307561
5232 9307561 9408958 9621819 9378706 9458737 9343849 9132727 9582857 10214578 10288044 10298732
$$ packed form
5303H910416k80928o94975K74504l2738L77169K80010p19800K46360N30757l41326
5293H549449J70642p1450k96593L57N02290r5003r6019M97609K85919N19783j08563
5282I858421q18404p48608N93142j396k29004N7264N341J52387K99409l43540
5272H825012J37491K83675k12206L44161p7780p49519k66002R32632L37224n46313
5262I008375n38182k81704Q3102J57721q1654j8905J98459k35994o8967O10785
5252H833036k21010k89522j51660M11797J87254l40542l4593R16438N58835o18542
5242I251491m31527J83649k63090K34108j81650j1453K82545l84907L44484K83911
5232I307561J01397K12861k43113Q0031j14888k11122M50130O31721P3466J0688
$$ plain form
5222 10298732 9494276 9474136 9842345 10182004 10638429 9893682 9710169 9791701 10470556 11567305
5212 11567305 11920306 11454162 11309021 11526342 11500547 11560020 11362208 11458997 11485729 11442213
5202 11442213 11952751 12091041 12524349 12843608 12599514 12179625 12090418 13155694 13615477
5193 13615477 13570369 14595754 14593447 14966267 15760537 16510985 16872535 18347001 19063696 19457355
5183 19457355 21483531 23591157 25400255 25872149 24575962 22611918 21828480 21159386 20657544
5174 20657544 20756201 20896002 20751676 21379264 22934151 24257955 26051984 25992608 24735935
5165 24735935 23609315 21605552 20183008 18802573 18537049 18245878 17974547 17312332 17284850
5156 17284850 18291394 18020869 16893788 16414141 16375701 16488235 17440480 17399421 16715660
$$ packed form
5222A0298732q04456k0140L68209L39659M56425p44747j83513Q1532O78855J096749
5212A1567305L53001m66144j45141K17321k5795N9473j97812R6789K6732m3516
5202A1442213N10538J38290M33308L19259k44094m19889q9207J065276M59783
5193A3615477m5108J025385k307L72820P94270P50448L61550J474466P16695L93659
5183A9457355K026176K107626J809098M71894j296187j964044p83438o69094n01842
5174B0657544R8657J39801j44326O27588J554887J323804J794029n9376j256673
5165B4735935j126620k003763j422544j380435k65524k91171k71331o62215k7482
5156A7284850J006544k70525j127081m79647l8440J12534R52245m1059o83761
$$ plain form
5147 16715660 16379222 16655577 16707844 17101498 17535582 17135970 17981573 18755350 18584699 19359729
5137 19359729 19773878 19814385 20747439 21716815 22475918 23610499 24692411 26044972 27998423
5128 27998423 30248103 32575887 34597560 35036237 33776566 31568106 29727673 28419698
5120 28419698 27758780 27961114 27860482 28810811 29657815 31148461 33034404 34306006 34208880
5111 34208880 32524200 30223245 27922046 25805342 24451412 23306135 22726522 22267185
5103 22267185 21143574 20222119 20029597 20183135 19884127 19658147 18965659 18976417 19323587
5094 19323587 18823606 19113664 19372483 18839059 18056873 18637035 18682159 18335335 18686154 18983314
5084 18983314 19204980 18663758 18691698 19263791 20156998 19273114 18170161 18216784 19536079
$$ packed form
5147A6715660l36438K76355N2267L93654M34084l99612Q45603P73777j70651P75030
5137A9359729M14149M0507R33054R69376P59103J134581J081912J352561J953451
5128B7998423K249680K327784K021673M38677j259671k208460j840433j307975
5120B8419698o60918K02334j00632R50329Q47004J490646J885943J271602r7126
5111C4208880j684680k300955k301199k116704j353930j145277n79613m59337
5103B2267185j123611r21455j92522J53538k99008k25980o92488J0758L47170
5094A9323587m99981K90058K58819n33424p82186N80162M5124l46824L50819K97160
5084A8983314K21666n41222K7940N72093Q93207q83884j102953M6623J319295
$$ plain form
5075 19536079 19663465 19212813 18763551 18204920 17925210 17858011 18403659 18600375 18307635 18070306
5065 18070306 18614866 18757040 18268418 18766133 19671462 19289099 18394811 19122392 20170083
5056 20170083 20627590 20096587 19730565 20870591 21474136 20472333 20770294 21568724 21254756
5047 21254756 21545613 21824080 21341505 21152590 21585860 21980605 22778865 22811049 22461595 22401538
5037 22401538 22821590 22863434 23248550 23678736 23484506 23552542 23591658 24187726 25408392 25221808
5027 25221808 24496581 24786448 25829931 25895091 26174472 26141157 26451088 27203595 27560789 27928805
5017 27928805 28717296 29110019 29044424 29487290 29094490 28892510 29885833 29870393 29259041 29511679
5007 29511679 30303730 30930121 31627693 31783442 32184485 32507987 32267449 32444449 33754696
$$ packed form
5075A9536079J27386m50652m49262n58631k79710o7199N45648J96716k92740k37329
5065A8070306N44560J42174m88622M97715R05329l82363q94288P27581J047691
5056B0170083M57507n31003l66022J140026O03545j001803K97961P98430l13968
5047B1254756K90857K78467m82575j88915M33270L94745P98260L2184l49454o0057
5037B2401538M20052M1844L85116M30186j94230O8036L9116N96068J220666j86584
5027B5221808p25227K89867J043483O5160K79381l3315L09931P52507L57194L68016
5017B7928805P88491L92723o5595M42866l92800k01980R93323j5440o11352K52638
5007B9511679P92051O26391O97572J55749M01043L23502k40538J77000J310247
$$ plain form
4998 33754696 34317365 34623606 35108334 35608810 36349048 37238266 38162005 38111452 38838581 39498602
4988 39498602 40857179 41643829 42193622 42665811 44617418 45264602 45326682 46941733 48522741
4979 48522741 50313730 51138444 51946123 52853375 54708476 57211871 58443666 59802513 61230547
4970 61230547 63335324 66072613 68390355 70629174 73370959 76063207 79194917 83411977
4962 83411977 86977124 90360128 94991879 100029423 104772279 110453824 117342576 124837385
4954 124837385 132652186 140202128 148388997 157067810 165258083 171076745 175235333 176878496
4946 176878496 176017962 173238106 169473024 165312089 160572594 154457570 148599726 142564047
4938 142564047 136040797 128979224 121903395 115273884 108517302 102588494 96337692 91905889
$$ packed form
4998C3754696N62669L06241M84728N00476P40238Q89218R23739n0553P27129O60021
4988C9498602J358577P86650N49793M72189J951607O47184O2080J615051J581008
4979D8522741J790989Q24714Q07679R07252J855101K503395J231795J358847J428034
4970F1230547K104777K737289K317742K238819K741785K692248L131710M217060
4962H3411977L565147L383004M631751N037544M742856N681545O888752P494809
4954A24837385P814801P549942Q186869Q678813Q190273N818662M158588J643163
4946A76878496q60534k779856l765082m160935m739495o115024n857844o035679
4938A42564047o523250p061573p075829o629511o756582n928808o250802m431803
$$ plain form
4930 91905889 87687853 83038946 78881117 75028020 71712055 68411714 65958967 63707474
4922 63707474 61393731 59003098 57095686 56011178 55280104 54461374 52797188 51483989
4914 51483989 49973997 49387378 49085616 49089987 48798910 48186336 47250205 47150072 47214189 46823473
4904 46823473 45657701 44338136 43035962 42075995 41338406 40390272 39590361 38931478 37649616
4895 37649616 36901789 37065884 36547674 36672044 36289908 35433848 35041295 34707780 35364243
4886 35364243 35168697 34544781 33944297 33287332 33388665 33918528 34071723 33723985 33508233
4877 33508233 33374678 33544433 33628758 34276904 34412682 34007489 33836815 33360407 34025909 34321720
4867 34321720 34432128 33900844 33466886 33556103 33660617 34214669 34033260 34081878 34415448 34022251
$$ packed form
4930I1905889m218036m648907m157829l853097l315965l300341k452747k251493
4922F3707474k313743k390633j907412j084508p31074q18730j664186j313199
4914E1483989j509992n86619l01762M371k91077o12574r36131j00133O4117l90716
4904D6823473j165772j319565j302174r59967p37589r48134p99911o58883j281862
4895C7649616p47827J64095n18210J24370l82136q56060l92553l33515O56463
4886C5364243j95546o23916o00484o56965J01333N29863J53195l47738k15752
4877C3508233j33555J69755Q4325O48146J35778m05193j70674m76408O65502K95811
4867C4321720J10408n31284m33958Q9217J04514N54052j81409M8618L33570l93197
$$ plain form
4857 34022251 33672526 34260763 34787671 34572253 34515534 33668054 33486539 34379008 34241497 34685164
4847 34685164 34651161 35211285 35888957 36662388 36984837 37728094 39088119 40180191 41485431
4838 41485431 43054619 44896850 46233815 46443150 44711567 42571286 40970218 39001062
4830 39001062 38114142 37637043 37324443 36795927 36462116 36311372 36049035 35994503 35931572 36239909
4820 36239909 36353231 36122905 36070097 37476462 38526210 38357171 39598953 40215469 41614058
4811 41614058 43306081 44520130 47179113 48832417 48625995 47468599 46195900 44296798
4803 44296798 42445930 41052743 40374117 39709791 38802048 37883731 37741268 37572454 36988966
4794 36988966 37301760 37814797 37379528 37172326 37650686 37617628 37683628 38579628 39655085 40786506
$$ packed form
4857C4022251l49725N88237N26908k15418n6719q47480j81515Q92469j37511M43667
4847C4685164l4003N60124O77672P73431L22449P43257J360025J092072J305240
4838D1485431J569188J842231J336965K09335j731583k140281j601068j969156
4830C9001062q86920m77099l12600n28516l33811j50744k62337n4532o2931L08337
4820C6239909J13322k30326n2808J406365J049748j69039J241782O16516J398589
4811D1614058J692023J214049K658983J653304k06422j157396j272699j899102
4803D4296798j850868j393187o78626o64326r07743r18317j42463j68814n83488
4794C6988966L12794N13037m35269k07202M78360l3058O6000Q96000J075457J131421
$$ plain form
4784 40786506 42468754 43255416 44368981 45367648 44920382 42984563 41466782 40326856 39673122
4775 39673122 39528359 38693318 38303967 38231351 37948923 37298974 37268768 36778165 36601809 36474478
4765 36474478 36170074 36199568 36941864 37301284 36994768 37303713 37849621 38652323 40078512
4756 40078512 40856510 42013213 43539497 44635307 44600663 42994604 40928542 39543212 38244238
4747 38244238 37014364 36194375 36132152 36297452 35472270 34798238 34116115 34457691 33793937
4738 33793937 32879761 32697160 33154349 32437335 32201470 32438675 32215981 32548164 32043569
4729 32043569 31860130 32064440 31335087 30694019 30827012 30306514 29707682 29804959 29805147 29676453
4719 29676453 29498153 29117268 29236938 29726811 29522334 28708923 29381127 29862541 29792046 29559224
$$ packed form
4784D0786506J682248P86662J113565R98667m47266j935819j517781j139926o53734
4775C9673122j44763q35041l89351p2616k82428o49949l0206m90603j76356j27331
4765C6474478l04404K9494P42296L59420l06516L08945N45908Q02702J426189
4756D0078512P77998J156703J526284J095810l4644j606059k066062j385330j298974
4747C8244238j229874q19989o2223J65300q25182o74032o82123L41576o63754
4738C3793937r14176j82601M57189p17014k35865K37205k22694L32183n04595
4729C2043569j83439K04310p29353o41068J32993n20498n98832R7277J88j28694
4719B9676453j78300l80885J19670M89873k04477q13411O72204M81414p0495k32822
$$ plain form
4709 29559224 29698588 29028775 29082383 29460360 29344927 29191919 29048047 28840899 28412049 28573226
4699 28573226 28820578 28946073 28603115 28272002 28473321 28650750 29076913 29776685 29651712
4690 29651712 29487690 29324884 30487544 31200867 31455098 31538886 31643620 32043761 32348915
4681 32348915 32394642 32763217 33499210 33702734 33910004 34886289 36213768 37116325 37784870
4672 37784870 38855688 39871812 40684993 42047573 43588743 45456765 47079763 48582316
4664 48582316 49916325 51372817 53128581 54670794 55620534 56383826 56313061 55694563 56159361
4655 56159361 55841430 53734147 52599274 52226168 51520426 50903129 50841042 51281219 51105105
4646 51105105 50764446 50743878 51904823 52693193 52646049 53460772 53306929 52436685 52364545 53201720
$$ packed form
4709B9559224J39364o69813N3608L77977j15433j53008j43872k07148m28850J61177
4699B8573226K47352J25495l42958l31113K01319J77429M26163O99772j24973
4690B9651712j64022j62806J162660P13323K54231Q3788J04734M00141L05154
4681C2348915M5727L68575P35993K03524K07270R76285J327479R02557O68545
4672C7784870J070818J016124Q13181J362580J541170J868022J622998J502553
4664D8582316J334009J456492J755764J542213R49740P63292p0765o18498M64798
4655E6159361l17931k107283j134873l73106p05742o17297o2087M40177j76114
4646E1105105l40659k0568J160945P88370m7144Q14723j53843q70244p2140Q37175
$$ plain form
4636 53201720 53212664 52435864 51357099 50534995 50547105 50616290 49134719 48102117 47199046
4627 47199046 45538310 45013045 44274710 43793852 43402684 41992546 40697376 39817649 39182497
4618 39182497 39037419 39204837 38519673 36840495 36089772 36532512 36736278 36380688 35405888
4609 35405888 34865184 34425244 34157518 33917393 34252857 34252784 33534428 33408486 32952476 33311280
4599 33311280 33975141 33447461 32958717 32705749 32770290 32666282 32937343 32919672 32807593 33045593
4589 33045593 32645743 33196884 34013695 34321843 34057198 34636473 34488322 34904565 35153888
4580 35153888 34545776 34242523 34310033 34209396 34226488 34332879 33978460 34251707 34509218 34108520
4570 34108520 33941073 34013321 34350242 34986426 35488160 35605103 35554269 35077102 34826029 35700795
$$ packed form
4636E3201720J0944p76800j078765q22104J2110O9185j481571j032602r03071
4627D7199046j660736n25265p38335m80858l91168j410138j295170q79727o35152
4618C9182497j45078J67418o85164j679178p50723M42740K03766l55590r74800
4609C5405888n40704m39940k67726k40125L35464p3p18356j25942m56010L58804
4599C3311280O63861n27680m88744k52968O4541j04008K71061j7671j12079K38000
4589C3045593l99850N51141Q16811L08148k64645N79275j48151M16243K49323
4580C5153888o08112l03253O7510j00637J7092J06391l54419K73247K57511m00698
4570C4108520j67447P2248L36921O36184N01734J16943n0834m77167k51073Q74766
$$ plain form
4560 35700795 36236716 36186581 36320320 36812117 37906555 38542783 38736307 38374773 38407366 38378984
4550 38378984 37595623 37142468 37105003 37170417 36956963 36758658 35979395 35875808 36880154 37401280
4540 37401280 36532055 35182028 35192953 35447859 35885186 36125599 35843812 35957365 36502515
4531 36502515 37196494 37049245 37292592 37209314 37115990 37492206 37519941 38360920 39478525 39783718
4521 39783718 39676038 40164517 40881362 41520066 43294521 43817059 44667462 45511933 46150073
4512 46150073 46920814 47677697 47897154 46941036 46917645 46626796 46895087 46699631 46436643 46677439
4502 46677439 47021441 47774081 48058731 48430183 48345117 49072656 49936943 49640945 48994789 48521008
4492 48521008 49657454 50025716 49516084 49263414 49795882 51161531 51160818 52047043 53509305
$$ packed form
4560C5700795N35921n0135J33739M91797J094438O36228J93524l61534L2593k8382
4550C8378984p83361m53155l7465O5414k13454j98305p79263j03587J004346N21126
4540C7401280q69225j350027J0925K54906M37327K40413k81787J13553N45150
4531C6502515O93979j47249K43347q3278r3324L76216K7735Q40979J117605L05193
4521C9783718j07680M88479P16845O38704J774455N22538Q50403Q44471O38140
4512D6150073P70741P56883K19457r56118k3391k90849K68291j95456k62988K40796
4502D6677439L44002P52640K84650L71452q5066P27539Q64287k95998o46156m73781
4492D8521008J136446L68262n09632k52670N32468J365649p13Q86225J462262
$$ plain form
4483 53509305 54025617 55164625 56385087 57500242 58270256 59699612 61488900 62963253
4475 62963253 64259564 65472170 67914800 70158772 71439889 71855797 72799098 74788864
4467 74788864 77078129 79396202 81344161 84100473 86656568 89731912 92303035 94022273
4459 94022273 95586504 96844280 98474168 99338991 99840164 100480085 101512673 101574733 101451658
4450 101451658 101011929 100677511 101422361 101540030 101492903 101504855 101347497 101900467 102959256
4441 102959256 102788019 101632852 101348308 100876408 99399842 97432017 95397632 93645607
4433 93645607 90942080 88356470 85703142 83527605 80981861 77811208 75347160 72699833
4425 72699833 69879008 66735746 63887287 61336459 58541315 55750817 53693565 51929665
$$ packed form
4483E3509305N16312J139008J220462J115155P70014J429356J789288J474353
4475F2963253J296311J212606K442630K243972J281117M15908R43301J989766
4467G4788864K289265K318073J947959K756312K556095L075344K571123J719238
4459I4022273J564231J257776J629888Q64823N01173O39921J032588O2060j23075
4450A01451658m39729l34418P44850J17669m7127J1952j57358N52970J058789
4441A02959256j71237j155167k84544m71900j476566j967825k034385j752025
4433I3645607k703527k585610k653328k175537k545744l170653k464048k647327
4425G2699833k820825l143262k848459k550828k795144k790498k057252j763900
$$ plain form
4417 51929665 49647136 47525906 46389253 45262359 44124499 43320044 42749056 41691931
4409 41691931 41642587 41486763 41151553 40565489 40337698 40175537 39904379 40175945 40483984 40777854
4399 40777854 40394756 39828832 39271879 38327855 37953878 37621384 36840532 35838672 35293990
4390 35293990 35146225 34878414 35085566 33767678 32614442 32521632 32505036 32033360 31092799
4381 31092799 30757678 30702074 30444454 29306613 28723540 28910503 28502711 28354390 28283554 28201690
4371 28201690 28391510 28395133 27840507 26515022 26087489 25773048 25764588 25371281 24321871 24029540
4361 24029540 23671678 22914791 22313395 22478821 22244797 22019495 21294745 21286811 21713883 21653516
4351 21653516 21093532 20929034 21577020 21442612 20971074 20736661 20503178 20972506 21862039
$$ packed form
4417E1929665k282529k121230j136653j126894j137860q04455n70988j057125
4409D1691931m9344j55824l35210n86064k27791j62161k71158K71566L08039K93870
4399D0777854l83098n65924n56953r44024l73977l32494p80852j001860n44682
4390C5293990j47765k67811K07152j317888j153236r2810j6596m71676r40561
4381C1092799l35121n5604k57620j137841n83073J86963m07792j48321p0836q1864
4371B8201690J89820L623n54626j325485m27533l14441q460l93307j049410k92331
4361B4029540l57862p56887o01396J65426k34024k25302p24750p934M27072o0367
4351B1653516n59984j64498O47986j34408m71538k34413k33483M69328Q89533
$$ plain form
4342 21862039 21943858 20799385 20780086 21035568 21148143 20698714 19688211 20050600 20311658
4333 20311658 19704558 18764795 18884568 19874802 19857386 19436943 18301987 18276754 18789293 18971316
4323 18971316 18450918 17915998 18334826 18499265 18836892 19147119 18321069 17766020 17844192 17282579
4313 17282579 17359133 17855888 17583303 17353773 17509790 17456040 17397798 17203380 16943148 16900524
4303 16900524 16881122 16838810 16368040 16798638 17561850 17380842 17295713 17173310 16941184 17097992
4293 17097992 17682847 17285302 16877154 17196954 17111205 17337830 17457630 17568625 17508013 17258386
4283 17258386 16884984 16747612 17373573 17494399 17168214 16713615 16858175 17449781 17410237 17031507
4273 17031507 17070867 17179521 17221363 16933584 16893739 17168318 17757012 17543246 16948560 16873920
$$ packed form
4342B1862039Q1819j144473j9299K55482J12575m49429j010503L62389K61058
4333B0311658o07100r39763J19773R90234j7416m20443j134956k5233N12539J82023
4323A8971316n20398n34920M18828J64439L37627L10227q26050n55049P8172n61613
4313A7282579P6554M96755k72585k29530J56017n3750n8242j94418k60232m2624
4303A6900524j9402m2312m70770M30598P63212j81008q5129j22403k32126J56808
4293A7097992N84855l97545m08148L19800q5749K26625J19800J10995o0612k49627
4283A7258386l73402j37372O25961J20826l26185m54599J44560N91606l9544l78730
4273A7031507L9360J08654M1842k87779l9845K74579N88694k13766n94686p4640
$$ plain form
4263 16873920 16855440 16962846 17174479 16631385 16366955 16752108 16931171 17232898 17500861 17018551
4253 17018551 16745416 16829959 16374844 16046858 16598633 16528698 16121232 16248734 16360638 16662637
4243 16662637 16929709 16732274 16559140 16884652 16616888 16588229 17787785 18272683 18254277 18042941
4233 18042941 17981385 18482668 19421208 19530636 18774460 18699355 18916607 18895332 18965984 18540253
4223 18540253 18303323 17950453 17468904 16847517 16931059 17174627 17704827 17914285 17062470 17188711
4213 17188711 17936504 19308914 19485909 18928318 18993756 19900489 20954747 20950373 20494992 19710772
4203 19710772 19914845 20063494 20270752 20703820 21074440 21750016 22419544 23802422 24840246
4194 24840246 25423711 25718999 25403561 24621977 24009348 23995034 24203736 24975844 25301530 25025680
$$ packed form
4263A6873920j8480J07406K11633n43094k64430L85153J79063L01727K67963m82310
4253A7018551k73135Q4543m55115l27986N51775o9935m07466J27502J11904L01999
4243A6662637K67072j97435j73134L25512k67764k8659J199556M84898j8406k11336
4233A8042941o1556N01283R38540J09428p56176p5105K17252k1275P0652m25731
4223A8540253k36930l52870m81549o21387Q3542K43568N30200K09458q51815J26241
4213A7188711P47793J372410J76995n57591O5438R06733J054258m374m55381p84220
4203A9710772K04073J48649K07258M33068L70620O75576O69528J382878J037824
4194B4840246N83465K95288l15438p81584o12629j4314K08702P72108L25686k75850
$$ plain form
4184 25025680 24856621 25961294 27562612 27526920 27860055 27438876 27202109 28151048 28213491
4175 28213491 27898950 28487772 28817692 28193011 27508917 26821344 26260145 27406268 28335835
4166 28335835 29199736 29406413 28467021 27464052 28652065 29301281 28170573 27620616 26668350
4157 26668350 26604525 26614446 26533210 26287205 26485878 26469141 25645679 26255595 26389079 26388479 27292799
4146 27292799 27979171 27531232 26782210 25938147 25074168 24804435 23661407 23935958 24831367
4137 24831367 24779581 24914050 25393350 26106975 26671909 26452051 25591947 25583051 24934997 24053853
4127 24053853 24129284 24213299 24416543 24214471 24686363 24500255 24244152 23545528 22760028 22738253
4117 22738253 22445767 22113287 22309281 22109931 21948189 22328075 22197971 21382420 20897462
$$ packed form
4184B5025680j69059J104673J601318l5692L33135m21179k36767R48939O2443
4175B8213491l14541N88822L29920o24681o84094o87573n61199J146123R29567
4166B8335835Q63901K06677r39392j002969J188013O49216j130708n49957r52266
4157B6668350o3825R921q1236k46005J98673j6737q23462O09916J33484o00R04320
4146B7292799O86372m47939p49022q44063q63979k69733j143028K74551Q95409
4137B4831367n1786J34469M79300P13625N64934k19858q60104q896o48054q81144
4127B4053853P5431Q4015K03244k02072M71892j86108k56103o98624p85500k1775
4117B2738253k92486l32480J95994j99350j61742L79886j30104q15551m84958
$$ plain form
4108 20897462 21229731 21587586 21262896 19892070 19842582 19938405 20023384 18834758 18349625 18456977
4098 18456977 18147565 17668403 17819143 18485951 18416183 18257272 18231404 17289751 16062218 15710210
4088 15710210 15230516 14950094 14409767 13395499 13865709 14215016 13799791 13929748 13687585
4079 13687585 13698859 12952397 13098092 13114767 12974653 13190507 12433580 12969108 13014819 12790428
4069 12790428 12684887 13096612 13040721 12407196 12494519 11958616 12183791 12201136 12094520 11739153
4059 11739153 11609637 11192495 11170623 11957688 11986750 11631790 12006855 12194956 12099079 11776243
4049 11776243 12257357 12327674 12296261 11958073 11855281 12197561 12197446 12566907 12748574 12708607
4039 12708607 12381453 12905222 13493713 12847925 12132317 12566414 13015388 12915166 12594807
$$ packed form
4108B0897462L32269L57855l24690j370826m9488R5823Q4979j188626m85133J07352
4098A8456977l09412m79162J50740O66808o9768j58911k5868r41653j227533l52008
4088A5710210m79694k80422n40327j014268M70210L49307m15225J29957k42163
4079A3687585J1274p46462J45695J6675j40114K15854p56927N35528M5711k24391
4069A2790428j05541M11725n5891o33525Q7323n35903K25175J7345j06616l55367
4059A1739153j29516m17142k1872P87065K9062l54960L75065J88101r5877l22836
4049A1776243M81114P0317l1413l38188j02792L42280j15L69461J81667l9967
4039A2708607l27154N23769N88491o45788p15608M34097M48974j00222l20359
$$ plain form
4030 12594807 12003356 12303672 12052519 11002932 10883813 11697908 12645904 13011486 12897501
4021 12897501 12670825 12250721 12401385 12644676 12543733 12138614 11143432 11529660 12054397
4012 12054397 11957263 11988243 12132603 11326760 10861365 10764731 10507238 10761662 10269054 9498083
4002 9498083 9963234 10226524 9721545 9830109 9933610 9346233 8769258 8977562 9881477 10878085
3992 10878085 10891230 10061643 10365565 10847491 11230074 11533287 11386908 10674427 10182702 10299752
3982 10299752 10764607 11193154 10746823 10323187 10354520 10765731 10695065 10445061 10295786 9604059
3972 9604059 9105799 9697636 10290716 10516077 10460878 10421129 10536256 10188421 10189750 10889195
3962 10889195 11352803 10964157 10474807 10624976 11514127 11058980 10171578 10674624 10745901 11008763
$$ packed form
4030A2594807n91451L00316k51153j049587j19119Q14095R47996L65582j13985
4021A2897501k26676m20104J50664K43291j00943m05119r95182L86228N24737
4012A2054397r7134L0980J44360q05843m65395r6634k57493K54424m92608p70971
4002I498083M65151K63290n04979J08564J03501n87377n76975K08304R03915R96608
3992A0878085J3145q29587L03922M81926L82583L03213j46379p12481m91725J17050
3982A0299752M64855M28547m46331m23636L1333M11211p0666k50004j49275o91727
3972I604059m98260N91837N93080K25361n5199l9749J15127l47835J329O99445
3962A0889195M63608l88646m89350J50169Q89151m55147q87402N03046P1277K62862
$$ plain form
3952 11008763 11447271 11568856 11391160 11409108 11698674 11844348 11174786 10411847 10808639 10700614
3942 10700614 10466711 10017246 9932195 9677560 9694200 10029817 10191287 10222092 9913477 9853643
3932 9853643 10152606 9889758 9258304 9632509 9579427 9118658 8826987 8541894 8910805 9527325
3922 9527325 9792161 9862830 9437619 8879615 9196334 10146077 9572476 8094116 8004249 8957809
3912 8957809 9570420 9421292 8951240 8664808 9065543 9441090 9472578 9379330 8750307 8756172
3902 8756172 9289438 9982548 9123230 8597796 9306263 9644627 8753241 8084121 9139596
3893 9139596 9985947 9692632 9146555 9412279 9454087 9375455 9557741 9307436 9114330 8430433
3883 8430433 8493244 9682836 10040591 9299245 8866560 9399577 9551311 9403578 10014604 10091150
$$ packed form
3952A1008763M38508J21585j77696J7948K89566J45674o69562p62939L96792j08025
3942A0700614k33903m49465q5051k54635J6640L35617J61470L0805l08615n9834
3932I853643K98963k62848o31454L74205n3082m60769k91671k85093L68911O16520
3922I527325K64836P0669m25211n58004L16719R49743n73601j478360q9867R53560
3912H957809O12611j49128m70052k86432M00735L75547L1488r3248o29023N865
3902H756172N33266O93110q59318n25434P08467L38364q91386o69120J055475
3893I139596Q46351k93315n46077K65724M1808p8632J82286k50305j93106o83897
3883H430433O2811J189592L57755p41346m32685N33017J51734j47733O11026P6546
$$ plain form
3873 10091150 9471476 9718935 9898945 9428861 9704122 10118084 10421968 10939982 10617080
3864 10617080 10418100 11125465 11821744 11000337 10434592 11150382 11419825 11268850 10848918
3855 10848918 10452525 11338499 11790546 11692710 12405847 12668109 11792898 12402465 12348894 12022448
3845 12022448 11901226 11724144 12118641 12494543 12394700 12041520 12833455 12864955 11981420 12330084
3835 12330084 12836274 13726829 14381275 14130195 13915107 14374976 14853633 14643770 14586640 14249091
3825 14249091 14538468 14740040 15094311 16121775 16239848 16103934 16648681 16528867 15375327
3816 15375327 15683820 16927635 17210335 16475178 16227150 16883838 18276634 18642848 18038490
3807 18038490 18015946 18628640 18695828 19036941 19961130 19788669 19830110 20239708 20734481 21496176
$$ packed form
3873A0091150o19674K47459J80010m70084K75261M13962L03884N18014l22902
3864A0617080j98980P07365O96279q21407n65745P15790K69443j50975m19932
3855A0848918l96393Q85974M52047r7836P13137K62262q75211O09567n3571l26446
3845A2022448j21222j77082L94497L75902r9843l53180P91935L1500q83535L48664
3835A2330084N06190Q90555O54446k51080k15088M59869M78657k09863n7130l37549
3825A4249091K89377K01572L54271J027464J18073j35914N44747j19814j153540
3816A5375327L08493J243815K82700p35157k48028O56688J392796L66214o04358
3807A8038490k2544O12694O7188L41113R24189j72461M1441M09598M94773P61695
$$ plain form
3797 21496176 22381875 22328516 23288500 23753664 23798287 24684574 25834521 26174729 26525243 26982627
3787 26982627 27731005 28359129 29227338 29923202 31224268 31923037 32442767 34255072 35940931
3778 35940931 37623879 39635784 42180170 45030799 48267611 52555656 58110414 64829668
3770 64829668 72033820 81426354 93393727 105614220 114710116 117879275 115289539 107101267
3762 107101267 95565117 83454163 75730870 71966934 69503922 66620836 63299719 59287253
3754 59287253 55003263 51707224 48711032 46480863 45082530 43569839 42864122 42855480 42471108
3745 42471108 42399788 42712036 42907903 43509369 44854563 46421298 48620338 51822357 54851164
3736 54851164 57032886 58290871 58737204 58971440 57378894 53434401 49848869 48633968
$$ packed form
3797B1496176Q85699n3359R59984M65164M4623Q86287J149947L40208L50514M57384
3787B6982627P48378O28124Q68209O95864J301066O98769N19730J812305J685859
3778C5940931J682948K011905K544386K850629L236812M288045N554758O719254
3770F4829668P204152R392534J1967373J2220493R095896L169159k589736q188272
3762A07101267j1536150j2110954p723293l763936k463012k883086l321117m012466
3754E9287253m283990l296039k996192k230169j398333j512691p05717q642l84372
3745D2471108p1320L12248J95867O01466J345194J566735K199040L202019L028807
3736E4851164K181722J257985M46333K34236j592546l944493l585532j214901
$$ plain form
3728 48633968 47512502 46299913 45421402 44647155 44583174 44886879 44833873 44770016 45217293 46331579
3718 46331579 48474152 49820339 50832781 53030059 55789200 57153418 56539079 54078016
3710 54078016 51915092 51457613 50724312 49430808 49352349 50255812 51052978 51168979 51035148
3701 51035148 51915432 53646928 55742005 58023616 60778404 64242945 68848063 75662756
3693 75662756 83150905 92167363 102667185 113454565 119649507 120207100 118013171 111119725
3685 111119725 100162226 87516218 77374848 70255083 64831227 59447420 55450637 52216221
3677 52216221 49283768 46934136 44261284 42791769 42276019 41032748 38728801 37819252
3669 37819252 37597941 36846193 35740548 34853207 34217690 33697449 33111431 32759823 32361560
$$ packed form
3728D8633968j121466j212589q78511p74247o3981L03705n3006o3857M47277J114286
3718D6331579K142573J346187J012442K197278K759141J364218o14339k461063
3710E4078016k162924m57479p33301j293504p8459R03463P97166J16001j33831
3701E1035148Q80284J731496K095077K281611K754788L464541M605118O814693
3693G5662756P488149R016458J0499822J0787380O194942N57593k193929o893446
3685A11119725j0957499j2646008j0141370p119765n423856n383807l996783l234416
3677E2216221k932453k349632k672852j469515n15750j243271k303947r09549
3669C7819252k21311p51748j105645q87341o35517n20241n86018l51608l98263
$$ plain form
3660 32361560 31558750 31044862 30739124 30263455 29702098 29947601 29938267 29547573 29104978 29636896
3650 29636896 29766932 28816039 28573115 28267896 28726789 28511245 28743458 28822420 28455424 28061425
3640 28061425 27859273 28669392 28818528 28942962 29018046 29033733 28150739 27282861 28089113 28509290
3630 28509290 28134648 27292223 27694395 28322155 28498066 28610909 28468704 28712738 28734051 28738576
3620 28738576 28788555 29732125 30234964 29807156 29814317 30746565 31441286 31991742 32432090 32250814
3610 32250814 31803509 31835789 32156133 33142957 33436971 32976957 33523677 34287996 34841689 35523849
3600 35523849 36139131 36105226 36236583 36679799 37353720 38076633 39145678 39874758 41185557
3591 41185557 42073113 42755864 44886429 47548797 49362719 50887536 53007887 53999470 53223950
$$ packed form
3660C2361560q02810n13888l05738m75669n61357K45503r334l90694m42595N31918
3650B9636896J30036r50893k42924l05219M58893k15544K32213P8962l66996l93999
3640B8061425k02152Q10119J49136J24434P5084J5687q82994q67878Q06252M20177
3630B8509290l74642q42425M02172O27760J75911J12843j42205K44034K1313M525
3620B8738576M9979R43570N02839m27808P161R32248O94721N50456M40348j81276
3610C2250814m47305L2280L20344R86824K94014m60014N46720P64319N53693O82160
3600C5523849O15282l3905J31357M43216O73921P22913J069045P29080J310799
3591D1185557Q87556O82751K130565K662368J813922J524817K120351R91583p75520
$$ plain form
3582 53223950 51460183 50340747 50038496 49893210 49661302 50385154 52496073 53876788 55534013
3573 55534013 57626361 58420464 57952234 56856550 56070199 55176585 54213366 53521612 54395955
3564 54395955 56104323 57370269 58527895 59019940 58027937 56607427 55066006 54828178 54634531
3555 54634531 54417178 53591255 53897836 55275115 56349261 57568167 58637101 57732683 55468205
3546 55468205 53365668 52128699 51758639 50844067 49724559 49414493 49365511 50260189 51153250
3537 51153250 51480543 51894260 52550903 53126822 53525818 54713811 55207974 55052122 54595254
3528 54595254 54770239 55878900 57679326 58762860 58617030 57812395 57331561 57230935 57605284
3519 57605284 57339269 56095969 55927069 55787905 55133074 55952866 55789702 55668107 55223542
$$ packed form
3582E3223950j763767j119436l02251j45286k31908P23852K110919J380715J657225
3573E5534013K092348P94103m68230j095684p86351q93614r63219o91754Q74343
3564E4395955J708368J265946J157626M92045r92003j420510j541421k37828j93647
3555E4634531k17353q25923L06581J377279J074146J218906J068934r04418k264478
3546E5468205k102537j236969l70060r14572j119508l10066m8982Q94678Q93061
3537E1153250L27293M13717O56643N75919L98996J187993M94163j55852m56868
3528E4595254J74985J108661J800426J083534j45830q04635m80834j00626L74349
3519E7605284k66015j243300j68900j39164o54831Q19792j63164j21595m44565
$$ plain form
3510 55223542 54858423 54474791 54770532 55595597 56057275 56323235 56795806 57354490 58479859
3501 58479859 59277642 59379511 59297624 59140111 59100473 58918155 58964562 58224998 57451979 56593355
3491 56593355 55820160 54418979 53290655 51893041 50484714 49521653 48322446 47952408 48149058
3482 48149058 47610432 47165412 46860335 46198173 46535403 46341111 45798773 45599921 45401285
3473 45401285 45457286 45335706 45401002 45000925 45093337 45833379 45872178 45729665 46137500 47273779
3463 47273779 48432558 48100253 47601479 47870315 48312203 48311017 47734614 47424109 47201911 47927657
3453 47927657 48267958 48533112 48826032 49176738 49593126 50238932 51364275 51970297 53046938
3444 53046938 53536101 54306053 55688989 56302658 56746275 57741724 58631986 59909148 60792852
$$ packed form
3510E5223542l65119l83632K95741Q25065M61678K65960M72571N58684J125369
3501E8479859P97783J01869q1887j57513l9638j82318M6407p39564p73019q58624
3491E6593355p73195j401181j128324j397614j408327r63061j199207l70038J96650
3482D8149058n38626m45020l05077o62162L37230j94292n42338j98852j98636
3473D5401285N6001j21580O5296m00077R2412P40042L8799j42513M07835J136279
3463D7273779J158779l32305m98774K68836M41888j186n76403l10505k22198P25746
3453D7927657L40301K65154K92920L50706M16388O45806J125343O06022J076641
3444E3046938M89163P69952J382936O13669M43617R95449Q90262J277162Q83704
$$ plain form
3435 60792852 61368736 61617047 62279007 62299977 61623173 60198432 59398633 59954459 59822210
3426 59822210 58811846 58078265 58437125 58859137 58623252 57975689 57955686 58366919 57577266
3417 57577266 56748838 57461818 57919196 58521979 59050425 60275328 61052658 61076678 61576200
3408 61576200 61102005 58538281 55672272 53936129 52691879 50579392 48791632 47652013
3400 47652013 47249301 45886205 44493696 44161766 43850841 43234103 41689993 41702454 42545038
3391 42545038 42511820 42611817 42793501 42821135 42479896 41815763 41882028 43179997 43881492 43573478
3381 43573478 44127648 43933132 44281506 45932970 46723584 46490190 46223768 46231633 46570727 48095744
3371 48095744 48390684 48333126 49199951 49505688 49473880 49675346 50078701 49835305 49902417 48966257
$$ packed form
3435F0792852N75884K48311O61960K0970o76804j424741p99799N55826j32249
3426E9822210j010364p33581L58860M22012k35885o47563k0003M11233p89653
3417E7577266q28428P12980M57378O02783N28446J224903P77330K4020M99522
3408F1576200m74195k563724k866009j736143j244250k112487j787760j139619
3400D7652013m02712j363096j392509l31930l10925o16738j544110J2461Q42584
3391D2545038l3218R9997J81684K7634l41239o64133O6265J297969P01495l08014
3381D3573478N54170j94516L48374J651464P90614k33394k66422P865L39094J525017
3371D8095744K94940n7558Q66825L05737l1808K01466M03355k43396O7112r36160
$$ plain form
3361 48966257 48456167 49531955 50008572 49113352 48921716 48937718 48600919 48963206 49315219
3352 49315219 48499700 47395782 46247744 45491480 45639095 44589400 43690698 43013622 42620513
3343 42620513 41679690 41582149 41698571 41276372 40703955 39348725 39333112 38861152 37983511 37327749
3333 37327749 37082971 37008478 37046937 37218126 37117764 37225937 36986838 36460613 36606177 37234072
3323 37234072 37807023 38091912 38576124 38628330 38912817 38956677 39015872 39349077 39705269 40221673
3313 40221673 41168087 41843831 42018727 42200132 43158846 43795744 43729124 44028960 44377410 45373452
3303 45373452 46371922 46676658 46756929 48218909 48911819 48911453 48828861 49686102 50071816 49419317
3293 49419317 49721735 50031588 50322367 50458929 50606222 50451837 50361799 49880576 49230709 49162078
$$ packed form
3361D8966257n10090J075788M76617q95220j91636J6002l36799L62287L52013
3352D9315219q15519j103918j148038p56264J47615j049695q98702o77076l93109
3343D2620513r40823r7541J16422m22199n72417j355230j5613m71960q77641o55762
3333C7327749k44778p4493L8459J71189j00362J08173k39099n26225J45564O27895
3323C7234072N72951K84889M84212N2206K84487M3860N9195L33205L56192N16404
3313D0221673R46414O75744J74896J81405R58714O36898o6620K99836L48450R96042
3303D5373452R98470L04736Q0271J461980O92910l66q2592Q57241L85714o52499
3293D9419317L02418L09853K90779J36562J47293j54385r0038m81223o49867o8631
$$ plain form
3283 49162078 47941787 46765253 45958259 45543651 44894890 44996961 44176700 42752395 41836074
3274 41836074 41250230 41250846 41226483 40599110 39609351 39301313 38732204 38199971 38401047 38175464
3264 38175464 37364084 37057905 36540726 36135844 36908454 37782900 37241195 36435128 35818906
3255 35818906 35741326 36755238 36648140 35283161 34957584 35502754 36624332 37021087 36894326
3246 36894326 37113322 37804986 37859234 37587074 37969248 38600968 38728878 39163251 39592565 39736466
3236 39736466 40160386 40584005 41185908 41550330 40982314 40949764 42155799 43005280 43038011 43026207
3226 43026207 43101777 43495905 43907951 43919658 43954095 44569895 45261109 45460296 46296669 46425942
3216 46425942 46467885 47023903 47492953 47308638 47441575 47756535 48301857 49239528 49479079 49882812
$$ packed form
3283D9162078j220291j176534q06994m14608o48761J02071q20261j424305r16321
3274D1836074n85844O16k4363o27373r89759l08038n69109n32233K01076k25583
3264C8175464q11380l06179n17179m04882P72610Q74446n41705q06067o16222
3255C5818906p7580J013912j07098j364979l25577N45170J121578L96755j26761
3246C6894326K18996O91664N4248k72160L82174O31720J27910M34373M29314J43901
3236C9736466M23920M23619O01903L64422n68016l2550J206035Q49481L2731j1804
3226D3026207P5570L94128M12046J1707L4437O15800O91214J99187Q36373J29273
3216D6425942M1943N56018M69050j84315J32937L14960N45322R37671K39551M03733
$$ plain form
3206 49882812 50510226 50847671 51214959 51882766 52463776 52495220 53105518 53751169 54502139 55273058
3196 55273058 55876128 57244391 57816670 58181133 58749823 59812453 61017642 61626382 62291482
3187 62291482 63034048 63946278 65549481 66699161 67146753 68268441 69473134 70877746 73806555
3178 73806555 76089251 78144655 80606656 83387270 86230501 88954593 90639063 91582984
3170 91582984 92656492 93016608 93192314 93957232 94954526 95529955 96261778 95988638 95527057
3161 95527057 96516546 96961501 96419677 96112404 95769765 96137330 97076059 98289087 100078885
3152 100078885 101697563 103039674 105350535 109222094 113390286 117324563 122052079 127456149
3144 127456149 133640389 140478993 147583392 156251164 165534813 173923002 182471402 189554003
$$ packed form
3206D9882812O27414L37445L67288O67807N81010L1444O10298O45651P50970P70919
3196E5273058O03070J368263N72279L64463N68690J062630J205189O08740O65100
3187F2291482P42566R12230J603203J149680M47592J121688J204693J404612K928809
3178G3806555K282696K055404K462001K780614K843231K724092J684470R43921
3170I1582984J073508L60116J75706P64918R97294N75429P31823k73140m61581
3161I5527057R89489M44955n41824l07273l42639L67565R38729J213028J789798
3152A00078885J618678J342111K310861L871559M168192L934277M727516N404070
3144A27456149O184240O838604P104399Q667772R283649Q388189Q548400P082601
$$ plain form
3136 189554003 195757941 200427316 202638232 203091493 201467311 199530165 197995440 198016797
3128 198016797 199510261 202051511 207246877 214745974 224016429 236090210 250891965 268234171
3120 268234171 290183193 316083246 345025497 370349382 385197618 388795233 385412469
3113 385412469 384217881 390711394 405032339 423701207 445096347 468832419 492515806
3106 492515806 506865760 501782971 475325866 434170391 393187500 357620428 328668461
3099 328668461 306529714 288448664 272521505 258176767 246418329 235796815 226677218
3092 226677218 218972034 213556160 209547044 206595410 204519208 203374189 204637389 207531995
3084 207531995 211816927 217825582 224054668 231682658 239863528 246847661 248398570 241586691
$$ packed form
3136A89554003O203938M669375K210916M53261j624182j937146j534725K1357
3128A98016797J493464K541250N195366P499097R270455J2073781J4801755J7342206
3120B68234171K1949022K5900053K8942251K5323885J4848236L597615l382764
3113C85412469j194588O493513J4320945J8668868K1395140K3736072K3683387
3106D92515806J4349954n082789k6457105m1155475m0982891l5567072k8951967
3099C28668461k2138747j8081050j5927159j4344738j1758438j0621514r119597
3092B26677218p705184n415874m009116k951634k076202j145019J263200K894606
3084B07531995M284932O008655O229086P627990Q180870O984133J550909o811879
$$ plain form
3076 241586691 229568927 215671882 202909450 192080371 182226075 173603182 165936287
3069 165936287 159831272 153460798 147502579 142838065 139192878 135692165 131634232 128004737
3061 128004737 125139316 123005332 120032403 117532487 115530181 113275152 111170259 109469590
3053 109469590 107568983 104854391 102826940 101275454 99455915 97699112 96760844 95968200
3045 95968200 95514624 94623339 93359352 93086796 92493811 91207625 90958364 90754353 89620349
3036 89620349 88497634 87841272 88132383 87455535 86138257 84959349 84126818 83280357 82239137
3027 82239137 81686588 80741576 79571048 78885076 78516186 77301851 75900212 75607687 75912036
3018 75912036 74955557 73015524 72227034 72227507 72480934 71213638 71036059 70838065 70496324 70128969
$$ packed form
3076B41586691j2017764j3897045j2762432j0829079r854296q622893p666895
3069A65936287o105015o370474n958219m664514l645187l500713m057933l629495
3061A28004737k865421k133984k972929k499916k002306k255029k104893j700669
3053A09469590j900607k714592k027451j551486j819539j756803r38268p92644
3045I5968200m53576q91285j263987k72556n92985j286186k49261k04011j134004
3036H9620349j122715o56362K91111o76848j317278j178908q32531q46461j041220
3027H2239137n52549r45012j170528o85972l68890j214335j401639k92525L04349
3018G5912036r56479j940033p88490M73K53427j267296j77579j97994l41741l67355
$$ plain form
3008 70128969 70127042 69735651 69054161 68506486 69049151 69358252 69037918 69474888 69770594 69288870
2998 69288870 67572739 66728195 66375143 66006599 65294034 64788501 63953669 63450140 63927795
2989 63927795 63789791 63037681 62383193 62118158 62559062 62283888 61454072 61045962 60989178 61028143
2979 61028143 61068338 61026191 61063004 61020139 61630909 61793019 61565429 61806058 62287758 62419523
2969 62419523 61643307 61445599 61935613 62719232 63303126 62318376 61185678 61490162 62269610
2960 62269610 62279222 62276251 62541924 62805973 62357460 62164992 62189584 61909514 60831386 59901148
2950 59901148 60092469 60210736 59449318 59070065 58951455 58705046 58433330 57356790 56937740
2941 56937740 56632786 56127579 55509313 55003628 54078297 53246866 53408476 53502628 53130254 51896983
$$ packed form
3008G0128969j927l91391o81490n47675N42665L09101l20334M36970K95706m81724
2998F9288870j716131q44544l53052l68544p12565n05533q34832n03529M77655
2989F3927795j38004p52110o54488k65035M40904k75174q29816m08110n6784L8965
2979F1028143M0195m2147L6813m2865O10770J62110k27590K40629M81700J31765
2969F2419523p76216j97708M90014P83619N83894r84750j132698L04484P79448
2960F2269610R612k971K65673K64049m48513j92468K4592k80070j078128r30238
2950E9901148J91321J18267p61418l79253j18610k46409k71716j076540m19050
2941E6937740l04954n05207o18266n05685r25331q31431J61610R4152l72374j233271
$$ plain form
2931 51896983 50993456 51024654 50524889 49994933 48943998 48619876 48995527 48330286 47617105
2922 47617105 47692661 48222577 48340428 47873609 47372756 47022723 47267701 47836492 47796671 47643520
2912 47643520 46888059 46598902 47468543 47918462 47750672 47394239 47194078 47068515 47466761
2903 47466761 48369258 49080374 49092715 49815393 49822612 49895983 50107661 50679259 51191772 50393368
2893 50393368 49401741 49519295 50524909 51057047 51108155 50773355 51180502 51034856 51834411
2884 51834411 52582831 52789129 52746972 51852331 51739068 52471265 52542760 52366248 52306748 52000390
2874 52000390 51154902 50681575 50741218 51104376 50898916 50584992 49965927 50406944 51241096 51811718
2864 51811718 51760551 51469851 51023644 51070675 51225972 51078262 51179314 50842590 50400551 49736064
$$ packed form
2931E1896983r03527L1198m99765n29956j050935l24122L75651o65241p13181
2922D7617105P5556N29916J17851m66819n00853l50033K44978N68791l9821j53151
2912D7643520p55461k89157Q69641M49919j67790l56433k00161j25563L98246
2903D7466761R02497P11116J2341P22678P219P3371K11678N71598N12513p98404
2893E0393368r91627J17554J005614N32138N1108l34800M07147j45646P99555
2884E1834411P48420K06298m2157q94641j13263P32197P1495j76512n9500l06358
2874E2000390q45488m73327N9643L63158k05460l13924o19065M41017Q34152N70622
2864E1811718n1167k90700m46207M7031J55297j47710J01052l36724m42039o64487
$$ plain form
2854 49736064 49693274 49552233 49404239 49603648 49267937 48352636 48116963 48644740 49646835
2845 49646835 50044373 50003311 49607484 49517416 50673676 51803631 51759167 52090629 52327332 52805333
2835 52805333 53778741 54893189 55536877 56012186 56218195 56721465 56787853 58036332 58231773
2826 58231773 58167054 58400725 57532840 58501046 59571550 60287935 61167859 61678224 62131726
2817 62131726 62196122 62928563 63389758 62724014 62179989 61690473 61364716 61170491 60925721 61184457
2807 61184457 60756043 59709768 59787827 60497550 60429632 60118893 60226398 61196050 61314345 61331511
2797 61331511 61764224 62037536 62032490 61200015 60259173 59568021 59292366 58866264 58759554 58830203
2787 58830203 59183866 59753724 60222822 60484326 60195331 60511629 60887448 60619324 61217994
$$ packed form
2854D9736064m2790j41041j47994J99409l35711r15301k35673N27777J002095
2845D9646835L97538m1062l95827r0068J156260J129955m4464L31462K36703M78001
2835E2805333R73408J114448O43688M75309K06009N03270O6388J248479J95441
2826E8231773o4719K33671q67885R68206J070504P16385Q79924N10365M53502
2817F2131726O4396P32441M61195o65744n44025m89516l25757j94225k44770K58736
2807F1184457m28414j046275P8059P09723o7918l10739J07505R69652J18295J7166
2797F1331511M32713K73312n046q32475r40842o91152k75655m26102j06710P0649
2787E8830203L53663N69858M69098K61504k88995L16298L75819k68124N98670
$$ plain form
2778 61217994 61908477 63268384 63325296 64265305 65525681 66206575 66343088 67232466 68760828
2769 68760828 68801717 68255131 69183747 70952471 72056443 72792886 73791116 74357669 74826995
2760 74826995 75162790 75904430 76055187 76327084 76849252 77959594 79297577 79214710 79770649
2751 79770649 80936277 81735485 81720528 81807962 82397782 83251126 83875920 84508635 84842598 84868029
2741 84868029 84710786 84710461 84714708 85056272 85241440 84908840 85487264 86147521 86524007 86397499
2731 86397499 86459289 86373008 86442791 86259196 85209481 84690354 84473700 84167056 83475094 83274688
2721 83274688 82224325 81676295 81802024 81774623 81824904 81502186 81490248 80872779 80127399 79594277
2711 79594277 79406930 79086088 78353079 77999622 77252603 76414261 75172584 74747303 74236703
$$ packed form
2778F1217994O90483J359907N6912R40009J260376O80894J36513Q89378J528362
2769F8760828M0889n46586R28616J768724J103972P36443R98230N66553M69326
2760G4826995L35795P41640J50757K71897N22168J110342J337983q2867N55939
2751G9770649J165628P99208j4957Q7434N89820Q53344O24794O32715L33963K5431
2741H4868029j57243l25M247L41564J85168l32600N78424O60257L76486j26508
2731H6397499O1790q6281O9783j83595j049715n19127k16654l06644o91962k00406
2721H3274688j050363n48030J25729k7401N0281l22718j1938o17469p45380n33122
2711G9594277j87347l20842p33009l53457p47019q38342j241677m25281n10600
$$ plain form
2702 74236703 72952343 71216769 70003912 69495701 68847984 67814514 66342863 65299635
2694 65299635 64805356 64030275 63687456 62608285 61164009 60627577 60031874 59893221 59652392
2685 59652392 58683339 58105623 57414580 56203883 54454149 53921354 53798694 52839363 51504890
2676 51504890 50910508 50899330 50749138 50209196 49207118 48831473 47867878 46706152 45954079
2667 45954079 45575276 45179037 44970520 44484760 43643628 42967596 42817292 43060278 42649629
2658 42649629 41245462 40317552 41336896 41373889 41335760 41277340 40880104 41395664 41186955 40023298
2648 40023298 39735700 39877945 39605565 40125935 40128304 39851846 39538460 39798593 39588832 39235494
2638 39235494 39352262 38190525 38223571 38209140 37810756 37840847 37569505 37291505 37522431 37392162
$$ packed form
2702G4236703j284360j735574j212857n08211o47717j033470j471651j043228
2694F5299635m94279p75081l42819j079171j444276n36432n95703j38653k40829
2685E9652392r69053n77716o91043j210697j749734n32795j22660r59331j334473
2676E1504890n94382j1178j50192n39942j002078l75645r63595j161726p52073
2667D5954079l78803l96239k08517m85760q41132o76032j50304K42986m10649
2658D2649629j404167r27910J019344L6993l8129n8420l97236N15560k08709j163657
2648D0023298k87598J42245k72380N20370K369k76458l13386K60133k09761l53338
2638C9235494J16768j161737L3046j4431l98384L0091k71342k78000K30926j30269
$$ plain form
2628 37392162 37062076 37137039 36724752 36791042 36290047 36204059 35818848 35900025 36538208 36218106
2618 36218106 36036258 36040150 36233988 36847334 36644212 36345414 35979326 35749083 35820584 35523764
2608 35523764 35157329 35675572 35734144 35214817 34720924 34453633 34774869 34731045 33867882 33157971
2598 33157971 32850311 33420769 33332361 33089280 33348468 32806666 33210241 33556159 33562825 33263817
2588 33263817 33246887 33316557 33508056 33392169 33103956 33519204 33862905 34092025 33641326 33652626
2578 33652626 33462531 33491377 34172331 34069491 33837337 34195634 34889901 34824517 35204735 35178547
2568 35178547 35364265 35315164 35100867 34808682 35133484 36584582 36562331 36653816 36483542 36611660
2558 36611660 36859935 36535570 36301256 36876373 37208946 37408025 37688693 37851099 38915113
$$ packed form
2628C7392162l30086P4963m12287O6290n00995q5988l85211Q1177O38183l20102
2618C6218106j81848L892J93838O13346k03122k98798l66088k30243P1501k96820
2608C5523764l66435N18243N8572n19327m93893k67291L21236m3824q63163p09911
2598C3157971l07660N70458q8408k43081K59188n41802M03575L45918O666k99008
2588C3263817j6930O9670J91499j15887k88213M15248L43701K29120m50699J1300
2578C3652626j90095K8846O80954j02840k32154L58297O94267o5384L80218k6188
2568C5178547J85718m9101k14297k92185L24802J451098k2251R1485j70274J28118
2558C6611660K48275l24365k34314N75117L32573J99079K80668J62406J064014
$$ plain form
2549 38915113 40029124 39729205 39371380 40206055 41487481 42528248 42665637 42864714 42957058
2540 42957058 43667323 44328361 44565867 45333224 45251115 45365651 45485320 45322378 46289895 47500309
2530 47500309 47337684 46744112 46667928 46584416 47793849 47906394 47345464 46595962 46754390 46831944
2520 46831944 47021059 47146575 46154677 45697200 45500047 45024711 44531893 44673333 44639949 43998280
2510 43998280 42647433 41809882 42224322 42417557 41442401 40680688 39969541 39287113 38550411
2501 38550411 38490377 39109120 38597924 37735759 37112796 37238320 37055262 36819312 37056627 36701882
2491 36701882 36254752 35465942 35534500 35593653 35423909 35334989 35122579 34535883 34749907 35821438
2481 35821438 35568049 35697805 34774809 34433441 35121903 35111307 34751060 35133912 35832925 35654392
$$ packed form
2549C8915113J114011k99919l57825Q34675J281426J040767J37389J99077R2344
2540D2957058P10265O61038K37506P67357q2109J14536J19669j62942R67517J210414
2530D7500309j62625n93572p6184q3512J209433J12545n60930p49502J58428P7554
2520D6831944J89115J25516r91898m57477j97153m75336m92818J41440l3384o41669
2510D3998280j350847q37551M14440J93235r75156p61713p11147o82428p36702
2501C8550411o0034O18743n11196q62165o22963J25524j83058k35950K37315l54745
2491C6701882m47130p88810O8558N9153j69744q8920k12410n86696K14024J071531
2481C5821438k53389J29756r22996l41368O88462j0596l60247L82852O99013j78533
$$ plain form
2471 35654392 35743006 35517852 35966018 36277516 37017123 36163435 35765421 35792962 36051241 37925087
2461 37925087 37878341 36736714 36543704 37081054 36961114 36826099 36114326 35592002 35367868
2452 35367868 35117046 35181931 35658934 35753872 34428117 34508575 34613187 33402005 33208791 33436719
2442 33436719 33112347 32728593 31880645 31119692 32102698 31873794 30976078 30791438 30186879
2433 30186879 29084193 29317325 30130727 29869234 29088559 29166553 29235939 29136006 28719314 28173312
2423 28173312 28576468 27620844 26829940 27089602 27186167 26538045 26520459 26942395 26681405 26737680
2413 26737680 26188409 25695358 25941927 25773355 25639022 25800946 25462537 24949728 25484100
2404 25484100 25358684 24941430 25385036 25441458 25166595 25169340 25021164 25247148 25937495 25433700
$$ packed form
2471C5654392Q8614k25154M48166L11498P39607q53688l98014K7541K58279J873846
2461C7925087m6746j141627j93010N37350j19940j35015p11773n22324k24134
2452C5367868k50822O4885M77003R4938j325755Q0458J04612j211182j93214K27928
2442C3436719l24372l83754q47948p60953R83006k28904q97716j84640o04559
2433C0186879j102686K33132Q13402k61493p80675P7994O9386r9933m16692n46002
2423B8173312M03156r55624p90904K59662R6565o48122j7586M21936k60990N6275
2413B6737680n49271m93051K46569j68572j34333J61924l38409n12809N34372
2404B5484100j25416m17254M43606N6422k74863K745j48176K25984O90347n03795
$$ plain form
2394 25433700 24713420 24637472 24438272 24135408 24400775 24165863 23640475 24156473 24506307 23416286
2384 23416286 23321971 23669142 23727241 23972459 23297465 23134452 23612078 23863874 23064539 22907769
2374 22907769 23277026 22914470 23116719 23869118 24013484 23854115 23615495 23546355 24324745 24290931
2364 24290931 23206239 23240559 23627328 22924300 23013925 23615383 23961772 24076505 24127547 24273140
2354 24273140 24135866 23888550 23545500 24356956 24239170 23580415 23901716 24332874 24206688
2345 24206688 24468236 24731433 23904191 23881288 24150736 24349951 25038162 25597986 25118198 25270926
2335 25270926 25356321 24848979 25315847 25639048 25705689 25081557 24797462 25253309 25808641 26238505
2325 26238505 26112054 26606541 25978385 25397826 25846221 26209855 25960093 25597017 25390760
$$ packed form
2394B5433700p20280p5948j99200l02864K65367k34912n25388N15998L49834j090021
2384B3416286r4315L47171N8099K45218o74994j63013M77626K51796p99335j56770
2374B2907769L69257l62556K02249P52399J44366j59369k38620o9140P78390l3814
2364B4290931j084692L4320L86769p03028Q9625O01458L46389J14733N1042J45593
2354B4273140j37274k47316l43050Q11456j17786o58755L21301M31158j26186
2345B4206688K61548K63197q27242k2903K69448J99215O88211N59824m79788J52728
2335B5270926Q5395n07342M66868L23201O6641o24132k84095M55847N55332M29864
2325B6238505j26451M94487o28156n80559M48395L63634k49762l63076k06257
$$ plain form
2316 25390760 25266909 25598565 25193079 25096620 25196525 25021554 24326356 24295528 24319090 24617670
2306 24617670 25167459 25513698 25135862 24593377 23692789 24634802 26123227 25832448 25426859
2297 25426859 26270150 26557123 26267384 26830847 25931023 25936609 26536277 26150712 26370254 26599356
2287 26599356 26818917 27796342 29210502 29033717 29130025 29693285 29347085 30078200 29855793
2278 29855793 29286016 29264770 29563325 29607336 30154198 30312269 29441967 29600036 30206229 30762731
2268 30762731 30711727 31000034 31238710 31791483 32414115 32036848 32195692 33104216 33441164 33065440
2258 33065440 32452872 32234091 33462520 34475360 34316137 33316724 32621820 32128156 32723865
2249 32723865 32234436 31805730 31843897 31648090 31295693 31420627 31865642 32216724 32830633 32439435
$$ packed form
2316B5390760j23851L31656m05486r6459R9905j74971o95198l0828K3562K98580
2306B4617670N49789L46239l77836n42485r00588R42013J488425k90779m05589
2297B5426859Q43291K86973k89739N63463q99824N586N99668l85565K19542K29102
2287B6599356K19561R77425J414160j76785R6308N63260l46200P31115k22407
2278B9855793n69777k1246K98555M4011N46862J58071q70302J58069O06193N56502
2268C0762731n1004K88307K38676N52773O22632l77267J58844R08524L36948l75724
2258C3065440o12568k18781J228429J012840j59223r99413o94904m93664N95709
2249C2723865m89429m28706L8167j95807l52397J24934M45015L51082O13909l91198
$$ plain form
2239 32439435 32104495 31818310 32169173 33172129 33271030 32707422 32258076 32692217 32654384 32853238
2229 32853238 33213659 33103898 32194475 32505250 33417398 34500658 35070159 34291023 34346247
2220 34346247 34647838 34668230 34631844 34752003 35048479 34909932 34658189 34256107 34751094 35204832
2210 35204832 35719094 35778694 35362321 35037820 35611280 37003690 36817020 36455954 37029630
2201 37029630 38024138 38920629 39105980 39286198 39817691 40324859 41100020 40729932 40724092 40327726
2191 40327726 40775927 40808611 40086941 39688967 40763306 42140910 43041486 43684934 44309259
2182 44309259 46104475 47412811 48651170 50529814 51326958 52115362 53182798 54672153
2174 54672153 54707805 53949603 52861392 52699691 52439439 51102212 49740798 48539426 48076352
$$ packed form
2239C2439435l34940k86185L50863J002956R8901n63608m49346M34141l7833J98854
2229C2853238L60421j09761r09423L10775R12148J083260N69501p79136N5224
2220C4346247L01591K0392l6386J20159K96476j38547k51743m02082M94987M53738
2210C5204832N14262N9600m16373l24501N73460J392410j86670l61066N73676
2201C7029630R94508Q96491J85351J80218N31493N07168P75161l70088n840l96366
2191D0327726M48201L2684p21670l97974J074339J377604R00576O43448O24325
2182D4309259J795216J308336J238359J878644P97144P88404J067436J489355
2174E4672153L5652p58202j088211j61701k60252j337227j361414j201372m63074
$$ plain form
2165 48076352 46306958 44690943 43332493 41912860 40779207 39248383 38402267 37166695
2157 37166695 36308241 35823587 35330751 34779813 33617157 32996968 32672461 32226017 31286865
2148 31286865 30012606 30040397 30441112 29563190 28862259 29289542 29587327 29284499 29547919
2139 29547919 29725629 30044499 29963714 29946434 30082770 30686385 30206818 28863097 28725273 28556070
2129 28556070 28199944 27455876 27169418 27389623 27722304 27700764 27195528 27319096 27090696 27350596
2119 27350596 28109429 28595347 28792795 29877577 30342712 30079328 30673476 31041086 31919941
2110 31919941 31904321 30717394 30501794 31753077 32406671 31900770 31407986 32398341 33171495
2101 33171495 33345033 32809603 32803237 32128692 30902236 30199189 30564651 30659228 29124571 28779560
$$ packed form
2165D8076352j769394j616015j358450j419633j133653j530824q46116j235572
2157C7166695q58454m84654m92836n50938j162656o20189l24507m46444r39152
2148C1286865j274259K7791M00715q77922p00931M27283K97785l02828K63420
2139B9547919J77710L18870q0785j7280J36336O03615m79567j343721j37824j69203
2129B8556070l56126p44068k86458K20205L32681k1540n05236J23568k28400K59900
2119B7350596P58833M85918J97448J084782M65135k63384N94148L67610Q78855
2110C1919941j5620j186927k15600J251283O53594n05901m92784R90355P73154
2101C3171495J73538n35430o366o74545j226456p03047L65462R4577j534657l45011
$$ plain form
2091 28779560 28195208 26970857 25461094 25183833 25040812 24206823 22873698 22343000 23098698
2082 23098698 22836926 22036925 22033215 21522359 21050612 20904245 21456961 21176889 20817794 20487203
2072 20487203 21021130 21623803 21943127 22119964 22180563 22686492 22743220 22135846 21975880 22038944
2062 22038944 22257222 21950029 21633952 22094593 22340840 22772600 23932798 25175918 25625847
2053 25625847 26220009 27533199 29180547 30237070 31225304 31965267 33151575 33268905 32572673
2044 32572673 32028773 32153442 31550258 30107766 29825861 29692958 29205599 29265118 29335940 27953669
2034 27953669 27935503 28292710 28311918 29090248 28962987 28726070 29151060 29031431 28768319 28245917
2024 28245917 27598654 26250391 24379554 22987910 21875762 21655604 20656940 19766543 19343193
$$ packed form
2091B8779560n84352j224351j509763k77261j43021q33989j333125n30698P55698
2082B3098698k61772q00001l710n10856m71747j46367N52716k80072l59095l30591
2072B0487203N33927O02673L19324J76837O0599N05929N6728o07374j59966O3064
2062B2038944K18278l07193l16077M60641K46247M31760J160198J243120M49929
2053B5625847N94162J313190J647348J056523R88234P39963J186308J17330o96232
2044C2572673n43900J24669o03184j442492k81905j32903m87359N9519P0822j382271
2034B7953669j8166L57207J9208P78330j27261k36917M24990j19629k63112n22402
2024B8245917o47263j348263j870837j391644j112148k20158r98664q90397m23350
$$ plain form
2015 19343193 18112375 16919900 17469032 17429350 16616296 15768894 15105115 15841356 16377977
2006 16377977 15380815 14514778 14310482 14483992 14009766 13482874 13661298 14098439 14042743 13346660
1996 13346660 13587041 14427196 14815870 14951632 14324354 13438583 13701533 14971560 15545950
1987 15545950 15928695 15918932 15776150 17132240 17959797 18582311 18919670 18741090 18697838 18345840
1977 18345840 17637616 17335563 17546192 16936098 15988498 15680895 15810707 15960229 16360673
1968 16360673 16452163 16126080 16187398 16222030 16529537 17050835 16456945 15732515 14993029 14890962
1958 14890962 14665058 14369634 13597183 12677317 13118492 13087436 12270758 11645648 11596620 11318437
1948 11318437 10918878 9934359 9555525 9995961 9593328 9333458 9232794 8762561 8772416 8838179
$$ packed form
2015A9343193j230818j192475N49132l9682q13054q47402o63779P36241N36621
2006A6377977r97162q66037k04296J73510m74226n26892J78424M37141n5696o96083
1996A3346660K40381Q40155L88674J35762o27278q85771K62950J270027N74390
1987A5545950L82745r763j42782J356090Q27557O22514L37359j78580m3252l51998
1977A8345840p08224l02053K10629o10094r47600l07603J29812J49522M00444
1968A6360673R1490l26083O1318L4632L07507N21298n93890p24430p39486j02067
1958A4890962k25904k95424p72451r19866M41175l1056q16678o25110m9028k78183
1948A1318437l99559r84519l78834M40436m02633k59870j00664m70233R855O5763
$$ plain form
1938 8838179 8941031 8645512 8580935 8508166 7962914 7511065 7332656 7527332 7790968 7275161
1928 7275161 6630952 7132933 7445681 7085720 7307891 7139410 6878568 6626074 6613471 6401742
1918 6401742 6544676 7081194 6991054 6722399 6352766 6090263 6484223 6859414 6837803 6582408
1908 6582408 5755390 6054600 7147083 7053843 6164232 5719276 5923221 6079331 6223381 6770207
1898 6770207 6474642 6267444 6163335 6866638 7220357 6995631 6682212 6704972 7389151 7240062
1888 7240062 6690413 6291998 6889439 7153598 6917252 7142684 7145286 7200110 7190713 7272071 7679980
1877 7679980 7739230 7589030 7523077 7607327 7394370 6733106 6612676 6824999 6635212 6703475
1867 6703475 7171094 7295984 7598611 7525362 7237038 7410922 6954057 6965750 7146082 7514865
$$ packed form
1938H838179J02852k95519o4577p2769n45252m51849j78409J94676K63636n15807
1928G275161o44209N01981L12748l59961K22171j68481k60842k52494j2603k11729
1918F401742J42934N36518r0140k68655l69633k62503L93960L75191k1611k55395
1908F582408q27018K99210J092483r3240q89611m44956K03945J56110J44050N46826
1898F770207k95565k07198j04109P03303L53719k24726l13419K2760O84179j49089
1888G240062n49649l98415N97441K64159k36346K25432K602N4824r397Q1358M07909
1877G679980N9250j50200o5953Q4250k12957o61264j20430K12323j89787O8263
1867F703475M67619J24890L02627p3249k88324J73884m56865J1693J80332L68783
$$ plain form
1857 7514865 7926758 7428516 7387118 7868898 8337043 8134402 8140435 8652968 8695313 8681662
1847 8681662 8732841 9395815 9833442 9671740 9396731 10312903 10733074 10719274 11286229 11971054
1837 11971054 12294384 12524966 13285992 13725080 13429749 13504923 14096803 14516709 13575192 12681281
1827 12681281 13607736 14588039 14304562 14003702 14325192 14239511 14078561 13800720 13776317 14202308
1817 14202308 13829956 13234146 13698420 13915405 13918106 13961174 14894599 14967382 14679227 15227833
1807 15227833 16918218 18399451 19348412 20404049 21871070 21955817 20827496 18915644 17153339
1798 17153339 15889703 14904792 14354077 13735857 13378316 12482740 12076965 11968114 11524756
1789 11524756 10817737 10719949 10713980 10834503 10195018 9311994 9515425 9747693 9895263 9807229
$$ packed form
1857G514865M11893m98242m1398M81780M68145k02641O033N12533M2345j3651
1847H681662N1179O62974M37627j61702k75009R16172M20171j3800N66955O84825
1837A1971054L23330K30582P61026M39088k95331P5174N91880M19906r41517q93911
1827A2681281R26455R80303k83477l00860L21490q5681j60950k77841k4403M25991
1817A4202308l72352n95810M64274K16985K701M3068R33425P2783k88155N48606
1807A5227833J690385J481233R48961J055637J467021Q4747j128321j911852j762305
1798A7153339j263636r84911n50715o18220l57541q95576m05775j08851m43358
1789A1524756p07019r7788n969J20523o39485q83024K03431K32268J47570q8034
$$ plain form
1779 9807229 9398401 9420633 9498804 10006944 9564699 9837754 10333174 10117495 10130850 10317889
1769 10317889 10382292 9950084 9787818 9251944 9197597 8734924 8488172 8457310 7892445 7240914
1759 7240914 6232244 5752625 6286299 6649770 6859417 5884284 5151942 5460312 5059309
1750 5059309 4661716 4125590 3950228 4327321 4162645 3853603 3879735 3811336 3828720 3892215
1740 3892215 3883141 3481925 3465966 4044148 3907693 3288311 3111166 3242676 3925608 3677548
1730 3677548 3410605 3466783 3691165 3460983 2840813 3196018 3600903 3240625 3625226 3626386
1720 3626386 3986208 4149629 2932845 2655937 2949614 2385268 1802176 2655009 3299977
1711 3299977 2771225 3202276 3693472 3320085 2942018 3098548 3059022 2717100 2383052 2340895
$$ packed form
1779I807229m08828K2232P8171N08140m42245K73055M95420k15679J3355J87039
1769A0317889O4403m32208j62266n35874n4347m62673k46752l0862n64865o51531
1759G240914j008670m79619N33674L63471K09647r75133p32342L08370m01003
1750E059309l97593n36126j75362L77093j64676l09042K6132o8399J7384O3495
1740C892215r074m01216j5959N78182j36455o19382j77145J31510O82932k48060
1730C677548k66943N6178K24382k30182o20170L55205M04885l60278L84601J160
1720C626386L59822J63421j216784k76908K93677n64346n83092Q52833O44968
1711C299977n28752M31051M91196l73387l78067J56530l9526l41922l34048m2157
$$ plain form
1701 2340895 3302198 2913236 1980017 2749335 4017249 3224532 2445582 2195168 2965224
1692 2965224 2884463 2062801 1739410 1806050 2034744 2026652 2397809 2547335 2133416 2128940 2046008
1681 2046008 2110795 2407744 1988885 2323529 2159076 1891974 2216832 2310242 2243904 2068734
1671 2068734 1987078 1673369 1696320 2026463 2019720 1961956 2076822 2327629 2424033 2005615 971955
1660 971955 972858 1309782 925784 1017686 1315871 1787596 1735844 1862031 1851032 1906054 1817465
1649 1817465 1596506 1786684 1484608 1351658 1366325 2107339 1784581 1044472 1169918 1182461
1639 1182461 1533043 1583812 1318780 1145359 1235702 1277560 1004570 804372 796170 872251 941136
1628 941136 766356 641830 743869 967321 733971 998839 1165946 1215786 1203381 765958
$$ packed form
1701B340895R61303l88962r33219P69318J267914p92717p78950k50414P70056
1692B965224q0761q21662l23391O6640K28694q092L71157J49526m13919m476q2932
1681B046008O4787K96949m18859L34644j64453k67102L24858R3410o6338j75170
1671B068734q1656l13709K2951L30143o743n7764J14866K50807R6404m18418j033660
1660I71955R03L36924l83998R1902K98185M71725n1752J26187j0999N5022q8589
1649A817465k20959J90178l02076j32950J4667P41014l22758p40109J25446J2543
1639A182461L50582N0769k65032j73421R0343M1858k72990k00198q202P6081O8885
1628I41136j74780j24526J02039K23452k33350K64868J67107M9840j2405m37423
$$ plain form
1618 765958 1365288 1253872 721987 168271 972009 1236352 613452 664225 521187 1053987
1608 1053987 1246429 1437077 1309256 1351649 1201431 563214 468611 301535 556501 796143
1598 796143 911812 1099071 1279855 1597705 1490269 1203236 1179227 631325 385075 934292
1588 934292 1106197 1319265 1426558 1123355 1107011 1303603 1045135 746697 745007 803150
1578 803150 587458 1168352 1650335 1763128 1723297 1237283 902857 112880 -343854 321830
1568 321830 1254274 843438 267382 597787 1036170 1309620 1348183 956444 387362 72444
1558 72444 470167 717534 774941 762770 868803 993289 1287978 1150109 979577 756972
1548 756972 407567 -63471 149861 1021701 1472720 1390955 655399 272573 470325 888155
$$ packed form
1618G65958N99330j11416n31885n53716Q03738K64343o22900N0773j43038N32800
1608A053987J92442J90648j27821M2393j50218o38217r4603j67076K54966K39642
1598G96143J15669J87259J80784L17850j07436k87033k4009n47902k46250N49217
1588I34292J71905K13068J07293l03203j6344J96592k58468k98438j690N8143
1578H03150k15692N80894M81983J12793l9831m86014l34426p89977m56734O65684
1568C21830R32444m10836n76056L30405M38383K73450L8563l91739n69082l14918
1558G2444L97723K47367N7407j2171J06033J24486K94689j37869j70532k22605
1548G56972l49405m71038K13332Q71840M51019q1765p35556l82826J97752M17830
$$ plain form
1538 888155 972006 256985 -204111 377969 545810 1081084 889205 844729 540170 289249
1528 289249 295074 251462 908627 1191297 1211505 470493 484691 1255105 2078081 1416293 60435
1517 60435 -64254 -22287 688184 1197359 1173986 628013 -67655 86990 785094 1117248
1507 1117248 438093 814617 1346187 744186 432143 968860 1261537 611268 -21782 -347613
1497 -347613 -565429 -95368 323460 959562 1120225 736314 224057 521388 798238 179507
1487 179507 376277 207359 633325 337235 185455 800081 528354 444844 196608 519510
1477 519510 644362 762853 654270 577724 928077 362124 409491 796597 1151791 770045
1467 770045 473473 698945 658226 845020 749934 1086714 1119563 564858 472935 780570
$$ packed form
1538H88155Q3851p15021m61096N82080J67841N35274j91879m4476l04559k50921
1528B89249N825m3612O57165K82670K0208p41012J4198P70414Q22976o61788j355858
1517F0435j24689M1967P10471N09175k3373n45973o95668J54645O98104L32154
1507A117248o79155L76524N31570o02001l12043N36717K92677o50269o33050l25831
1497c47613k17816M70061M18828O36102J60663l83911n12257K97331K76850o18731
1487A79507J96770j68918M25966k96090j51780O14626k71727q3510k48236L22902
1477E19510J24852J18491j08583p6546L50353n65953M7367L87106L55194l81746
1467G70045k96572K25472m0719J86794r5086L36780L2849n54705r1923L07635
$$ plain form
1457 780570 418210 -51056 372242 382135 284880 966108 1343077 1000290 851945 723659
1447 723659 961067 840606 40129 -419282 812995 846778 82468 -136195 318029 436458
1437 436458 343700 418493 244518 224752 -248528 228640 381077 -33172 -284944 -69413
1427 -69413 -4614 -193697 106667 247987 690593 527339 -94889 235645 621844 176582
1417 176582 172361 795538 372197 -112895 -184315 377114 623296 504416 179561 590391
1407 590391 699796 1784 1489 745664 544012 658396 141621 -302612 114279 -197691
1397 -197691 -25489 689645 379010 -302027 395343 940105 555975 363897 599798 530768
1387 530768 186370 -352390 -234591 380044 240192 -281948 201831 532215 651286 796440
$$ packed form
1457G80570l62360m69266M23298R893r7255O81228L76969l42787j48345j28286
1447G23659K37408j20461q00477m59411J232277L3783p64310k18663M54224J18429
1437D36458r2758P4793j73975j9766m73280M77168J52437m14249k51772K15531
1427f9413O4799j89083L00364J41320M42606j63254o22228L30534L86199m45262
1417A76582m221O23177m23341m85092p1420N61429K46182j18880l24855M10830
1407E90391J09405o98012k95P44175k01652J14384n16775m44233M16891l11970
1397a97691J72202P15134l10635o81037O97370N44762l84130j92078K35901o9030
1387E30768l44398n38760J17799O14635j39852n22140M83779L30384J19071J45154
$$ plain form
1377 796440 912372 599734 -44252 -333417 768217 1139671 351336 388278 760982 717959
1367 717959 463774 1744 56965 -70728 19336 53245 352048 425446 320365 389203 682871
1356 682871 496930 -645949 -646463 434080 886461 -51273 -512507 371092 1281533 1156726
1346 1156726 823839 172844 109339 -63156 247924 702250 1054537 834743 727949 1147798
1336 1147798 855871 953673 971515 1030753 586002 -395627 -213888 664803 194910 -687654
1326 -687654 -161088 155915 293515 375748 56197 122733 497573 370818 266499 812594
1316 812594 766236 -80962 812177 313001 -462937 373700 963620 953701 285790 100464
1306 100464 450973 468799 -8021 -98114 365653 406373 -378396 -212793 490382 205702
$$ packed form
1377G96440J15932l12638o43986k89165J101634L71454p88335L6942L72704m3023
1367G17959k54185m62030N5221j27693R0064L3909K98803P3398j05081O8838K93668
1356F82871j85941j142879n14J080543M52381r37734m61234Q83599R10441j24807
1346A156726l32887o50995o3505j72495L11080M54326L52287k19794j06794M19849
1336A147798k91927R7802J7842N9238m44751r81629J81739Q78691m69893q82564
1326f87654N26566L17003J37600Q2233l19551O6536L74840j26755j04319N46095
1316H12594m6358q47198Q93139m99176p75938Q36637N89920r919o67911j85326
1306A00464L50509J7826m76820r0093M63767M0720p84769J65603P03175k84680
$$ plain form
1296 205702 -284978 84048 547050 672147 77054 -76011 561124 328575 -196962 -43506
1286 -43506 59756 239523 192441 25645 -422874 -304178 -225764 205694 884105 296691
1276 296691 -118360 706374 855195 -33196 -145902 153681 254053 -232613 -817179 -257433
1266 -257433 959926 1214858 456973 223803 39649 89100 541028 518132 492647 247727
1256 247727 -439095 -520809 392692 -272103 -406723 213330 59321 230835 334977 645239
1246 645239 524333 894118 517734 -338363 148194 504428 608248 1066796 538337 571294
1236 571294 1095070 1221623 1364048 1076256 512566 215100 555117 294085 430118 -95421
1226 -95421 -479418 -614096 -313519 -33951 59415 800396 397410 281596 354102 -38143
$$ packed form
1296B05702m90680L69026M63002J25097n95093j53065O37135k32549n25537J53456
1286d3506J03262J79767m7082j66796m48519J18696P8414M31458O78411n87414
1276B96691m15051Q24734J48821q88391j12706K99583J00372m86666n84566N59746
1266b57433J217359K54932p57885k33170j84154M9451M51928k2896k5485k44920
1256B47727o86822q1714R13501o64795j34620O20053j54009J71514J04142L10262
1246F45239j20906L69785l76384q56097M86557L56234J03820M58548n28459L2957
1236E71294N23776J26553J42425k87792n63690k97466L40017k61032J36033n25539
1226i5421l83997j34678L00577K79568R3366P40981m02986j15814P2506l92245
$$ plain form
1216 -38143 -58979 109595 -85410 -341030 -418751 -88803 678203 753877 844493 1180722 1546082
1205 1546082 1431864 885125 495227 249294 434950 568355 294154 338717 503492 181861
1195 181861 594922 632580 74788 -268460 -189244 99898 -89136 38831 223218 309741
1185 309741 35587 -317320 -827963 -652834 -84555 251075 -30124 -73474 238637 1467083
1175 1467083 1957954 1050079 67529 94552 818516 865410 344279 -138348 572791 1070319
1165 1070319 865892 681819 819464 573467 729211 128742 -578527 8750 267202 -85248
1155 -85248 299332 251491 240616 512340 941137 372124 -416190 -396022 123327 413517
1145 413517 527957 278672 552029 895005 452612 216690 901580 550714 -37261 251740
$$ packed form
1216c8143k0836J68574j95005k55620p7721L29948P67006P5674R0616L36229L65360
1205A546082j14218n46739l89898k45933J85656J33405k74201M4563J64775l21631
1195A81861M13061L7658n57792l43248P9216K89142j89034J27967J84387Q6523
1185C09741k74154l52907n10643J75129N68279L35630k81199m3350L12111J228446
1175A467083M90871r07875r82550K7023P23964M6894n21131m82627P11139M97528
1165A070319k04427j84073J37645k45997J55744o00469p07269N87277K58452l52450
1155h5248L84580m7841j0875K71724M28797n69013p88314K0168N19349K90190
1145D13517J14440k49285K73357L42976m42393k35922O84890l50866n87975K89001
$$ plain form
1135 251740 339840 324019 -109922 359528 1440001 1155762 319811 -152288 -99436 47372
1125 47372 -609443 -507714 394481 745773 200912 -445925 179389 933675 1088834 934268
1115 934268 616788 425189 203878 406873 1403522 886221 211337 862584 1936528 1583566
1105 1583566 1111834 1671021 1856930 1153682 176818 -28350 563755 1286948 62731
1096 62731 109624 526397 817264 1149852 1037642 1006413 1164406 668827 1450845 1014608
1086 1014608 907404 938607 1235879 1338400 1178280 1895126 2134421 1619594 967140 1771523
1076 1771523 2649723 3030053 2140011 1707777 2035422 2084486 2019086 1355309 1361637 1832112
1066 1832112 2341699 2799822 3387434 3529347 3748447 3531212 3377906 3157794 2251606 2606843
$$ packed form
1135B51740Q8100j5821m33941M69450J080473k84239q35951m72099N2852J46808
1125D7372o56815J01729R02195L51292n44861o46837O25314P54286J55159j54566
1115I34268l17480j91599k21311K02995R96649n17301o74884O51247J073944l52962
1105A583566m71732N59187J85909p03248r76864k05168N92105P23193j224217
1096F2731M6893M16773K90867L32588j12210l1229J57993m95579P82018m36237
1086A014608j07204L1203K97272J02521j60120P16846K39295n14827o52454Q04383
1076A771523Q78200L80330q90042m32234L27645M9064o5400o63777O328M70475
1066A832112N09587M58123N87612J41913K19100k17235j53306k20112r06188L55237
$$ plain form
1056 2606843 2541693 1984875 2213154 2754000 3028985 3405969 3055824 2727207 3141662 3528373
1046 3528373 2958865 2614969 2688986 2976857 3642528 3767025 3098511 3175411 4030197 3811540
1036 3811540 3837557 3474225 3339242 3784513 3692317 3763295 3586437 3699821 3479492 3426839
1026 3426839 3491056 3067531 3811191 4303560 4384862 4719655 4484463 4115634 4459363 5312407
1016 5312407 4748781 4372826 4007322 3869797 4615433 5219043 4561779 4353805 5322422 5009811
1006 5009811 5598928 5895571 5609444 5601966 5354598 5454082 5358741 5295829 5537202 6187527
996 6187527 6649228 6278617 6884830 7538951 8066788 8397630 8025942 8482821 9432399 10582631
986 10582631 10778896 11665012 12212467 12909101 14055247 15185539 15709491 16248165 17035522
$$ packed form
1056B606843o5150n56818K28279N40846K74985L76984l50145l28617M14455L86711
1046C528373n69508l43896P4017K87871O65671J24497o68514P6900Q54786k18657
1036C811540K6017l63332j34983M45271r2196P0978j76858J13384k20329n2653
1026C426839O4217m23525P43660M92369Q1302L34793k35192l68829L43729Q53044
1016E312407n63626l75955l65504j37525P45636O03610o57264k07974R68617l12611
1006E009811N89117K96643k86127p478k47368R9484r5341o2912K41373O50325
996F187527M61701l70611O06213O54121N27837L30842l71688M56879R49578J150232
986A0582631J96265Q86116N47455O96634J146146J130292N23952N38674P87357
$$ plain form
977 17035522 17949803 19206847 20738992 22051985 24283148 26460651 28535298 30601533
969 30601533 32536002 33178962 35299472 37220575 39841637 44518578 51340052 59204975
961 59204975 67740149 77776324 90576436 107290025 129985265 162166302 208785315
954 208785315 234676858 202496357 153976856 119881933 97946824 83622310 73742138
947 73742138 65053294 56522037 48605420 43582478 40084354 36451940 33079166 30911263
939 30911263 30281471 29216517 26995391 24238153 22317234 20747661 19886023 18961487 16916841
930 16916841 15549204 14379583 13996130 13079413 12025610 11242856 11232517 10965985 10037281
921 10037281 10798687 10717489 10036446 9858003 10089218 10263021 9705885 8536529 7853604 8418427
$$ packed form
977A7035522R14281J257044J532145J312993K231163K177503K074647K066235
969C0601533J934469O42960K120510J921103K621062M676941O821474P864923
961E9204975Q535174J0036175J2800112J6713589K2695240L2181037M6619013
954B08785315K5891543l2180501m8519501l4094923k1935109j4324514r880172
947G3742138q688844q531257p916617n022942l498124l632414l372774k167903
939C0911263o29792j064954k221126k757238j920919j569573q61638r24536k044646
930A6916841j367637j169621l83453r16717j053803p82754j0339k66532r28704
921A0037281P61406q1198o81043j78443K31215J73803n57136j169356o82925N64823
$$ plain form
911 8418427 8119095 7306716 7141468 7568044 7284909 6763689 6481749 5918501 6420159 6167990
901 6167990 5750192 5183141 4423935 4772835 5002330 4333909 3573379 3861603 4810547 4622875
891 4622875 4277284 4058815 4051235 4318497 4305482 3838297 3839738 3564929 3584076 4242562 4254338
880 4254338 3473146 3349549 4059906 4489685 3342539 2877543 3186504 3614747 3002251 2456003
870 2456003 2922683 2939006 2863536 2625525 2589662 2002984 1676484 2061646 2632737 2386399
860 2386399 2026072 1532003 2044306 2603319 1524049 1496063 1769505 1375477 1300183 1209068
850 1209068 1519903 1272372 1458163 1775356 1653743 1434445 1354520 1379668 1494991 1382100
840 1382100 924173 903511 1267969 1038529 1235220 1368979 1213774 1368355 1021143 1499146
$$ packed form
911H418427k99332q12379j65248M26576k83135n21220k81940n63248N01658k52169
901F167990m17798n67051p59206L48900K29495o68421p60530K88224R48944j87672
891D622875l45591k18469p580K67262j3015m67185J441k74809J9147O58486J1776
880D254338p81192j23597P10357M29779j147146m64996L08961M28243o12496n46248
870B456003M66680J6323p5470k38011l5863n86678l26500L85162N71091k46338
860B386399l60327m94069N12303N59013j079270k7986K73442l94028p5294r1115
850A209068L10835k47531J85791L17193j21613k19298p9925K5148J15323j12891
840A382100m57927k0662L64458k29440J96691J33759j55205J54581l47212M78003
$$ plain form
830 1499146 1615024 549998 144217 1117091 1047523 -102639 367292 922972 648878 958985
820 958985 1597615 1198284 1269620 1040514 746311 1171541 1088000 1121377 1276729 1699439
810 1699439 1244273 1196318 1194688 660263 775002 730954 705965 741976 1253192 766295 779242
799 779242 860457 403102 702682 359024 -146371 -378910 -131708 -80279 489726 615105
789 615105 515929 462010 346760 300420 610314 917287 458196 244332 -1064 334428
779 334428 896553 787444 71203 -46763 282470 277786 399167 327426 393839 493265 605954
768 605954 288955 153142 -83295 -367640 -77937 -313346 -662681 -37966 291737 341606
758 341606 401602 220788 350394 827188 930730 561404 855020 762796 481426 776066
$$ packed form
830A499146J15878j065026m05781R72874o9568j150162M69931N55680k74094L10107
820I58985O38630l99331P1336k29106k94203M25230q3541L3377J55352M22710
810A699439m55166m7955j630n34425J14739m4048k4989L6011N11216m86897J2947
799G79242Q1215m57355K99580l43658n05395k32539K47202N1429N70005J25379
789F15105r9176n3919j15250m6340L09894L06973m59091k13864k45396L35492
779C34428N62125j09109p16241j17966L29233m684J21381p1741O6413R9426J12689
768F05954l16999j35813k36437k84345K89703k35409l49335O24715L29703M9869
758C41606N9996j80814J29606M76794J03542l69326K93616r2224k81370K94640
$$ plain form
748 776066 998844 463495 734824 870995 613650 833401 285737 82982 135160 331508
738 331508 107054 350027 634257 -170128 -170318 73726 -256004 -411018 -140211 52600
728 52600 324744 214867 41992 605451 888878 756203 580525 709940 690033 557032
718 557032 458432 358783 460228 182082 -704387 -533654 -201785 143829 265202 -144675
708 -144675 -145535 357169 -355801 -1051989 -686583 -438572 -209632 34437 92746 246954 75206
697 75206 200811 516676 533667 -482607 -521546 377964 378988 409202 368253 632322 335508
686 335508 -417818 -649043 160994 115424 -687060 -721186 247698 233274 -495537 -292992
676 -292992 -57739 -496597 -278812 132517 526555 293290 -63122 397405 1028993 1095723
$$ packed form
748G76066K22778n35349K71329J36171k57345K19751n47664k02755N2178J96348
738C31508k24454K42973K84230q04385j90K44044l29730j55014K70807J92811
728E2600K72144j09877j72875N63459K83427j32675j75678J29415j9907j33001
718E57032r8600r9649J01445k78146q86469J70733L31869L45614J21373m09877
708a44675q60N02704p12970o96188L65406K48011K28940K44069N8309J54208j71748
697G5206J25605L15865J6991j016274l8939Q99510J024L0214m0949K64069k96814
686C35508p53326k31225Q10037m5570q02484l4126R68884j4424p28811K02545
676b92992K35253m38858K17785M11329L94038k33265l56412M60527O31588O6730
$$ plain form
666 1095723 1104192 1384864 811895 -53737 -402178 -212046 -136726 -403124 -632668 -532258
656 -532258 -7224 -7695 413015 644723 -42457 -533485 -1106375 -428056 -218044 -708116
646 -708116 -1218566 -607745 -275553 -603021 -392951 -655226 -634075 -272972 46250 -729383
636 -729383 -1235856 -905773 -506313 375584 292673 -735491 -779352 -774881 -999102 -775180
626 -775180 -779737 -853112 -257523 -608396 -895077 -648870 -613733 -749509 -1299291 -1615100 -1366993
615 -1366993 -1143743 -513662 -1151146 -976453 -858666 -514858 -376910 -958521 -1412401 -1691803
605 -1691803 -2065500 -2259594 -1644586 -1424497 -1297089 -1249423 -1346463 -1475721 -1574506 -1304594
595 -1304594 -1250439 -1191324 -1572984 -1297440 -838930 -570746 -757650 -1006249 -917304 -1246606
$$ packed form
666A095723Q469K80672n72969q65632l48441J90132P5320k66398k29544J00410
656e32258N25034m71M20710K31708o87180m91028n72890O78319K10012m90072
646g08116n10450O10821L32192l27468K10070k62275K1151L61103L19222p75633
636g29383n06473L30083L99460Q81897q2911j028164m3861M471k24221K23922
626g75180m557p3375N95589l50873k86681K46207L5137j35776n49782l15809K48107
615a366993K23250O30081o37484J74693J17787L43808J37948n81611m53880k79402
605a691803l73697j94094O15008K20089J27408M7666r7040j29258r8785K69912
595a304594N4155N9115l81660K75544M58510K68184j86904k48599Q8945l29302
$$ plain form
585 -1246606 -1031859 -892626 -740495 -542685 -944885 -1032589 -861730 -1101641 -1416161 -1402345
575 -1402345 -675345 -853212 -1174062 -1759631 -1554804 -972880 -887625 -1219571 -1238357 -751268
565 -751268 -888527 -581917 -332162 -297298 334296 -336589 -888554 -1073234 -472158 -160962
555 -160962 -35415 -112665 164338 372324 341488 -205421 -775415 -1253456 -1394274 -1212402
545 -1212402 -831085 -1308234 -1470685 -1147060 -994189 -1091698 -943128 -1229383 -1240779 -1162299
535 -1162299 -1410759 -860643 -296856 -738533 -837338 -575548 -1093901 -838010 -293484 -461854
525 -461854 -942450 -1248179 -958567 -752859 -813190 -709499 -488978 -374896 -1111446 -1277055
515 -1277055 -867426 -1162885 -1298638 -1511742 -921013 -528042 -790563 -1068336 -977428 -822086
$$ packed form
585a246606K14747J39233J52131J97810m02200q7704J70859k39911l14520J3816
575a402345P27000j77867l20850n85569K04827N81924Q5255l31946j8786M87089
565g51268j37259L06610K49755L4864O31594o70885n51965j84680O01076L11196
555a60962J25547p7250K77003K07986l0836n46909n69994m78041j40818J81872
545a212402L81317m77149j62451L23625J52871r7509J48570k86255j1396P8480
535a162299k48460N50116N63787m41677r8805K61790n18353K55891N44526j68370
525d61854m80596l05729K89612K05708o0331J03691K20521J14082p36550j65609
515a277055M09629k95459j35753k13104N90729L92971k62521k77773R0908J55342
$$ plain form
505 -822086 -1918887 -1650510 -1108541 -291943 -654697 -1215192 -1139938 -894152 -905622 -1021889
495 -1021889 -742801 -658246 -1010374 -1045298 -1061709 -651549 -974066 -892622 -570047 -536481 -1359626
484 -1359626 -1432867 -1007592 -1325506 -1737240 -1409324 -1030946 -554194 -537233 -1202745 -1242130
474 -1242130 -1015592 -924239 -820254 -1128333 -1274041 -833777 -851117 -574626 -1094973 -822514
464 -822514 -854959 -943699 -980935 -1029728 -588242 -332264 -1081032 -981475 -421879 -793728 -965986
453 -965986 -1270681 -1019754 -584542 -858326 -888818 -1265034 -1273178 -747013 -867054 -1153168
443 -1153168 -879939 -445544 -776585 -959091 -950813 -819148 -1370376 -1263502 -927721 -1180372
433 -1180372 -1196150 -738405 -143753 -382754 -859715 -937464 -400856 -71994 -590541 -965275
$$ packed form
505h22086j096801K68377N41969Q16598l62754n60495P5254K45786j1470j16267
495a021889K79088Q4555l52128l4924j6411M10160l22517Q1444L22575L3566q23145
484a359626p3241M25275l17914m11734L27916L78378M76752J6961o65512l9385
474a242130K26538R1353J03985l08079j45708M40264j7340K76491n20347K72459
464h22514l2445q8740l7236m8793M41486K55978p48768R9557N59596l71849j72258
453i65986l04695K50927M35212k73784l0492l76216q144N26165j20041k86114
443a153168K73229M34395l31041j82506Q278J31665n51228J06874L35781k52651
433a180372j5778M57745N94652k39001m76961p7749N36608L28862n18547l74734
$$ plain form
423 -965275 -1053848 -1365614 -1554338 -1394723 -1048101 -557932 -683007 -1395977 -1628036 -1416216
413 -1416216 -1492811 -1376065 -1042231 -614803 -1118367 -1586946 -996751 -706595 -1270274 -1784306
403 -1784306 -1544606 -1305994 -788366 -1047731 -1058051 -284217 -314752 -534068 -670457 -442602
393 -442602 -896641 -790574 -622559 -941394 -1206115 -1648000 -516351 68561 -800412 -1396580
383 -1396580 -750672 -147294 -559740 -1343874 -1269438 -1537011 -1484033 -1273589 -1169633 -964293
373 -964293 -1626881 -1156826 -671426 -676643 -1224904 -1613713 -509531 -237643 -813999 -987192
363 -987192 -962228 -645312 -388970 -468250 -854006 -1169243 -984299 -802885 -984799 -1566109
353 -1566109 -1382066 -546325 -671267 -1583169 -2071254 -1794729 -1410611 -1267888 -1909079 -1626658
$$ packed form
423i65275q8573l11766j88724J59615L46622M90169j25075p12970k32059K11820
413a416216p6595J16746L33834M27428n03564m68579N90195K90156n63679n14032
403a784306K39700K38612N17628k59365j0320P73834l0535k19316j36389K27855
393d42602m54039J06067J68015l18835k64721m41885J131649N84912q68973n96168
383a396580O45908O03378m12446p84134P4436k67573N2978K10444J03956K05340
373i64293o62588M70055M85400n217n48261l88809J104182K71888n76356j73193
363i87192K4964L16916K56342p9280l85756l15237J84944J81414j81914n81310
353a566109J84043Q35741j24942r11902m88085K76525L84118J42723o41191K82421
$$ plain form
343 -1626658 -1044974 -672436 -373776 -816418 -849694 -715275 -868318 -1302637 -1002430 -738333
333 -738333 -1038288 -943869 -812465 -844184 -842893 -1005935 -1009136 -825863 -882573 -1350450 -1499839
$$ packed form
343a626658N81684L72538K98660m42642l3276J34419j53043m34319L00207K64097
333g38333k99955R4419J31404l1719J291j63042l201J83273n6710m67877j49389
$$ [...]
##END NTUPLES=NMR SPECTRUM
##END=
