##TITLE=1H_TG-2310
 CDCl3, 8 sc, 
 22.12.2020
##JCAMPDX= 6.0         $$ Bruker NMR JCAMP-DX V2.0
##DATA TYPE= NMR SPECTRUM
##DATA CLASS= NTUPLES
##ORIGIN= UXNMR, Bruker Analytische Messtechnik GmbH
##OWNER= root
$$ XWIN-NMR		Version 3.5
$$ Tue Dec 22 10:49:39 2020 Russian Standard Time (UT+4h)  she@DPX200
##.OBSERVE FREQUENCY= 200.1315066352
##.OBSERVE NUCLEUS= ^1H
##.ACQUISITION MODE= SIMULTANEOUS
##.ACQUISITION SCHEME= undefined
##.AVERAGES= 8
##.DIGITISER RES= 18
##SPECTROMETER/DATA SYSTEM= spect
##.PULSE SEQUENCE= zg30
##.SOLVENT NAME= CDCl3
##.SHIFT REFERENCE= (INTERNAL, CDCl3, 0, 15.9585)
##AUDIT TRAIL= $$ (NUMBER, WHEN, WHO, WHERE, WHAT)
$$ ##TITLE= Audit trail, XWIN-NMR		Version 3.5
$$ ##JCAMPDX= 5.01
$$ ##ORIGIN= Bruker BioSpin GmbH
$$ ##OWNER= she
$$ F:/spectra/data/she/nmr/H-F/1/pdata/1/auditp.txt
$$ ##AUDIT TRAIL=  $$ (NUMBER, WHEN, WHO, WHERE, WHAT)
(   1,<2020-12-22 10:46:33.75 +0400>,<she>,<DPX200>,
      <created by zg, POWCHK disabled, PULCHK disabled
       configuration hash MD5:
       00 E9 B6 7A A2 85 ED C7 34 08 36 98 17 FE 4E 26
       data hash MD5: 16K
       21 F1 7A 9F B9 68 FF A1 CF C6 24 12 B2 04 EB C1>)
(   2,<2020-12-22 10:46:56.54 +0400>,<she>,<DPX200>,
      <Start of raw data processing
       efp BC_mod = 2 LB = 0.24 FT_mod = 6 PKNL = 1 PHC0 = -10761.82 PHC1 = 7.400949 SI = 16K 
       data hash MD5: 16K
       1F AD BC E6 33 8F 7E 60 27 5C 2C 8C D5 D0 A3 23>)
(   3,<2020-12-22 10:48:11.75 +0400>,<she>,<DPX200>,
      <pk PHC0 = -155.5327 PHC1 = 0.4 
       data hash MD5: 16K
       0D DF ED 25 9A AB 25 F0 BF 9F B9 12 DC D0 F0 A1>)
(   4,<2020-12-22 10:48:15.35 +0400>,<she>,<DPX200>,
      <abs ABSG = 5 
       data hash MD5: 16K
       EF 99 18 35 D1 56 75 F1 FE DB 27 F5 AE 09 57 AA>)
$$ ##END=
$$ 
$$ hash MD5
$$ 10 40 0B 58 26 E9 62 B3 76 F5 F7 5B FE 94 A3 0C
##$RELAX= 
##$RELAX= 
##$RELAX= 
##$RELAX= 
##$RELAX= 
##$RELAX= 
$$ Bruker specific parameters
$$ --------------------------
##$DU= <F:/spectra>
##$EXPNO= 1
##$NAME= <H-F>
##$PROCNO= 1
##$TYPE= <nmr>
##$USER= <she>
##$AMP= (0..31)
100 100 100 100 100 100 100 100 100 100 100 100 100 100 100 100 100 100 
100 100 100 100 100 100 100 100 100 100 100 100 100 100 
##$AQSEQ= 0
##$AQ_mod= 1
##$AUNM= <au_zg>
##$AUTOPOS= <>
##$BF1= 200.13
##$BF2= 200.13
##$BF3= 200.13
##$BF4= 200.13
##$BF5= 200.13
##$BF6= 200.13
##$BF7= 200.13
##$BF8= 200.13
##$BYTORDA= 1
##$CFDGTYP= 0
##$CFRGTYP= 5
##$CHEMSTR= <none>
##$CNST= (0..31)
1 1 145 1 1 1 1 1 1 1 1 1 1 1 1 1 1 1 1 1 1 1 1 1 1 1 1 1 1 1 1 1 
##$CPDPRG= <>
##$CPDPRG1= <>
##$CPDPRG2= <>
##$CPDPRG3= <>
##$CPDPRG4= <mlev>
##$CPDPRG5= <mlev>
##$CPDPRG6= <mlev>
##$CPDPRG7= <mlev>
##$CPDPRG8= <mlev>
##$CPDPRGB= <>
##$CPDPRGT= <>
##$D= (0..31)
0 1.2 0 0 0 0 0 0 0 0.06 0 0.03 0 0 0 0 0.0002 0 0 0 0 0 0 0 0 0 0 0 0 
0 0 0 
##$DATE= 1608619593
##$DBL= (0..7)
120 120 120 120 120 120 120 120 
##$DBP= (0..7)
150 150 150 150 150 150 150 150 
##$DBP07= 0
##$DBPNAM0= <>
##$DBPNAM1= <>
##$DBPNAM2= <>
##$DBPNAM3= <>
##$DBPNAM4= <>
$$ [...]
##$SUBNAM3= <"">
##$SUBNAM4= <"">
##$SUBNAM5= <"">
##$SUBNAM6= <"">
##$SUBNAM7= <"">
##$SUBNAM8= <"">
##$SUBNAM9= <"">
##$SW= 16.9725356469052
##$SWIBOX= (0..15)
0 0 2 0 0 0 0 0 0 0 0 0 0 0 0 0 
##$SW_h= 3396.73913043478
##$TD= 16384
##$TD0= 1
##$TE= 0
##$TE2= 300
##$TE3= 300
##$TEG= 300
##$TL= (0..7)
0 120 120 120 120 120 120 120 
##$TP= (0..7)
150 150 150 150 150 150 150 150 
##$TP07= 0
##$TPNAME0= <>
##$TPNAME1= <>
##$TPNAME2= <>
##$TPNAME3= <>
##$TPNAME4= <>
##$TPNAME5= <>
##$TPNAME6= <>
##$TPNAME7= <>
##$TPOAL= (0..7)
0.5 0.5 0.5 0.5 0.5 0.5 0.5 0.5 
##$TPOFFS= (0..7)
0 0 0 0 0 0 0 0 
##$TUNHIN= 0
##$TUNHOUT= 0
##$TUNXOUT= 0
##$USERA1= <user>
##$USERA2= <user>
##$USERA3= <user>
##$USERA4= <user>
##$USERA5= <user>
##$V9= 5
##$VALIST= <valist>
##$VCLIST= <CCCCCCCCCCCCCCC>
##$VD= 0
##$VDLIST= <DDDDDDDDDDDDDDD>
##$VPLIST= <PPPPPPPPPPPPPPP>
##$VTLIST= <TTTTTTTTTTTTTTT>
##$WBST= 1024
##$WBSW= 4
##$XGAIN= (0..3)
0 0 0 0 
##$XL= 0
##$YL= 0
##$YMAX_a= 101612
##$YMIN_a= -233763
##$ZGOPTNS= <>
##$ZL1= 120
##$ZL2= 120
##$ZL3= 120
##$ZL4= 120
##$ABSF1= 15.98542
##$ABSF2= -0.9872417
##$ABSG= 5
##$ABSL= 3
##$ALPHA= 0
##$AQORDER= 0
##$ASSFAC= 0
##$ASSFACI= 0
##$ASSFACX= 0
##$ASSWID= 0
##$AUNMP= <proc_1d>
##$AZFE= 0.1
##$AZFW= 0.1
##$BCFW= 0
##$BC_mod= 2
##$BYTORDP= 0
##$COROFFS= 0
##$CY= -3
##$DATMOD= 1
##$DC= 0
##$DFILT= <>
##$DTYPP= 0
##$F1P= 0
##$F2P= 0
##$FCOR= 1
##$FTSIZE= 16384
##$FT_mod= 6
##$GAMMA= 0
##$GB= 0
##$INTBC= 1
##$INTSCL= 2.992141e-10
##$ISEN= 128
##$LB= 0.24
##$LEV0= 0
##$LPBIN= 0
##$MAXI= 10000
##$MC2= 0
##$MEAN= 0
##$ME_mod= 0
##$MI= 1.114404
##$NCOEF= 0
##$NC_proc= -7
##$NLEV= 6
##$NOISF1= 3.799351
##$NOISF2= 2.8
##$NSP= 0
##$NTH_PI= 0
##$NZP= 0
##$OFFSET= 15.95849
##$PC= 1
##$PHC0= -10917.35
##$PHC1= 7.800949
##$PH_mod= 1
##$PKNL= yes
##$PPARMOD= 0
##$PSCAL= 0
##$PSIGN= 0
##$REVERSE= no
##$SF= 200.130011231901
##$SI= 16384
##$SIGF1= 3
##$SIGF2= 2
##$SINO= 5.538805
##$SIOLD= 16384
##$SREGLST= <1H.CDCl3>
##$SSB= 0
##$STSI= 16384
##$STSR= 0
##$SW_p= 3396.73913043478
##$SYMM= 0
##$S_DEV= 0
##$TDeff= 16384
##$TDoff= 0
##$TI= <>
##$TILT= no
##$TM1= 0
##$TM2= 0
##$TOPLEV= 0
##$USERP1= <user>
##$USERP2= <user>
##$USERP3= <user>
##$USERP4= <user>
##$USERP5= <user>
##$WDW= 1
##$XDIM= 16384
##$YMAX_p= 549225119
##$YMIN_p= -240756
$$ End of Bruker specific parameters
$$ ---------------------------------
##NTUPLES= NMR SPECTRUM
##VAR_NAME=  FREQUENCY,     SPECTRUM/REAL,   SPECTRUM/IMAG
##SYMBOL=    X,             R,               I
##VAR_TYPE=  INDEPENDENT,   DEPENDENT,       DEPENDENT
##VAR_FORM=  AFFN,          ASDF,            ASDF
##VAR_DIM=   16384,         16384,           16384
##UNITS=     HZ,            ARBITRARY UNITS, ARBITRARY UNITS
##FACTOR=    0.207333158178281, 1,           1
##FIRST=     3193.77285733333, 0,            0
##LAST=      -202.966273101454, 0,           0
##MIN=       -202.966273101454, -240756,     0
##MAX=       3193.77285733333, 549225119,    0
$$ Real data points
##PAGE= N=1
##DATA TABLE= (X++(R..R)), XYDATA
$$ [...]
$$ plain form
6145 767949 805352 803519 794696 767418 773994 769595 749916 738165 736476 752255 782526 764490 775432
6132 775432 745701 738031 876512 831840 763044 780647 778193 767154 715579 721255 644488 662985
6120 662985 721055 671448 759462 767454 677855 695135 693306 671300 575771 560277 548775 505123
6108 505123 474383 478061 463958 456591 491643 524607 520236 503801 508310 501615 414240 367441 388885
6095 388885 394721 441272 527356 423408 306827 364036 414861 407115 372686 356763 388204 405564
6083 405564 366598 327684 396483 444417 451266 368056 317963 307331 387610 485012 424222 381967
6071 381967 406603 375930 377711 369089 407905 486377 521220 474156 481607 467339 553824 560287
6059 560287 515063 481246 491993 479396 486768 477691 458345 521685 558805 579819 528661 529572
$$ packed form
6145G67949L7403j833q823k7278O576m399j9679j1751j689J5779L0271j8036J0942
6132G75432k9731p670J38481m4672o8796J7603k454j1039n1575N676p6767J8497
6120F62985N8070m9607Q8014P992q9599J7280j829k2006r5529j5494j1502m3652
6108E05123l0740L678j4103p367L5052L2964m371j6435M509o695q7375m6799K1444
6095C88885N836M6551Q6084j03948j16581N7209N0825p746l4429j5923L1441J7360
6083D05564l8966l8914O8799M7934O849q3210n0093j0632Q0279R7402o0790m2255
6071C81967K4636l0673J781q622L8816P8472L4843m7064P451j4268Q6485O463
6059E60287m5224l3817J0747j2597P372r077j9346O3340L7120K1014n1158R11
$$ plain form
6047 529572 509526 524011 499748 482965 541122 574804 565285 553548 499487 498206 508645 519669
6035 519669 519624 487337 437103 410164 449321 459961 447900 499564 530416 535625 548158 555182 559217
6022 559217 567878 586145 644617 627724 555695 563864 598097 673065 689027 668842 634444 697820
6010 697820 691335 676354 691704 671318 666941 637852 616359 540153 502395 505901 516048 477817
5998 477817 452916 411452 468012 527944 524778 452500 494537 514759 502632 487796 493097 518431
5986 518431 493811 464846 395556 354240 325407 315925 350328 299332 384206 377742 330102 379776
5974 379776 325577 347410 313070 305680 334615 294271 284130 281433 273487 307737 280994 278276
5962 278276 245169 346051 363127 324527 332615 285117 254770 315712 313661 284587 308363 319795
$$ packed form
6047E29572k0046J4485k4263j6783N8157L3682r519j1737n4061j281J0439J1024
6035E19669m5l2287n0234k6939L9157J0640j2061N1664L0852N209J2533P024M035
6022E59217Q661J8267N8472j6893p2029Q169L4233P4968J5962k0185l4398O3376
6010F97820o485j4981J5350k0386m377k9089k1493p6206l7758L506J0147l8231
5998D77817k4901m1464N6560N9932l166p2278M2037K0222j2127j4836N301K5334
5986E18431k4620k8965o9290m1316k8833r482L4403n0996Q4874o464m7640M9674
5974C79776n4199K1833l4340p390K8935m0344j0141k697p946L4250k6743k718
5962B78276l3107J00882J7076l8600Q088m7498l0347O0942k051k9074K3776J1432
$$ plain form
5950 319795 364232 292713 258927 195385 134185 162124 183077 99576 165760 268022 186247
5939 186247 172412 195638 152158 101576 134978 140220 13067 14637 114077 186585 78442 126211
5927 126211 148040 114770 150010 110247 104129 164598 198475 158883 139285 186477 187148 171648
5915 171648 180698 211321 143300 118674 162952 145656 189507 105386 152419 177250 195562 190093
5903 190093 151994 171180 252064 248011 160423 216454 279624 241953 280877 342384 314564 280346
5891 280346 297492 276515 229775 289083 339372 343870 412083 344169 252067 333054 388046 386865
5879 386865 396698 385901 318131 349980 391129 396043 420792 435954 497549 502957 514743 569648
5867 569648 582889 650279 732437 778662 840586 917581 1014826 1118151 1153650 1147103 1129247 1076543
$$ packed form
5950C19795M4437p1519l3786o3542o1200K7939K0953q3501O6184J02262q1775
5939A86247j3835K3226m3480n0582L3402N242j27153J570R9440P2508j08143M7769
5927A26211K1829l3270L5240l9763o118O0469L3877l9592j9598M7192O71j5500
5915A71648R050L0623o8021k4626M4278j7296M3851q4121M7033K4831J8312n469
5903A90093l8099J9186Q0884m053q7588N6031O3170l7671L8924O1507k7820l4218
5891B80346J7146k0977m6740N9308N0289M498O8213o7914r2102Q0987N4992j181
5879C86865R833j0797o7770L1849M1149M914K4749J5162O1595N408J1786N4905
5867E69648J3241O7390Q2158M6225O1924P6995R7245J03325L5499o547j7856n2704
$$ plain form
5855 1076543 1039980 1036876 940866 814075 806201 758166 650603 631383 659920 530909 571188
5844 571188 539118 451129 557255 657548 623167 537896 553481 541093 515671 520422 557907
5833 557907 481009 485637 489872 442620 496605 504922 445421 486864 473137 469622 443155 466268
5821 466268 522141 521408 474054 472635 518796 507446 532149 521405 522806 502621 549161 524707
5809 524707 493530 509160 493787 384462 419908 438186 433689 428888 464092 476888 413193 481254
5797 481254 421825 365462 402866 309423 208890 266698 287137 229738 195839 286678 268411
5786 268411 215169 241320 255177 246631 240733 162687 131198 112530 139843 236813 232213 210157
5774 210157 225180 240744 186931 230830 201347 163110 196478 231333 187747 175650 153677 97914
$$ packed form
5855A076543l6563l104r6010j26791p874m8035j07563j9220K8537j29011M0279
5844E71188l2070q7989J06126J00293l4381q5271J5585j2388k5422M751L7485
5833E57907p6898M628M235m7252N3985Q317n9501M1443j3727l515k6467K3113
5821D66268N5873p33m7354j419M6161j1350K4703j0744J401k0185M6540k4454
5809E24707l1177J5630j5373j09325L5446J8278m497m801L5204J2796o3695O8061
5797D81254n9429n6363L7404r3443j00533N7808K0439n7399l3899R0839j8267
5786B68411n3242K6151J3857q546n898p8046l1489j8668K7313R6970m600k2056
5774B10157J5023J5564n3813M3899k9483l8237L3368L4855m3586j2097k1973n5763
$$ plain form
5762 97914 176290 221886 248083 182973 179291 167554 154624 226574 185433 209401 232536 194855
5750 194855 169512 85222 106742 163217 149576 192837 245891 221709 153655 150064 161521 83629
5738 83629 198608 270108 118443 74934 151579 145589 174089 226718 239940 285759 189893 131651
5726 131651 172382 198778 263878 199466 227919 185696 154182 180659 153567 190297 217313 246488
5714 246488 173141 79917 145934 240418 270843 221213 230830 321000 374418 408657 496972 523023
5702 523023 622928 638950 482627 347855 329189 360105 322365 231575 153214 246726 258126
5691 258126 237565 186381 202079 318978 290268 254060 278210 238474 217710 153587 79724
5680 79724 143746 192534 174008 186561 137309 101684 106843 154670 76204 38474 85536 145268
$$ packed form
5762I7914P8376M5596K6197o5110l682j1737j2930P1950m1141K3968K3135l7681
5750A94855k5343q4290K1520N6475j3641M3261N3054k4182o8054l591J1457p7892
5738H3629J14979P1500j51665m3509P6645n990K8500N2629J3222M5819r5866n8242
5726A31651M0731K6396O5100o4412K8453m2223l1514K6477k7092L6730K7016K9175
5714B46488p3347r3224O6017R4484L0425m9630R617R0170N3418L4239Q8315K6051
5702E23023R9905J6022j56323j34772j8666L0916l7740r0790p8361R3512J1400
5691B58126k0561n1184J5698J16899k8710l6208K4150l9736k0764o4123p3863
5680G9724O4022M8788j8526J2553m9252l5625N159M7827p8466l7730M7062N9732
$$ plain form
5668 145268 192723 209707 194461 233134 193861 139238 88972 55849 58561 59366 87583 131606
5656 131606 103167 142531 175356 128065 89907 106966 169117 129440 63085 68981 47044 78022
5644 78022 58919 68034 144475 96744 34166 43635 23882 37187 82203 58612 -6434 76502
5632 76502 181402 137858 107164 123803 112754 69845 43942 -20813 7656 110655 103986 46145
5620 46145 48064 72335 112920 93849 27514 -17751 -16519 -83694 -64712 -19471 24274 41992
5608 41992 70345 33066 -23531 57097 79919 33648 80982 44239 121866 119676 114289 43632
5596 43632 52448 72744 9837 349 -7417 -68836 -34711 -45293 -17037 -25367 16670 29915 -15152
5583 -15152 -22838 -33075 -13666 81023 69161 249 87005 104492 76772 23723 -2161 -1722
$$ packed form
5668A45268M7455J6984j5246L8673l9273n4623n0266l3123K712Q05K8217M4023
5656A31606k8439L9364L2825m7291l8158J7059O2151l9677o6355N896k1937L0978
5644G8022j9103R115P6441m7731o2578R469j9753J3305M5016k3591o5046Q2936
5632G6502J04900m3544l0694J6639j1049m2909k5903o4755K8469J02999o669n7841
5620D6145J919K4271M0585j9071o6335m5265J232o7175J8982M5241M3745J7718
5608D1992K8353l7279n6597Q0628K2822m6271M7334l6743P7627k190n387p0657
5596D3632Q816K0296o2907r488p766o1419L4125j0582K8256q330M2037J3245m5067
5583a5152p686j0237J9409R4689j1862o8912Q6756J7487k7720n3049k5884M39
$$ plain form
5571 -1722 -21213 -86057 -42073 22628 95376 20847 83856 15926 23301 124248 68333 67047
5559 67047 125931 139319 101995 63696 102244 98880 89130 89303 69917 76281 44888 -4510 -21761
5546 -21761 31 65265 139897 253927 260711 231026 236961 292299 280315 240893 236916 214662
5534 214662 217123 249980 215769 186285 219417 219069 217153 143510 173457 253577 220785 235284
5522 235284 333082 393194 393790 410859 355720 375533 394240 376782 337524 336771 427195 416930
5510 416930 429151 425868 466396 496279 507056 438356 359960 305926 325431 342405 406747 414371
5498 414371 409265 378409 269322 274729 288541 354244 351473 398418 395332 386327 378614 348652 266422
5485 266422 320256 350944 302114 298374 321226 277019 311678 405136 394862 490886 479941 464857
$$ packed form
5571a722j9491o4844M3984O4701P2748p4529O3009o7930P375J00947n5915j286
5559F7047N8884J3388l7324l8299L8548l364r750J73j9386O364l1393m9398j7251
5546b1761K1792O5234P4632J14030O784k9685N935N5338j1984l9422l977k2254
5534B14662K461L2857l4211k9484L3132l48j916p3643K9947Q0120l2792J4499
5522B35284R7798O0112N96J7069n5139J9813J8707j7458l9258p53R0424j0265
5510D16930J2221l283M0528K9883J0777o8700p8396n4034J9505J6974O4342P624
5498D14371n106l0856j09087N407J3812O5703k771M6945l086r005p713k9962q2230
5485B66422N3834L0688m8830l740K2852m4207L4659R3458j0274R6024j0945j5084
$$ plain form
5473 464857 437344 426451 449864 448277 524710 628258 584425 648757 683621 731615 676933 699667
5461 699667 687215 654653 689206 732360 751732 784811 871893 883954 875823 874886 846901 770873
5449 770873 850840 827864 766642 766433 770130 699087 729594 770907 751583 734198 770587 780881
5437 780881 733489 680152 642324 589479 606329 615839 674510 765995 900823 789207 699619
5426 699619 765203 921076 1071444 1095286 1121669 1114058 1023263 918680 865619 783824 810021
5415 810021 847009 827596 715839 734732 778630 756182 747896 746902 701604 674938 629246 640402
5403 640402 552968 637124 705620 711668 709932 677365 675871 713067 786946 753314 784116 796432
5391 796432 727527 696608 724641 783598 777544 735942 705242 705567 700326 683452 655524 607529
$$ packed form
5473D64857k7513j0893K3413j587P6433J03548m3833O4332L4864M7994n4682K2734
5461F99667j2452l2562L4553M3154J9372L3079Q7082J2061q131r37k7985p6028
5449G70873P9967k2976o1222k09L697p1043L0507M1313j9324j7385L6389J0294
5437G80881m7392n3337l7828n2845J6850R510N8671R1485J34828j11616q9588
5426F99619O5584J55873J50368K3842K6383p611r0795j04583n3061q1795K6197
5415H10021L6988j9413j11757J8893M3898k2448q286r94m5298k6666m5692J1156
5403F40402q7434Q4156O8496O048j736l2567j494L7196P3879l3632L0802J2316
5391G96432o8905l0919K8033N8957o054m1602l0700L25n241j6874k7928m7995
$$ plain form
5379 607529 606877 693123 632197 618908 596703 573841 592890 579856 559859 560944 645315 626111
5367 626111 579984 548905 629745 633482 621156 644513 635352 592423 678353 643891 590796 703036
5355 703036 699874 697041 738271 674857 602725 628108 671544 632631 616997 671542 686820 648798
5343 648798 646589 674037 636950 617399 596280 647032 596947 604237 744697 784627 768129 783361
5331 783361 826617 761690 765022 800915 817156 777184 795074 787209 779603 877843 873913 868387 893740
5318 893740 885405 877739 898840 916538 883932 932263 991530 909103 939393 1008639 981652 883219
5306 883219 909940 977936 996340 992381 943351 1004336 1025615 1101851 1110133 1113328 1077264 1122639
5294 1122639 1159719 1054635 1096853 1184616 1211733 1279841 1342944 1264003 1222888 1297190 1280316
$$ packed form
5379F07529o52Q6246o0926j3289k2205k2862J9049j3034j9997J085Q4371j9204
5367F26111m6127l1079Q0840L737j2326K3357r161m2929Q5930l4462n3095J12240
5355G03036l162k833M1230o3414p2132K5383M3436l8913j5634N4545J5278l8022
5343F48798k209K7448l7087j9551k1119N0752n0085P290J40460L9930j6498J5232
5331G83361M3256o4927L332L5893J6241l9972J7890p865p606R8240l930n526K5353
5318H93740q335p666K1101J7698l2606M8331N9267q2427L0290O9246k6987r8433
5306H83219K6721O7996J8404l959m9030O0985K1279P6236Q282L195l6064M5375
5294A122639L7080j05084M2218Q7763K7117O8108O3103p8941m1115P4302j6874
$$ plain form
5283 1280316 1245142 1252104 1299413 1341349 1423042 1368031 1305371 1392537 1434561 1380803 1314815 1317751
5271 1317751 1373775 1435691 1462900 1497039 1651118 1636101 1588674 1608906 1623794 1672566 1703140
5260 1703140 1691451 1773555 1899301 1864602 1921333 2022971 2071623 2017750 2107439 2176570 2255759
5249 2255759 2333135 2432216 2506753 2582898 2660246 2699330 2755085 2778472 2745591 2758860 2855470
5238 2855470 2927647 3002487 3102802 3204707 3293513 3335245 3484678 3650347 3701883 3678823 3664116
5227 3664116 3717123 3835252 4031167 4135042 4161330 4200085 4286741 4385011 4464514 4560507 4658319
5216 4658319 4802237 5005504 5141375 5224626 5340062 5464050 5556089 5684488 5878078 6058856
5206 6058856 6290095 6485737 6703778 6854888 7028971 7293837 7573121 7869361 8172297 8514098
$$ packed form
5283A280316l5174O962M7309M1936Q1693n5011o2660Q7166M2024n3758o5988K936
5271A317751N6024O1916K7209L4139J54079j5017m7427K0232J4888M8772L0574
5260A703140j1689Q2104J25746l4699N6731J01638M8652n3873Q9689O9131P9189
5249B255759P7376R9081P4537P6145P7348L9084N5755K3387l2881J3269R6610
5238B855470P2177P4840J00315J01905Q8806M1732J49433J65669N1536k3060j4707
5227C664116N3007J18129J95915J03875K6288L8755Q6656R8270P9503R5993R7812
5216D658319J43918K03267J35871Q3251J15436J23988R2039J28399J93590J80778
5206F058856K31239J95642K18041J51110J74083K64866K79284K96240L02936L41801
$$ plain form
5196 8514098 8857053 9237860 9722400 10358430 11079675 11813731 12656123 13642407 14834238
5187 14834238 16189202 17781118 19690185 21837728 24172948 26687921 29209385 32048400
5179 32048400 33676174 33735747 34328761 35936318 38431809 41328997 44570553 48019828 50904358
5170 50904358 51714138 50119631 46900296 43928818 42107805 41128592 40996631 41890842 43665845
5161 43665845 46008687 48467722 50736688 51928898 50748910 47122764 42252521 37769936
5153 37769936 34013071 30886482 28265689 26163645 24530782 23099438 21912591 20758465
5145 20758465 19777394 18975269 18308645 17772881 17378241 17084844 16905133 16833709 16806843 16876813
5135 16876813 17032469 17277232 17488700 17801126 18205292 18753946 19489886 20431769 21630441
$$ packed form
5196H514098L42955L80807M84540O36030P21245P34056Q42392R86284J191831
5187A4834238J354964J591916J909067K147543K335220K514973K521464K839015
5179C2048400J627774N9573N93014J607557K495491K897188L241556L449275K884530
5170E0904358Q09780j594507l219335k971478j821013r79213j31961Q94211J775003
5161D3665845K342842K459035K268966J192210j179988l626146m870243m482585
5153C7769936l756865l126589k620793k102044j632863j431344j186847j154126
5145B0758465r81071q02125o66624n35764l94640k93397j79711p1424k6866O9970
5135A6876813J55656K44763K11468L12426M04166N48654P35940R41883J198672
$$ plain form
5126 21630441 23194531 25137184 27545844 30381783 33763826 37829740 42559664 47747040
5118 47747040 53040435 58079774 61842606 62704860 60455201 56548247 53166956 51081759
5110 51081759 50178184 50420624 51861691 54355077 57520030 60769933 63600200 64634583
5102 64634583 62356710 57042631 50626074 44739737 39802731 35688588 32181924 29347086
5094 29347086 27108314 25202856 23418810 21730650 20253117 19078460 17946886 17058286
5086 17058286 16220362 15328690 14632291 14017439 13391520 12787409 12235782 11721184 11292150
5077 11292150 10831391 10306010 9981179 9624150 9340399 9134193 8913314 8678982 8540919
5068 8540919 8424951 8253163 8073486 7907594 7807415 7657556 7527378 7454463 7373416 7206376
$$ packed form
5126B1630441J564090J942653K408660K835939L382043M065914M729924N187376
5118D7747040N293395N039339L762832Q62254k249659l906954l381291k085197
5110E1081759r03575K42440J441067K493386L164953L249903K830267J034383
5102F4634583k277873n314079o416557n886337m937006m114143l506664k834838
5094B9347086k238772j905458j784046j688160j477533j174657j131574q88600
5086A7058286q37924q91672o96399o14852o25919o04111n51627n14598m29034
5077A1292150m60759n25381l24831l57029k83751k06206k20879k34332j38063
5068H540919j15968j71788j79677j65892j00179j49859j30178p2915q1047j67040
$$ plain form
5058 7206376 7018642 6848835 6746933 6736359 6698886 6614175 6577824 6501307 6488800 6490257 6427067
5047 6427067 6402951 6380927 6312635 6139609 5894407 5676610 5498025 5384981 5303111 5187966
5037 5187966 5130568 5125279 5055593 5048980 5030614 4976454 4926658 4983499 5025890 4991979 4980183 4960335
5025 4960335 4895487 4879335 4861565 4822970 4802383 4827795 4792685 4769438 4833100 4851885 4884641
5014 4884641 4910011 4934147 4872752 4756515 4730648 4652434 4461145 4399209 4279031 4240426 4177761
5003 4177761 4120932 4034839 3986108 3930120 3910746 3760562 3704396 3677943 3658862 3633839 3644392
4992 3644392 3580928 3556977 3585280 3584927 3560682 3565366 3560925 3575121 3651724 3603358 3627432 3669588
4980 3669588 3749987 3848542 3828779 3764791 3779350 3718307 3506309 3397109 3431428 3335660 3319059
$$ packed form
5058G206376j87734j69807j01902j0574l7473q4711l6351p6517j2507J457o3190
5047F427067k4116k2024o8292j73026k45202k17797j78585j13044q1870j15145
5037E187966n7398n289o9686o613j8366n4160m9796N6841M2391l3911j1796j9848
5025D960335o4848j6152j7770l8595k0587K5412l5110k3247O3662J8785L2756
5014D884641K5370K4136o1395j16237k5867p8214j91289o1936j20178l8605o2665
5003D177761n6829q6093m8731n5988j9374j50184n6166k6453j9081k5023J0553
4992C644392o3464k3951K8303l53k4245M684m441J4196P6603m8366K4074M2156
4980C669588Q0399R8555j9763o3988J4559o1043k11998j09200L4319r5768j6601
$$ plain form
4969 3319059 3288267 3207829 3089302 3116285 3077438 3110151 3158065 3170541 3131698 3140390 3075144
4958 3075144 3082397 3143004 3199672 3198392 3271707 3296920 3238380 3329176 3405708 3577172 3691621
4947 3691621 3792653 3818470 3895245 3877399 3836179 3711956 3645938 3616111 3477009 3401002 3375764
4936 3375764 3309081 3228650 3234543 3232474 3223892 3150155 3150923 3214802 3145453 3108652 3207611 3226684
4924 3226684 3244468 3292676 3398780 3398722 3414527 3438642 3490891 3567810 3639578 3735259 3784697 3858717
4912 3858717 4045537 4124805 4263822 4211650 4027107 3867986 3799670 3774144 3829103 3791400 3749668
4901 3749668 3742204 3698292 3679087 3629301 3645569 3780643 3920609 3892837 3899353 3829192 3904759
4890 3904759 3982381 4048127 3993281 3970735 3975843 3977349 3958211 3957856 4001713 4108186 4214802 4341398
$$ packed form
4969C319059l0792q0438j18527K6983l8847L2713M7914J2476l8843Q692o5246
4958C075144P253O0607N6668j280P3315K5213n8540R0796P6532J71464J14449
4947C691621J01032K5817P6775j7846m1220j24223o6018k9827j39102p6007k5238
4936C375764o6683q0431N893k069q582p3737P68O3879o9349l6801R8959J9073
4924C226684J7784M8208J06104n8J5805K4115N2249P6919P1768R5681M9438P4020
4912C858717J86820P9268J39017n2172j84543j59121o8316k5526N4959l7703m1732
4901C749668p464m3912j9205m9786J6268J35074J39966k7772O516p0161P5567
4890C904759P7622O5746n4846k2546N108J506j9138l55M3857J06473J06616J26596
$$ plain form
4878 4341398 4365889 4460367 4515216 4539399 4484400 4440739 4447194 4562594 4589299 4561086 4596241
4867 4596241 4565873 4637356 4715400 4776790 4800007 4815792 4864693 4946974 4971157 5083300 5171650
4856 5171650 5301525 5374947 5486471 5707161 5803327 5939405 6234075 6388372 6533090 6645554
4846 6645554 6843394 6896194 7002294 7144403 7229016 7366996 7569466 7707285 7867380 8104601
4836 8104601 8310271 8526022 8761883 8993189 9289458 9654607 10162980 10663013 11111284 11642019
4826 11642019 12318335 13102051 14017810 15081661 16402784 18076341 20114687 22465159 25294848
4817 25294848 28632341 32241358 36075434 39859080 43439300 46769399 49582916 50236423
4809 50236423 47768781 43384253 39412256 36202904 33526175 31029184 28895138 27350713
$$ packed form
4878D341398K4491R4478N4849K4183n4999m3661O455J15400K6705k8213L5155
4867D596241l0368P1483P8044O1390K3217J5785M8901Q2281K4183J12143Q8350
4856E171650J29875P3422J11524K20690R6166J36078K94670J54297J44718J12464
4846F645554J97840N2800J06100J42109Q4613J37980K02470J37819J60095K37221
4836H104601K05670K15751K35861K31306K96269L65149N08373N00033M48271N30735
4826A1642019O76316P83716R15759J063851J321123J673557K038346K350472K829689
4817B5294848L337493L609017L834076L783646L580220L330099K813517O53507
4809E0236423k467642m384528l971997l209352k676729k496991k134046j544425
$$ plain form
4801 27350713 26341163 25473105 24766055 24177161 23763428 23588807 23670380 24090480 25000703
4792 25000703 26250426 27978191 30206000 32989592 36240881 39853623 43581751 47290002
4784 47290002 50723893 53799261 55667464 54555070 50563852 45646047 41452308 38030971
4776 38030971 34993345 32302058 30055734 28315049 27047878 26080211 25303187 24594616 24103664
4767 24103664 23909640 24190527 24766476 25831325 27394487 29251995 31387934 33700538 35952128
4758 35952128 38191027 40247724 41711190 41533319 39049335 35383669 32217549 29701326
4750 29701326 27466150 25437672 23737143 22445559 21553032 20837697 20098551 19442482 18949160
4741 18949160 18741936 18763057 19012879 19521020 20420479 21542287 23129950 25240846 27623274
$$ packed form
4801B7350713j009550q68058p07050n88894m13733j74621Q1573M20100R10223
4792B5000703J249723J727765K227809K783592L251289L612742L728128L708251
4784D7290002L433891L075368J868203j112394l991218m917805m193739l421337
4776C8030971l037626k691287k246324j740685j267171r67667p77024p08571m90952
4767B4103664j94024K80887N75949J064849J563162J857508K135939K312604K251590
4758C5952128K238899K056697J463466j77871k483984l665666l166120k516223
4750B9701326k235176k028478j700529j291584q92527p15335p39146o56069m93322
4741A8949160k07224K1121K49822N08141Q99459J121808J587663K110896K382428
$$ plain form
4732 27623274 30223451 32994964 35640536 37968460 40084699 41200968 39812815 36182515
4724 36182515 32275236 28902078 26103294 23613221 21376548 19523388 18090824 16889964
4716 16889964 15751862 14641811 13591666 12536165 11656716 10911125 10341930 9763942 9268187
4707 9268187 8852981 8384317 8002149 7754628 7378385 7014053 6686814 6500716 6136308 5889493
4697 5889493 5688646 5536778 5505320 5375335 5175119 5014080 4941298 4855711 4695597 4536903
4687 4536903 4398638 4347085 4343601 4239556 4052467 3891546 3852678 3794251 3727774 3618074 3639320
4676 3639320 3615549 3587507 3560229 3456796 3504373 3680594 3631569 3559538 3499076 3467254 3516362
4665 3516362 3515477 3465954 3519230 3531629 3452796 3394475 3371977 3476485 3398122 3347717 3347334 3354150
$$ packed form
4732B7623274K600177K771513K645572K327924K116239J116269j388153l630300
4724C6182515l907279l373158k798784k490073k236673j853160j432564j200860
4716A6889964j138102j110051j050145j055501q79449p45591n69195n77988m95755
4707I268187m15206m68664l82168k47521l76243l64332l27239j86098l64408k46815
4697E889493k00847j51868l1458j29985k00216j61039p2782q5587j60114j58694
4687D536903j38265n1553l484j04045j87089j60921l8868n8427o6477j09700K1246
4676C639320k3771k8042k7278j03433M7577J76221m9025p2031o0462l1822M9108
4665C516362q85m9523N3276J2399p8833n8321k2498J04508p8363n0405l83O816
$$ plain form
4653 3354150 3277127 3204594 3180023 3256664 3320150 3318124 3283554 3158588 3211103 3242076 3136448
4642 3136448 3166982 3211866 3324546 3396237 3304114 3238773 3274672 3323843 3330616 3344593 3277505
4631 3277505 3289985 3323176 3287171 3201596 3230094 3263942 3310427 3329176 3277746 3201295 3244263
4620 3244263 3396738 3320141 3250881 3313352 3372307 3372493 3416885 3482869 3474066 3574785 3573388 3623764
4608 3623764 3690733 3829764 3919903 4060353 3982766 4079583 4174521 4283795 4432780 4557656
4598 4557656 4665796 4794549 4855953 4915383 5036488 5222387 5288444 5360259 5342608 5427193 5401312
4587 5401312 5557475 5648434 5681675 5720404 5821811 5866508 6072466 6266300 6428417 6627366
4577 6627366 6868155 7092047 7331134 7573157 7736169 7684087 7666497 7722813 7697503 7687557 7755252
$$ packed form
4653C354150p7023p2533k4571P6641O3486k026l4570j24966N2515L0973j05628
4642C136448L0534M4884J12680P1691r2123o5341L5899M9171O773J3977o7088
4631C277505J2480L3191l6005q5575K8498L3848M6485J8749n1430p6451M2968
4620C244263J52475p6597o9260O2471N8955J86M4392O5984q803J00719j397N0376
4608C623764O6969J39031R0139J40450p7587R6817R4938J09274J48985J24876
4598D557656J08140J28753O1404N9430J21105J85899O6057P1815j7651Q4585k5881
4587E401312J56163R0959L3241L8729J01407M4697K05958J93834J62117J98949
4577F627366K40789K23892K39087K42023J63012n2082j7590N6316k5310r946O7695
$$ plain form
4566 7755252 7803747 7892547 8019387 8093779 8208778 8498538 8689879 8942583 9272036 9542690
4556 9542690 9865330 10215956 10443954 10825883 11143632 11515199 11817679 12138506 12610790 13191805
4546 13191805 13855257 14605341 15340400 16063534 16872891 17643560 18592502 19689380 21107730
4537 21107730 23000950 25430960 28475002 32226524 36740485 42115071 48426259 56348809
4529 56348809 66271553 79073900 93408555 108685066 122126234 129659408 114637199
4522 114637199 92902141 78671070 66694679 57332808 49842865 44533267 40276865 36730366
4514 36730366 33139024 30010550 27234320 25127931 23248771 21688589 20164561 18796882
4506 18796882 17479461 16397480 15346346 14667933 14007864 13543436 12956037 12443325 11777461
$$ packed form
4566G755252M8495Q8800J26840P4392J14999K89760J91341K52704L29453K70654
4556I542690L22640L50626K27998L81929L17749L71567L02480L20827M72284N81015
4546A3191805O63452P50084P35059P23134Q09357P70669R48942J096878J418350
4537B1107730J893220K430010L044042L751522M513961N374586O311188P922550
4529E6348809R922744J2802347J4334655J5276511J3441168P533174j5022209
4522A14637199k1735058j4231071j1976391r361871p489943n309598m256402l546499
4514C6730366l591342l128474k776230k106389j879160j560182j524028j367679
4506A8796882j317421j081981j051134o78413o60069m64428n87399n12712o65864
$$ plain form
4497 11777461 11315022 10850494 10486579 10063579 9712417 9300224 9022162 8703276 8513961
4488 8513961 8272700 8160241 7928263 7767451 7595998 7370510 7147173 7027992 6757423 6574968
4478 6574968 6379261 6306688 6190747 6167950 6036297 5975571 5846030 5792814 5799771 5729889 5540751
4467 5540751 5481408 5408231 5312966 5261052 5217610 5217036 5217509 5230782 5174567 4982490 4951290 4982624
4455 4982624 4964175 4973504 4989501 4904488 4873213 4828069 4790022 4733778 4675940 4608737 4536055 4465073
4443 4465073 4458354 4482548 4471144 4495372 4447268 4440712 4403855 4314020 4247200 4303012 4263505 4280769
4431 4280769 4301211 4313847 4446995 4482304 4438234 4562892 4650346 4612026 4606964 4596121 4548507
4420 4548507 4554298 4458532 4258213 4154006 4215517 4243550 4183937 4198347 4206767 4200807 4287446 4450278
$$ packed form
4497A1777461m62439m64528l63915m23000l51162m12193k78062l18886j89315
4488H513961k41261j12459k31978j60812j71453k25488k23337j19181k70569j82455
4478F574968j95707p2573j15941k2797j31653o0726j29541n3216O957o9882j89138
4467E540751n9343p3177r5265n1914m3442n74M73J3273n6215j92077l1200L1334
4455D982624j8449R329J5997q5013l1275m5144l8047n6244n7838o7203p2682p0982
4443D465073o719K4194j1404K4228m8104o556l6857q9835o6820N5812l9507J7264
4431D280769K0442J2636J33148L5309m4070J24658Q7454l8320n062j0843m7614
4420D548507N791r5766k00319j04207O1511K8033n9613J4410Q420n960Q6639J62832
$$ plain form
4408 4450278 4556702 4721516 4950118 5176203 5469436 5767767 5998199 6278312 6511283 6726109
4398 6726109 6867086 6706428 6397798 6122674 5755329 5382017 5087005 4754671 4592483 4394185
4388 4394185 4323230 4197499 4118545 4105566 4027030 4035834 4121288 4132921 4165751 4281692 4313087
4377 4313087 4322993 4553748 4542288 4448265 4464567 4504515 4367636 4296444 4184092 4018047 3812642
4366 3812642 3570392 3515520 3404725 3266223 3194770 3030947 2952915 2854936 2812172 2734909 2706415
4355 2706415 2673173 2618290 2529442 2493419 2576697 2541433 2521137 2508486 2401256 2418167 2542326
4344 2542326 2512648 2516528 2557527 2592899 2581727 2533375 2472521 2444551 2424757 2416716 2385459 2342202
4332 2342202 2358696 2369125 2387305 2374991 2343082 2298735 2337564 2369063 2336975 2292878 2319844
$$ packed form
4408D450278J06424J64814K28602K26085K93233K98331K30432K80113K32971K14826
4398F726109J40977j60658l08630k75124l67345l73312k95012l32334j62188j98298
4388D394185p0955j25731p8954j2979p8536Q804Q5454J1633L2830J15941L1395
4377D313087R906K30755j1460r4023J6302L9948j36879p1192j12352j66045k05405
4366C812642k42250n4872j10795j38502p1453j63823p8032r7979m2764p7263k8494
4355B706415l3242n4883q8848l6023Q3278l5264k0296j2651j07230J6911J24159
4344B542326k9678L880M0999L5372j1172m8352o0854k7970j9794q041l1257m3257
4332B342202J6494J0429J8180j2314l1909m4347L8829L1499l2088m4097K6966
$$ plain form
4321 2319844 2359285 2426677 2441606 2496356 2469741 2488068 2479691 2532500 2639579 2727978 2774415
4310 2774415 2927026 3020199 3115308 3183240 3177424 3187390 3097247 3001681 2995249 2981116 2914794 2992155
4298 2992155 3022611 2978009 2957465 3005471 3001848 3059893 3074617 3138349 3147550 3173422 3181438 3162232
4286 3162232 3244693 3354365 3338460 3443654 3462691 3466067 3564574 3625226 3560428 3649336 3701293
4275 3701293 3699286 3652464 3624575 3711313 3823254 3848694 3921130 3998976 3963773 4008873 4008436 4101862
4263 4101862 4212452 4250034 4321877 4345765 4349887 4457177 4567630 4566349 4732874 4770313 4772285
4252 4772285 4927804 4919452 4881601 4961620 4992254 4992160 5022753 5074833 5166309 5281152 5316826 5314301
4240 5314301 5371270 5557819 5711626 5838319 5951336 6160156 6357330 6580803 6850380 7074883
$$ packed form
4321B319844L9441O7392J4929N4750k6615J8327q377N2809J07079Q8399M6437
4310B774415J52611R3173R5109O7932n816R966r0143r5566o432j4133o6322P7361
4298B992155L0456m4602k0544M8006l623N8045J4724O3732R201K5872Q016j9206
4286C162232Q2461J09672j5905J05194J9037L376R8507O0652o4798Q8908N1957
4275C701293k007m6822k7889Q6738J11941K5440P2436P7846l5203M5100m37R3426
4263D101862J10590L7582P1843K3888M122J07290J10453j281J66525L7439J972
4252D772285J55519q352l7851Q0019L0634r4L0593N2080R1476J14843L5674k525
4240E314301N6969J86549J53807J26693J13017K08820J97174K23473K69577K24503
$$ plain form
4230 7074883 7329519 7485206 7504379 7482594 7483343 7509175 7585901 7614439 7667415 7757846 7817326
4219 7817326 7845941 7984421 8132854 8281800 8412495 8583633 8761341 8942816 9327173 9559594
4209 9559594 9824506 10203311 10611257 10932587 11386697 11925204 12573168 13377087 14296816 15288654
4199 15288654 16354288 17539575 18815907 20201075 21534713 22895203 24006964 24356171
4191 24356171 24209496 24222329 24641790 25449956 26633483 28264729 30201413 32448479 34754544
4182 34754544 37018619 39238157 40734525 40461719 39769957 39624553 39984868 40725263 41860800
4173 41860800 43257258 44236165 44894334 45870988 47193053 48802950 50073854 50870945 51917968
4164 51917968 53001712 53655760 54038540 54622666 54933131 53694279 51915835 50877961 50681557
$$ packed form
4230G074883K54636J55687J9173k1785P49K5832P6726K8538N2976R0431N9480
4219G817326K8615J38480J48433J48946J30695J71138J77708J81475L84357K32421
4209I559594K64912L78805M07946L21330M54110N38507O47964Q03919R19729R91838
4199A5288654J065634J185287J276332J385168J333638J360490J111761L49207
4191B4356171j46675J2833M19461Q08166J183527J631246J936684K247066K306065
4182C4754544K264075K219538J496368k72806o91762j45404L60315P40395J135537
4173D1860800J396458R78907O58169R76654J322065J609897J270904P97091J047023
4164E1917968J083744O54048L82780N84126L10465j238852j778444j037874j96404
$$ plain form
4155 50681557 51071859 51812892 52890415 54203304 54721367 54081128 53328357 52976917 52541985
4146 52541985 51257532 50193254 49334582 47811058 46238452 45099496 44353347 43835720 43057799
4137 43057799 42320930 42044084 42219499 42537271 42823167 43088506 42177440 39594486 37021158
4128 37021158 35181758 33897352 33086118 32714047 32917685 33522823 34388193 35265219 36182275
4119 36182275 36947599 36872936 36037092 35114481 33993925 32468946 30507205 28370879 26437475
4110 26437475 24762925 23350128 22160298 21078837 20250454 19644473 19101003 18625450 18125791
4101 18125791 17757850 17615775 17559508 17655603 17796813 17941231 18183775 18489237 18683558 18868543
4091 18868543 18991235 18725087 18251690 17588162 16841431 16053414 15335872 14722688 14055663
$$ packed form
4155E0681557L90302P41033J077523J312889N18063o40239p52771l51440m34932
4146E2541985j284453j064278q58672j523524j572606j138956p46149n17627p77921
4137D3057799p36869k76846J75415L17772K85896K65339r11066k582954k573328
4128C7021158j839400j284406q11234l72071K03638O05138Q65370Q77026R17056
4119C6182275P65324p4663q35844r22611j120556j524979j961741k136326j933404
4110B6437475j674550j412797j189830j081461q28383o05981n43470m75553m99659
4101A8125791l67941j42075n6267R6095J41210J44418K42544L05462J94321J84985
4091A8868543J22692k66148m73397o63528p46731p88017p17542o13184o67025
$$ plain form
4082 14055663 13541304 13233497 12945467 12626329 12295952 11950216 11657554 11318169 10970350
4073 10970350 10623728 10310265 10087961 9814283 9536864 9271386 9197531 9157857 8971307 8754611
4063 8754611 8563751 8350163 8192736 8065888 7921232 7784641 7729880 7712111 7737381 7826943
4053 7826943 7975301 8089212 8186011 8171969 8152337 8148434 8214702 8283282 8237539 7958780 7775118
4042 7775118 7676640 7562605 7519929 7416053 7119090 6802400 6659492 6545545 6351779 6039743
4032 6039743 5715787 5518764 5375472 5219391 5060663 4924484 4926804 4841460 4725245 4654693
4022 4654693 4592942 4596250 4708142 4614919 4481616 4389247 4326794 4231742 4163186 4088595 3967976
4011 3967976 3896638 3726896 3574826 3502978 3519826 3444862 3242346 3153499 3073399 2937842 2928060
$$ packed form
4082A4055663n14359l07807k88030l19138l30377l45736k92662l39385l47819
4073A0970350l46622l13463k22304k73678k77419k65478p3855l9674j86550k16696
4063H754611j90860k13588j57427j26848j44656j36591n4761j7769K5270Q9562
4053G826943J48358J13911R6799j4042j9632l903O6268O8580m5743k78759j83662
4042G775118r8478j14035m2676j03876k96963l16690j42908j13947j93766l12036
4032F039743l23956j97023j43292j56081j58728j36179K320q5344j16215p0552
4022D654693o1751L308J11892r3223j33303r2369o2453r5052o8556p4591j20619
4011C967976p1338j69742j52070p1848J6848p4964k02516q8847q0100j35557r782
$$ plain form
4000 2928060 2891745 2861864 2890385 2891140 2814128 2761715 2747694 2747556 2722790 2597813 2595967 2585116
3988 2585116 2521325 2388400 2421003 2384407 2437824 2532679 2466141 2381263 2359130 2391550 2359852
3977 2359852 2340140 2349953 2395048 2382735 2331072 2278384 2278294 2355494 2297401 2316729 2354749 2300410
3965 2300410 2293525 2273361 2263917 2270755 2371191 2354047 2340480 2265859 2276429 2356145 2413936 2399180
3953 2399180 2455014 2609689 2705201 2879854 3097051 3348068 3621339 3943006 4094938 3946150
3943 3946150 3860922 3580692 3224036 3010009 2805052 2633344 2584319 2485331 2343454 2291811
3933 2291811 2294335 2251349 2204235 2246952 2195615 2208584 2098859 2076697 2058920 2102465 2079655
3922 2079655 2032428 2080394 2089433 2176355 2209602 2253912 2375906 2533522 2595060 2678908 2772213
$$ packed form
4000B928060l6315k9881K8521P55p7012n2413j4021j38k4766j24977j846j0851
3988B585116o3791j32925L2603l6596N3417R4855o6538q4878k2133L2420l1698
3977B359852j9712R813M5095j2313n1663n2688r0P7200n8093J9328L8020n4339
3965B300410o885k0164r444O838J00436j7144j3567p4621J0570P9716N7791j4756
3953B399180N5834J54675R5512J74653K17197K51017K73271L21667J51932j48788
3943C946150q5228k80230l56656k14027k04957j71708m9025r8988j41877n1643
3933B291811K524m2986m7114M2717n1337J2969j09725k2162j7777M3545k2810
3922B079655m7227M7966R039Q6922L3247M4310J21994J57616O1538Q3848R3305
$$ plain form
3911 2772213 2901644 3148829 3423430 3557122 3751878 3960614 4148591 4349838 4467482 4289826
3901 4289826 3948168 3724201 3601352 3478919 3357414 3381694 3338572 3344709 3405432 3447634 3531067
3890 3531067 3691519 3829353 3968002 4088389 4016076 3785937 3590935 3394757 3285481 3150767
3880 3150767 3036309 2920294 2737157 2633324 2540988 2405299 2340769 2273212 2224207 2205764
3870 2205764 2150217 2178579 2148582 2107736 2087740 2082129 2049488 2096207 2110812 2093234 2206470
3859 2206470 2315617 2259799 2252655 2316956 2329406 2364847 2442481 2509122 2561220 2696364 2692641
3848 2692641 2756012 2871887 2992030 3007727 2971305 2878160 2784676 2808489 2830344 2795632 2813097
3837 2813097 2867626 2870284 2898400 2815006 2854987 2960037 3027382 3040298 3158111 3218246 3310868
$$ packed form
3911B772213J29431K47185K74601J33692J94756K08736J87977K01247J17644j77656
3901D289826l41658k23967j22849j22433j21505K4280m3122O137O0723M2202Q3433
3890C531067J60452J37834J38649J20387p2313k30139j95002j96178j09276j34714
3880C150767j14458j16015j83137j03833r2336j35689o4530o7557m9005j8443
3870B205764n5547K8362k9997m0846j9996n611l2641M6719J4605j7578J13236
3859B206470J09147n5818p144O4301J2450L5441P7634O6641N2098J35144l723
3848B692641O3371J15875J20143J5697l6422r3145r3484K3813K1855l4712J7465
3837B813097N4529K658K8116q3394L9981J05050O7345J2916J17813O0135R2622
$$ plain form
3826 3310868 3485050 3596095 3674215 3822343 4080992 4232908 4397633 4504305 4484112 4511254
3816 4511254 4631395 4664033 4679495 4647087 4568053 4525740 4573887 4726224 4802297 5064114 5258837
3805 5258837 5425140 5566253 5784383 6026771 6092184 6299051 6535505 6721792 6866708 6915205
3795 6915205 6826876 6745724 6742155 6678603 6679536 6750193 6655943 6619965 6677195 6802628 6976794 7045233
3783 7045233 7124818 7369301 7560602 7618074 7753486 7850884 7939937 8120752 8236321 8317487
3773 8317487 8364722 8394173 8461010 8532491 8706890 8833183 8947609 9283358 9463218 9588463
3763 9588463 9862408 10175139 10463184 10841780 11255762 11556580 12035960 12551832 13094963 13768478
3753 13768478 14555289 15446067 16535385 17773094 19238162 21013237 23100728 25692885
$$ packed form
3826C310868J74182J11045P8120J48128K58649J51916J64725J06672k0193K7142
3816D511254J20141L2638J5462l2408p9034m2313M8147J52337P6073K61817J94723
3805E258837J66303J41113K18130K42388O5413K06867K36454J86287J44916M8497
3795F915205q8329q1152l569o3552R33P0657r4250l5978N7230J25433J74166O8439
3783G045233P9585K44483J91301N7472J35412R7398Q9053J80815J15569Q1166
3773H317487M7235K9451O6837P1481J74399J26293J14426L35749J79860J25245
3763I588463K73945L12731K88045L78596M13982L00818M79380N15872N43131O73515
3753A3768478P86811Q90778J089318J237709J465068J775075K087491K592157
$$ plain form
3745 25692885 28874897 32462258 36267265 40218438 44141500 47765273 50825770 50780981
3737 50780981 47138930 43223806 40388714 38207951 36409034 35156916 34668021 35089808
3729 35089808 36043002 37401835 39302274 41983701 45602916 50049907 55461210 61868500
3721 61868500 68709943 75586155 82331802 86795338 87402607 86773821 84335348 77627212
3713 77627212 69266585 62104295 56572393 52008999 48080497 45055061 43038256 41744211
3705 41744211 41016742 40904363 41317886 42672517 44843831 47536508 50682561 53930419 56883650
3696 56883650 59583491 60299471 56332814 49874854 44323307 39887740 35919186 32258776
3688 32258776 29286852 26906630 25002363 23366164 21748509 20227472 18935339 17705940
$$ packed form
3745B5692885L182012L587361L805007L951173L923062L623773L060497m4789
3737E0780981l642051l915124k835092k180763j798917j252118m88895M21787
3729C5089808R53194J358833J900439K681427L619215M446991N411303O407290
3721F1868500O841443O876212O745647M463536O07269o28786k438473o708136
3713G7627212q360627p162290n531902m563394l928502l025436k016805j294045
3705D1744211p27469j12379M13523J354631K171314K692677L146053L247858K953231
3696E6883650K699841P15980l966657o457960n551547m435567l968554l660410
3688C2258776k971924k380222j904267j636199j617655j521037j292133j229399
$$ plain form
3680 17705940 16635590 15784119 14877788 14189002 13625382 13038034 12493670 12040054 11650636
3671 11650636 11317607 11042600 10732979 10445198 10149760 9902407 9556281 9308128 9106531
3662 9106531 8936072 8794419 8644911 8429451 8271725 8200220 8050877 7951429 7837391 7813457
3652 7813457 7706167 7577418 7464112 7420379 7409113 7399150 7444552 7444713 7397089 7410394 7419598 7396295
3640 7396295 7347624 7386324 7461836 7443507 7387668 7391667 7425003 7536669 7614062 7672739 7829484
3629 7829484 7869062 7841102 7906572 8014792 8079186 8223506 8297675 8361531 8542743 8586196 8639008
3618 8639008 8727416 8919160 9055752 9107018 9288374 9406333 9630624 9878607 10058337 10185974
3608 10185974 10363881 10534134 10715125 10954059 11187782 11375451 11654444 11989543 12316972
$$ packed form
3680A7705940j070350q51471r06331o88786n63620n87348n44364m53616l89418
3671A1650636l33029k75007l09621k87781k95438k47353l46126k48153k01597
3662I106531j70459j41653j49508k15460j57726p1505j49343r9448j14038k3934
3652G813457j07290j28749j13306m3733j1266r963M5402J61m7624J3305R204k3303
3640G396295m8671L8700P5512j8329n5839L999L3336J11666P7393N8677J56745
3629G829484L9578k7960O5470J08220O4394J44320P4169O3856J81212M3453N2812
3618H639008Q8408J91744J36592N1266J81356J17959K24291K47983J79730J27637
3608A0185974J77907J70253J80991K38934K33723J87669K78993L35099L27429
$$ plain form
3599 12316972 12588019 12835545 13149352 13512171 13885055 14224666 14659369 15153414 15718107
3590 15718107 16315580 16902750 17504584 18156388 18872776 19705878 20619192 21646863 22858540
3581 22858540 24359038 26151444 28209951 30682393 33765027 37310592 41527564 46390608
3573 46390608 51560398 56963945 62325487 67272827 70738296 71053586 68500308 65354739
3565 65354739 63186132 62338749 62594792 64016003 66543861 69872727 73677004 77418974
3557 77418974 80679325 82142024 80525287 76870017 73646579 71785337 71158525 71520926
3549 71520926 72730543 74552992 76776102 78560809 78399357 75779997 72326804 69551876
3541 69551876 68025863 67492556 67839554 69188227 71298118 73771142 76208814 78382301
$$ packed form
3599A2316972K71047K47526L13807L62819L72884L39611M34703M94045N64693
3590A5718107N97473N87170O01834O51804P16388Q33102R13314J027671J211677
3581B2858540J500498J792406K058507K472442L082634L545565M216972M863044
3573D6390608N169790N403547N361542M947340L465469L15290k553278l145569
3565F5354739k168607q47383K56043J421211K527858L328866L804277L741970
3557G7418974L260351J462699j616737l655270l223438j861242o26812L62401
3549G1520926J209617J822449K223110J784707j61452k619360l453193k774928
3541F9551876j526013n33307L46998J348673K109891K473024K437672K173487
$$ plain form
3533 78382301 79483090 78370011 75028874 71200615 67912973 65441924 63304161 61405533
3525 61405533 60075371 59212343 58660090 58331623 58151671 58361883 58853725 59615535 60707800
3516 60707800 62050947 63530583 64857527 66088734 67143831 68151181 69180640 70008424
3508 70008424 70780257 71482793 72265228 73116657 74066192 75114199 76211650 77199103 78103036
3499 78103036 78844850 79447694 79820646 79576597 78981944 78197773 77290602 76310885 75382302
3490 75382302 74592520 73913991 73300803 72747532 72183447 71482398 70588512 69471089 68099288
3481 68099288 66475070 64732846 62999799 61313332 59474177 57698770 56006245 54405253
3473 54405253 52897223 51498786 49979214 48524839 47338694 46196999 45230859 44369770
$$ packed form
3533G8382301J100789j113079l341137l828259l287642k471049k137763j898628
3525F1405533j330162q63028n52253l28467j79952K10212M91842P61810J092265
3516F0707800J343147J479636J326944J231207J055097J007350J029459Q27784
3508G0008424P71833P02536P82435Q51429R49535J048007J097451R87453R03933
3499G8103036P41814O02844L72952k44049n94653p84171r07171r79717r28583
3490G5382302p89782o78529o13188n53271n64085p01049q93886j117423j371801
3481F8099288j624218j742224j733047j686467j839155j775407j692525j600992
3473E4405253j508030j398437j519572j454375j186145j141695r66140q61089
$$ plain form
3465 44369770 43573974 42705514 41655520 40282246 38656697 36864746 35147773 33471658
3457 33471658 32037399 30761260 29592114 28558476 27522189 26450000 25499235 24656724
3449 24656724 23719105 22792236 21834387 20884084 20026614 19174749 18428084 17864656 17472227
3440 17472227 17164843 16644041 16039767 15336147 14564562 13950948 13308076 12809567 12504655
3431 12504655 12121413 11669186 11199659 10831068 10530674 10281371 9951866 9538313 9392092
3422 9392092 9279992 8994693 8771078 8553727 8347903 8232457 8107605 7914990 7787909 7647942
3412 7647942 7504899 7308767 7214209 7128663 6932605 6858911 6800072 6644122 6650415 6608308 6500571
3401 6500571 6509309 6503474 6344349 6239335 6123462 6016956 5963877 5920192 5857303 5831961 5782553
$$ packed form
3465D4369770p95796q68460j049994j373274j625549j791951j716973j676115
3457C3471658j434259j276139j169146j033638j036287j072189r50765q42511
3449B4656724r37619r26869r57849r50303q57470q51865p46665n63428l92429
3440A7472227l07384n20802o04274p03620p71585o13614o42872m98509l04912
3431A2504655l83242m52227m69527l68591l00394k49303l29505m13553j46221
3422I392092j12100k85299k23615k17351k05824j15446j24852j92615j27081j39967
3412G647942j43043j96132r4558q5546j96058p3694n8839j55950O293m2107j07737
3401F500571Q738n835j59125j05014j15873j06506n3079m3685o2889k5342m9408
$$ plain form
3390 5782553 5737176 5723037 5568492 5532674 5490423 5439851 5303402 5105221 5088832 5065222 5017285
3379 5017285 4971762 4908415 4911169 4938529 4854090 4676342 4659519 4638783 4566027 4515142 4436363
3368 4436363 4293458 4353145 4336134 4263176 4244880 4215466 4144736 4022871 3922625 3886019 3867715
3357 3867715 3916041 3887877 3891652 3888393 3909766 3856907 3842823 3819279 3772701 3752964 3694525 3682570
3345 3682570 3757241 3727680 3754296 3711669 3729860 3852158 3928885 3975073 3891026 3863937 3788604
3334 3788604 3764205 3780634 3783924 3707169 3754386 3843408 3739856 3747472 3871390 3907699 3920439
3323 3920439 3929753 3899679 3936917 4002251 3888454 3857361 3955432 3911511 3858647 3820524 3855446
3312 3855446 3983921 4230407 4351595 4482182 4645712 4735113 4875572 4917285 5018337 4986902
$$ packed form
3390E782553m5377j4139j54545l5818m2251n0572j36449j98181j6389k3610m7937
3379E017285m5523o3347K754K7360q4439j77748j6823k0736p2756n0885p8779
3368D436363j42905N9687j7011p2958j8296k9414p0730j21865j00246l6606j8304
3357C867715M8326k8164L775l259K1373n2859j4084k3544m6578j9737n8439j1955
3345C682570P4671k9561K6616m2627J8191J22298P6727M6188q4047k7089p5333
3334C788604k4399J6429L290p6755M7217Q9022j03552P616J23918L6309J2740
3323C920439R314l0074L7238O5334j13797l1093R8071m3921n2864l8123L4922
3312C855446J28475K46486J21188J30587J63530Q9401J40459M1713J01052l1435
$$ plain form
3302 4986902 5097176 5207413 5206667 5250972 5375630 5475787 5493867 5485271 5500229 5619859 5765679
3291 5765679 5826084 5857486 5854565 5904503 5891111 5835291 5775735 5838998 5829966 5813066 5823222 5839031
3279 5839031 5962984 5970986 6001726 6091599 6168357 6195096 6285686 6437011 6695713 6918549 6974820
3268 6974820 7081361 7172224 7208670 7224884 7188164 7123253 7173637 7184690 7196436 7228229 7358454
3257 7358454 7577919 7743362 7851883 7873085 7830164 7948617 8099403 8191259 8362768 8532365
3247 8532365 8765215 9034497 9122889 9297704 9534011 9749422 9986928 10427979 10742199 11062917
3237 11062917 11340739 11497719 11583343 11821006 12167900 12422266 12706774 12962337 13297271 13795407
3227 13795407 14363857 14818151 15286722 15813382 16158583 16522016 16923208 17266125 17614368
$$ packed form
3302D986902J10274J10237p46M4305J24658J00157J8080q596J4958J19630J45820
3291E765679O0405L1402k921M9938j3392n5820n9556O3263r032j6900J0156J5809
3279E839031J23953Q002L0740Q9873P6758K6739R0590J51325K58702K22836N6271
3268F974820J06541R0863L6446J6214l6720o4911N0384J1053J1746L1793J30225
3257G358454K19465J65443J08521K1202m2921J18453J50786R1856J71509J69597
3247H532365K32850K69282Q8392J74815K36307K15411K37506M41051L14220L20718
3237A1062917K77822J56980Q5624K37663L46894K54366K84508K55563L34934M98136
3227A3795407N68450M54294M68571N26660L45201L63433M01192L42917L48243
$$ plain form
3218 17614368 18003523 18225569 18533765 19084894 19664903 20208015 20888426 21542660 22212890
3209 22212890 22990506 23635370 24256578 24891086 25454478 25907158 26308872 26785754 27307825
3200 27307825 28056715 28967771 29797937 30651364 31587860 32547538 33746534 35033148 36281585
3191 36281585 37615878 38882835 40128666 41521194 43186761 44777279 46524387 48283594
3183 48283594 50154190 52490022 55363274 58619940 62261255 66222083 70508075 75060802
3175 75060802 80110843 85639436 91795785 99059068 108103981 119145469 133182065 150253505
3167 150253505 170536310 194131334 221617861 253985382 294321581 344733728 405890875
3160 405890875 472316610 529445961 549225119 524616190 464316026 390173720 327379083
$$ packed form
3218A7614368L89155K22046L08196N51129N80009N43112O80411O54234O70230
3209B2212890P77616O44864O21208O34508N63392M52680M01714M76882N22071
3200B7307825P48890R11056Q30166Q53427R36496R59678J198996J286614J248437
3191C6281585J334293J266957J245831J392528J665567J590518J747108J759207
3183D8283594J870596K335832K873252L256666L641315L960828M285992M552727
3175G5060802N050041N528593O156349P263283R044913J1041488J4036596J7071440
3167A50253505K0282805K3595024K7486527L2367521M0336199N0412147O1157147
3160D05890875O6425735N7129351J9779158k4608929o0300164p4142306o2794637
$$ plain form
3153 327379083 278001550 240846181 212513650 189961901 170874027 154207933 139707781
3146 139707781 127630253 117437867 108959848 101312156 94470776 87821021 81091992 74634135
3138 74634135 69084022 64377513 60428790 57058910 54051995 51126133 48472079 45842475
3130 45842475 43486423 41291054 39399017 37550168 35888853 34231866 32730396 31191374
3122 31191374 29849017 28485723 27247348 26138624 25220525 24287707 23450294 22544743 21591096
3113 21591096 20590228 19673361 18955595 18411326 17979747 17635388 17290472 16904145 16678833
3104 16678833 16410781 16213169 16158522 16057865 15918275 15505982 15041303 14565875 14053215 13681151
3094 13681151 13307534 12998084 12763236 12627381 12380820 12215704 12157075 11871994 11543697 11405579
$$ packed form
3153C27379083m9377533l7155369k8332531k2551749j9087874j6666094j4500152
3146A39707781j2077528j0192386q478019p647692o841380o649755o729029o457857
3138G4634135n550113m706509l948723l369880l006915k925862k654054k629604
3130D5842475k356052k195369j892037j848849j661315j656987j501470j539022
3122C1191374j342357j363294j238375j108724r18099r32818q37413r05551r53647
3113B1591096j000868r16867p17766n44269m31579l44359l44916l86327k25312
3104A6678833k68052j97612n4647j00657j39590m12293m64679m75428n12660l72064
3094A3681151l73617l09450k34848j35855k46561j65116n8629k85081l28297j38118
$$ plain form
3084 11405579 11101283 10838259 10580592 10297380 10023584 9877238 9628600 9431924 9238432
3075 9238432 9226021 9158996 9046478 8909695 8721646 8582421 8419983 8248893 8019615 7785750
3065 7785750 7658761 7582555 7419314 7201959 7009526 6738919 6544718 6381383 6192180 6095624
3055 6095624 6007607 5858003 5678788 5563581 5365130 5232543 5146584 5079062 4955859 4856088
3045 4856088 4849936 4797223 4774794 4836096 4895950 4809038 4717360 4674852 4583788 4476101 4416770
3034 4416770 4266619 4162375 4148890 4117200 3983406 3920456 3830411 3747931 3686646 3555880 3388589
3023 3388589 3283924 3238003 3181806 3127514 3116820 3089084 3191941 3179452 3145645 3092197 3057927
3012 3057927 3016145 3031496 3059128 3158161 3258720 3296735 3347704 3450970 3531882 3553182 3569506
$$ packed form
3084A1405579l04296k63024k57667k83212k73796j46346k48638j96676j93492
3075I238432j2411o7025j12518j36783j88049j39225j62438j71090k29278k33865
3065G785750j26989p6206j63241k17355j92433k70607j94201j63335j89203r6556
3055F095624q8017j49604j79215j15207j98451j32587q5959o7522j23203r9771
3045D856088o152n2713k2429O1302N9854q6912r1678m2508r1064j07687n9331
3034D416770j50151j04244j3485l1690j33794o2950r0045q2480o1285j30766j67291
3023C388589j04665m5921n6197n4292j0694k7736J02857j2489l3807n3448l4270
3012C057927m1782J5351K7632R9033J00559L8015N0969J03266Q0912K1300J6324
$$ plain form
3001 3569506 3547896 3488425 3453858 3346767 3326280 3308013 3279824 3273082 3196342 3247979 3235020
2990 3235020 3203383 3214241 3215637 3251453 3233388 3243047 3330381 3312188 3281338 3323166 3352404 3390350
2978 3390350 3385270 3336802 3321873 3293525 3181693 3050175 3119617 3101425 3025239 2992473 3024344
2967 3024344 2962271 2945656 2933871 2885684 2855652 2899261 2904092 2928478 2926568 2886664 2880397 2859356
2955 2859356 2884569 2813048 2772537 2762437 2817104 2744920 2697941 2704856 2639421 2600739 2619284 2588620
2943 2588620 2529506 2446918 2423675 2352882 2384408 2407131 2504810 2524165 2545063 2539141 2555132 2612603
2931 2612603 2647131 2671305 2655784 2658653 2725513 2827621 2874665 2862553 2833934 2973168 2996251
2920 2996251 3075459 3049314 3068105 3024441 3010097 2999123 3011346 2954054 3023772 2997033 3013161
$$ packed form
3001C569506k1610n9471l4567j07091k0487j8267k8189o742p6740N1637j2959
2990C235020l1637J0858J396L5816j8065R659Q7334j8193l0850M1828K9238L7946
2978C390350n080m8468j4929k8348j11832j31518O9442j8192p6186l2766L1871
2967C024344o2073j6615j1785m8187l0032M3609M831K4386j910l9904o267k1041
2955B859356K5213p1521m0511j0100N4667p2184m6979O915o5435l8682J8545l0664
2943B588620n9114q2588k3243p0793L1526K2723R7679J9355K0898n922J5991N7471
2931B612603L4528K4174j5521K869O6860J02108M7044j2112k8619J39234K3083
2920B996251P9208k6145J8791m3664j4344j0974J2223n7292O9718k6739J6128
$$ plain form
2909 3013161 3084504 3081380 2973059 3028121 2946051 2963026 3012759 3016432 3013894 2961910 2978330 3063683
2897 3063683 3103486 3140509 3156450 3120665 3243241 3199575 3251356 3266325 3314281 3372461 3414806
2886 3414806 3490837 3567585 3556409 3554242 3583074 3662885 3708964 3784722 3774949 3807583 3853032 3868723
2874 3868723 3802489 3850100 4025096 4154847 4243452 4357418 4469436 4466528 4605206 4671659 4652414
2863 4652414 4734848 4892120 4918868 5054367 5262219 5403741 5553155 5825500 5995382 6231378
2853 6231378 6661256 7030141 7371323 7724154 7824000 7783225 7531197 7211721 6808132 6590173
2843 6590173 6473327 6320776 6146598 5977134 5938188 6034857 6037136 6048983 6169864 6271479
2833 6271479 6298429 6459320 6537048 6558546 6744644 6856690 6955380 7120570 7456419 7578450
$$ packed form
2909C013161P1343l124j08321N5062q2070J6975M9733L673k538n1984J6420Q5353
2897C063683L9803L7023J5941l5785J22576m3666N1781J4969M7956N8180M2345
2886C414806P6031P6748j1176k167K8832P9811M6079P5758r773L2634M5449J5691
2874C868723o6234M7611J74996J29751Q8605J13966J12018k908J38678O6453j9245
2863D652414Q2434J57272K6748J35499K07852J41522J49414K72345J69882K35996
2853F231378M29878L68885L41182L52831R9846m0775k52028l19476m03589k17959
2843F590173j16846j52551j74178j69464l8946R6669K279J1847J20881J01615
2833F271479K6950J60891P7728K1498J86098J12046R8690J65190L35849J22031
$$ plain form
2823 7578450 7826607 8113279 8311736 8477374 8788040 9000323 9194669 9478814 9805408 10036476
2813 10036476 10364999 10661547 10939164 11169201 11405812 11606704 11820900 12023989 12231954
2804 12231954 12449115 12738799 12914858 13242978 13514508 13754744 14033491 14363996 14721383
2795 14721383 15170383 15640657 16058094 16483729 16908774 17318050 17687021 18253860 18769399
2786 18769399 19401650 20154871 20928438 21811894 22799711 23781239 24851618 26186611 27422164
2777 27422164 28619733 30018154 31513272 32917756 34312612 35795095 37095220 38283364
2769 38283364 39432990 40522946 41563338 42664740 43639021 44836704 46188803 47656443
2761 47656443 49256694 51094564 53108232 55068254 57055068 58841785 60354307 61353973
$$ packed form
2823G578450K48157K86672J98457J65638L10666K12283J94346K84145L26594K31068
2813A0036476L28523K96548K77617K30037K36611K00892K14196K03089K07965
2804A2231954K17161K89684J76059L28120K71530K40236K78747L30505L57387
2795A4721383M49000M70274M17437M25635M25045M09276L68971N66839N15539
2786A8769399O32251P53221P73567Q83456R87817R81528J070379J334993J235553
2777B7422164J197569J398421J495118J404484J394856J482483J300125J188144
2769C8283364J149626J089956J040392J101402R74281J197683J352099J467640
2761D7656443J600251J837870K013668J960022J986814J786717J512522R99666
$$ plain form
2753 61353973 61877844 62384834 63114856 63967306 64929323 66053166 67289146 68777893 70420274
2744 70420274 71930390 73136047 73997434 74527303 74578057 74258460 73460514 72275467 70906530
2735 70906530 69358299 67772825 66340733 65217841 64174625 63306525 62719465 62137167 61479577
2726 61479577 60767275 59789546 58125077 56133029 54066951 52027242 50136008 48329832
2718 48329832 46619878 45084920 43770853 42560201 41616981 40578579 39575417 38557555
2710 38557555 37513379 36230168 34863887 33274024 31696774 30188288 28675780 27259369
2702 27259369 26043506 24834669 23708414 22710345 21696510 20655145 19718833 18926626 18123643
2693 18123643 17370188 16808329 16331836 15841463 15362676 14844308 14366662 13944678 13575695
$$ packed form
2753F1353973N23871N06990P30022Q52450R62017J123843J235980J488747J642381
2744G0420274J510116J205657Q61387N29869N0754l19597p97946j185047j368937
2735G0906530j548231j585474j432092j122892j043216q68100n87060n82298o57590
2726F1479577p12302r77729j664469j992048k066078k039709j891234j806176
2718D8329832j709954j534958j314067j210652r43220j038402j003162j017862
2710C8557555j044176j283211j366281j589863j577250j508486j512508j416411
2702B7259369j215863j208837j126255r98069j013835j041365r36312p92207q02983
2693A8123643p53455n61859m76493m90373m78787n18368m77646m21984l68983
$$ plain form
2684 13575695 13135288 12816668 12573043 12333825 12037968 11760781 11372155 11043814 10822604
2675 10822604 10639734 10445624 10247031 10039859 9879188 9603908 9310679 8978145 8681684
2666 8681684 8428796 8200305 7962150 7656385 7464554 7357433 7157571 6982798 6811927 6629277
2656 6629277 6472411 6238340 5955026 5784219 5799952 5598749 5377411 5282229 5170876 5034834
2646 5034834 4822627 4701994 4583713 4491094 4459197 4324717 4288956 4261513 4100206 3964992
2636 3964992 4014409 3919421 3823819 3800837 3695250 3592422 3671665 3659463 3582525 3519215 3461373
2625 3461373 3421640 3417230 3368264 3307230 3302986 3267358 3149304 3125664 3114015 3094954 3100276 3093826
2613 3093826 3073230 3000022 3050873 3041532 2976358 2979574 2939117 2967614 3000156 2935068 2960817 2944082
$$ packed form
2684A3575695m40407l18620k43625k39218k95857k77187l88626l28341k21210
2675A0822604j82870j94110j98593k07172j60671k75280k93229l32534k96461
2666H681684k52888k28491k38155l05765j91831j07121j99862j74773j70871j82650
2656F629277j56866k34071k83314j70807J5733k01203k21338r5182j11353j36042
2646E034834k12207j20633j18281r2619l1897j34480l5761k7443j61307j35214
2636C964992M9417r4988r5602k2982j05587j02828P9243j2202p6938o3310n7842
2625C461373l9733m410m8966o1034m244l5628j18054k3640j1649j9061N322o450
2613C093826k0596p3208N0851r341o5174L216m0457K8497L2542o5088K5749j6735
$$ plain form
2601 2944082 2898477 2854163 2856623 2835176 2871703 2922997 2923643 2847776 2823719 2751062 2742186 2715951
2589 2715951 2663687 2607263 2671161 2700366 2677275 2714995 2706756 2618454 2587482 2538373 2460766 2409114
2577 2409114 2438686 2374292 2352346 2381558 2360395 2333192 2264734 2260402 2161085 2149015 2176566 2129613
2565 2129613 2166694 2104371 2055101 2121068 2079503 2079324 2137469 2183784 2134704 2212522 2254941 2225278
2553 2225278 2261885 2321400 2367172 2387624 2357708 2278321 2325139 2316116 2333252 2345998 2367456 2328413
2541 2328413 2274494 2330365 2260425 2183802 2215976 2115464 2050274 2038851 1996402 1989101 2054571
2530 2054571 2018561 1982715 2033614 2008363 1949778 2016827 1943902 1963518 2038836 2040064 1971373 1965110
2518 1965110 1992580 1942213 1986940 1937840 1863335 1834460 1891534 1868809 1871362 1915464 1951475 1957696
$$ packed form
2601B944082m5605m4314K460k1447L6527N1294O46p5867k4057p2657q876k6235
2589B715951n2264n6424O3898K9205k3091L7720q239q8302l0972m9109p7607n1652
2577B409114K9572o4394k1946K9212k1163k7203o8458m332r9317j2070K7551m6953
2565B129613L7081o2323m9270O5967m1565j79N8145M6315m9080P7818M2419k9663
2553B225278L6607N9515M5772K0452k9916p9387M6818r023J7136J2746K1458l9043
2541B328413n3919N5871o9940p6623L2174j00512o5190j1423m2449p301O5470
2530B054571l6010l5846N0899k5251n8585O7049p2925J9616P5318J228o8691o263
2518A965110K7470n0367M4727m9100p4505k8875N7074k2725K553M4102L6011O221
$$ plain form
2506 1957696 1987190 1904038 1822429 1803359 1729116 1691889 1718066 1627181 1589156 1563584 1611854
2495 1611854 1618944 1630059 1534157 1498356 1545038 1548650 1464234 1458428 1445945 1419985 1431927 1457728
2483 1457728 1413099 1438198 1503143 1529689 1469106 1481877 1485612 1513545 1537788 1437716 1474317
2472 1474317 1533510 1552901 1516568 1616946 1585795 1622868 1732653 1699381 1704805 1807310 1904360
2461 1904360 2027564 2131403 2170249 2129695 2099252 2002219 1804145 1776573 1808041 1717340 1713821
2450 1713821 1707080 1675653 1650128 1644822 1562491 1541364 1592183 1549452 1578604 1579170 1523030 1508755
2438 1508755 1537376 1512934 1484255 1469266 1494875 1488970 1502044 1471708 1412737 1404909 1464875 1492482
2426 1492482 1497971 1451361 1454859 1495525 1572927 1530436 1578802 1563306 1496802 1518946 1548499 1539870
$$ packed form
2506A957696K9494q3152q1609j9070p4243l7227K6177r0885l8025k5572M8270
2495A611854P090J1115r5902l5801M6682L612q4416n806j2483k5960J1942K5801
2483A457728m4629K5099O4945K6546o0583J2771L735K7933K4243j00072L6601
2472A474317N9193J9391l6333J00378l1151L7073J09785l3272N424J02505R7050
2461A904360J23204J03839L8846m0554l0443r7033j98074k7572L1468r0701l519
2450A713821o741l1427k5525n306q2331k1127N0819m2731K9152N66n6140j4275
2438A508755K8621k4442k8679j4989K5609n905J3074l0336n8971p828N9966K7607
2426A492482N489m6610L498M0666P7402m2491M8366j5496o6504K2144K9553q629
$$ plain form
2414 1539870 1495315 1496782 1481049 1546158 1534065 1483241 1431192 1447297 1457112 1408978 1487716 1551014
2402 1551014 1473913 1455943 1435163 1385616 1382033 1446303 1397870 1426437 1384957 1396527 1465256 1532477
2390 1532477 1450636 1457153 1352302 1369543 1477402 1487184 1476827 1512061 1576183 1553706 1480285
2379 1480285 1524976 1501259 1565511 1620428 1580235 1645855 1762617 1686802 1735059 1886096 1932245
2368 1932245 2043709 2174164 2294240 2365513 2548665 2630328 2688633 2640182 2526260 2376726
2358 2376726 2238316 2215495 2161737 2024611 2079481 2121730 2166651 2172701 2205341 2192233 2293227
2347 2293227 2316630 2315340 2221448 2172905 2176375 2239146 2234922 2229564 2370592 2494767 2647449 2806504
2335 2806504 3051561 3236560 3565766 3821468 4059940 4241194 4393706 4367151 4113823 3726984
$$ packed form
2414A539870m4555J467j5733O5109j2093n0824n2049J6105R815m8134P8738O3298
2402A551014p7101j7970k0780m9547l583O4270m8433K8567m1480J1570O8729O7221
2390A532477q1841O517j04851J7241J07859R782j0357L5234O4122k2477p3421
2379A480285M4691k3717O4252N4917m0193O5620J16762p5815M8257J51037M6149
2368A932245J11464J30455J20076P1273J83152Q1663N8305m8451j13922j49534
2358B376726j38410k2821n3758j37126N4870M2249M4921O050L2640j3108J00994
2347B293227K3403j290r3892m8543L470O2771m224n358J41028J24175J52682J59055
2335B806504K45057J84999L29206K55702K38472J81254J52512k6555k53328l86839
$$ plain form
2325 3726984 3403441 3230079 3141518 2967410 2892618 2887377 2806594 2745809 2730497 2707201 2734776
2314 2734776 2751896 2724366 2712308 2838228 2921702 2873312 2971007 2957080 2985332 2976330 2954559
2303 2954559 2919687 2930195 2927443 3003321 3117758 3218864 3282680 3470130 3511597 3517334 3425855
2292 3425855 3291727 3196688 3143912 3019950 2984843 3031782 3065860 3111300 3178041 3234983 3244849
2281 3244849 3220572 3203394 3213003 3175502 3154168 3172731 3134050 3170576 3264388 3182671 3217050 3274005
2269 3274005 3277494 3271457 3408279 3480486 3634415 3818574 4011514 4160578 4425489 4644945
2259 4644945 4787268 4683920 4512160 4341492 4301325 4271927 4282824 4337271 4391833 4400003 4533295
2248 4533295 4655070 4727940 4843688 4904539 5041978 5270523 5492047 5655376 5945070 6142324
$$ packed form
2325C726984l23543j73362q8561j74108p4792n241q0783o0785j5312k3296K7575
2314B734776J7120k7530j2058J25920Q3474m8390R7695j3927K8252r002k1771
2303B954559l4872J0508k752P5878J14437J01106O3816J87450M1467N737r1479
2292C425855j34128r5039n2776j23962l5107M6939L4078M5440O6741N6942R866
2281C244849k4277j7178R609l7501k1334J8563l8681L6526R3812q1717L4379N6955
2269C274005L489o037J36822P2207J53929J84159J92940J49064K64911K19456
2259D644945J42323j03348j71760j70668m0167k9398J0897N4447N4562Q170J33292
2248D533295J21775P2870J15748O0851J37439K28545K21524J63329K89694J97254
$$ plain form
2238 6142324 6126872 6050803 6002930 5970521 6006723 6080539 6198168 6354247 6519542 6744886 7077367
2227 7077367 7454771 7835682 8129030 8220223 7959229 7735391 7602455 7573709 7566262 7691674
2217 7691674 7883059 8113525 8333525 8559878 8723006 8861690 9007277 9203692 9403423 9604734
2207 9604734 9736264 9913494 10031343 10094588 10214223 10454567 10765365 11140969 11570217 11995942
2197 11995942 12449780 12938171 13330518 13493238 13607994 13540361 13290754 12843135 12168575 11504152
2187 11504152 10953037 10551457 10124665 9870274 9831904 9769223 9765359 9616161 9341383 8953062
2177 8953062 8564547 8171816 7866106 7536843 7228317 7061917 6874589 6556792 6408480 6214839
2167 6214839 6072826 6104001 6027125 5937045 5902651 5917748 5871262 5727909 5542183 5321252 5062520
$$ packed form
2238F142324j5452p6069m7873l2409L6202P3816J17629J56079J65295K25344L32481
2227G077367L77404L80911K93348R1193k60994k23838j32936k8746p447J25412
2217G691674J91385K30466K20000K26353J63128J38684J45587J96415J99731K01311
2207I604734J31530J77230J17849O3245J19635K40344L10798L75604M29248M25725
2197A1995942M53838M88391L92347J62720J14756o7633k49607m47619o74560o64423
2187A1504152n51115m01580m26792k54391l8370o2681l864j49198k74778l88321
2177H953062l88515l92731l05710l29263l08526j66400j87328l17797j48312j93641
2167F214839j42013L1175p6876r0080l4394J5097m6486j43353j85726k20931k58732
$$ plain form
2156 5062520 4924790 4809521 4751076 4662605 4666803 4679057 4674375 4718544 4755809 4860820 4824953
2145 4824953 4789265 4752196 4592349 4479346 4338397 4169146 4007315 3911033 3787273 3632572
2135 3632572 3651476 3572550 3477650 3444402 3421000 3398864 3454494 3557452 3567301 3519557 3424794
2124 3424794 3254480 3119986 3074775 3101866 3040216 3000085 2905586 2841269 2798066 2801204 2744543
2113 2744543 2747073 2692713 2668189 2570938 2549564 2536982 2535744 2516332 2409136 2297005 2241872
2102 2241872 2190497 2182987 2191838 2132362 2158690 2168983 2060046 1963336 2029984 2015384 2005877 1995022
2090 1995022 1942284 1759746 1853427 1775451 1787199 1822280 1790495 1713710 1783628 1698016 1615741
2079 1615741 1686367 1711523 1662915 1683866 1616144 1641609 1683229 1616021 1588575 1571406 1548570
$$ packed form
2156E062520j37730j15269n8445q8471M198J2254m682M4169L7265J05011l5867
2145D824953l5688l7069j59847j13003j40949j69251j61831r6282j23760j54701
2135C632572J8904p8926r4900l3248k3402k2136N5630J02958R849m7744r4763
2124C424794j70314j34494m5211K7091o1650m0131r4499o4317m3203L138n6661
2113B744543K530n4360k4524r7251k1374j2582j238j9412j07196j12131n5133
2102B241872n1375p510Q851n9476K6328J0293j08937r6710O6648j4600r507j0855
2090A995022n2738j82538R3681p7976J1748L5081l1785p6785O9918q5612q2275
2079A615741P0626K5156m8608K0951o7722K5465M1620o7208k7446j7169k2836
$$ plain form
2068 1548570 1533318 1540114 1407013 1305914 1397786 1450835 1391874 1471222 1337459 1329134 1297950
2057 1297950 1196308 1190516 1273994 1313817 1277844 1256758 1240540 1167216 1172036 1159650 1185151 1125757
2045 1125757 1184647 1156794 1133026 1104653 1075602 1064081 1107049 1165142 1150402 1191788 1117507
2034 1117507 990768 910578 931462 1038667 1074784 997989 934659 921178 862427 746850 803996
2023 803996 833111 897446 961327 968552 881571 901018 932280 909287 909037 959353 846323 804174
2011 804174 884556 842511 803404 915769 954506 840555 861712 823845 798184 843902 833834
2000 833834 791816 739005 826087 872789 828023 817185 858284 854984 862002 787321 750423 822693
1988 822693 787375 802467 826181 803411 864444 880125 805369 766788 737210 752594 766175 778127
$$ packed form
2068A548570j5252O796j33101j01099R1872N3049n8961P9348j33763q325l1184
2057A297950j01642n792Q3478L9823l5973k1086j6218p3324M820j2386K5501n9394
2045A125757N8890k7853k3768k8373k9051j1521M2968N8093j4740M1386p4281
2034A117507j26739q0190K0884J07205L6117p6795o3330j3481n8751j15577N7146
2023H03996K9115O4335O3881P225q6981J9447L1262k2993k50N0316j13030m2149
2011H04174Q0382m2045l9107J12365L8737j13951K1157l7867k5661M5718j0068
2000H33834m2018n2811Q7082M6702m4766j0838M1099l300P018p4681l6898P2270
1988H22693l5318J5092K3714k2770O1033J5681p4756l8581k9578J5384J3581J1952
$$ plain form
1976 778127 726897 715478 771835 725028 667236 678193 705626 672405 665984 721538 693953 669025
1964 669025 788818 779747 689308 712166 742436 767328 749149 720082 678541 783480 798559
1953 798559 730952 701732 693532 693300 708363 742306 706320 706047 680787 674931 706128 718445 744629
1940 744629 733345 680480 688363 734376 712875 652255 693053 808080 828668 887703 886011 846346
1928 846346 833871 868578 811929 765687 806629 800226 819194 853325 849795 751867 786508 919188
1916 919188 886181 955270 1006896 982961 946333 972035 985156 948215 972858 977067 972589 957686
1904 957686 978316 978074 970897 975637 1031632 976162 1037433 1016713 1021165 1059123 1099250 1114063 1123504
1891 1123504 1167811 1144467 1100408 1018253 1074162 1152736 1150447 1186070 1254252 1274842 1329076 1286639
$$ packed form
1976G78127n1230j1419N6357m6807n7792J0957K7433l3221o421N5554k7585k4928
1964F69025J19793r071r0439K2858L0270K4892j8179k9067m1541J04939J5079
1953G98559o7607k9220q200k32J5063L3943l5986k73k5260n856L1197J2317K6184
1940G44629j1284n2865P883M6013k1501o0620M0798J15027K0588N9035j692l9665
1928H46346j2475L4707n6649m6242M0942o403J8968L4131l530r7928L4641J32680
1916I19188l3007O9089N1626k3935l6628K5702J3121l6941K4643M209m478j4903
1904I57686K0630k42p177M740N5995n5470O1271k0720M452L7958M0127J4813R441
1891A123504M4307k3344m4059q2155N5909P8574k289L5623O8182K0590N4234m2437
$$ plain form
1879 1286639 1270943 1289185 1347102 1406148 1424468 1501067 1529834 1474071 1447989 1481911 1555346
1868 1555346 1621643 1658042 1635988 1714416 1739226 1717445 1792102 1837511 1880307 1893078 1910231
1857 1910231 1990285 2059356 2062728 2053873 2085826 2151480 2126128 2117562 2076851 2097621 2149780 2179234
1845 2179234 2219827 2346408 2364634 2370648 2519808 2577112 2639878 2693931 2830946 2897824 2935710
1834 2935710 2991031 3065657 3257124 3405355 3515632 3619322 3647195 3667791 3629832 3461091
1824 3461091 3335678 3224137 3101961 3030274 2916526 2810314 2810828 2830657 2832958 2872867 2889702
1813 2889702 2891655 2904447 2883416 2877618 2866043 2893818 2904968 2884547 2845709 2903971 2928347 2905782
1801 2905782 2963231 2982311 3017571 3028747 2969362 2838702 2758956 2748685 2672283 2591812 2475000
$$ packed form
1879A286639j5696J8242N7917N9046J8320P6599K8767n5763k6082L3922P3435
1868A555346O6297L6399k2054P8428K4810k1781P4657M5409M2796J2771J7153
1857A910231Q0054O9071L372q855L1953O5654k5352q566m0711K0770N2159K9454
1845B179234M0593J26581J8226O014J49160N7304O2766N4053J37015O6878L7886
1834B935710N5321P4626J91467J48231J10277J03690K7873K0596l7959j68741
1824C461091j25413j11541j22176p1687j13748j06212N14J9829K301L9909J6835
1813B889702J953J2792k1031n798j1575K7775J1150k0421l8838N8262K4376k2565
1801B905782N7449J9080L5260J1176n9385j30660p9746j0271p6402q0471j16812
$$ plain form
1790 2475000 2449411 2399622 2321007 2323889 2277005 2252478 2179942 2087149 2031461 1972947 1911371 1895472
1778 1895472 1914462 1896764 1858180 1747594 1651365 1648622 1538479 1535527 1578666 1482357 1377164
1767 1377164 1336429 1301682 1206760 1152595 1164532 1082488 1122364 1141746 1026743 975385 985887
1756 985887 980874 1020582 969940 942185 931805 904254 801269 755590 818940 806188 872288 880832
1744 880832 784678 782997 804373 794478 754270 701186 658747 652094 702892 596801 529592 566225
1732 566225 551846 551298 492387 360823 401155 425714 520471 491956 471445 474020 485448 465931
1720 465931 472143 438626 478262 433587 327984 326443 368054 398477 336120 362564 363343 335652
1708 335652 297415 285088 310953 279307 265046 334601 328986 271072 248705 277029 249734 168203
$$ packed form
1790B475000k5589m9789p8615K882m6884k4527p2536r2793n5688n8514o1576j5899
1778A895472J8990j7698l8584j10586r6229k743j10143k952M3139r6309j05193
1767A377164m0735l4747r4922n4165J1937q2044L9876J9382j15003n1358J0502
1756I85887n013L9708n0642k7755j0380k7551j02985m5679O3350j2752O6100Q544
1744H80832r6154j681K1376r895m0208n3084m2439o653N0798j06091o7209L6633
1732E66225j4379n48n8911j31564M0332K4559R4757k8515k0511K575J1428j9517
1720D65931O212l3517L9636m4675j05603j541M1611L0423o2357K6444P79k7691
1708C35652l8237j2327K5865l1646j4261O9555n615n7914k2367K8324k7295q1531
$$ plain form
1696 168203 206192 255714 202045 278206 300243 238698 182134 244830 291206 215911 192130 182458
1684 182458 145231 208668 242547 300124 325912 251099 223424 207199 190365 141165 152631 156839
1672 156839 108950 126240 108999 79081 165140 210292 172017 146229 101123 30376 -9896 12029
1660 12029 76083 112852 125529 103783 64285 44803 149384 147832 100474 37928 71243 84107
1648 84107 63232 62542 62947 16672 -4449 56840 54008 47140 28935 -3448 5140 97258 55665
1635 55665 31505 87276 68174 -20788 -38126 -45911 -30037 -46473 10745 -49093 -46328 -80511
1623 -80511 -41762 -15710 15728 -29615 -18749 3519 -58011 -97412 -4849 -24170 -53788 -54377
1611 -54377 -65523 -51659 -14117 -30980 -38056 61622 61227 -23197 -69106 -17650 -38399 61567
$$ packed form
1696A68203L7989M9522n3669P6161K2037o1545n6564O2696M6376p5295k3781r672
1684A82458l7227O3437L3879N7577K5788p4813k7675j6225j6834m9200J1466M208
1672A56839m7889J7290j7241k9918Q6059M5152l8275k5788m5106p0747m0272K1925
1660A2029O4054L6769J2677k1746l9498j9482J04581j552m7358o2546L3315J2864
1648H4107k0875o90M05m6275k1121O1289k832o868j8205l2383Q588R2118m1593
1635E5665k4160N5771j9102q8962j7338p785J5874j6436N7218n9838K765l4183
1623h0511L8749K6052L1438m5343J0866K2268o1530l9401R2563j9321k9618n89
1611e4377j1146J3864L7542j6863p076R9678l95q4424m5909N1456k0749R9966
$$ plain form
1599 61567 54539 21112 4243 31657 79353 90301 49231 65457 67567 53687 25644 77379
1587 77379 19998 -42225 -38029 33193 9526 -10737 -13957 -29040 -35501 -74432 -102278 -65525
1575 -65525 -15382 -16134 -43008 -30349 -28750 -26778 62207 13030 -36223 47636 71617 30009 -8901
1562 -8901 -3887 3245 38059 1670 -22439 57722 221 -44468 -47126 -54700 -50933 -67948 -146812
1549 -146812 -122082 -39285 -45327 -38570 4156 -12489 -18412 31240 22149 9209 -27208 68477
1537 68477 54924 -34884 -74602 -73599 -77518 -42674 -28615 -59503 -71527 -65787 -69072 -15980 44070
1524 44070 21803 44771 -5719 -46191 -16301 8524 -35458 -79197 -30278 -57828 -28317 42377
1512 42377 8202 22197 14972 -36171 -75807 -35372 -48133 -84627 -6017 4595 56952 65004
$$ packed form
1599F1567p028l3427j6869K7414M7696J0948m1070J6226K110j3880k8043N1735
1587G7379n7381o2223M196P1222k3667k0263l220j5083o461l8931k7846L6753
1575f5525N0143p52k6874J2659J599J972Q8985m9177m9253Q3859K3981m1608l8910
1562h901N014P132L4814l6389k4109Q0161n7501m4689k658p574L767j7015p8864
1549a46812K4730Q2797o042O757M2726j6645n923M9652r091j2940l6417R5685
1537F8477j3553q9808l9718J003l919L4844J4059l0888j2024N740l285N3092O0050
1524D4070k2267K2968n0490m0472K9890K4825m3982m3739M8919k7550K9511P0694
1512D2377l4175J3995p225n1143l9636M0435j2761l6494P8610J0612N2357Q052
$$ plain form
1500 65004 8011 -29449 -26923 58428 -35105 -95212 -72272 -63584 -35958 -34307 -119802 -71386
1488 -71386 10578 193 -32594 -12421 -8363 -40854 -24692 -57834 -113682 -22409 13227 -22619
1476 -22619 -55395 -77719 -141480 -140510 -135053 -99193 -57519 -44026 -21206 34601 -14494 -55295
1464 -55295 -90361 -57944 -65649 -62863 -74218 -113229 -115845 -83936 -51745 -75484 -58695 -115158
1452 -115158 -168484 -127863 -61374 -143340 -93009 -84975 -48576 -52484 -49874 -77876 -7151 -64346
1440 -64346 -103693 -47184 2222 426 17456 -12700 -24285 12744 29580 -39223 -80848 -129831
1428 -129831 -114739 -43224 -84818 -157575 -102749 -21421 -145430 -150124 -102586 -108041 -104566 17630
1416 17630 -41911 -37955 -47334 -42522 -143108 -87260 -105759 -134042 -93123 -70844 -147228 -123132
$$ packed form
1500F5004n6993l7460K526Q5351r3533o0107K2940Q688K7626J651q5495M8416
1488g1386Q1964j0385l2787K0173M058l2491J6162l3142n5848R1273L5636l5846
1476b2619l2776k2324o3761R70N457L5860M1674J3493K2820N5807m9095m0801
1464e5295l5066L2417p705K786j1355l9011k616L1909L2191k3739J6789n6463
1452a15158n3326M0621O6489q1966N0331Q034L6399l908K610k8002P0725n7195
1440f4346l9347N6509M9406j796J7030l0156j1585L7029J6836o8803m1625m8983
1428a29831J5092P1515m1594p2757N4826Q1328j24009m694M7538n455L475J22196
1416A7630n9541L956r379M812j00586N5848j8499k8283M0919K2279p6384K4096
$$ plain form
1404 -123132 -4041 1643 620 923 -37734 -44907 -101587 -82520 -54314 -64068 -50987 -75289 -64424
1391 -64424 -74482 -81393 -132569 -92256 -142865 -72545 -97259 -128965 -95774 -13255 -20702 -1583
1379 -1583 -22405 -81169 -43674 -82275 -188336 -125576 -91247 -90397 -38636 -7462 -116196 -79499
1367 -79499 -12731 -28580 -86550 -42297 -45024 -111866 -85549 -149928 -145128 -72952 -34897 -85008
1355 -85008 -94496 -139664 -127339 -99855 -78369 -93893 -7289 -12687 -58154 -156901 -147641 -81535
1343 -81535 -82701 -130220 -115088 -73458 -51789 -68611 -91770 -58050 -74955 -127585 18953 -73148
1331 -73148 -117604 -23029 -71018 -59596 -8823 -58665 -108202 14979 -76409 -79520 -52789 -68181
1319 -68181 -94141 -50901 -87268 -75008 -46853 -96709 -165928 -123184 -87476 -90163 -127887 -57472
$$ packed form
1404a23132J19091N684j023L03l8657p173n6680J9067K8206r754J3081k4302J0865
1391f4424j0058o911n1176M0313n0609P0320k4714l1706L3191Q2519p447J9119
1379a583k0822n8764L7495l8601j06061O2760L4329Q50N1761L1174j08734L6697
1367g9499O6768j5849n7970M4253k727o6842K6317o4379M800P2176L8055n0111
1355h5008r488m5168J2325K7484K1486j5524Q6604n398m5467r8747R260O6106
1343h1535j166m7519J5132M1630K1669j6822k3159L3720j6905n2630J46538r2101
1331g3148m4456R4575m7989J1422N0773m9842m9537J23181r1388l111K6731j5392
1319f8181k5960M3240l6367J2260K8155m9856o9219M2744L5708k687l7724P0415
$$ plain form
1307 -57472 -100078 -72309 -29604 -62962 -39625 -31817 -122561 -78941 -95700 -130307 -77951 -70423
1295 -70423 -108888 -120106 -51954 -87705 -112688 -33107 -53987 -84018 -22599 -129290 -115838 -33425
1283 -33425 -7658 -102565 -93592 -63173 -68064 -70088 -30978 -71648 -48095 -25180 6944 -4963
1271 -4963 34178 50207 69373 47732 32170 81397 91177 92209 89424 119159 118283 115665 123750
1258 123750 86102 49491 54015 3812 -82631 -9711 23315 -2681 -15367 -83716 -57826 -1079
1246 -1079 -23262 -99824 -86438 -41674 -41293 -83915 -67480 -68273 -58752 -101 -45787 -118376 -45192
1233 -45192 27726 -32272 -60619 -88980 -85177 -15518 -34718 -95371 -56061 -29828 -55190 1286
1221 1286 -69020 -70470 -41532 -63086 -77042 -19222 2246 -7140 -11343 -93933 -124782 -84407 -21267
$$ packed form
1307e7472m2606K7769M2705l3358K3337P808r0744M3620j6759l4607N2356P528
1295g0423l8465j1218O8152l5751k4983P9581k0880l0031O1419j06691J3452Q2413
1283c3425K5767r4907Q973L0419m891k024L9110m0670K3553K2915L2124j1907
1271d963L9141J6029J9166k1641j5562M9227R780J032k785K9735q76k618Q085
1258A23750l7648l6611M524n0203q6443P2920L3026k5996j2686o8349K5890N6747
1246a079k2183p6562J3386M4764L81m2622J6435p93R521N8651m5686p2589P3184
1233d5192P2918n9998k8347k8361L803O9659j9200o0653L9310K6233k5362N6476
1221A286p0306j450K8938k1554j3956N7820K1468r386m203q2590l0849M0375O3140
$$ plain form
1208 -21267 -72346 -63613 10527 37035 -39638 20656 -141 13419 88951 55834 11623 13244
1196 13244 -5230 27021 9684 -21666 -6219 -421 -24006 3681 -10543 -36549 -22017 -63594
1184 -63594 -16356 24174 37450 -16714 -76791 -61747 -27147 -37799 -10769 -39359 -60794 -2352
1172 -2352 55518 32709 65249 117163 75901 -2116 -15487 -24547 20270 98547 158088 63537
1160 63537 -29084 -51475 -41549 -29790 -2949 -47396 -33931 -47628 -70305 31613 111691 58207
1148 58207 61890 53572 -32703 -30949 -56245 -50793 -24693 85991 101747 57940 19874 -802
1136 -802 -26537 -24479 20920 37680 96244 117358 29914 82848 133425 109638 109048 122573 78052
1123 78052 90524 93324 40870 124006 124533 147566 183923 167959 150408 156726 150069 130364 24305
$$ packed form
1208b1267n1079Q733P4140K6508p6673O0294k0797J3560P5532l3117m4211J621
1196A3244j8474L2251j7337l1350J5447N798k3585K7687j4224k6006J4532m1577
1184f3594M7238M0530J3276n4164o0077J5044L4600j0652K7030k8590k1435N8442
1172b352N7870k2809L2540N1914m1262p8017j3371r060M4817P8277N9541r4551
1160F3537r2621k2391R926J1759K6841m4447J3465j3697k2677J01918Q0078n3484
1148E8207L683q318q6275J754k5296N452K6100J10684J5756m3807l8066k0676
1136h02k5735K058M5399J6760N8564K1114q7444N2934N0577k3787n90J3525m4521
1123G8052J2472K800n2454Q3136N27K3033L6357j5964j7551O318o657j9705j06059
$$ plain form
1110 24305 59843 33106 -7338 -19192 32918 84557 139053 190511 190471 178747 194772 175221
1098 175221 173331 169807 226441 326085 303810 235677 227017 191637 144618 221347 326383 331194
1086 331194 303682 285566 227876 192510 257623 297178 288049 337398 325461 226777 273779 304596
1074 304596 234787 290935 293856 308538 274252 274838 267855 388456 311091 360926 389835 422653
1062 422653 450313 470190 460539 562100 638624 692312 565681 595840 646032 595019 529648
1051 529648 539350 598316 673957 708239 644883 643600 724942 707536 715144 765370 719857 754099
1039 754099 785530 755355 776768 833846 898954 1011542 973216 973092 984106 1124269 1173109 1226728
1027 1226728 1222318 1275000 1288369 1256304 1220816 1218789 1323437 1415013 1381040 1450845 1540812 1537949
$$ packed form
1110B4305L5538k6737m0444j1854N2110N1639N4496N1458m0j1724J6025j9551
1098A75221j890l524N6634R9644k2275o8133q660l5380m7019P6729J05036M811
1086C31194k7512j8116n7690l5366O5113L9555r129M9349j1937r8684M7002L0817
1074C04596o9809N6148K921J4682l4286N86o983J20601p7365M9835K8909L2818
1062D22653K7660J9877r651J01561P6524N3688j26631L0159N0192n1013o5371
1051E29648R702N8966P5641L4282o3356j283Q1342j7406P608N0226m5513L4242
1039G54099L1431l0175K1413N7078O5108J12588l8326j24J1014J40163M8840N3619
1027A226728m410N2682J3369l2065l5488k027J04648R1576l3973O9805Q9967k863
$$ plain form
1015 1537949 1605795 1728842 1776254 1875858 2022095 2038798 2034844 2224126 2360719 2446639 2589281
1004 2589281 2729082 2907764 3190189 3400550 3559296 3929861 4249487 4556516 5019750 5291593
994 5291593 5466191 5745591 6121090 6714131 7576398 8667614 9995273 11498676 13150253
985 13150253 15223945 18047347 21628588 26631645 32866619 38369749 37169242 30229056
977 30229056 23693000 18944457 15926487 13740897 11942224 10527418 9324319 8365087
969 8365087 7615328 7010252 6486716 6055724 5817341 5546598 5095517 4613715 4207888 3858194
959 3858194 3531193 3339974 3195854 2900906 2705930 2597610 2459064 2332217 2207376 2084038
949 2084038 1943574 1830852 1764580 1681537 1549616 1513295 1466912 1333541 1277166 1256248 1184474
$$ packed form
1015A537949O7846J23047M7412R9604J46237J6703l954J89282J36593Q5920J42642
1004B589281J39801J78682K82425K10361J58746L70565L19626L07029M63234K71843
994E291593J74598K79400L75499N93041Q62267J091216J327659J503403J651577
985A3150253K073692K823402L581241N003057O234974N503130j200507o940186
977C0229056o536056m748543l017970k185590j798673j414806j203099r59232
969H365087p49759o05076n23536m30992k38383k70743m51081m81802m05827l49694
959C858194l27001j91219j44120k94948j94976j08320j38546j26847j24841j23338
949B084038j40464j12722o6272q3043j31921l6321m6383j33371n6375k0918p1774
$$ plain form
938 1184474 1113217 1100763 918722 933396 952339 916627 884880 871786 742184 754069 801851
927 801851 832187 705898 679587 663597 647360 655182 712988 611798 564721 550635 554477 487704
915 487704 530339 512118 523070 496849 523450 583319 514475 469949 520474 555678 495732 489384
903 489384 468091 492505 443096 427018 346673 385575 426646 484218 411127 448133 402257 348248
891 348248 376826 308336 273133 299655 246155 265414 240539 229951 203772 262563 188506 165416
879 165416 192927 233486 180776 167454 203317 186887 112013 120170 143842 153602 159941 130776
867 130776 137589 123351 188580 156463 159679 113115 131159 142282 160668 104445 103071 8648
855 8648 39741 55884 109282 75690 109501 97974 128469 93709 112706 54660 45589 85312
$$ packed form
938A184474p1257j2454j82041J4674J8943l5712l1747j3094j29602J1885M7782
927H01851L0336j26289k6311j5990j6237P822N7806j01190m7077j4086L842o6773
915D87704M2635j8221J0952k6221K6601N9869o8844m4526N0525L5204n9946o348
903D89384k1293K4414m9409j6078q0345L8902M1071N7572p3091L7006m5876n4009
891C48248K8578o8490l5203K6522n3500J9259k4875j0588k6179N8791p4057k3090
879A65416K7511M0559n2710j3322L5863j6430p4874Q157K3672R760O339k9165
867A30776O813j4238O5229l2117L216m6564J8044J1123J8386n6223j374r4423
855H648L1093J6143N3398l3592L3811j1527L0495l4760J8997n8046r071L9723
$$ plain form
843 85312 -9513 -40564 27919 107322 64305 117021 77777 19820 22942 31046 -5925 97520
831 97520 29601 49917 102623 146688 70651 67585 25833 103122 66521 65518 50699 78313
819 78313 75980 6064 -1113 69377 9408 94223 91804 27354 33666 86736 34478 119148 85402
806 85402 21941 24863 71830 48416 -42208 2227 -47083 -55302 6969 45441 -3389 49681
794 49681 65767 55917 -8303 68644 91742 76266 38676 26732 -24627 11137 -54557 34895
782 34895 63373 103516 100599 88156 52464 -11605 -17064 63778 107232 112513 98827 113470 72146
769 72146 48239 3623 10090 45705 36396 56290 62608 -40605 -9119 36953 -19037 -4379
757 -4379 11202 12927 12095 -10110 -59372 -59747 -90108 -11556 -5279 26935 -27057 -50870 -40128
$$ packed form
843H5312r4825l1051O8483P9403m3017N2716l9244n7957L122Q104l6971J03445
831I7520o7919K0316N2706M4065p6037l066m1752P7289l6601j003j4819K7614
819G8313k333o9916p177P0490n9969Q4815k419o4450O312N3070n2258Q4670l3746
806H5402o3461K922M6967k3414r0624M4435m9310q219O2271L8472m8830N3070
794D9681J6086r850o4220P6947K3098j5476l7590j1944n1359L5764o5694Q9452
782C4895K8478M0143k917j2443l5692o4069n459Q0842M3454N281j3686J4643m1324
769G2146k3907m4616O467L5615r309J9894O318j03213L1486M6072n5990J4658
757d379J5581J725q32k2205m9262l75l0361P8552O277L2214n3992k3813J0742
$$ plain form
744 -40128 -101934 -129426 -42499 -5365 58090 102093 54426 -36243 -10497 24120 -3503 61515
732 61515 2313 -100172 -55240 45753 69703 102695 -3910 -6023 6285 44794 37239 42709
720 42709 20534 47806 73842 31904 -28346 -42616 25156 40908 -33407 86731 72846 37662
708 37662 59694 22765 -16574 74733 104930 79669 89724 -6718 -20519 14769 61902 28865
696 28865 96333 156717 175523 133230 107316 46547 64636 121929 106698 81201 160042 80580
684 80580 50792 32722 5298 15689 71027 -8003 -62075 21358 40937 51399 61140 26566
672 26566 89467 89635 53153 32383 41384 -7391 -4601 26527 67090 77137 35646 30521 -15321
659 -15321 34683 37939 7688 -68414 -63889 -8615 17853 20924 26699 51418 94345 20764 -92765
$$ packed form
744d0128o1806k7492Q6927L7134O3455M4003m7667r0669K5746L4617k7623O5018
732F1515n9202j02485M4932J00993K3950L2992j06605k113J2308L8509p555N470
720D2709k2175K7272K6036m1938o0250j4270O7772J5752p4315J20138j3885l5184
708C7662K2032l6929l9339R1307L0197k5261J0055r6442j3801L5288M7133l3037
696B8865O7468O0384J8806m2293k5914o0769J8089N7293j5231k5497P8841p9462
684H0580k9788j8070k7424J0391N5338p9030n4072Q3433J9579J0462R741l4574
672B6566O2901J68l6482k0770R001m8775K790L1128M0563J0047m1491n125m5842
659a5321N0004L256l0251p6102M525N5274K6468L071N775K4719M2927p3581j13529
$$ plain form
646 -92765 -143592 -36791 961 981 -17539 -35043 25229 28629 4805 -185 21292 -4413 -352
633 -352 -30888 -80274 -13396 -29426 -75030 -10004 21360 -10308 -50180 -57337 -130845 -51904 43156
620 43156 36343 -29208 4209 12025 4613 44048 41076 -31979 31351 30941 -47758 -16505 51011
607 51011 7671 17486 10350 -33459 41918 20005 -87156 -63421 7612 61505 74730 60861
595 60861 7860 -62463 -52318 -20594 -52594 -56436 -46533 -32846 5409 -44427 9987 106706
583 106706 80249 181 -4241 -50574 -13629 -2280 -43685 -73086 30651 34849 -30121 -76419
571 -76419 -22998 -32252 3221 23952 -8076 -18162 17846 4010 36049 31425 -30762 -29324 -6369
558 -6369 -21867 -70455 -39142 -43637 -38246 16446 92848 71313 58258 43953 4879 9277 24835
$$ packed form
646i2765n0827J06801L7752K0j8520j7504O0272L400k3824m990K1477k5705M061
633c52l0536m9386O6878j6030m5604O5026L1364l1668l9872p157p3508P8941R5060
620D3156o813o5551L3417P816p412L9435k972p3055O3330m10p8699L1253O7516
607E1011m3340R815p136m3809P5377k1913j07161K3735P1033N3893J3225j3869
595F0861n3001p0323J0145L1724l2000l842R903J3687L8255m9836N4414R6719
583A06706k6457q0068m422m6333L6945J1349m1405k9401J03737M198o4970m6298
571g6419N3421r254L5473K0731l2028j0086L6008j3836L2039m624o2187J438K2955
558f369j5498m8588L1313m495N391N4692P6402k1535j3055j4305l9074M398J5558
$$ plain form
545 24835 30065 -3944 -25097 -19512 9558 -24004 -51557 235 26363 -46620 -28692 -37644 -96084
532 -96084 4661 67838 73838 22102 64745 -10558 -63846 5882 34370 81795 38210 44769
520 44769 14340 77412 67544 -22792 -3113 56292 83646 33778 -17020 -23196 -19800 -17212 -60830
507 -60830 7179 -15801 -10291 20734 -43828 -53202 17647 18718 10718 10302 -807 29795 21808
494 21808 9292 11666 85833 52220 -24437 -21532 26109 4963 5529 31161 109853 58148 -8628
481 -8628 -48303 -40276 -24156 3680 -3387 -9140 37180 81125 29917 14102 -78979 -46318 -13698
468 -13698 -43560 -63405 -21306 -34990 -17936 63474 52750 78140 68977 -2142 -16202 16047
456 16047 41679 36560 72539 30754 11900 31996 52181 43840 11576 33841 16326 77986
$$ packed form
545B4835N230l4009k1153N585K9070l3562k7553N1792K6128p2983J7928q952n8440
532i6084J00745O3177O000n1736M2643p5303n3288O9728K8488M7425m3585O559
520D4769l0429O3072r868r0336J9679N9405K7354m9868n0798o176L396K588m3618
507f0830O8009k2980N510L1025o4562r374P0849J071q000m16j1109L0602p987
494B1808j2516K374P4167l3613p6657K905M7641k1146N66K5632P8692n1705o6776
481h628l9675Q027J6120K7836p067n753M6320M3945n1208j5815r3081L2661L2620
468a3698k9862j9845M2099j3684J7054Q1410j0724K5390r163p1119j4060L2249
456A6047K5632n119L5979m1785j8854K0096K0185q341l2264K2265j7515O1660
$$ plain form
444 77986 -2803 -72760 -23469 112950 120709 112122 93891 -18550 7796 51794 4053 -18015
432 -18015 25397 26914 -68216 -113704 -104009 -13617 67745 50532 -4950 -24963 -38125 -63631
420 -63631 26025 20362 -3064 -63230 -27321 31712 -40592 -27759 -49682 814 24402 20062
408 20062 61004 -3885 -58791 -19752 89319 34349 40794 126965 46265 -56660 47781 35698
396 35698 19675 134475 106304 20533 -16680 14281 -14735 47671 1803 -6107 25865 56345
384 56345 -45984 -67064 34571 116260 13350 -35188 -58081 -96003 -120869 -28546 -18226
373 -18226 24168 21415 -26396 -31647 -7561 75773 149754 157617 83033 52543 -1461 -46485 -23270
360 -23270 50722 45354 56099 43060 46998 23943 1234 2628 43362 6002 26283 38182 52014
$$ packed form
444G7986q0789o9957M9291J36419P759q587j8231j12441K6346M3998m7741k2068
432a8015M3412J517r5130m5488R695R0392Q1362j7213n5482k0013j3162k5506
420f3631Q9656n663k3426o0166L5909N9033p2304J2833k1923N0496K3588m340
408B0062M0942o4889n4906L9039J09071n4970O445Q6171q0700j02925J04441j2083
396C5698j6023J14800k8171q5771l7213L0961k9016O2406m5868p910L1972L0480
384E6345j02329k1080J01635Q1689j02910m8538k2893l7922k4866R2323J0320
373a8226M2394k753m7811n251K4086Q3334P3981P863p4584l0490n4004m5024K3215
360b3270P3992n368J0745j3039L938k3055k2709J394M0734l7360K0281J1899J3832
$$ plain form
347 52014 -20124 -46924 -30422 7395 71148 38517 -43816 -23991 43959 24805 -54013 -7074
335 -7074 105495 92387 16367 -31097 -43565 -20204 8846 -3940 32899 44828 49510 -1175
323 -1175 -5324 -19863 34643 77655 68312 57162 -19267 -62016 -21363 112235 106392 71464 43972
310 43972 32609 -14906 -16926 1849 -5852 60045 133943 85917 36673 43609 -2077 -53791 33512
297 33512 67213 34821 5555 9141 -56028 -49493 -838 37327 59352 2788 -17921 -32558
285 -32558 -70125 -10830 41370 48813 102386 90327 48811 33809 16040 -11406 69771 52114
273 52114 -30412 -49418 -61459 2608 16091 4720 45621 63358 34619 13875 30173 -9682
261 -9682 -30789 -25907 21181 24630 37379 12337 1072 54835 21118 -39243 7347 62450 22417
$$ packed form
347E2014p2138k6800J6502L7817O3753l2631q2333J9825O7950j9154p8818M6939
335g074J12569j3108p6020m7464j2468K3361K9050j2786L6839J1929M682n0685
323a175m149j4539N4506M3012r343j1150p6429m2749M0653J33598n843l4928k7492
310D3972j1363m7515k020J8775p701O5897P3898m8026m9244O936m5686n1714Q7303
297C3512L3701l2392k9266L586o5169O535M8655L8165K2025n6564k0709j4637
285c2558l7567N9295N2200P443N3573j2059m1516j5002j7769k7446Q1177j7657
273E2114q2526j9006j2041O4067J3483j1371M0901J7737k8739k0744J6298l9855
261i682k1107M882M7088L449J2749k5042j1265N3763l3717o0361M6590N5103m0033
$$ plain form
248 22417 31855 -13618 5187 -28775 1543 -33342 -92273 -61443 -53984 1716 -21620 27740
236 27740 1041 -7627 -34261 -5253 -3909 6629 10256 55069 19548 7182 21889 16339 -13007
223 -13007 22969 34485 33912 58312 57892 6385 37025 131535 103172 33034 -40411 -65273 -32223
210 -32223 84280 86950 83970 8744 -67727 -97762 -51820 34863 24134 28133 -14989 -14585 -32046
197 -32046 -46172 -38771 9199 64396 -3100 -37268 28133 -1810 13805 -15503 -72860 -81694
185 -81694 -69698 -23778 -28426 -42830 -33628 50594 38309 49430 45494 20022 10386 5063 -17818
172 -17818 991 40791 97436 48551 13894 16478 39581 -19796 -20949 -5843 -55527 -68447
160 -68447 -4193 -31025 -10372 -20014 8821 11673 13825 -17045 -57812 -41091 -4405 7925 16970
$$ packed form
248B2417R438m5473J8805l3962L0318l4885n8931L0830P459N5700k3336M9360
236B7740k6699q668k6634K9008J344J0538L627M4813l5521j2366J4707n550k9346
223a3007L5976J1516n73K4400m20n1507L0640R4510k8363p0138p3445k4862L3050
210c2223J16503K670k980p5226p6471l0035M5942Q6683j0729L999m3122M04j7461
197c2046j4126P401M7970N5197o7496l4168O5401k9943J5615k9308n7357q834
185h1694J1996M5920m648j4404R202Q4222j2285J1121l936k5472r636n323k2881
172a7818J8809L9800N6645m8885l4657K584K3103n9377j153J5106m9684j2920
160f8447O4254k6832K0653r642K8835K852K152l0870m0767J6721L6686J2330R045
$$ plain form
147 16970 -13311 -8995 20221 4297 60542 39869 72861 95277 101550 30450 25824 -26795 11096
134 11096 25902 53399 12773 15828 37264 16460 -7767 -4537 44214 43102 99164 62496 -22577
121 -22577 -14947 -22574 -37908 -29337 17211 26731 -18189 28575 32570 60571 91204 93703 48482
108 48482 -3692 18300 -22385 -71196 -16690 36697 13843 -18845 -11186 -3028 31342 18388
96 18388 11177 31471 100307 77096 -2254 -29932 19435 59131 7292 7047 -22538 -23839 18264
83 18264 53593 -29180 -55882 -33979 -26901 -5170 -34824 -2972 -3696 -53077 -17819 -33227 -75651
70 -75651 -36520 -33356 -50452 -2079 -47580 -77883 -51347 -82303 -121376 -62225 32491 -38829
58 -38829 -77312 -29297 -20349 -33159 -4047 15982 12474 22084 37580 23029 -32060 -73189 -36542
$$ packed form
147A6970l0281M316K9216j5924N6245k0673L2992K2416O273p1100m626n2619L7891
134A1096J4806K7497m0626L055K1436k0804k4227L230M8751j112N6062l6668q5073
121b2577P630p627j5334Q571M6548R520m4920M6764L995K8001L0633K499m5221
108D8482n2174K1992m0685m8811N4506N3387k2854l2688P659Q158L4370j2954
96A8388p211K0294O8836k3211p9350k7678M9367L9696n1839k45k9585j301M2103
83A8264L5329q2773k6702K1903P078K1731k9654L1852p24m9381L5258j5408m2424
70g5651L9131L164j7096M8373m5501l0303K6536l0956l9073N9151R4716p1320
58c8829l8483M8015Q948j2810K9112K0029l508R610J5496j4551n5089m1129L6647
$$ plain form
45 -36542 16667 -29366 -57266 21820 33992 45824 50221 90022 64722 13201 441 -44562
33 -44562 13258 26469 23487 25110 34281 29335 65790 56300 33689 41405 39729 23489 16821 12982
19 12982 -10792 -47584 -79649 -67510 -60067 1706 -580 -29002 -1263 12104 24324 -2011 -14470
6 -14470 -8424 7754 -3723 -6130 -12426 -26969
0 -26969
$$ packed form
45c6542N3209m6033k7900P9086J2172J1832M397L9801k5300n1521j2760m5003
33d4562N7820J3211k982J623R171m946L6455r490k2611P716j676j6240o668l839
19A2982k3774l6792l2065J2139P443O1773k286k8422K7739J3367J2220k6335j2459
6a4470O046J6178j1477k407o296j4543
0b6969
$$ Imaginary data points
##PAGE= N=2
##DATA TABLE= (X++(I..I)), XYDATA
$$ plain form
16383 -1731297 -1755992 -1802630 -1709080 -1629240 -1623784 -1666979 -1688592 -1660650 -1593253 -1570999 -1536038
16372 -1536038 -1504034 -1495531 -1451760 -1450355 -1393813 -1404714 -1336402 -1249634 -1229687 -1228664 -1199184 -1180960
16360 -1180960 -1173869 -1136124 -1087014 -1117844 -1103912 -1043671 -1008002 -967450 -963810 -903116 -846042 -822757
16348 -822757 -850960 -832486 -778693 -729304 -711116 -667139 -619177 -591268 -578625 -597891 -607246 -523081
16336 -523081 -486247 -413842 -405775 -451168 -433547 -352735 -309408 -275836 -262594 -209319 -146472 -186326
16324 -186326 -161492 -181565 -161694 -85347 -39821 -35624 -60226 -1400 -17219 14682 80883 89251
16312 89251 120678 145181 163542 164091 208031 265966 275445 280748 283338 316029 345646 330875 322771
$$ packed form
16383a731297k4695m6638R3550P9840N456m3195k1613K7942O7397K2254L4961
16372a536038L2004Q503M3771J405N6542j0901O8312Q6768J9947J023K9480J8224
16360a180960P091L7745M9110l0830J3932O0241L5669M0552L640O0694N7074K3285
16348h22757k8203J8474N3793M9389J8188M3977M7962K7909J2643j9266r355Q4165
16336e23081L6834P2405Q067m5393J7621Q0812M3327L3572J3242N3275O2847l9854
16324a86326K4834k0073J9871P6347M5526M197k4602N8826j5819L1901O6201Q368
16312H9251L1427K4503J8361N49M3940N7935R479N303K590L2691K9617j4771q104
$$ [...]
##END NTUPLES=NMR SPECTRUM
##END=
