##TITLE=1H_TG-2310-1
 CDCl3, 8 sc, 
 22.12.2020
##JCAMPDX= 6.0         $$ Bruker NMR JCAMP-DX V2.0
##DATA TYPE= NMR FID
##DATA CLASS= NTUPLES
##ORIGIN= UXNMR, Bruker Analytische Messtechnik GmbH
##OWNER= root
$$ XWIN-NMR		Version 3.5
$$ Tue Dec 22 12:19:47 2020 Russian Standard Time (UT+4h)  she@DPX200
##.OBSERVE FREQUENCY= 200.1315066352
##.OBSERVE NUCLEUS= ^1H
##.DELAY= (6, 6)
##.ACQUISITION MODE= SIMULTANEOUS
##.ACQUISITION SCHEME= undefined
##.AVERAGES= 8
##.DIGITISER RES= 18
##SPECTROMETER/DATA SYSTEM= spect
##.PULSE SEQUENCE= zg30
##.SOLVENT NAME= CDCl3
##.SHIFT REFERENCE= (INTERNAL, CDCl3, 0, 15.7039)
##AUDIT TRAIL= $$ (NUMBER, WHEN, WHO, WHERE, WHAT)
$$ ##TITLE= Audit trail, XWIN-NMR		Version 3.5
$$ ##JCAMPDX= 5.01
$$ ##ORIGIN= Bruker BioSpin GmbH
$$ ##OWNER= she
$$ F:/spectra/data/she/nmr/H-F/1/audita.txt
$$ ##AUDIT TRAIL=  $$ (NUMBER, WHEN, WHO, WHERE, WHAT)
(   1,<2020-12-22 12:18:37.59 +0400>,<she>,<DPX200>,
      <created by zg, POWCHK disabled, PULCHK disabled
       configuration hash MD5:
       00 E9 B6 7A A2 85 ED C7 34 08 36 98 17 FE 4E 26
       data hash MD5: 16K
       BF 05 3D DE 80 33 06 C4 DB ED 14 9D 50 DC A9 01>)
$$ ##END=
$$ 
$$ hash MD5
$$ 9E 7E F4 51 53 79 88 63 29 AB CD 9E DC 03 BA 67
##$RELAX= 
##$RELAX= 
##$RELAX= 
##$RELAX= 
##$RELAX= 
##$RELAX= 
$$ Bruker specific parameters
$$ --------------------------
##$DU= <F:/spectra>
##$EXPNO= 1
##$NAME= <H-F>
##$PROCNO= 1
##$TYPE= <nmr>
##$USER= <she>
##$AMP= (0..31)
100 100 100 100 100 100 100 100 100 100 100 100 100 100 100 100 100 100 
100 100 100 100 100 100 100 100 100 100 100 100 100 100 
##$AQSEQ= 0
##$AQ_mod= 1
##$AUNM= <au_zg>
##$AUTOPOS= <>
##$BF1= 200.13
##$BF2= 200.13
##$BF3= 200.13
##$BF4= 200.13
##$BF5= 200.13
##$BF6= 200.13
##$BF7= 200.13
##$BF8= 200.13
##$BYTORDA= 1
##$CFDGTYP= 0
##$CFRGTYP= 5
##$CHEMSTR= <none>
##$CNST= (0..31)
1 1 145 1 1 1 1 1 1 1 1 1 1 1 1 1 1 1 1 1 1 1 1 1 1 1 1 1 1 1 1 1 
##$CPDPRG= <>
##$CPDPRG1= <>
##$CPDPRG2= <>
##$CPDPRG3= <>
##$CPDPRG4= <mlev>
##$CPDPRG5= <mlev>
##$CPDPRG6= <mlev>
##$CPDPRG7= <mlev>
##$CPDPRG8= <mlev>
##$CPDPRGB= <>
##$CPDPRGT= <>
##$D= (0..31)
0 1.2 0 0 0 0 0 0 0 0.06 0 0.03 0 0 0 0 0.0002 0 0 0 0 0 0 0 0 0 0 0 0 
0 0 0 
##$DATE= 1608625117
##$DBL= (0..7)
120 120 120 120 120 120 120 120 
##$DBP= (0..7)
150 150 150 150 150 150 150 150 
##$DBP07= 0
##$DBPNAM0= <>
##$DBPNAM1= <>
##$DBPNAM2= <>
##$DBPNAM3= <>
##$DBPNAM4= <>
##$DBPNAM5= <>
##$DBPNAM6= <>
##$DBPNAM7= <>
##$DBPOAL= (0..7)
0.5 0.5 0.5 0.5 0.5 0.5 0.5 0.5 
##$DBPOFFS= (0..7)
0 0 0 0 0 0 0 0 
##$DE= 6
##$DECBNUC= <off>
##$DECIM= 32
##$DECNUC= <off>
##$DECSTAT= 4
##$DIGMOD= 1
##$DIGTYP= 9
##$DL= (0..7)
0 120 120 120 120 120 120 120 
##$DP= (0..7)
150 150 150 150 150 150 150 150 
##$DP07= 0
##$DPNAME0= <>
##$DPNAME1= <>
##$DPNAME2= <>
##$DPNAME3= <>
##$DPNAME4= <>
##$DPNAME5= <>
##$DPNAME6= <>
##$DPNAME7= <>
##$DPOAL= (0..7)
0.5 0.5 0.5 0.5 0.5 0.5 0.5 0.5 
##$DPOFFS= (0..7)
0 0 0 0 0 0 0 0 
##$DQDMODE= 0
##$DR= 18
##$DS= 0
##$DSLIST= <SSSSSSSSSSSSSSS>
$$ [...]
##$SUBNAM2= <"">
##$SUBNAM3= <"">
##$SUBNAM4= <"">
##$SUBNAM5= <"">
##$SUBNAM6= <"">
##$SUBNAM7= <"">
##$SUBNAM8= <"">
##$SUBNAM9= <"">
##$SW= 16.9725356469052
##$SWIBOX= (0..15)
0 0 2 0 0 0 0 0 0 0 0 0 0 0 0 0 
##$SW_h= 3396.73913043478
##$TD= 16384
##$TD0= 1
##$TE= 0
##$TE2= 300
##$TE3= 300
##$TEG= 300
##$TL= (0..7)
0 120 120 120 120 120 120 120 
##$TP= (0..7)
150 150 150 150 150 150 150 150 
##$TP07= 0
##$TPNAME0= <>
##$TPNAME1= <>
##$TPNAME2= <>
##$TPNAME3= <>
##$TPNAME4= <>
##$TPNAME5= <>
##$TPNAME6= <>
##$TPNAME7= <>
##$TPOAL= (0..7)
0.5 0.5 0.5 0.5 0.5 0.5 0.5 0.5 
##$TPOFFS= (0..7)
0 0 0 0 0 0 0 0 
##$TUNHIN= 0
##$TUNHOUT= 0
##$TUNXOUT= 0
##$USERA1= <user>
##$USERA2= <user>
##$USERA3= <user>
##$USERA4= <user>
##$USERA5= <user>
##$V9= 5
##$VALIST= <valist>
##$VCLIST= <CCCCCCCCCCCCCCC>
##$VD= 0
##$VDLIST= <DDDDDDDDDDDDDDD>
##$VPLIST= <PPPPPPPPPPPPPPP>
##$VTLIST= <TTTTTTTTTTTTTTT>
##$WBST= 1024
##$WBSW= 4
##$XGAIN= (0..3)
0 0 0 0 
##$XL= 0
##$YL= 0
##$YMAX_a= 47768
##$YMIN_a= -97619
##$ZGOPTNS= <>
##$ZL1= 120
##$ZL2= 120
##$ZL3= 120
##$ZL4= 120
##$ABSF1= 10
##$ABSF2= 0
##$ABSG= 5
##$ABSL= 3
##$ALPHA= 0
##$AQORDER= 0
##$ASSFAC= 0
##$ASSFACI= 0
##$ASSFACX= 0
##$ASSWID= 0
##$AUNMP= <proc_1d>
##$AZFE= 0.1
##$AZFW= 0.1
##$BCFW= 1
##$BC_mod= 2
##$BYTORDP= 1
##$COROFFS= 0
##$CY= 11.3945322036743
##$DATMOD= 1
##$DC= 2
##$DFILT= <>
##$DTYPP= 0
##$F1P= 15.9154993809931
##$F2P= -4.1035820241983
##$FCOR= 0.5
##$FTSIZE= 0
##$FT_mod= 4
##$GAMMA= 1
##$GB= 0.15
##$INTBC= 1
##$INTSCL= 1
##$ISEN= 128
##$LB= 0.24
##$LEV0= 0
##$LPBIN= 0
##$MAXI= 10000
##$MC2= 0
##$MEAN= 0
##$ME_mod= 0
##$MI= 1.114404
##$NCOEF= 0
##$NC_proc= 0
##$NLEV= 6
##$NOISF1= 3.799351
##$NOISF2= 2.8
##$NSP= 1
##$NTH_PI= 0
##$NZP= 0
##$OFFSET= 15.70392
##$PC= 1
##$PHC0= -10919.61
##$PHC1= 9.400951
##$PH_mod= 1
##$PKNL= yes
##$PPARMOD= 0
##$PSCAL= 0
##$PSIGN= 0
##$REVERSE= no
##$SF= 200.130013532006
##$SI= 16384
##$SIGF1= 3
##$SIGF2= 2
##$SINO= 400
##$SIOLD= 16384
##$SREGLST= <1H.CDCl3>
##$SSB= 0
##$STSI= 0
##$STSR= 0
##$SW_p= 3612.71676300578
##$SYMM= 0
##$S_DEV= 0
##$TDeff= 0
##$TDoff= 0
##$TI= <>
##$TILT= no
##$TM1= 0
##$TM2= 0
##$TOPLEV= 0
##$USERP1= <user>
##$USERP2= <user>
##$USERP3= <user>
##$USERP4= <user>
##$USERP5= <user>
##$WDW= 1
##$XDIM= 8192
##$YMAX_p= 0
##$YMIN_p= 0
$$ End of Bruker specific parameters
$$ ---------------------------------
##NTUPLES= NMR FID
##VAR_NAME=  TIME,          FID/REAL,        FID/IMAG
##SYMBOL=    X,             R,               I
##VAR_TYPE=  INDEPENDENT,   DEPENDENT,       DEPENDENT
##VAR_FORM=  AFFN,          ASDF,            ASDF
##VAR_DIM=   8192,          8192,            8192
##UNITS=     SECONDS,       ARBITRARY UNITS, ARBITRARY UNITS
##FACTOR=    0.0002944,     1,               1
##FIRST=     0,             0,               0
##LAST=      2.4114304,     0,               0
##MIN=       0,             -97619,          0
##MAX=       2.4114304,     47768,           0
$$ Real data points
##PAGE= N=1
##DATA TABLE= (X++(R..R)), XYDATA
$$ [...]
$$ plain form
1523 463 -3057 -77 -302 -3015 7 1269 -1664 -1378 1777 -1121 -1531 575 -1798 -1860 2016 1618 -2514
1540 -2514 348 942 -1990 -258 1645 -1145 -1159 3010 226 -1308 1028 -106 -2233 1217 2521 -1637
1556 -1637 330 1725 -1257 -950 1976 -1049 -2492 2708 1369 -1831 73 826 -2677 -729 2105
1571 2105 -1629 -1307 1405 -219 -2553 364 -438 -3084 -132 603 -1025 -558 -15 -3164 -1275 1268
1587 1268 -2201 -2369 929 135 -2495 639 -522 -3949 -274 1860 -1606 -1644 2184 -1034 -2197 1273
1603 1273 96 -2336 424 2204 -944 686 1452 -1236 -595 2067 645 -176 2569 671 44 2383
1619 2383 1210 -1489 1447 3334 -325 1455 3240 206 -772 2726 1312 -738 2632 1769 -410
1634 -410 1679 2833 -1429 -754 2549 391 219 1909 426 -1474 1695 635 -2289 404 1391 -869
$$ packed form
1523D63l520K980k25k713L022J262k933K86L155k898m10K106k373o2L876l98m132
1540b514K862N94k932J732J903k790j4M169k784j534K336j134k127L450J304m158
1556a637J967J395k982L07K926l025j443N200j339l200J904P53l503J948K834
1571B105l734L22K712j624k334K917q02k646K952P35j628M67N43l149J889K543
1587A268l469j68L298p94k630L134j161l427L675K134l466l8L828l218j163L470
1603A273j177k432K760J780l148J630P66k688O41K662j422q21K745j898o27K339
1619B383j173k699K936J887l659J780J785l034r78L498j414k050L370q63k179
1634d10K089J154m262O75L303k158j72J690j483j900L169j060k924K693R87k260
$$ plain form
1650 -869 -361 1825 -1781 -1961 1047 -847 -1999 628 776 -2445 -189 312 -2299 -1290 288 -1340
1666 -1340 -1159 1705 -1389 -2337 533 -357 -2468 95 1223 -1971 201 1279 -1577 -1506 1416 -516
1682 -516 -1723 2323 938 -1553 462 1741 -1085 -336 1837 -477 496 2095 391 -1317 1636 637
1698 637 -973 1865 1722 -304 917 2267 -1018 -269 2247 217 -576 1913 1212 -1331 1253 986
1714 986 -1776 433 1754 -797 -869 2114 -559 -1747 518 -126 -1362 446 799 -1844 306 762
1730 762 -2132 -1389 765 -815 -1773 1328 -642 -1695 154 -177 -2556 -414 1174 -1661 -746 746
1746 746 -838 -1770 673 -529 -1884 1326 801 -1534 -431 858 -1651 -675 1672 -639 -98 1771
1762 1771 233 -1619 1531 733 -1516 699 1747 -354 202 1896 -181 -157 1116 251 -122 1868
$$ packed form
1650h69N08K186l606j80L008j894j152K627J48l221K256N01k611J009J578j628
1666a340J81K864l094r48K870q90k111K563J128l194K172J078k856P1K922j932
1682e16j207M046j385k491K015J279k826P49K173k314R73J599j704j708K953r99
1698F37j610K838j43k026J221J350l285P49K516k030p93K489p01k543K584k67
1714I86k762K209J321k551p2K983k673j188K265o44j236J808L53k643K150M56
1730G62k894P43K154j580r58L101j970j053J849l31k379K142J588k835R15J492
1746G46j584r32K443j202j355L210n25k335J103J289k509R76K347k311N41J869
1762A771j538j852L150p98k249K215J048k101N56J694k077K4J273q65l73J990
$$ plain form
1778 1868 1732 -1114 1248 1720 -722 42 2074 449 322 3098 163 -799 1815 980 -893 1030
1794 1030 2152 -616 822 1618 -953 -538 1663 339 -1384 1797 1053 -832 128 701 -1506 -107
1810 -107 1369 -1316 -619 1310 -227 -1911 404 -443 -1841 611 440 -1595 -644 649 -1610 -1393
1826 -1393 664 -1314 -1538 581 323 -2177 41 -73 -1787 -288 818 -1200 -914 1233 -1107 -2128
1842 -2128 266 -152 -1372 386 649 -1542 591 860 -1574 -829 913 48 -1025 1548 -90 -794
1858 -794 871 489 -1649 321 2161 -504 -41 1147 0 -695 1391 -90 -1069 1627 1109 -593
1874 -593 113 1080 -1001 -155 1203 -997 -370 1413 175 -1108 676 653 -1818 627 1077 -1066 -436
1891 -436 1151 -1144 -1283 668 -618 -1195 663 559 -1883 11 335 -1525 -763 443 -616 -928 1153
$$ packed form
1778A868j36k846K362M72k442P64K032j625j27K776k935r62K614q35j873J923
1794A030J122k768J438P96k571M15K201j324j723L181p44j885R60N73k207J399
1810a07J476k685O97J929j537j684K315q47j398K452j71k035R51J293k259K17
1826a393K057j978k24K119k58k500K218j14j714J499J106k018K86K147k340j021
1842b128K394m18j220J758K63k191K133K69k434P45J742q65j073K573j638p04
1858g94J665l82k138J970J840k665M63J188j147o95K086j481r79K696n18j702
1874e93P06R67k081Q46J358k200O27J783j238j283J784k3k471K445M50k143O30
1891d36J587k295j39J951j286n77J858j04k442J894L24j860P62J206j059l12K081
$$ plain form
1908 1153 -892 -1460 483 23 -1497 -54 1007 -1125 221 620 -1152 -859 1214 -57 -1301 1314
1924 1314 553 -653 316 692 -1110 179 1663 -571 67 1359 286 -848 1065 448 -883 1264
1940 1264 1005 -433 322 1433 -873 -388 1490 -85 -343 1204 854 -1022 672 551 -1121 320
1956 320 1071 -345 -506 1393 -450 -951 632 18 -698 655 790 -1289 491 774 -1119 -685 986
1973 986 -109 -775 1261 -172 -936 598 528 -1219 124 1513 -593 98 906 -196 -696 1012 219
1990 219 -787 1377 684 -567 341 1104 -736 -131 1388 -273 132 1289 225 -1040 1037 583 -953
2007 -953 608 1028 -47 -314 1210 -534 -577 907 -117 -655 767 985 -973 277 654 -973 -301
2024 -301 778 -584 -704 1349 -448 -1065 360 325 -1347 -206 538 -1129 -58 387 -803 -997 733
$$ packed form
1908A153k045n68J943m60j520J443J061k132J346L99j772K93K073j271j244K615
1924A314p61j206R69L76j802J289J484k234O38J292j073j134J913o17j331K147
1940A264k59j438P55J111k306M85J878j575k58J547l50j876J694j21j672J441
1956C20P51j416j61J899j843n01J583o14p16J353J35k079J780K83j893M34J671
1973I86j095o66K036j433p64J534p0j747J343J389k106O91Q08j102n00J708p93
1990B19j006K164o93j251R08P63j840O05J519j661M05J157j064j265K077m54j536
2007i53J561M20j075k67J524j744m3J484j024n38J422K18j958J250L77j627O72
2024c01J079j362j20K053j797o17J425l5j672J141P44j667J071M45j190j94J730
$$ plain form
2041 733 48 -1072 1002 -144 -810 188 257 -1017 59 855 -646 -158 1056 -283 -1018 621 247
2058 247 -855 597 646 -790 215 682 -716 -471 1300 -284 -390 821 575 -724 540 490 -1071
2075 -1071 356 899 -110 -616 1032 -469 -901 551 62 -931 283 819 -1262 41 493 -1133 -816
2092 -816 472 -296 -955 637 -550 -942 74 -202 -1390 -476 710 -934 -498 186 -1047 -1122 388
2109 388 -470 -1199 658 122 -1211 -707 602 -969 -510 715 -502 -329 605 33 -1028 686 838
2126 838 -687 754 539 60 -53 725 -370 -221 1244 703 -141 1227 1240 -458 618 1262 -297 545
2144 545 1212 285 306 1605 277 -327 1151 1245 -158 490 1457 -73 915 1253 -358 -322 1278 311 -604
2163 -604 1230 616 -507 -27 655 -554 -139 825 -757 -243 564 -160 -881 -43 -237 -1158 504 -84
$$ packed form
2041G33o85j120K074j146o66R98O9j274J076P96j501M88J214j339p35J639l74
2058B47j102J452M9j436J005M67j398K45J771j584j06J211k46j299J264n0j561
2075a071J427N43j009n06J648j501m32J452m89r93J214N36k081J303M52j626L17
2092h16J288p68o59J592j187l92J016k76j188R14J186j644M36O84j233p5J510
2109C88q58p29J857n36j333N04J309j571M59J225j217J73R34n72j061J714J52
2126H38j525J441k15m79j13P78j095J49J465n41q44J368J3j698J076O44j559Q42
2144E45O67r27K1J299j328o04J478R4j403O48R67j530R88L38j611L6J600r67r15
2163f04J834o14j123M80O82j209M15R64j582N14Q07p24p21Q38j94r21J662n88
$$ plain form
2181 -84 -1114 -642 223 -1280 -921 425 -897 -1106 168 -206 -1612 -351 -146 -1218 -329 474 -932
2198 -932 -1155 541 -554 -805 -28 -175 -715 399 487 -998 199 558 -498 -248 606 207 -231 1130
2216 1130 94 -349 636 625 -761 445 1424 -275 243 927 163 -144 1101 285 -596 1175 962 -107
2234 -107 15 825 -394 63 1181 -228 -266 619 248 -872 494 271 -1040 333 512 -347 -595 525
2252 525 -675 -684 491 -264 -701 -13 307 -982 -176 45 -961 -175 108 -576 -692 658 -542 -976 149
2271 149 -86 -945 -16 599 -813 49 681 -410 -771 919 314 -742 355 209 -77 268 470 -89
2289 -89 298 1163 -59 471 1135 349 -175 967 654 -188 1290 877 -13 513 1181 -382 -84 1532 571
2308 571 302 645 756 -632 847 877 -696 299 791 590 -378 888 -98 -585 433 -122 -305 50 180
$$ packed form
2181h4j030M72Q65j503L59J346j322k09J274l74j406J261K05j072Q89Q03j406
2198i32k23J696j095k51P77j47n40J114Q8j485J197L59j056K50Q54l99m38J361
2216A130j036m43R85j1j386J206R79j699N18O84p64l07J245q16q81J771k13j069
2234a07J22Q10j219M57J118j409l8Q85l71j120J366k23j311J373J79q59k48J120
2252E25j200rJ175p55m37O88L20j289Q06K21j006P86K83o84j16J350j200m34J125
2271A49k35q59R29O15j412Q62O32j091l61J690o05j056J097j46k86L45K02n59
2289h9L87Q65j222N30O64p86n24J142l13q42J478m13q90N26O68j563K98J616r61
2308E71k69L43J11j388J479L0j573R95M92k01r68J266r86m87J018n55j83L55J30
$$ plain form
2327 180 -1085 -402 368 -808 -841 339 -162 -848 224 -673 -1205 -346 -417 -1217 -464 290 -1180 -676 -158
2346 -158 -628 -1153 201 -373 -1088 96 -2 -885 -359 269 -962 -481 848 -444 -325 512 259 -686 448
2365 448 694 -332 281 793 435 195 818 -210 286 1201 385 21 816 1126 -139 823 794 -127 451
2384 451 963 205 -19 1331 226 -390 590 441 -261 311 816 -539 -170 532 -218 -661 241 56 -476
2403 -476 263 -357 -845 -228 -22 -1009 -675 102 -1041 -550 -90 -688 -1303 -249 -314 -1075 -83 -460 -1023 -485
2423 -485 308 -1081 -1224 201 -264 -605 -105 -129 -919 80 178 -681 133 366 -63 -350 799 37 -218 550
2443 550 471 28 661 1264 -331 751 681 307 466 710 726 353 1473 616 -247 696 1298 240 562 1377
2463 1377 383 68 877 302 360 1065 575 -135 835 751 -326 159 895 -100 -116 608 16 -348 510 41
$$ packed form
2327A80j265O83P70j176l3J180n01o86J072q97n32Q59p1q00P53P54j470N04N18
2346a58m70n25J354n74p15J184r8q83N26O28j231M81J329j292J19Q37k53r45J134
2365D48K46j026O13N12l58k40O23j028M96R15q16l64P95L10j265R62k9r21N78
2384D51N12p58k24J350j105o16R80j49p02N72N05j355L69P02p50m43R02j85n32
2403d76P39o20m88O17K06r87L34P77j143M91M60n98o15J054o5p61R92l77n63N38
2423d85P93j389j43J425m65l41N00k4p90R99R8q59Q14K33m29k87J149p62k55P68
2443E50p9m43O33O03j595J082p0l74J59K44J6l73J120q57q63R43O02j058L22Q15
2463A377r94l15Q09n75N8P05m90p10R70q4j077M85P36r95j6P24n92l64Q58m69
$$ plain form
2483 41 -918 195 244 -808 133 -35 -575 -497 288 -692 -849 330 -331 -547 -121 56 -784 -56 -190 -1191
2503 -1191 -365 562 -873 -895 189 -134 -793 -288 -293 -274 -125 551 -669 -60 139 -356 -138 503 63 -549
2523 -549 609 406 -85 315 86 -280 152 897 -44 211 759 -22 -308 483 244 -425 805 486 -296
2542 -296 -25 967 119 -347 878 74 -22 350 489 -460 641 388 -577 5 470 -196 -488 205 -363 -390
2562 -390 125 39 -656 -25 189 -975 -286 51 -774 -354 277 -22 -803 121 -617 -635 -129 170 -531 -150
2582 -150 140 -339 -355 159 -375 -414 254 237 -641 203 322 -115 189 449 -253 51 929 33 155 380 628
2603 628 -584 352 728 122 671 412 295 -77 918 -3 -25 558 310 -107 331 171 -679 -191 28 -492
2623 -492 -61 548 -129 -582 477 -289 -585 242 5 -778 -269 166 -696 -218 7 -638 -709 145 -159 -250
$$ packed form
2483D1r59J113M9j052R41j68n40P8P85r80j57J179o61k16M26J77q40P28j34j001
2503a191Q26R27j435k2J084l23o59N05nJ9J49O76j220O09J99m95K18O41m40o12
2523e49J158k03m91M00k29l66M32P45r41K55N48p81k86P91k39o69J230l19p82
2542b96K71R92q48m66J225q04r6L72J39r49J101k53r65N82M65o66k92O93n68k7
2562c90N15q6o95O31K14j164O89L37q25M20O31k99p81R24p38j8N06K99p01L81
2582a50K90m79j6N14n34l9O68j7q78Q44J19m37L04K60p02L04Q78q96J22K25K48
2603F28j212R36L76o06N49k59j17l72R95r21k2N83k48m17M38j60q50M88K19n20
2623d92M31O09o77m53J059p66k96Q27k37p83N09M35q62M78K25o45p1Q54l04r1
$$ plain form
2643 -250 -6 -198 -326 -187 -79 -565 -195 823 -464 -300 202 -33 -649 297 222 -437 532 496 -67 -98
2663 -98 520 -77 -113 716 194 184 461 170 -148 547 491 -58 340 477 132 208 761 -33 -74 782 399 -125
2685 -125 425 508 -296 283 525 -24 -227 505 318 -159 528 46 -426 75 364 -264 -262 294 -390 -98 83
2706 83 -304 -568 134 -50 -593 114 -143 -655 -379 147 -550 -476 122 -611 -360 64 -256 -970 -148 36 -569
2727 -569 -130 -156 -491 -394 252 -563 -619 166 -227 -429 59 191 -667 -108 260 -328 -128 292 -50 -457 465
2748 465 121 -220 136 145 34 269 441 -351 80 466 52 34 394 89 -137 749 192 -270 245 428 -153
2769 -153 130 810 -218 -78 575 415 -106 260 351 -360 400 378 -64 -220 433 26 -153 487 -52 -98 296
2790 296 197 -285 294 250 -551 166 369 165 -163 368 -388 -127 571 -216 -435 -112 829 -331 -211 309
$$ packed form
2643b50K44j92j28J39J08m86L70J018j287J64N02k35o16R46p5o59R69l6n63l1
2663i8O18n97l6Q29n22j0K77k91l18O95n6n49L98J37l45P6N53p94m1Q56l83n24
2685a25N50Q3q04N79K42n49k03P32j87m77O87m82m72N01K89o28KN56o84K92J81
2706H3l87k64P02j84n43P07k57n12K76N26o97P4N98p33K51M24l20p14Q22J84o05
2727e69M39k6l35R7O46q15n6P85l93k02M88J32q58N59L68n88K00M20l42m07R22
2748D65l44l41L56Rj11K35J72p92M31L86m14j8L60l05k26Q86n57m62N15J83n81
2769a53K83O80j028J40O53j60n21L66R1p11P60k2m42j56O53m07j79O40n39m6L94
2790B96r9m82N79m4q01P17K03k04l28N31p56K61O98p87k19L23R41j160J20N20
$$ plain form
2810 309 14 220 568 92 -266 501 129 -212 405 448 -221 160 439 -158 50 228 15 -101 467 264
2830 264 -374 258 69 -55 -37 202 -272 -175 420 -276 -235 16 -175 -650 178 19 -632 -24 -72 -437 -406 161
2852 161 -598 -682 215 -126 -599 -341 34 -571 -241 -41 -503 -250 97 -83 -548 86 -164 -361 61 -26 -197
2873 -197 19 286 -431 85 325 -124 -127 331 253 -375 465 100 -302 184 469 33 498 777 -36 130 437
2894 437 365 -3 344 191 -40 626 454 63 324 605 366 -100 285 -71 81 280 312 -351 267 96 -232
2915 -232 52 180 -161 -408 322 -284 -366 53 -288 -347 -421 245 -523 -573 -12 -541 -547 -93 -362 -615 -56 -299
2937 -299 -425 111 -227 -493 -392 48 -237 -309 -312 -222 -682 -458 36 -742 -255 -164 -89 114 -125 -213 -302 364 -345
2960 -345 -97 244 273 -359 243 348 -136 346 390 59 -2 627 96 -133 576 385 176 282 518 -55 382
$$ packed form
2810C09k95K06L48m76l58P67l72l41O17M3o69L81K79n97K08J78k13j16N68k03
2830B64o38O32j89j24J8K39m74R7N95o96M1K51j91m75Q28j59o51O08m8l65L1N67
2852A61p59q4Q97l41m73K58L75o05L30K00m62K53L47j80m65O34k50j97M22q7j71
2873a97K16K67p17N16K40m49lM58p8o28Q40l65m02M86K85m36M65K79q13J66L07
2894D37p2l68L47j53k31O66j72l91K61K81k39m66L85l56J52J99L2o63O18j71l28
2915b32K84J28l41k47P30o06q2M19l41n9p4O66p68n0N61n29oM54k69k53N59k43
2937b99j26N36l38k66J01M40k85p2lR0m60K24M94p78M87R1P5K03k39q8q9O66p09
2960c45K48L41K9o32O02J05m84M82M4l31o1O29n31k29P09j91k09J06K36n73M37
$$ plain form
2981 382 519 7 290 530 349 -50 570 144 -66 336 247 61 133 365 -216 143 265 -121 -190 204 118
3002 118 -241 206 -127 -357 25 137 -487 -257 340 -352 -320 -44 -201 -461 -46 -86 -586 -1 -3 -361 -375 38
3024 38 -149 -292 27 -271 -108 49 -73 -466 -8 187 -262 97 187 -120 -148 444 -51 -294 291 157 -58
3045 -58 183 436 -310 41 362 33 23 262 127 -153 445 78 -192 195 302 6 -5 363 -295 104 168
3066 168 -83 -221 229 116 -467 195 61 -127 -233 22 -265 -121 254 -360 -337 -4 31 -387 -92 -19 -372
3087 -372 128 4 -287 -295 293 -209 -276 250 -48 -140 43 260 -341 119 295 -96 112 372 202 -136 387
3108 387 187 60 352 300 141 328 548 -41 309 516 175 207 447 411 46 522 266 84 382 485 28
3129 28 82 607 118 150 237 174 -20 266 232 -172 281 265 -53 -133 134 -125 -174 158 -280 -193 -24 -111 -547 -105
$$ packed form
2981C82J37n12K83K40j81l99O20m26k10M02q9j86P2K32n81L59J22l86o9L94q6
3002A18l59M47l33k30L82J12o24K30N97o92L2K76j57k60M15m0n00N85kl58j4M13
3024C8j87j43L19k98J63J57j22l93M58J95m49L59R0l07k8N92m95k43N85j34k15
3045e8K41K53p46L51L21l29j0K39j35k80N98l67k70L87J07k96j1L68o58L99O4
3066A68k51j38M50j13n83O62j34j88j06K55k87J44L75o14K3L33L5m18K95P3l53
3087c72N00j24k91qN88n02o7N26k98r2J83K17o01M60J76l91K08K60j70l38N23
3108C87k00j27K92n2j59J87K20n89L50K07l41L2K40l6l65M76k56j82K98J03m57
3129B8N4N25m89L2Q7o3j94K86l4m04M53j6l18q0K67k59m9L32m38Q7J69q7m36M42
$$ plain form
3153 -105 -1 -463 -212 -143 -320 -462 -75 -447 -536 -104 -244 -508 -348 38 -612 -331 -201 -343 -308 -220 -221 -525
3175 -525 82 -266 -370 -124 -35 -232 -122 189 -287 101 122 -7 -113 328 245 -193 290 172 51 205 378
3196 378 71 158 633 118 182 380 368 60 285 335 164 440 252 95 85 525 217 177 302 -19 62 79 360
3219 360 -210 121 98 -230 5 135 2 -371 128 -237 -223 22 -174 -343 -121 61 -499 -301 -120 -306 -397
3240 -397 -258 -250 -483 -50 -288 -484 -199 -199 -515 -459 -24 -452 -302 -93 -281 -381 -124 -118 -406 67 61 -367 -293
3263 -293 106 -117 -67 170 -303 -44 219 190 -270 177 223 1 169 309 126 -84 459 -59 -40 466 218
3284 218 78 -10 208 -305 64 222 -98 86 336 262 -5 216 71 -58 -70 -40 119 56 266 -269 -40 247
3306 247 -128 -126 58 100 -400 78 59 155 23 150 -172 -139 198 -48 -50 1 160 -373 -141 20 -4 158 -8
$$ packed form
3153a05J04m62K51O9j77j42L87l72q9M32j40k64J60L86o50K81J30j42L5Q8jl04
3175e25O07l48j04K46Q9j97J10L11m76L88K1j29j06M41q3m38M83j18j21J54J73
3196C78l07Q7M75n15O4J98j2l08K25N0j71K76j88j57j0M40l08m0J25l21Q1J7K81
3219C60n70L31k3l28K35J30j33l73M99l65J4K45j96j69K22J82n60J98J81j86r1
3240c97J39Qk33M33k38j96K85%l16N6M35m28J50K09j88j00K57Ok88M73om28P4
3263b93L99k23N0K37m73K59K63k9m60M47M6k22J68J40j83k10N43n18J9N06k48
3284B18j40q8K18n13L69J58l20J84K50p4k67K21j45j29j2L0J59o3K10n35K29K87
3306B47l75KJ84M2n00M78j9R6j32J27l22L3L37k46kN1J59n33K32J61k4J62j66
$$ plain form
3329 -8 -182 -13 328 -323 -78 163 -202 55 -42 107 -75 -203 459 -328 104 145 180 -117 272 -68 -179 153
3351 153 184 6 -161 399 -240 273 57 328 219 281 -155 8 404 -126 -55 16 190 -157 -63 419 -134 -90
3373 -90 28 66 -165 190 105 -170 87 96 -69 -83 270 22 -305 173 -552 -11 266 -371 -202 -156 198 -314
3395 -314 -263 33 -196 -255 272 163 -588 80 -127 -126 -120 301 87 -21 50 -171 38 362 145 -165 263 51
3417 51 -172 220 399 81 -5 341 -74 55 353 116 73 233 515 71 255 366 146 146 358 179 399 301
3439 301 77 77 226 14 31 222 37 -280 179 199 -275 -136 100 146 102 94 218 -40 -154 293 -178 -260 315
3462 315 -467 -115 81 -75 -1 -234 -248 59 111 -322 -119 -12 -428 -345 -13 144 71 -142 78 -257 -544 121
3484 121 152 -126 -52 63 -278 -76 279 14 86 145 -90 -25 230 2 125 475 261 144 -113 300 342 -148
$$ packed form
3329hj74J69L41o51K45K41l65K57r7J49j82j28O62p87M32M1L5k97L89l40j11L32
3351A53L1j78j67N60o39N13k16K71j09O2m36J63L96n30P1P1J74l47R4M82n53M4
3373i0J18L8k31L55q5k75K57Rj65j4L53k48l27M78p25N41K77o37J69M6L54n12
3395c14N1K96k29n9N27j09p51O68k07JOM21k14j08P1k21K09L24k17l10M28k12
3417E1k23L92J79l18q6L46m15J29K98k37m3J60K82m44J84J11k20%K12j79K20r8
3439C01k24%J49k12J7J91j85l17M59K0m74J39K36M6m4qJ24k58j14M47m71q2N75
3462C15p82L52J96j56P4k33j4L07N2m33K03J07m16Q3L32J57p3k13K20l35k87O65
3484A21L1k78P4J15l41K02L55k65P2N9k35O5K55k28J23L50k14j17k57M13M2m90
$$ plain form
3506 -148 322 -163 240 352 209 -106 182 176 -86 45 81 74 -110 302 45 -159 268 110 -44 -98 146 -319
3528 -319 -178 -28 -299 -156 34 -8 -368 -38 -155 -253 -214 -110 -77 -50 -108 -402 -248 -7 -155 -243 -185 -72 -325
3551 -325 -81 -265 -152 -115 -135 -307 -291 -18 -277 -165 -33 -42 -216 -37 50 -256 0 5 -46 -272 142 -61 -127
3574 -127 56 166 -69 -223 185 -92 139 -76 -94 140 372 299 -5 201 60 123 280 -6 -38 119 382
3595 382 -92 31 190 86 12 211 162 -165 199 29 -89 52 193 -19 -144 216 -79 -13 42 -16 -116 73
3617 73 46 -241 -25 13 -13 -101 68 -78 -134 106 -88 -94 -44 49 -145 -3 109 -134 29 40 76 -7 159 -98
3641 -98 -131 236 89 -43 -39 176 7 96 180 73 79 146 201 -97 224 170 -29 42 160 142 10 181 -39 117
3665 117 190 65 -88 82 242 15 94 26 -17 105 172 -92 -97 217 -95 15 42 68 -174 -12 98 -158 6
$$ packed form
3506a48M70m85M03J12j43l15K88ok62J31L6pj84M12k57k04M27j58j54n4K44m65
3528c19J41J50k71J43J90m2l60L30j17r8L9J04L3K7n8k94J54K41j48q8N8J13k53
3551c25K44j84J13L7k0j72J6K73k59J12J32rj74J79Q7l06K56Nn1k26M14k03o6
3574a27J83J10k35j54M08k77K31k15j8K34K32p3l04K06j41O3J57k86l2J57K63
3595C82m74J23J59j04p4J99m9l27L64j70j18J41J41k12j25L60k95O6N5n8j00J89
3617G3k7k87K16L8k6q8J69j46n6K40j94oN0R3j94J42J12k43J63J1L6q3J66k57
3641i8l3L67j47j32MK15j69Q9Q4j07OO7N5k98L21n4j99P1J18j8j32J71k20J56
3665A17P3j25j53J70J60k27P9o8m3J22O7k64nL14l12J10K7K6k42J62J10k56J64
$$ plain form
3688 6 -70 -135 -171 54 -92 -274 19 -77 -83 -54 7 -236 -34 115 -169 -90 -65 7 -71 32 -50 -31 74 -21 -61 65
3714 65 237 -123 -9 173 114 38 64 89 -27 339 129 -15 51 253 188 54 223 17 122 145 123 6 150
3737 150 277 -89 178 151 71 17 143 63 44 213 -111 -26 143 131 -120 -74 110 -89 14 -63 -122 -153 73 -127
3761 -127 -227 -39 -63 -210 -211 43 -226 -203 -96 -240 -142 -83 -88 -423 -5 -41 -215 -179 -126 -125 -158 32 -244 -185 -7
3786 -7 -41 -195 -61 61 -140 27 -61 -29 22 86 -58 -21 216 -70 5 57 135 9 154 147 -72 184 157 26 -55
3811 -55 240 170 -48 170 73 70 52 132 -78 72 181 -83 58 -8 85 -85 47 -8 -75 0 -61 -145 -94 108 -161
3836 -161 -116 -32 -22 -125 -113 -61 -268 24 -75 -178 -127 9 -99 -237 15 -218 -106 -77 -89 -143 0 33 -233 -19
3860 -19 16 -2 -88 29 -22 -45 191 -50 -64 -8 186 -14 4 94 -7 129 127 58 29 139 48 -33 266 57 18 26
$$ packed form
3688Fp6o5l6K25j46j82K93r6oK9O1k43K02J49k84P9K5P2p8J03q2J9J05r5m0J26
3714F5J72l60J14J82n9p6K6K5j16L66k10j44O6K02o5j34J69k06J05K3k2j17J44
3737A50J27l66K67k7q0n4J26q0j9J69l24Q5J69j2k51M6J84j99J03p7n9l1K26k00
3761a27j00J88k4j47jK54k69K3J07j44R8N9nl35M18l6j74L6N3Jl3J90k76N9J78
3786gl4j54J34J22k01J67q8L2N1O4j44L7K37k86P5N2P8j26J45pk19K56k7j31q1
3811e5K95p0k18K18r7lj8Q0k10J50J09k64J41o6R3j70J32n5o7P5o1q4N1K02k69
3836a61M5Q4J0j03J2N2k07K92r9j03N1J36j08j38K52k33J12K9j2n4J43L3k66K14
3860a9L5j8q6J17n1k3K36k41j4N6J94k00J8R0j01J36ko9k9J10r1q1K99k09l9Q
$$ plain form
3886 26 157 69 93 120 -11 86 145 114 -178 133 131 28 77 76 8 -70 155 -135 -11 63 36 -99 1 41 -143 51
3912 51 -59 -88 67 90 -95 -205 127 -16 -34 -60 -88 -93 27 41 -134 0 26 -46 -142 157 -11 -137 108 28
3936 28 63 -42 -1 -114 60 130 -108 -36 15 154 -33 118 58 -18 153 68 -1 9 209 -39 70 138 47 86 27
3961 27 44 -77 203 63 -103 2 165 61 -65 16 -57 85 15 -38 -63 14 83 -139 66 -37 -80 -75 72 -50
3985 -50 -83 90 -118 -4 -42 13 -177 -83 63 -121 -56 -54 -52 -172 28 -57 -131 -19 -51 -21 -95 4 -102 49 -23 -128
4011 -128 -17 102 77 -179 89 101 25 -5 -16 -10 69 131 -100 6 200 113 13 5 160 -8 83 70 108 70 186
4036 186 61 67 240 71 116 95 141 11 73 183 -31 122 131 70 -48 67 35 -51 60 -51 -14 -16 17 -183 -76
4061 -76 40 -141 -113 -92 -21 -195 -38 -153 -161 18 -168 -214 -163 121 -215 -183 -74 -96 -100 -143 -25 -154 30 -51 -99
$$ packed form
3886B6J31q8K4K7j31R7N9l1k92L11kj03M9jo8p8K25k90J24P4k7j35J00M0j84J94
3912E1j10k9J55K3j85j10L32j43j8k6k8nJ20J4j75J34K6p2r6K99j68j26K45q0
3936B8L5j05M1j13J74P0k38P2N1J39j87J51o0p6J71q5o9J0K00k48J09O8r1L9n9
3961B7J7j21K80j40j66J05J63j04j26Q1p3J42p0n3k5P7O9k22K05j03m3NJ47j22
3985e0l3J73k08J14l8N5j90R4J46j84O5KKj20K00q5p4J12l2L0p4R9j06J51p2j05
4011a28J11J19k5k56K68J2p6l0j1OP9O2k31J06J94q7j00qJ55j68R1j3L8l8J16
4036A86j25OJ73j69M5k1M6j30O2J10k14J53Ro1j18J15l2q6J11j11L7kL3k00J07
4061g6J16j81K8K1P1j74J57j15qJ79j86m6N1K84l36L2J09k2mm3J18j29J84q1m8
$$ plain form
4086 -99 12 -29 32 -86 51 -129 51 86 20 -14 70 176 -4 125 49 79 117 107 67 13 254 43 25 150 275
4111 275 50 -18 135 58 140 33 77 49 139 73 -46 89 -63 41 -38 18 -96 8 43 -71 -21 12 -66 -250
4135 -250 51 -42 -126 -105 -72 -109 -183 4 -193 -191 -106 -114 -143 -190 -119 -226 -54 -205 -120 -76 22 -138 -190 87 -39 -114
4161 -114 -92 44 -27 -43 70 -102 65 75 49 -71 61 77 7 81 16 108 89 85 -22 143 178 -23 164 118 82
4186 82 -24 155 8 0 158 194 55 -56 181 46 24 18 47 75 16 54 -35 118 28 -9 25 -11 59 -71 16 -111
4212 -111 44 -12 -177 -110 36 -1 -208 -28 0 -54 -118 -6 -50 -116 43 17 -64 -101 20 -38 -93 -44 -17 88 -14
4237 -14 -16 -23 177 34 -65 96 28 92 47 112 -23 149 167 32 28 73 192 40 105 13 70 100 18 146 69 166 -24
4264 -24 111 79 4 47 16 102 -35 114 28 -26 42 92 44 -117 76 -25 50 -66 28 -14 -65 66 -149 66 -60
$$ packed form
4086i9J11m1O1j18J37j80J80L5o6l4Q4J06j80J29p6L0L8j0m0n4K41k11j8J25J25
4111B75k25o8J53p7Q2j07M4k8R0o6j19J35j52J04p9N6j14J04L5j14N0L3p8j84
4135b50L01r3q4K1L3l7p4J87j97KQ5qk9m7P1j07J72j51Q5M4R8j60n2K77j26p5
4161a14K2J36p1j6J13j72J67J0k6j20J32J6p0P4o5R2j9mj07J65L5k01J87m6l6
4186H2j06J79j47qJ58L6j39j11K37j35k2oK9K8n9L8q9J53r0l7L4l6P0j30Q7j27
4212a11J55n6j65O7J46l7k07J80K8n4o4J12m4o6J59k6q1l7J21n8n5M9K7J05j02
4237a4kpK00j43r9J61o8O4m5O5j35J72J8j35mM5J19j52O5r2N7L0q2J28p7R7j90
4264b4J35l2p5M3l1Q6j37J49q6n4O8N0m8j61J93j01P5j16R4m2n1J31k15K15j26
$$ plain form
4289 -60 29 -58 -21 23 -75 34 -184 -37 -13 -61 -147 -92 29 -113 -76 -52 43 -121 7 7 -114 24 -5 10 -95 71
4315 71 -13 -5 -36 -70 59 -27 3 -38 59 2 -30 -16 -30 3 -20 90 -62 26 45 17 -43 -29 82 -25 -3 -10 70 -39
4343 -39 -80 -58 -55 41 -130 -62 -29 0 -77 -63 2 -117 11 -56 -60 -102 -25 -43 -179 -38 -51 -37 -115 -35 -54 -55 -41 -154 -84
4372 -84 -72 -32 -118 -92 -54 -14 -31 -92 -30 -60 69 -51 -75 22 -4 -31 -40 83 10 80 9 2 78 36 99 -16 138 101 168
4401 168 49 46 95 125 127 6 187 106 130 75 116 104 104 151 59 106 116 142 0 11 124 76 76 -22 89 80 59 28 19 70
4431 70 31 71 -48 -8 -61 -50 -43 -55 -1 -67 -29 -133 -8 -96 -80 -174 -75 -49 -128 -115 -180 -72 -74 -145 -127 -171 -38 -139
4459 -139 -82 -170 -50 -94 -73 -98 -129 7 -143 -100 -74 21 -47 -62 -31 25 70 -51 12 -19 62 80 23 48 21 184 13
4486 13 108 56 68 97 -9 106 86 126 28 79 -3 86 46 44 83 36 142 -81 4 -20 23 35 -15 27 -42 28 -67 -25 8
$$ packed form
4289f0Q9q7L7M4r8J09k18J47K4m8q6N5J21j42L7K4R5j64J28%j21J38k9J5j05J66
4315G1q4Ql1l4J29q6L0m1R7n7l2J4j4L3k3J10j52Q8J9k8o0J4J11j07K2pQ0j09
4343c9m1K2LR6j71O8L3K9p7J4O5j19J28o7mm2P7j8j36J41j3J4p8Q0j9jJ4j13P0
4372h4J2M0q6K6L8M0j7o1O2l0J29j20k4R7k6k7rJ23p3P0p1pP6m2O3j15J54l7O7
4401A68j19lM9L0Kj21J81q1K4n5M1j2%M7r2M7J0K6j42J1J13m8%r8J11rk1l1rN1
4431G0l9M0j19M0n3J1Pj2N4o6L8j04J25q8J6r4R9K6p9J3o5J08kp1J8m4J33j01
4459a39N7q8J20m4K1k5l1J36j50M3K6R5o8j5L1N6M5j21O3l1Q1J8n7K5k7J63j71
4486A3R5n2J2K9j06J15k0M0r8N1q2Q9m0kL9m7J06k23Q5k4M3J2n0M2o9P0r5M2L3
$$ plain form
4515 8 -12 -4 -80 24 -27 -5 -83 -59 -24 -46 13 -113 3 -43 -5 -57 -64 -93 -51 61 -107 -16 -52 52 -79 -96 64 1
4543 1 66 -78 26 -5 71 -6 33 57 56 63 9 97 71 128 52 33 115 101 123 26 131 115 96 44 42 121 86 67 22 108 52
4574 52 0 -8 -23 75 -18 17 -73 11 8 9 -44 -113 -6 -90 1 -86 -35 -49 -30 -82 -128 -2 -42 -24 -168 -33 -38 -106 -62 -56 21
4605 21 -62 -13 -64 -32 17 -84 -59 -5 48 -53 -33 19 4 37 -7 65 -23 77 53 64 87 81 101 10 145 64 105 37 48
4634 48 102 111 154 26 171 51 178 48 94 85 64 46 2 115 60 117 -3 25 38 33 40 -126 4 -34 -5 -29 -115 -23
4662 -23 -53 -11 -124 -78 -48 -78 -135 -134 -64 -112 -69 -160 -67 -105 -110 -126 -124 -78 -105 -32 -172 -37 -74 -57 -146 -133 -25 -49 -60 -126
4692 -126 -39 -47 -56 -33 -86 -1 -14 16 -44 -41 20 1 25 -11 51 11 52 -20 33 45 9 8 12 100 14 96 57 98 20 58 67 3 151
4725 151 29 80 18 12 57 39 7 10 92 0 -25 17 83 -11 -56 33 -15 42 -32 -31 -79 19 -34 -78 0 -47 32 -84 -50 -60
$$ packed form
4515Hk0Qp6J04n1K2p8K4L5k2N9j26J16m6L8n2pk9M2J12j68R1l6J04j31j7J60o3
4543AO5j44J04l1P6p7L9K4jPn4Q8k6N7p6j9Q2j4K2r7J05j6j9n2kP9l5j9m5Q6n6
4574E2n2qj5R8r3L5r0Q4lJn3o9J07q4R1q7N1j4J9n2m6J26m0J8j44J35no8M4OP7
4605B1q3M9n1L2M9j01K5N4N3j01K0N2j5L3m4P2q8J00k4J1K3oK0r1J35q1M1o8J1
4634D8N4RM3j28J45j20J27j30M6rk1j8m4J13n5N7j20K8J3nPj66J30l8K9k4q6R2
4662b3l0M2j13M6L0l0n7JP0m8M3r1R3l8nj6KM6k7P3j40J35l7J7q9J3J08k4j1o6
4692a26Q7qrK3n3Q5j3L0o0LO1j9K4l6O2m0M1p2N3J2l6jMQ8q6Q2l9M1p8L8Ro4J48
4725A51j22N1o2oM5j8l2LQ2r2k5M2O6r4m5Q9m8N7p4Jm8R8n3m4P8m7P9j16L4j0
$$ plain form
4755 -60 -50 -58 -106 -31 -20 49 -63 -47 -24 -16 45 -36 23 -46 55 -33 24 -23 -22 32 -143 85 39 37 -43 -24 54 15 69 23
4785 23 87 -38 44 30 20 85 9 95 -23 62 83 33 -6 -32 67 -10 23 -17 33 35 35 -5 -51 25 28 39 -2 -13 -31 -32 -45
4816 -45 -83 3 -76 -33 -61 1 -11 -80 -69 -54 -8 -37 -7 -120 -66 -38 -48 6 -94 45 -69 -22 -98 -53 16 -67 -45 -11
4844 -11 46 -26 -1 -50 -7 -12 -12 62 -54 155 62 -48 -72 51 89 -98 4 38 83 12 -21 -29 50 87 -45 114 -18
4871 -18 70 41 30 -12 -12 109 37 2 -29 76 -68 -21 40 -39 -29 -9 -45 -49 0 -144 -86 -82 -91 -41 -118 -44 -50 -21 -56 -109 -63
4902 -63 -18 -9 -125 11 -37 -32 -32 -50 -23 -1 79 -103 -39 -10 82 -64 13 55 77 107 -35 62 11 54 2 -2 118 58 34
4931 34 33 75 78 75 88 -26 173 151 97 -47 59 107 55 28 18 113 21 72 3 46 28 -15 -29 -30 42 -60 88 -53 -77
4960 -77 6 -91 -22 -101 35 -83 -81 -9 -13 -126 -39 -15 -169 -44 -18 -89 -129 -53 -27 -117 -58 -90 -8 -105 -117 -110 -65 -26 -139
$$ packed form
4755f0J0qm8P5J1O9j12J6K3QO1q1N9o9J01q8N7m7JN4j75K28m6kq0J9P8l9N4m6
4785B3O4j25Q2j4j0O5p6Q6j18Q5K1n0l9k6R9p7L3m0N0K%m0m6P6LJ1m1j1j8jj3
4816d5l8Q6p9M3k8O2j2o9J1J5M6k9L0j13N4K8j0N4j00J39j14M7p6M5O9q3K2L4
4844a1N7p2K5m9M3n%P4j16K09r3j10k4J23L8j87J02L4M5p1l3qP9L7j32J59j32
4871a8Q8k9j1m2%J21p2l5l1J05j44M7O1p9J0K0l6mM9j44N8MrN0p7P4oK9l5n3M6
4902f3M5Rj16J36m8N%j8K7K2Q0j82O4K9R2j46P7M2K2L0j42R7n1M3n2mJ20o0k4
4931C4jM2LlJ3j14J99k2n4j44J06M8n2k7j0R5r2N1o9M3j8m3j4jP2j02J48j41k4
4960g7Q3r7O9p9J36j18KP2mj13Q7K4j54J25K6p1m0P6K6r0N9l2Q2r7j2PM5L9j13
$$ plain form
4989 -139 -43 -61 1 -35 44 -5 -73 54 24 -22 -18 130 -56 -20 33 54 87 -9 32 31 102 22 44 102 27 31 -7 32 -50 51
5019 51 19 -65 -5 -1 81 -70 14 13 0 -70 -45 15 -45 0 -146 -4 -22 4 -64 -17 -37 -77 15 -111 -42 -40 41 -11 -108 62
5049 62 21 -31 -59 -39 -60 -17 75 -101 -34 7 79 -68 -9 61 10 51 -36 -17 54 63 -45 13 62 11 63 76 76 16 121
5078 121 -8 -20 87 151 44 -13 102 35 40 -3 45 68 30 76 -7 29 22 27 -35 -59 2 -61 21 -96 -34 -38 -7 -109 -56
5107 -56 66 -100 -98 -67 -20 -133 -124 -61 -92 15 -72 -78 -84 -60 -97 -123 -22 -96 -1 -125 -5 -97 24 -14 -90 -17 2 32
5135 32 -23 52 -50 36 47 -2 5 32 159 16 55 106 75 69 119 55 44 245 87 51 141 130 60 192 120 117 181 120 117
5164 117 106 159 44 -69 140 108 36 45 102 30 43 31 -32 55 -49 -33 -56 23 -103 -97 -8 -69 -62 -80 16 -146 -87 -42
5192 -42 -52 -110 -123 -57 -174 -60 -88 -88 -90 -42 -98 -145 -18 -75 -80 -47 -102 -17 -76 -45 -175 17 16 -81 -68 -14 15 -47 -3 -5
$$ packed form
4989a39R6j8O2l6P9m9o8J27l0m6MJ48j86L6N3K1L3r6M1jP1q0K2N8p5Ml8L9q2J01
5019E1l2q4O0MQ2j51Q4jj3p0K5O0o0M5j46J42j8K6o8M7k0m0R2j26O9KQ1n2r7J70
5049F2m1n2k8K0k1M3R2j76O7M1P2j47N9P0n1M1q7J9P1Rj08N8M9n1N2J3%o0J05
5078A21j29j2J07O4j07n7J15o7Nm3M8K3l8M6q3L6pNo2k4O1o3Q2j17O2mL1j02N3
5107e6J22j66KL1M7j13RO3l1J07q7ooK4l7k6J01p4R5j24J20r2J21l8p6P3J9L0
5135C2n5P5j02Q6J1m9PK7J27j43L9N1l1oN0o4j1K01j58l6R0j1p0J32p2lO4o1l
5164A17j1N3j15j13K09l2p2RN7p2J3j2o3Q7j04J6k3P9j26OQ9o1Pj8R6j62N9M5
5192d2j0n8j3O6j17J14k8%kM8n6m7J27n7nL3n5Q5n9L1j30J92jr7J3N4K9o2M4k
$$ plain form
5222 -5 66 -51 52 -95 13 64 -43 88 43 38 -14 34 1 7 54 26 -15 49 145 104 39 26 6 111 134 -50 -22 159
5250 159 73 -8 39 73 59 -39 59 -31 36 7 -25 7 -2 76 -77 8 36 -8 -6 -46 -80 -39 27 -77 -76 14 13 -59 -51 13 -86
5281 -86 23 -19 -81 -86 -10 10 -135 63 -27 -16 -18 27 -35 6 53 -127 9 53 15 -112 25 -7 19 37 -48 -10 1 -7
5309 -7 -60 -39 68 -22 -36 19 107 -25 32 -12 -29 21 43 94 -43 54 0 1 -43 3 -38 -71 22 -165 17 16 -57 -83 -9
5338 -9 28 -110 19 -70 -42 -44 -36 -126 -39 71 -59 -34 -30 -22 -108 53 -76 -104 54 -20 -29 -11 51 -40 -16 35 -55 71 61
5367 61 27 -1 100 72 -20 35 103 5 47 105 39 120 84 29 27 75 140 -23 82 -10 46 83 45 37 -30 124 -12 -7 58
5396 58 67 -25 -31 2 -35 34 43 -56 -18 12 -73 -80 17 -63 -30 -44 -43 -108 -1 -13 -80 -83 -28 -35 -146 -8 -4 -67 -61 -71 -149 -75 -6
5429 -6 -133 -102 -11 -75 -71 -113 -81 -98 15 -34 -102 -9 16 -59 -67 75 -91 -74 -22 -17 -85 18 58 -133 6 -13 -38 -12 36
$$ packed form
5222eP1j17J03j47J08N1j07J31m5nn2M8l3OM7k8m1O4R6m1o5j3k0J05K3j84K8J81
5250A59q6q1M7L4j4r8R8r0O7k9l2L2rP8j53Q5K8m4Km0l4M1O6j04JR0jp2QO4r9
5281h6J09m2o2nP6K0j45J98r0J1kM5o2M1M7j80J36M4l8j27J37l2K6J8q5L8J1q
5309gn3K1J07r0j4N5Q8j32N7m4j7N0K2N1j37R7n4Jm4M6m1l3R3j87J82jp3k6P4
5338iL7j38J29q9K8kQr0Q7J10j30K5MQq6J61j29k8J58p4rJ8O2r1K4N1r0J26j0
5367F1l4k8J01k8r2N5O8r8M2N8o6Q1l6n5kM8O5j63J05r2N6L7l8qo7J54j36NO5
5396E8Rr2oL3l7O9Rr9L8L0q5pR7q0L3j4Jo5J07j2o7lN5pj11J38Mo3Oj0p8P4O9
5429fj27L1R1o4Mm2L2j7J13m9o8R3K5p5qJ42j66J7N2No8J03M0j91J39j9k5K6M8
$$ plain form
5458 36 29 15 82 -33 43 76 57 -7 -9 137 -84 58 115 73 18 133 59 10 110 94 2 -31 167 73 51 91 5 68
5486 68 91 53 -76 -20 86 -44 -41 149 -29 -8 162 -86 -19 27 -60 69 84 229 -40 -9 88 -107 61 -17 12
5511 12 -31 57 -76 -48 25 -69 1 -12 -10 133 56 -62 -96 -19 6 6 -47 -6 88 -28 -43 73 -58 34 94 -119 54
5538 54 94 86 -64 63 -12 28 147 -24 34 60 72 -22 -33 81 1 44 25 2 -42 81 34 -58 52 34 -7 -32 111
5565 111 -28 57 -129 50 63 153 96 -60 69 358 -166 39 41 106 -50 76 -127 -60 78 22 -95 46 104
5588 104 -37 -84 -10 -14 -61 86 -45 -75 -35 -46 -41 -51 73 26 -48 -68 -112 -20 49 2 -211 -22 35 -60 -108 32 -55
5615 -55 -140 -13 -71 -29 39 -88 -146 -10 34 -32 -40 14 -19 19 -61 -97 -68 104 -36 -31 -19 -71 -28 8 13 -79 82 47 -37
5644 -37 -35 32 41 -36 121 40 25 -14 22 -8 6 122 -22 39 68 55 -80 18 13 -12 97 -48 26 5 143 7 -71 73
$$ packed form
5458C6pj4O7j15P6L3j9o4kJ46k21J42N7m2n5J15p4m9J00j6r2l3J98r4k2M0q6O3
5486F8K3l8j29N6J06j30LJ90j78K1J70k48O7M6q7J29J5J45k69L1R7j95J68p8K9
5511A2m3Q8j33K8P3r4P0j3KJ43p7j18l4P7K5%n3M1R4j16j5J16j31R2O0k13J73
5538E4M0qj50J27p5M0J19j71N8K6J2r4j1J14q0M3j9k3m4J23m7r2J10j8m1k5J43
5565A11j39Q5j86J79J3R0n7j56J29K89n24K05KO5j56J26k03O7J38n6j17J41N8
5588A04j41m7P4mm7J47j31l0M0j1Nj0J24m7p4k0m4R2O9m7k13J89N7r5m8J40q7
5615e5q5J27n8M2O8j27n8J36M4o6qN4l3L8q0l6K9J72j40NJ2n2M3L6Nr2J61l5q4
5644c7KO7Rp7J57q1j5l9L6l0J4J16j44O1K9j3j35R8nk5J09j45P4k1J38j36p8J44
$$ plain form
5672 73 28 44 39 26 -85 82 60 -22 20 86 10 -49 71 -29 41 56 26 -21 27 47 -70 62 43 -34 13 57 14 -8
5700 -8 129 -73 -37 35 42 -63 -62 68 -37 -13 27 -39 6 51 5 -61 75 -20 -30 -8 58 -64 17 23 -12 1 61 -73
5728 -73 -112 38 34 -91 -24 25 4 -43 63 -58 -3 23 -40 9 36 65 -29 -33 -2 -4 -3 12 -16 -6 135 -24 -127 71
5756 71 34 -46 0 28 -102 10 26 -78 -53 43 34 -46 34 3 -11 20 21 -58 -5 59 -107 46 -41 -2 -7 32 -17 -62 67
5785 67 21 -24 -36 60 -31 -25 36 22 -11 -9 -5 -101 67 -43 -52 8 22 -29 -7 9 -45 -57 25 -28 -20 26 43 -60 53 40 -49
5816 -49 -47 22 -36 -49 43 -63 -62 -27 -36 -60 -49 46 34 30 -24 -7 -33 -21 -73 -104 92 -21 -80 -81 25 -112 11 23 -103
5845 -103 36 38 -33 -104 76 59 -36 2 18 81 17 47 -56 42 94 54 33 72 106 -31 38 35 -10 159 97 30 -23 98
5873 98 49 -7 24 79 2 63 86 -102 124 71 23 25 93 76 -24 125 21 36 81 61 -22 52 105 -77 56 50 56 24
$$ packed form
5672G3m5J6nj3j11J67k2q2M2O6p6n9J20j00P0J5l0m7M8K0j17J32j9p7M7M4m3k2
5700hJ37k02L6P2Pj05JJ30j05K4M0o6M5M5m6o6J36r5j0K2O6j22Q1Ol5J3O0j34
5728g3l9J50mj25O7M9k1m7J06j21N5K6o3M9K7K9r4mL1kJJ5k8J0J41j59j03J98
5756G1l7q0M6K8j30J12J6j04K5R6rq0Q0l1j4L1Jp9N3O4j66J53q7L9nL9m9m5J29
5785F7m6m5j2R6r1OO1j4l3KMr6J68j10rO0J4n1K2J6n4j2Q2n3QM6J7j03J13j3q9
5816d9KO9n8j3R2j06JL5rk4J1R5j2mn4J7k6J2n2l1J96j13n9jJ06j37J23J2j26
5845a03J39Kp1p1J80j7r5L8J6O3o4L0j03R8N2m0k1L9L4j37O9lm5J69o2o7n3J21
5873I8m9n6L1N5p7O1K3j88K26n3m8KO8j7j00J49j04J5M5k0q3P4N3j82J33oOl2
$$ plain form
5901 24 33 -8 -2 87 77 -17 -18 105 -39 -5 47 -15 -17 17 20 -65 48 19 -60 21 14 -11 -100 79 -69 -23 54 -57 -78 -41
5931 -41 20 -163 -102 -15 -104 -53 -3 -105 -106 21 -86 -126 -81 -41 -100 -87 -24 -145 -73 -78 -96 -77 -34 -114 -177 -65 -81 -66
5959 -66 -110 -44 -40 -52 33 -94 -34 -4 -29 -101 -8 -17 -53 51 -7 7 -23 22 -77 1 102 48 -1 16 99 -26 51 11 13 54
5989 54 106 58 -41 140 7 33 95 56 18 78 60 8 71 89 -77 20 102 75 18 70 -35 -11 100 50 -3 25 84 -8
6017 -8 -11 1 70 1 12 5 -49 -9 -9 -68 -77 74 -34 -21 21 -52 -7 -51 -20 -114 19 14 -124 -33 -15 -5 -59 -39 -119 -38 -29 -73
6049 -73 -66 43 54 -110 38 -15 -60 -5 6 -21 -37 106 -46 -12 63 52 -59 42 50 -54 64 53 -29 15 108 108 -16
6076 -16 155 111 -13 -15 56 -5 23 83 -5 36 66 -12 -69 49 80 -49 33 45 28 32 30 -53 -28 33 -4 23 -24 25 -118
6105 -118 29 -29 -63 8 27 -37 -80 96 -75 -69 -47 -46 -67 12 -8 -134 -25 -74 -49 -49 95 -36 -39 38 -42 -49 14 0 -35
$$ packed form
5901B4Rm1OQ9j0r4jJ23j44L4N2o2kL4Lq5J13k9p9Q1pk5q9J79j48M6P7j11k1L7
5931d1O1j83O1Q7q9N1N0j02jJ27j07m0M5M0n9J3O3j21P2nj8J9M3q0o3J12j6J5
5959f6m4O6Mj2Q5j27O0L0k5p2R3rl6J04n8J4l0M5r9P8J01n4m9J7Q3j25P7m0KM1
5989E4N2m8r9J81j33K6O2l9l8O0j8n2O3J8j66R7Q2k7n7N2j05K4J11n0n3K8N9r2
6017hlJ2O9o9J1pn4M0%n9rJ51j08J3M2p3M5m4L1r4J33nj38R1J8J0n4K0q0Q1Rm4
6049g3PJ09J1j64J48n3m5N5J1k7j6J43j52L4P5j1j11J01Qj04J18j1q2M4R3%j24
6076a6J71m4j24kP1o1K8O0q8M1L0p8n7J18L1j29Q2J2j7Mkq3K5O1l7K7m7M9j43
6105a18J47n8l4P1J9o4m3J76j71OK2Jk1P9k0j26J09m9K5%J44j31lP7q0pO3j4l5
$$ plain form
6134 -35 11 42 -87 23 61 -14 -25 45 26 -88 142 31 -39 -22 85 -35 19 55 -16 51 28 50 -62 40 49 -59
6160 -59 15 44 -26 -58 50 -39 -49 65 -33 -69 3 47 -45 -5 29 -55 -66 -18 -41 -58 72 -119 -90 26 9 -58 -30 49
6188 49 -47 -21 -5 -25 -54 -40 -10 -197 133 137 -80 -5 -88 -101 34 122 66 -24 86 -63 66 91 238 104 68 179
6214 179 220 -109 308 214 100 195 206 92 59 337 94 72 19 -246 266 -43 32 -48 -163 -46 -236 107 -57
6237 -57 -47 110 -21 -309 82 -228 -116 4 158 129 -132 38 -36 19 8 23 -68 -36 51 -71 -32 41 2 -74 4
6262 4 -26 -82 29 -48 -91 -30 18 -101 -21 -32 -34 6 34 -91 -58 -81 74 -59 -42 96 -42 -19 20 -129 110 212
6288 212 -83 0 -23 52 -117 -7 50 -30 -31 14 7 -39 90 49 -42 47 61 1 -8 84 -63 68 43 -16 -46 91 26 -87
6316 -87 65 -76 -28 35 53 -72 -23 81 -65 -48 -16 -17 -146 12 65 -61 82 -25 -56 -14 16 -63 -72 35 4 -30
$$ packed form
6134c5M6L1j29J10L8p5j1P0j9j14K30j11p0J7J07j20N4L6p1O7k3K2j12J02Rj08
6160e9P4K9p0l2J08q9j0J14r8l6P2M4r2M0L4q4j1M8k3j7J30j91K9J16j7o7K8P9
6188D9r6K6J6k0k9J4L0j87L30Mk17P5q3j3J35Q8n6r0J10j49J29K5J47j34l6J11
6214A79M1l29M17r4j14R5J1j14l3K78k43k2n3k65N12l09P5q0j15J17j90L43j64
6237e7J0J57j31k88L91l10J12J20J54k9k61J70p4N5j1J5r1L2Q7j22L9P3l9p6P8
6262Dl0n6J11p7m3O1M8j19Q0j1kM0K8j25L3k3J55j33J7J38j38K3L9j49K39J02
6288B12k95Q3k3P5j69J10N7q0jM5pm6J29m1r1Q9J4o0rR2j47J31k5n9l0J37o5j13
6316h7J52j41M8O3J8j25M9J04j46J7L2jj29J58N3j26J43j07l1M2L0p9rJ07l1l4
$$ plain form
6342 -30 -17 -33 -77 10 -20 -78 -16 19 -39 -87 22 -65 -35 -19 -46 -54 26 55 -9 -12 29 -15 -51 55 8 -17 125 -11 -122
6371 -122 28 65 -47 5 143 -41 31 48 -7 18 94 50 -17 103 45 17 -3 116 57 41 80 45 97 43 24 -27 61
6398 61 43 -50 81 107 -6 -37 58 -50 -31 101 13 -37 -32 71 -64 -27 12 -58 4 18 -79 -73 68 14 -50 -2 21 1
6426 1 19 -11 -105 43 7 -104 -116 19 18 -83 15 -19 -42 -46 -15 -18 -6 97 -74 -29 -27 36 -91 0 -6 -68 52 53 -84
6455 -84 -50 97 -34 -92 4 -144 -59 -96 139 -287 438 -23 -38 -112 78 115 -297 60 -98 30 -56 2 -66 103
6479 103 -25 -95 -14 26 -101 -82 23 27 -91 115 -98 -42 19 14 -58 -37 1 -45 -69 34 -32 12 63 64 79 41 96 -23
6507 -23 0 4 17 -20 43 36 63 77 35 -205 9 7 -121 13 74 39 -32 120 -98 21 131 38 -52 -107 57 -120 131
6534 131 97 -174 44 293 34 -170 233 192 -30 113 -1 159 -19 100 -154 -38 -57 -104 -35 -46 -57 -148 -91
$$ packed form
6342c0J3j6m4Q7l0n8O2L5n8m8J09q7L0J6k7qQ0K9o4lM1m4l6J06m7k5J42j36j11
6371a22J50L7j12N2J38j84P2J7n5K5P6m4o7J20n8k8k0J19n9j6L9l5N2n4j9n1Q8
6398F1j8r3J31K6j13l1R5j08J9J32q8n0NJ03j35L7L9p0O2J4r7OJ41n4o4M8K3k0
6426AJ8l0r4J48l6j11j2J35jj01R8l4k3mL1lJ2J03j71M5KO3j27R1oo2J20Jj37
6455h4L4J47j31n8R6j48Q5l7K35m26P25m61j5p4J90L7m12L57j58J28q6N8o8J69
6479A03j28p0Q1M0j27J9J05Mj18K06k13N6O1np2K1L8m6k4J03o6M4N1JJ5l8N5j19
6507b3K3MJ3l7O3pK7J4m2k40K14kj28J34O1l5p1J52k18J19J10r3r0n5J64j77K51
6534A31l4k71K18K49k59k04M03m1k22J43j14J60j78J19k54J16j9m7O9j1j1r1N7
$$ plain form
6557 -91 164 36 -19 -128 -115 -42 -146 -139 5 35 -39 -87 -151 -47 -114 -18 -145 -320 -47 15 1 -107 -67 -77 26
6582 26 46 -77 -59 8 139 -121 68 -93 -78 -1 -98 -108 -15 102 -119 164 192 150 -37 55 93 57 -23 84 -113
6607 -113 126 59 11 -2 53 74 -177 54 184 -69 -10 -72 -184 -56 -190 -51 -79 -37 34 19 48 -79 23 123
6631 123 199 -89 25 190 -103 -104 -111 -133 109 217 142 -182 51 51 -63 54 88 -57 80 -18 -208 -60 -257 -33
6655 -33 -24 -213 -149 -98 -72 -120 20 -72 135 84 -21 -21 153 -278 -5 16 -63 -52 53 70 -118 86 8 -25 -91 48
6681 48 -40 16 265 -8 -47 149 -50 -153 328 20 82 -5 218 -54 45 57 -69 -99 86 -251 58 -17 -253
6704 -253 -71 90 -39 -137 -217 -179 -42 -304 -162 -102 -38 69 97 -23 141 -19 -339 -20 -60 159 -91 -70 -36
6727 -36 -118 179 -52 36 153 37 -45 -10 13 -71 4 107 31 24 173 142 -63 122 82 -20 21 61 29 57 135 -25
$$ packed form
6557i1K55j28n5j09J3P3j04PJ44L0p4m8o4J04o7R6j27j75K73O2j4j08M0j0J03
6582B6K0j23J8O7J31k60J89j61J5P7r7j0R3J17k21K83K8m2j87R2L8l6q0J07j97
6607a13K39o7m8j3N5K1k51K31J30k53N9o2j12J28j34J39k8M2P1j5K9j27J02J00
6631A23P6k88J14J65k93jpk2K42J08p5l24K33%j14J17L4j45J37r8j90J48j97K24
6655c3Rj89O4N1K6m8J40r2K07n1j05%J74m31K73K1p9J1J05J7j88K04p8l3o6J39
6681D8q8N6K49k73l9J96j99j03M81l08O2q7K23k72R9J2j26l0J85l37L09p5k36
6704b53J82J61j29r8q0L8J37k62J42O0O4J07K8j20J64j60l20L19m0K19k50K1L4
6727c6q2K97k31Q8J17j16q2L5K3q4P5J03p6pJ49l1k05J85m0j02M1M0l2K8P8j60
$$ plain form
6753 -25 64 70 5 -28 73 97 -8 73 52 40 -11 64 11 -44 57 5 -50 93 102 -23 35 106 -50 -26 69 -7 9 72
6781 72 -128 -59 109 -146 -71 105 41 -99 44 73 -273 63 -7 -60 -162 230 -258 24 0 276 159 -268 -39
6804 -39 -426 -198 8 74 -198 205 113 -87 30 18 25 -61 -53 -36 -21 7 -130 -103 6 17 -111 11 207 -113 225
6829 225 -20 142 379 132 -62 -104 29 159 123 -89 62 -13 185 -166 51 20 -128 -95 5 -41 88 7
6851 7 -15 100 -88 -162 236 -69 -73 87 -146 -43 55 -66 -117 -109 60 -89 -91 86 -98 67 -110 -61 -5 153 -212
6876 -212 -193 162 237 149 -67 -62 67 -141 38 -127 -191 188 -154 88 -113 -196 -105 138 210 147 -51 -189 -51
6899 -51 9 236 413 134 -211 -51 17 -144 0 -413 37 291 162 87 11 71 156 -179 -172 -48 73 47 -5 5
6923 5 71 77 23 125 -90 -86 172 34 -31 -22 125 -83 -3 -2 -82 -85 -1 -70 -24 7 -48 -105 21 -23 -84 -9 5 -52 -85 -8
$$ packed form
6753b5Q9Oo5l3J01K4j05Q1k1j2n1P5n3n5J01n2n5J43Rj25N8P1j56K4R5p6J6O3
6781G2k00O9J68k55P5J76o4j40J43K9l46L36p0n3j02L92m88K82k4K76j17m27K29
6804c9l87K28K06O6k72M03r2k00J17j2Pq6QJ7J5K8j37K7J09J1j28J22J96l20L38
6829B25k45J62K37k47j94m2J33J30l6k12J51p5J98l51K17l1j48L3J00m6J29q1
6851Gk2J15j88p4L98l05mJ60k33J03R8j21n1QJ69j49kJ77j84J65j77M9N6J58l65
6876b12J9L55P5q8k16NJ29k08J79j65o4L79l42K42k01q3R1K43P2o3j98j38J38
6899e1O0K27J77k79l45J60O8j61J44m13M50K54j29p5p6O0Q5l35PJ24J21k6n2J0
6923EO6On4J02k15MK58j38o5RJ47k08Q0Jq0lQ4o9M6L1n5n7J26m4o1P5J4n7l3P7
$$ plain form
6953 -8 -44 -61 52 -38 -50 27 -6 -49 50 -15 36 -70 20 36 7 81 -16 -115 52 56 18 61 27 -63 71 58 6 37 -43
6982 -43 -35 -97 17 65 -144 -5 27 -57 90 8 27 -153 214 -9 -20 58 -63 -88 27 63 146 46 -109 -59 98
7007 98 55 -35 -194 54 -25 -227 122 135 24 -102 49 -83 64 -20 -195 -181 -71 -24 56 -20 162 -130 118
7030 118 185 -54 -22 308 117 -65 316 -176 -159 -130 105 -50 -164 155 -1 -18 36 -74 -194 307 -81 -128
7052 -128 -74 79 195 -240 69 -226 -8 145 -20 93 -169 16 -107 131 -16 10 -4 27 14 -33 200 39
7074 39 318 66 -97 12 -50 -8 -44 9 -68 -56 41 20 -60 -89 61 -36 -103 11 35 -24 -51 13 -12 -3 4 -51 -88 40
7102 40 55 -70 20 -4 -27 16 45 -4 12 79 -101 -30 53 39 1 26 38 -23 49 13 -42 55 58 -58 20 7 18 5 3 37
7132 37 -79 22 34 -21 28 92 16 -25 -24 -23 -54 60 -4 -24 -1 54 -32 -4 66 6 -30 0 14 -75 17 -24 -49 25 3 -66
$$ packed form
6953hl6j7J13r0j2P7l3m3R9o5N1j06R0J6k9P4r7r9J67Ml8M3l4r0J34j3n2L1q0
6982d3Qo2J14M8k09J39L2q4J47q2J9j80L67k23j1P8j21k5J15L6Q3j00j55N0J57
7007I8m3r0j59K48p9k02L49J3j11j26J51j32J47q4j75J4J10M7Q0p6J82k92K48
7030A18O7k39L2L30j91j82L81m92J7K9K35j55j14L19j56j7N4j10j20N01l88m7
7052a28N4J53J16m35L09k95K18J53j65J13k62J85j23K38j47K6j4L1j3m7K33j61
7074C9K79k52j63J09o2M2l6N3p7J2R7k1q0k9J50r7o7J14K4n9k7O4k5RPn5l7J28
7102D0J5j25R0k4k3M3K9m9J6O7j80P1Q3j4l8K5J2o1P2l6n5R7Lj16P8j3J1j3kL4
7132C7j16J01J2n5M9O4p6m1JJl1J14o4k0K3N5q6K8P0o0l6L0J4q9R2m1k5P4k2o9
$$ plain form
7162 -66 -52 5 -19 -26 -61 -77 -76 -17 -16 -101 19 -41 -63 -51 38 -120 -70 32 -93 -14 1 -11 -57 39 57 -32 47 39 -2 -21
7192 -21 56 -37 9 96 -20 -72 19 88 -49 -12 15 -58 114 43 -53 -6 75 -38 -67 26 19 6 29 58 -72 30 -2 -58
7220 -58 -34 46 56 -59 53 -59 12 1 27 -56 18 57 -101 31 35 -1 -34 78 -30 -46 53 -54 -38 -31 47 -109 -93
7247 -93 78 -60 4 -32 -38 -72 29 -22 -76 -32 83 13 -32 30 -36 -24 33 -14 7 -22 59 -67 -17 32 -32 7 46 59
7275 59 -19 47 -11 -33 55 91 3 -26 60 36 -40 17 -47 44 58 0 -54 84 -35 -73 -62 33 -40 0 73 -32 31 41 43
7304 43 -67 53 77 -2 4 13 -51 27 -42 3 -1 62 14 -63 -47 -37 -50 -47 47 -65 4 11 -72 -119 -15 -40 -31 -11 24 -16 -18 32
7336 32 -79 32 12 -62 -61 31 82 -27 18 20 -29 44 -11 -7 51 114 -66 -11 39 66 -46 36 -10 -141 -33 16 -93 76
7364 76 123 17 -219 97 -17 58 168 -117 -103 159 2 -90 100 -68 -220 -330 13 -229 -90 -52 -65 -270
$$ packed form
7162f6J4N7k4pl5j6JN9Jq5J20o0k2J2Q9j58N0J02j25P9J5j2m6R6J8q9P9qm1j9
7192b1P7r3M6Q7j16n2R1O9j37L7K7p3J72p1r6M7Q1j13k9R3pj3K3K9j30J02l2n6
7220e8K4Q0J0j15J12j12P1j1K6q3P4L9j58J32Ml6l3J12j08j6R9j07J6PP8j56J6
7247i3J71j38O4l6ol4J01n1n4M4J15p0m5O2o6J2N7m7K1k9Q1j26N0M9o4L9L9J3
7275E9p8O6n8k2Q8L6q8k9Q6k4p6N7o4R1J4n8n4J38j19l8J1R5p3M0P3j05O3J0K
7304D3j10J20K4p9ORo4P8o9M5mO3m8p7J6J0j3LR4j12O9Pq3m7J04k5RK0L5m0kN0
7336C2j11J11k0p4JR2N1j09M5Km9P3n5MN8O3j80N5N0K7j12Q2m6j31J08M9j09J69
7364G6M7j06k36L16j14P5J10k85J4K62j57r2J90j68j52j10L43k42J39L8j3k05
$$ plain form
7386 -270 -40 166 9 151 -256 -18 -139 353 -92 -239 -18 -227 146 -104 -106 -254 -101 81 -111 14 -46
7407 -46 -31 -53 0 -26 -95 -19 -35 -21 -37 22 21 -58 32 -57 13 38 10 -78 74 46 -9 50 53 -10 20 56 -69 53 78 22
7437 22 58 2 51 -38 46 13 -28 80 52 -40 -43 54 -78 0 -5 -6 2 -30 -16 -113 18 4 -16 -44 26 36 -78 -4 -28 -42
7467 -42 10 17 -48 -57 86 -83 -62 -13 19 -30 33 -22 -84 51 -3 -62 -39 60 -49 -89 2 -10 32 0 -3 -55 36 46 -70
7496 -70 81 0 1 -34 -5 -4 11 22 19 -22 47 109 -66 45 32 5 52 70 19 11 94 18 4 70 17 -4 30 82 -25 7
7526 7 -14 -43 -20 59 46 -31 -7 -8 -13 -57 -17 -38 -29 50 -50 2 -36 -22 -70 -3 -23 -34 -19 -54 -48 -59 24 -45 3 -13 -41 -11
7558 -11 -90 8 -61 -33 -12 -43 -29 -54 -93 -125 34 -12 -42 -6 -32 -58 -31 22 -10 18 -3 -9 -64 13 -2 -19 10 -15 -5 -21
7588 -21 82 -14 6 56 -39 -25 73 19 3 79 32 10 60 68 14 59 27 -14 -38 -17 -37 39 12 -31 -62 51 8 -44 -6 -29
$$ packed form
7386b70K30K06j57J42m07K38j21M92m45j47K21k09L73k50kj48J53J82j92J25o0
7407d6J5k2N3k6o9P6j6J4j6N9jp9R0q9P0K5k8q8J52k8n5N9Lo3L0L6j25J22K5n6
7437B2L6n6M9q9Q4l3m1J08k8r2lR7j32P8njQl2J4r7J31j4k0k8P0J0j14P4k4j4
7467d2N2Po5rJ43j69K1M9L2m9O3n5o2J35n4n9K3R9j09m0R1j2M2l2ln2R1J0j16
7496g0J51q1Jl5K9JJ5J1lm1O9O2j75J11j3k7M7J8n1qQ3p6j4O6n3k1L4N2j07L2
7526Gk1k9K3P9j3p7K4jnm4M0k1RP9j00N2l8J4m8O7k0j1J5l5Oj1Q3o9M8j6k8L0
7558a1p9R8o9K8K1l1J4k5l9l2J59m6l0L6k6k6K7N3l2K8k1on5P7j5j7K9k5J0j6
7588b1J03r6K0N0r5J4R8n4j6P6m7k2N0Qn4M5l2m1k4K1k0P6k7m3l1J13m3n2L8k3
$$ plain form
7618 -29 -6 -84 50 9 -48 69 -11 -43 11 35 -48 6 53 -23 -1 -25 25 -50 35 32 -9 11 4 3 -33 53 -45 11 0 -81 -29
7649 -29 12 24 -83 1 -8 11 -36 9 -1 -45 43 -78 -3 70 43 -40 -5 68 1 38 16 -36 -42 35 -61 11 37 17 -27 0
7679 0 24 -59 85 24 -16 20 23 -71 -93 4 -29 -36 -19 24 -63 -29 18 -122 -48 -15 -74 -7 -50 -23 -71 15 -20 -44 4 -11 -64
7710 -64 -27 32 -37 -7 -1 7 -36 -8 14 -51 61 -33 -33 3 81 -3 1 88 -23 35 40 -54 -85 11 58 8 10 84 9 -2 61 -8
7742 -8 -48 39 0 -13 36 78 -4 18 23 2 46 4 -3 -26 33 -29 -90 -21 51 -15 -60 41 -82 -3 -22 -30 -36 -3 13 -154 -8
7773 -8 -14 -14 9 -13 -41 -63 30 -82 8 37 40 -49 -12 -24 -58 25 16 -10 -13 -14 -82 -20 65 -9 -56 -6 15 -25 -1 46 -25 14 23 74
7807 74 -53 15 14 -19 36 14 17 37 54 -23 80 37 9 -2 79 18 32 49 -15 11 76 57 -54 -7 89 1 44 22 28 -18
7837 -18 17 50 -12 80 72 -56 -75 69 -19 8 58 -81 -12 -12 5 -106 20 60 -30 -49 31 -28 -119 -17 -68 1 57 -39
$$ packed form
7618b9K3p8J34m1n7J17q0l2N4K4q3N4M7p6K2k4N0p5Q5lm1K0pjl6Q6r8N6j1q1N2
7649b9M1J2j07Q4rJ9m7M5j0m4Q8j21P5P3k7q3L5P3o7L7k2n2oP7r6P2K6k0m4K7
7679@K4q3J44o1m0L6Lr4k2R7l3pJ7M3q7L4M7j40P4L3n9O7m3K7m8Q6l5k4M8j5n3
7710f4L7N9o9L0OQm3K8K2o5J12r4%L6P8q4MQ7j11N8Nr4l1R6M7n0KP4p5j1O3o9
7742hm0Q7l9j3M9M2q2K2Nk1M4m2pk3N9o2o1O9P2o6m5J01j23P9j9qoL3J6j67J46
7773ho%K3k2k8k2R3j12R0K9Lq9L7j2l4Q3rk6ljo8O2Q5p4m7N0K1m0K4M7p1L9RN1
7807G4j27O8jl3N5k2LK0J7p7J03m3k8j1Q1o1J4J7o4K6O5j9j11M7R6q8M3k2Om6
7837a8L5L3o2R2qj28j9J44q8K7N0j39O9%J7j11J26M0r0j9Q0n9r1J02n1O9N6r6
$$ plain form
7865 -39 -46 -15 52 -11 8 35 -21 -16 22 -8 -82 41 -16 -87 9 43 -9 -70 42 -76 14 12 -34 -21 45 3 -62 8 -28 -2
7895 -2 -26 28 -37 -56 30 -48 -70 5 -8 -45 -11 52 -57 3 -19 -53 -48 63 -1 -33 23 1 -55 -5 42 -21 76 33 -32 37
7925 37 54 -11 -46 -26 -28 6 -20 34 -92 -14 5 -56 -9 28 -30 8 24 17 -48 -5 -64 -5 26 38 -6 -6 57 -11 21 18 49 63
7957 63 1 46 -31 66 58 6 -23 62 52 1 38 -53 3 41 26 -11 -3 49 -94 16 16 4 22 35 -76 -39 9 5 -63 -12 40
7988 40 -42 -18 -14 -47 -10 45 -60 -69 25 -27 -67 -9 -30 26 -54 -6 -90 -22 20 -109 -62 -12 -20 -128 -9 -18 -13 18 35 -4 -15
8019 -15 14 -93 -11 50 14 -96 36 36 -2 59 -21 19 -11 57 30 -8 43 54 7 80 86 -30 85 31 -1 63 75 29 -14
8048 -14 21 -2 -20 69 9 -36 -21 28 -70 -29 -12 -32 -57 -24 -46 -78 15 -71 -54 7 -38 -93 -22 66 -40 -67 -51 -38 -72 4
8078 4 13 -106 -20 -41 -12 -77 -66 -37 -22 9 -94 -18 -18 -30 -84 3 26 -37 27 8 3 -40 30 -65 -32 88 -4 -24 -16 74 4
$$ packed form
7865c9pL1O7o3J9K7n6NL8l0p4J23n7p1R6L4n2o1J12j18R0km6J3O6m2o5P0l6K6
7895bk4N4o5j9Q6p8k2P5j3l7L4O3j09O0k2l4NJ11o4l2N6k2n6N0M7o3R7m3o5O9
7925C7J7o5l5K0kL4k6N4j26P8J9o1M7L7n8L8J6po5M3n9N9L1J2m4%O3o8L2lL1J4
7957F3o2M5p7R7qn2k9Q5j0n1L7r1N6L8j5l7QN2j43J10%j2J8J3j11L7M8mo8N1N2
7988D0q2K4Ml3L7N5j05rR4n2m0N8k1N6q0M8q4O8M2j29M7N0qj08J19rNL1J7l9j1
8019a5K9j07Q2O1l6j10J32%l8O1q0M0l0O8k7l8N1J1m7P3Oj16J15n4l2O4J2m6m3
8048a4L5k3j8Q9o0m5J5M9r8M1J7k0k5L3k2l2R3q6J7O1m5n5P1Q8j06k7J6J3l4P6
8078DRj19Q6k1K9o5J1K9J5L1j03P6%j2n4Q7K3o3O4j9nm3P0r5L3J20r2k0QR0p0
$$ plain form
8109 4 -3 56 -6 21 90 34 -12 87 50 -16 72 86 33 1 62 35 -27 59 9 -10 55 57 -40 13 -17 -27 14 26 -30 5 33 -49
8141 -49 -55 5 13 -19 -9 -21 -51 -22 -26 -45 -20 -7 -11 -79 16 19 -35 -36 -5 -68 49 40 -53 -28 27 -50 -15 -45 -9 -19 -24 3 -32 45
8175 45 15 -5 8 -4 -5 8 76 -15 -16 56 13 -22 -27 73 5 25
$$ packed form
8109DpN9o2K7O9n6m6R9l7o6Q8J4n3l2O1k7o2Q6n0j9O5Kr7N3l0j0M1J2n6L5K8q2
8141d9oO0Ql2J0j2l0K9mj9K5J3mo8R5Ln4jL1o3J17rr3K5N5p7L5l0L6j0nK7l5P7
8175D5l0k0J3j2jJ3O8r1jP2m3l5nJ00o8K0
8191B5
$$ Imaginary data points
##PAGE= N=2
##DATA TABLE= (X++(I..I)), XYDATA
$$ plain form
0 0 0 0 0 0 0 0 0 0 0 0 0 0 0 0 8 -8 8 -8 8 -9 16 -16 22 -24 26 -32 40 -41 49 -57 65 -75 88 -97 112 -125
36 -125 139 -157 176 -196 217 -241 269 -297 329 -365 401 -443 488 -537 592 -653 719 -793 877
55 877 -971 1078 -1198 1339 -1503 1702 -1946 2248 -2641 3173 -3939 5143 -7328 12591 -54275
70 -54275 -30101 24820 -67597 -53018 -17746 -42763 -51173 -9251 -47102 -57901 -15851 -1545
82 -1545 -29225 -10758 -19254 -46101 -14337 -416 -20378 -6222 11812 -12563 -4920 16663 -19006
95 -19006 -13018 23415 5474 -14262 45730 39261 -33030 -5469 44345 9808 -4872 39944 19736
108 19736 3312 39669 27477 -8049 8021 27484 9455 38842 45132 -9157 -2837 47768
120 47768 22739 -16080 19978 26229 15180 32700 23493 -11944 4443 31005 -499 6435 32985
$$ packed form
0@%%%%%%%%%%%%%%Qj6J6j6J6j7K5l2L8m6N0n8P2q1R0j06J22j40J63j85K09k37
36a25K64k96L33l72M13m58N10n66O26o94P66q44R31j025J129j245J372j512J670
55H77j848K049k276K537k842L205l648M194m889N814p112R082j2471J9919o6866
70e4275K4174N4921r2417J4579L5272k5017q410M1922l7851j0799M2050J4306
82a545k7680J8467q496k6847L1764J3921j9962J4156J8034k4375P643K1583l5669
95a9006N988L6433j7941j9736N9992o469p2291K7561M9814l4537j4680M4816k0208
108A9736j6424L6357j2192l5526J6070J9463j8029K9387O290n4289O320N0605
120D7768k5029l8819L6058O251j1049J7520r207l5437J6387K6562l1504O934K6550
$$ plain form
133 32985 12677 -1485 24879 13106 -14490 11716 14134 2209 21153 24430 -7715 5485
145 5485 21350 -18588 -3901 39902 9679 -25406 27109 34436 -24605 -10021 20464 -3501
157 -3501 -4401 32157 7105 -16248 10588 7137 -12528 1347 10998 -10272 8991 21751 -6427
170 -6427 -12319 -3032 -6960 1284 16332 -13231 -9513 25103 -917 -32950 928 13645 -27361
183 -27361 -1635 28937 -10569 -24585 12457 -1594 -31653 4479 10384 -14119 -14 12824
195 12824 -14663 -13214 6930 -15916 -12727 15788 7766 -13753 2506 1736 -15728 2185 218
208 218 -13313 7313 21650 -11522 -10645 15477 -8808 -18672 12048 14094 -10671 8399 12420
221 12420 -13630 -1171 8729 -11935 -4736 25513 1868 -9970 15158 1304 -18945 5673
$$ packed form
133C2985k0308j4162K6364j1773k7596K6206K418j1925J8944L277l2145J3200
145E485J5865l9938J4687M3803l0223l5085N2515P327n9041J4584L0485k3965
157c501r00L6558k5052k3353K6836l451j9665J3875R651k1270J9263J2760k8178
170f427n892R287l928Q244J5048k9563L718L4616k6020l2033L3878J2717m1006
183b7361K5726L0572l9506j4016L7042j4051l0059L6132N905k4503J4105J2838
195A2824k7487J449K0144k2846L189K8515q022k1519J6259p70j7464J7913j967
208B18j3531K0626J4337l3172Q77K6122k4285r864L0720K046k4765J9070M021
221A2420k6050J2459R900k0664P199L0249k3645j1838K5128j3854k0249K4618
$$ plain form
233 5673 15563 -13873 5090 24546 -4950 -11797 10226 -1360 -13678 14707 8110 -8189 9983
246 9983 12883 -13068 -8899 9523 -5460 452 13580 656 -4703 8790 -4843 -15354 10973
259 10973 2348 -13405 11216 19656 -16145 -12507 13323 -10069 -13525 14173 6176 -15836 8321
272 8321 9494 -21742 -7467 8411 -9324 -8719 15389 -413 -12844 1659 -7130 -14615 2240
285 2240 4908 -13177 2160 7790 -11932 -5949 292 -16799 -10013 19426 -893 -16492 5544
298 5544 2312 -17324 -3105 7012 -15830 -1113 17623 -3903 -12257 5479 -5161 -17081 10626
311 10626 8865 -9669 2380 11048 -8104 -4822 8439 -10652 -4957 17663 7743 -7621 7748
324 7748 3456 -13243 6571 11069 -5439 2852 18015 -747 -3139 12225 -4842 -9447 13425
$$ packed form
233E673R890k9436J8963J9456k9496o847K2023j1586j2318K8385o597j6299J8172
246I983K900k5951M169J8422j4983N912J3128j2924n359J3493j3633j0511K6327
259A0973q625j5753K4621Q440l5801L638K5830k3392l456K7698p997k2012K4157
272H321J173l1236J4275J5878j7735O05K4108j5802j2431J4503q789p485J6855
285B240K668j8085J5337N630j9722N983O241j7091O786K9439k0319j5599K2036
298E544l232j9636J4219J0117k2842J4717J8736k1526q354J7736j0640j1920K7707
311A0626j761j8534J2049Q668j9152L282J3261j9091N695K2620r920j5364J5369
324G748m292j6699J9814M498j6508Q291J5163j8762k392J5364j7067m605K2872
$$ plain form
337 13425 14279 -3432 9717 8839 -10915 4326 14086 -6613 -5588 20502 7486 -3704 10456
350 10456 142 -12867 6591 15394 -6942 3452 14946 -4101 -5213 9215 -2673 -12166 10153
363 10153 7081 -3264 7085 2647 -15371 -3470 10940 -8364 -4920 9144 -1657 -6408 6832
376 6832 -6215 -20481 4146 6668 -9218 -225 7638 -12876 -10600 6697 -9848 -12975 5649
389 5649 1924 -11099 4134 1031 -20366 -6902 4203 -7399 -5399 7559 -8018 -11116 5389
402 5389 -6705 -16992 -792 4129 -10095 2490 5434 -15275 -10061 3179 -7279 -9874 8519
415 8519 -3073 -11475 5777 1471 -17499 -7949 5351 -7456 -39 7872 -9002 -10843 5753
428 5753 -3235 -15854 3293 3676 -6416 3291 5147 -12229 -6698 7020 -7737 -4489 11327 2221
$$ packed form
337A3425Q54j7711J3149q78j9754J5241R760k0699J025K6090j3016j1190J4160
350A0456j0314j3009J9458Q803k2336J0394J1494j9047j112J4428j1888r493K2319
363A0153l072j0345J0349m438j8018J1901J4410j9304L444J4064j0801m751J3240
376F832j3047j4266K4627K522j5886Q993P863k0514K276J7297j6545l127J8624
389E649l725j3023J5233l103k1397J3464J1105j1602K000J2958j5577l098J6505
402E389j2094j0287J6200M921j4224J2585K944k0709N214J3240j0458k595J8393
415H519j1592q402J7252m306j8970R550J3300j2807P417P911j6874j841J6596
428E753q988j2619J9147L83j0092R707J856j7376N531J3718j4757L248J5816r106
$$ plain form
442 2221 -8210 6216 2945 -11695 3384 6948 -4888 4329 16477 -2635 -6692 9749 711
455 711 -3743 10822 10166 -3172 10323 13033 -5587 961 10666 1244 2700 18837 6311 -2398
469 -2398 10764 6449 -3345 6779 11516 -1915 9620 16592 -1989 -3143 9351 1823 -3699 12798
483 12798 5713 -3748 8822 7414 -9981 -2895 9591 -5062 -1466 10803 -223 -7728 4230
496 4230 -1854 -13430 3592 5116 -7577 -829 7492 -7173 -8737 2980 -6872 -6423 7042 2341
510 2341 -8660 3359 2802 -11774 -1235 4843 -4509 -262 11776 -1403 -5627 7581 -868 -7465
524 -7465 7514 11195 -3832 5781 12042 -2707 -282 8919 535 -884 16600 8801 -2485 8080
538 8080 8188 -2843 3527 10845 -765 6362 14842 1308 -2818 7986 2117 -5648 9264 7231
$$ packed form
442B221j0431J4426l271j4640J5079L564j1836R217J2148j9112m057J6441r038
455G11m454J4565o56j3338J3495K710j8620O548R705r422J456J6137j2526q709
469b398J3162m315r794J0124M737j3431J1535O972j8581j154J2494p528n522J6497
483A2798p085r461J2570j408j7395P086J2486j4653L596J2269j1026p505J1958
496D230o084j1576J7022J524j2693O748Q321j4665j564J1717r852M49J3465m701
510B341j1001J2019n57j4576J0539O078r352M247J2038j3179m224J3208q449o597
524g465J4979L681j5027R613O261j4749K425R201q384j419J7484p799j1286J0565
538H080J08j1031O370P318j1610P127Q480j3534m126J0804n869p765J4912k033
$$ plain form
552 7231 -3207 4727 7804 -6698 -4521 6153 -5841 -3819 8448 467 -9194 1405 -964 -13576
566 -13576 -2391 1287 -8353 -3844 4760 -9730 -12690 772 -8166 -13976 -1407 604 -10748 -3219
580 -3219 -2165 -15802 -8473 794 -8964 -11978 2886 -2189 -9665 -3026 -7813 -12437 -1129 2724
594 2724 -10571 -3014 4540 -7017 -7193 553 -6641 -8723 8313 2153 -8855 2056 4471 -8964
608 -8964 -4313 6716 -4396 -1451 9951 1456 -6616 3622 2964 -6933 3399 6057 -1008 3854
622 3854 8527 -3469 -3711 6691 -738 -727 8266 3859 -3174 8031 5775 -9655 169 9217 484
637 484 -145 9445 -83 -3610 7697 360 -8125 3340 10309 -1423 1410 4651 -4508 -821 5120
652 5120 -3376 -5058 9867 3985 -5096 2398 574 -7028 810 6467 -6485 -628 9803 -1450
$$ packed form
552G231j0438P934L077j4502K177J0674j1994K022J2267p981r661J0599k369j2612
566a3576J1185L678r640M509Q604j4490k960J3462q938n810J2569K011j1352P529
580c219J054j3637P329R267r758l014J4864n075p476O639m787m624J1308L853
594B724j3295P557P554j1557j76P746p194k082J7036o160j1008J0911K415j3435
608h964M651J1029j1112K945J1402q495q072J0238o58r897J0332K658p065M862
622C854M673j1996k42J0402p429J1Q993m407p033J1205k256j5430R824R048q733
637D84o29R590r528l527J1307p337q485J1465O969j1732K833L241r159L687N941
652E120q496j682J4925n882r081P494j824p602P838N657j2952N857J0431j1253
$$ plain form
666 -1450 -7746 1864 -33 -7043 4285 3621 -4778 696 5136 -5372 -5208 3135 -3268 -381 6946
681 6946 -274 -6355 3583 1907 -8725 757 4067 -3327 1741 8969 -4995 -7922 6623 744
695 744 -6648 2744 6377 -2659 2556 3904 -7356 -2209 5869 -248 -3361 6184 1922 -2229 3490
710 3490 -2704 -6923 4223 7185 -6032 272 7757 -3411 -4770 3481 -2378 -6797 7680 4797
724 4797 -6522 -164 4048 -5535 -4652 4075 -2890 -1714 5334 -132 -5113 784 -1494 -7074 3169
739 3169 2818 -4682 1089 5597 -6107 -5671 5129 -3352 -5005 6318 3798 -6665 2149 4991 -7949
754 -7949 -3237 5717 969 -1610 5639 38 -3487 4233 -48 -4751 2587 6286 -832 3719 4281
769 4281 -5447 -101 6823 -1451 -3736 9541 4297 -4390 4136 4032 -5912 -658 8418 -1339 -336
$$ packed form
666a450o296R610j897p010J1328o64q399N474M440j0508J64Q343o403K887P327
681F946p220o081R938j676j0632R482L310p394N068P228j3964k927J4545n879
695G44p392R392L633r036N215J348j1260N147Q078o117l113R545m262m151N719
710C490o194m219J1146K962j3217O304P485j1168j359Q251n859m419J4477k883
724D797j1319O358M212r583Q83Q727o965J176P048n466m981N897k278n580J0243
739C169l51p500N771M508j1704M36J0800q481j653J1323k520j0463Q814K842j2940
754g949M712Q954m748k579P249n601l525P720m281m703P338L699p118M551N62
769D281r728N346O924q274k285J3277n244q687Q526j04r944N254R076r757J003
$$ plain form
784 -336 7516 577 -4776 2133 1779 -4603 3229 3624 -1870 1940 2878 -5674 -3391 4403 -3932 -2699
800 -2699 6156 516 -7020 1308 1044 -9248 -955 3716 -4296 -3033 5329 -3238 -8733 623 -1726
815 -1726 -5328 365 1595 -4816 215 1055 -8190 -3248 2240 -3400 -3481 5809 -1165 -6426 2944 -248
831 -248 -7806 495 7073 -3825 -967 7059 -1374 -5312 2733 2603 -3054 4851 4866 -699 2922 3932
847 3932 -2377 -169 6274 681 3126 7674 975 -961 6945 2548 -5458 6517 8811 -1093 2195
862 2195 8887 -756 -3265 7188 1638 -2166 6521 6973 -2789 1266 5075 -3024 -763 3583 755
877 755 805 5721 -1139 -4197 3228 -889 -4581 2155 3770 -4442 1100 4228 -6438 -4896 3102 -1508
893 -1508 -5586 4578 1635 -6554 -617 1165 -5742 -3656 2895 -3180 -1255 3903 -3167 -6164 617
$$ packed form
784c36P852o939n353O909l54o382P832L95n494L810R38q552K283P794q335J233
800b699Q855n640p536Q328k64j0292Q293M671q012J263Q362q567n495R356k349
815a726l602N693J230o411N031Q40r245M942N488n640q1R290o974n261R370l192
831b48p558Q301O578j0898K858Q026q433l938Q045j30n657P905J5n565L621J010
847C932o309K208O443n593K445M548o699j936P906m397q006J1975K294r904L288
862B195O692r643k509J0453n550l804Q687M52r762M055L809q099K261M346k828
877G55N0M916o860l058P425m117l692O736J615q212N542L128j0666J542P998m610
893a508m078J0164k943q189N937J782o907K086O551o075J925N158p070k997O781
$$ plain form
908 617 -599 -6008 2330 1959 -4382 414 3051 -6010 -5076 4412 -2312 -3792 4513 2111 -5571 -500
924 -500 1550 -5451 -328 2796 -2199 -1049 4474 -2042 -5291 1361 -1924 -2888 3278 1875 -5264 1240
940 1240 3188 -6898 -3039 3468 -2184 -4123 5583 759 -6950 230 559 -5638 -1221 4845 -3257
955 -3257 -2597 3409 -1582 -4346 -585 -1332 -3390 4242 1709 -4299 267 1242 -4460 -1552 3907 -3476
971 -3476 -1056 6043 -68 -4965 1935 1136 -6143 2813 5875 -2490 -1435 4925 -878 -3685 3332
986 3332 -522 -1979 4618 4286 -2954 576 2792 -3800 336 4295 -230 -664 5449 200 -3515 3383
1002 3383 260 -4122 2111 5919 -1548 144 3250 -3465 -1779 4259 -2 -4240 4489 3601 -2680
1017 -2680 598 180 -4093 240 5209 -2484 -1105 4798 -1028 -4239 2054 837 -5339 2594 4222
$$ packed form
908F17j216n409Q338l71o341M796K637r061R34R488o724j480Q305k402p682N071
924e00K050p001N123L124m995J150N523o516l249O652l285r64O166j403p139O504
940A240J948j0086L859O507n652j939R706m824p709P180L29o197M417O066q102
955c257O60O006m991k764L761p47k058P632k533o008M566R75n702K908N459p383
971c476K420P099o111m897O900p99p279Q956L062q365J055O360n803k807P017
986C332l854j457O597l32p240L530K216o592M136L959m525m34O113n249l715O898
1002C383l123m382O233L808p467J692L106o715J686O038m261m238Q729q88o281
1017b680L278m18m273M333M969p693J379N903n826l211O293j217o176P933J628
$$ plain form
1032 4222 -2231 -346 2489 -3513 -3464 4240 -765 -2478 3393 1944 -3418 565 1390 -4913 345 3641
1048 3641 -892 -360 3873 -1980 -4152 3275 -154 -3124 2624 3499 -3156 1187 3959 -4983 -2953
1063 -2953 4391 1671 -2227 3625 1154 -2858 2522 1031 -4043 446 5972 -744 -245 4090 -1271
1078 -1271 -2428 2613 1092 -2393 4343 3102 -2356 1823 2886 -3317 -1555 5340 -502 -641 5052
1093 5052 889 -3790 1723 2474 -4028 1434 4169 -792 -72 3332 -2214 -3609 3442 -382 -2654
1108 -2654 3090 2959 -3608 -537 2044 -4053 -1278 2190 -1026 -1123 3755 -1604 -5402 1817 229 -4599
1124 -4599 -82 3587 -2724 -1096 2281 -4066 -3607 1923 -184 -3524 2900 1175 -4291 419 1193
1139 1193 -4217 -2062 3950 -1140 -959 3109 -1462 -3929 1348 1369 -3507 1978 2536 -2009 1101 2929
$$ packed form
1032D222o453J885K835o002M9P704n005j713N871j449n362L983Q25o303N258L296
1048C641m533N32M233n853k172P427l429k970N748Q75o655M343K772q942K030
1063b953P344k720l898N852k471m012N380j491n074M489N526o716M99M335n361
1078a271j157N041j521l485O736j241n458M179J063o203J762O895n842j39N693
1093E052m163m679N513P51o502N462K735m961P20L404n546j395P051l824k272
1108b654N744j31o567L071K581o097K775L468l216r7M878n359l798P219j588m828
1124d599M517L669o311J628L377o347M59N530k107l340O424j725n466M710P74
1139A193n410K155O012n090J81M068m571k467N277K1m876N485N58m545L110J828
$$ plain form
1155 2929 -3768 -3471 4709 720 -1874 2813 1843 -2659 995 1867 -4065 852 4010 -976 -1017 4260
1171 4260 -565 -4530 1850 742 -1828 1962 2613 -3222 -55 3067 -3422 -2599 1757 -221 -1432
1186 -1432 3914 -229 -5374 633 1348 -2961 -871 2604 -2502 -356 3515 -2660 -4352 925 538
1201 538 -2576 3366 1474 -4447 239 3304 -2555 -3273 3054 -16 -311 3682 161 -3648 1158 2407
1217 2407 -3068 1572 4052 -595 -559 3108 -188 -1787 2862 -347 -806 4525 3501 -2579 -1 2370
1233 2370 -2057 1637 3578 -1707 -1344 5668 1386 -4245 753 530 -1889 2211 3866 -3362 -1654
1248 -1654 3253 -1768 -2880 981 -435 -3044 2918 1711 -4193 -1760 -151 -2632 -1249 2110 -2692
1263 -2692 -1798 2049 -1906 -3962 -35 -590 -4295 1393 1982 -2894 -1056 637 -3823 -2574 3955 -1222
$$ packed form
1155B929o697K97Q180l989k594M687r70m502L654Q72n932M917L158m986m1N277
1171D260m825l965O380j108k570L790O51n835L167L122o489Q23M356j978j211
1186a432N346m143n145O007P15m309K090L475n106K146L871o175j692N277l87
1201E38l114N942j892n921M686L065n859p18O327l070k95L993l521l809M806J249
1217B407n475M640K480m647L6L667l296j599M649l209m59N331j024o080K578K371
1233B370m427L694J941n285L63P012m282n631M998k23k419M100J655p228J708
1248a654M907n021j112L861j416k609N962j207n904K433J609k481J383L359m802
1263b692Q94L847l955k056L927n55l705N688N89m876J838J693m460J249O529n177
$$ plain form
1279 -1222 -3524 2064 1935 -2396 62 494 -4486 1245 5182 -492 -2655 2429 847 -1848 2343
1294 2343 126 -1866 2622 4403 -996 -220 2064 -1847 261 3430 726 -871 3453 988 -2052
1309 -2052 2264 716 -2776 1007 4403 -1207 -402 2773 -2259 -2679 2500 926 -3544 1913 2029 -3100
1325 -3100 -447 1476 -3359 -3452 2772 -91 -1898 610 -1463 -3633 263 655 -4527 -860 1761 -1180
1341 -1180 -1252 126 -3214 -3161 2211 -906 -2612 1349 870 -3056 -85 1120 -3933 -519 2812 -726
1357 -726 -1327 3309 -323 -3838 2006 1698 -1775 1110 3658 -1147 317 3554 -1448 -1794 3133 2502
1373 2502 -975 3005 2742 -1226 988 2167 -114 690 3673 367 1194 3810 -15 -1373 2252 2061
1389 2061 -892 3414 2751 -1359 1547 3269 -1702 -1497 4446 668 -1044 3386 1893 -2725 697
$$ packed form
1279a222k302N588j29m331K458M32m980N731L937n674k163N084j582k695M191
1294B343k217j992M488J781n399P76K284l911K108L169k704j597M324k465l040
1309b052M316j548l492L783L396n610Q05L175n032m20N179j574m470N457J16n129
1325c100K653J923m835r3O224k863j807K508k073k170L896L92n182L667K621k941
1341a180p2J378l340N3N372l117j706L961m79l926K971J205n053L414L331l538
1357g26o01M636l632l515N844l08l473K885K548m805J464L237n002l46M927o31
1373B502l477L980k63l968K214J179k281Q04K983l306Q27K616l825j358L625j91
1389B061k953M306o63m110K906J722m971K05N943l778j712M430j493m618L422
$$ plain form
1404 697 2722 -2647 67 3678 155 -1572 1965 207 -2584 976 250 -1075 1242 1642 -2181 -431
1420 -431 1306 -2839 -1312 1742 -303 -1608 1879 -718 -3448 957 134 -3360 -375 2947 -1963
1435 -1963 -1757 1763 -2059 -3023 1137 532 -2976 1445 1436 -2833 -764 1095 -2191 -2017 2610 -520 -1208
1452 -1208 2016 -285 -3176 379 1914 -2303 273 1993 -598 -237 1495 -1411 -2145 2318 318
1467 318 -821 2026 1131 -2248 514 1932 -2405 68 2414 -627 -609 3360 -512 -4010 1588 1788
1483 1788 -1969 151 2636 -1817 -1128 2355 -1558 -2659 941 1006 -1686 1014 554 -2653 -738 -14
1499 -14 -1581 -578 1364 -2184 -944 1919 -1720 -3170 107 -144 -2547 1746 1020 -3676 -1059 2012
1515 2012 -2028 -3003 2045 -400 -1940 1655 890 -2930 -851 1280 -1963 278 2184 -804 -1456 1768
$$ packed form
1404F97K025n369K714L611l523j727L537j758k791L560p26j325K317M00l823J750
1420d31J737m145J527L054k045j305L487k597k730M405q23l494K985L322m910
1435a963K06L520l822r64M160o05l508M421rm269K069J859l286J74M627l130o88
1452a208L224k301k891L555J535m217K576J720k591L61J732k906p34M463k000
1467C18j139K847q95l379K762J418m337K473K346l041J8L969l872l498N598K00
1483A788l757K120K485m453O89L483l913j101L600O5k692K700m60l207J915P24
1499a4j567J003J942l548J240K863l639j450L277k51k403M293p26m696K617L071
1515B012m040r75N048k445j540L595p65l820K079K131l243K241J906k988o52L224
$$ plain form
1531 1768 212 -1939 1140 -105 -846 2234 2242 -2162 -603 2035 -1291 -290 2129 107 -1223 2544
1547 2544 946 -2363 585 465 -1445 751 2831 -1490 -1219 1762 -1168 -1547 1300 -39 -2610 1935
1563 1935 1761 -2713 -1065 776 -1858 -1399 2470 -882 -2051 1217 80 -2505 -377 809 -2324
1578 -2324 123 1710 -665 -890 155 -1523 -1039 2455 -579 -1709 1801 1552 -1607 330 1418 -2212
1594 -2212 704 3506 121 -1189 2653 995 -1769 2139 1903 -816 1139 3588 171 146 2287 -246
1610 -246 -22 2598 1960 -288 2156 1408 -599 1816 1319 -1060 783 3530 -159 -203 2477 -301 -1635
1627 -1635 1577 1627 -1608 1231 1626 -1380 69 1519 -1626 -2116 2206 449 -1280 610 -170 -2126
1643 -2126 108 803 -2652 -336 1516 -1010 -1340 908 -1247 -2694 1191 63 -1835 326 1165 -2117
$$ packed form
1531A768j556k151L079j245p41L080Qm404J559K638l326J001K419k022j330L767
1547B544j598l309K948j20j910K196K080m321K71K981k930l79K847j339k571M545
1563A935j74m474J648J841k634M59L869l352j169L268j137k585K128J186l133
1578b324K447J587k375k25J045j678M84L494l034j130L510k49l159J937J088l630
1594b212K916K802l385j310L842j658k764L908k36k719J955K449l417k5K141k533
1610b46K24K620o38k248K444p48k007K415m97k379J843K747l689m4K680k778j334
1627a635L212N0l235K839L95l006J449J450l145m90M322j757j729J890p80j956
1643b126K234O95l455K316J852k526l30K248k155j447L885j128j898K161Q39l282
$$ plain form
1659 -2117 -1025 1117 -1775 -1105 1010 -166 -1089 1369 -429 -2593 769 651 -1594 -63 1977 -1340
1675 -1340 -726 1611 -1338 -1733 1191 489 -1755 1580 1274 -2227 -461 1302 -980 -1376 1633 -385
1691 -385 -734 1106 -307 -2257 -24 809 -1750 748 964 -1532 -706 1166 -1419 -2178 1594 -288
1707 -288 -1010 914 745 -1999 -310 1109 -1909 -5 1786 -258 -1294 1774 135 -2184 801 867
1723 867 -643 597 1672 -827 -36 1886 -1238 -358 2013 1015 -809 1853 1250 -1242 880 1332
1739 1332 -650 485 2736 -77 -278 2110 275 -981 1193 1301 -1017 1707 1849 -1088 16 1449
1755 1449 -424 -775 1903 396 -197 1336 362 -1989 222 1144 -1780 273 1322 -619 -1074 1075
1771 1075 -792 -2120 474 -387 -1023 321 735 -2376 -911 736 -1819 -1428 446 -444 -1497 523
$$ packed form
1659b117J092K142k892O70K115j176r23K458j798k164L362j18k245J531K040l317
1675a340O14K337k949l95K924p02k244L335l06l501J766J763k282l96L009k018
1691c85l49J840j413j950K233Q33k559K498K16k496Q26J872k585p59L772j882
1707b88p22J924j69k744J689J419l018J904J791k044j036L068j639k319K985O6
1723H67j510J240J075k499P91J922l124Q80K371r98j824K662o03k492K122M52
1739A332j982J135K251k813k01K388j835j256K174J08k318K724J42k937J104J433
1755A449j873l51K678j507n93J533r74k351K211R22k924K053J049j941m55K149
1771A075j867j328K594q61o36J344M14l111J465J647k555L91J874q90j053K020
$$ plain form
1787 523 -535 -2472 -55 110 -1647 -613 1023 -1361 -1081 545 -1380 -1515 844 243 -1729 753
1803 753 911 -1584 -439 497 -829 -492 1548 -685 -885 1371 95 -1581 331 1093 -1031 809
1819 809 1343 -1012 -290 1589 -221 -1172 1693 358 -756 1290 1147 -1245 -17 1405 -883 418
1835 418 1486 -45 -469 1468 267 -1446 918 617 -838 404 1392 -859 -300 1288 -1372 -874
1851 -874 1064 451 -1486 608 -114 -1516 329 172 -1356 -530 1595 -1019 -1315 633 -633 -1320 259
1868 259 169 -1734 515 812 -1417 -793 440 -710 -1371 1323 -410 -1040 920 303 -1483 -157 792
1885 792 -1366 484 1353 -651 -601 1272 -47 -1137 1416 613 -429 1092 1484 -824 113 1792 -408
1902 -408 166 1627 851 -97 1638 673 -832 1471 1391 -208 545 2154 77 75 1511 -312 -188 1613
$$ packed form
1787E23j058j937K417J65j757J034J636k384K80J626j925j35K359o01j972K482
1803G53J58k495J145R36j326L37K040k233k00K256j276j676J912P62k124J840
1819H09N34k355P22J879j810r51K865j335j114K046j43k392J228J422k288J301
1835D18J068j531m24J937j201j713K364l01j455J242R88k251N59J588k660M98
1851h74J938o13j937K094p22j402J845j57j528Q26K125k614k96J948j266o87J579
1868B59r0j903K249K97k229O24J233j150o61K694j733o30J960o17j786J326R49
1885G92k158J850Q69k004N0J873j319j090K553q03j042J521L92k308R37J679k200
1902d08N74J461p76r48J735r65j505K303q0j599P53J609k077kJ436j823J24J801
$$ plain form
1920 1613 1008 -1019 1150 1256 -904 61 713 -521 -390 1622 -469 -868 768 -182 -1414 -5 468
1937 468 -1521 187 476 -1445 -888 304 -1172 -1766 780 -554 -1536 65 94 -1772 -763 445 -1570
1954 -1570 -486 698 -588 -1186 568 -274 -1607 569 245 -570 338 956 -857 -77 1389 -667 -280
1971 -280 1460 982 -429 1413 961 -623 1109 1386 -38 466 2382 363 30 1648 600 -53 1289
1988 1289 1390 -313 1460 1400 -336 306 1184 -21 -394 1716 93 -358 942 191 -1075 87 927
2005 927 -1384 -176 864 -709 -1214 238 -849 -1791 326 -629 -1455 -389 137 -1970 -1533 -137 -1672
2022 -1672 -850 70 -1110 -1564 55 -854 -2371 -171 -162 -1362 -842 379 -1316 -1454 -255 -1222 -1087 310
2040 310 203 -1095 439 399 -864 -362 528 -281 -304 1662 -198 -471 1224 376 -910 599 1316 -476
$$ packed form
1920A613o05k027K169J06k160R65O52j234J31K012k091l99J636r50j232J409M73
1937D68j989J708K89j921N57J192j476n94K546j334r82J601K9j866J009J208k015
1954a570J084J184j286n98J754q42j333K176l24q15R08O18j813P80J466k056L87
1971b80J740m78j411J842m52j584J732K77j424N04J916k019l33J618j048o53J342
1988A289J01j703J773o0j736O42Q78j205l73K110j623m51J300p51j266J162Q40
2005I27k311J208J040j573n05J452j087r42K117r55q26J066N26k107M37J396j535
2022a672Q22R20j180m54J619r09j517K200Rj200N20J221j695j38J199r67J35J397
2040C10j07j298J534m0j263N02Q90q09k3J966j860k73J695q48j286J509P17j792
$$ plain form
2058 -476 905 1481 -154 -31 1455 417 -566 1567 412 -43 1156 1174 -359 347 1317 -490 735
2075 735 1623 331 -579 990 520 -937 950 403 -333 361 991 -711 -315 994 -754 -671 571 377
2093 377 -911 270 -64 -1236 88 -69 -965 -552 755 -585 -973 303 -482 -825 4 146 -1365
2110 -1365 404 455 -1077 -438 343 -567 -936 1158 158 -482 565 446 -905 283 1181 -839 495
2127 495 1104 -106 -77 554 264 -409 1352 618 -131 484 894 -140 164 1468 -192 -34 992 83
2145 83 -504 1046 416 -817 520 750 -331 153 892 -591 54 1217 -508 -558 974 696 -814 210
2163 210 98 -1141 -639 139 -770 -699 679 -609 -864 213 -487 -1433 -552 317 -920 -91 109 -1119
2181 -1119 -967 354 -865 -1268 625 -416 -1042 514 153 -1261 -418 775 -676 77 654 -282 -879
$$ packed form
2058d76J381N76j635J23J486j038r83K133j155m55J199J8j533P06R70j807J225
2075G35Q88j292r10J569m70j457J887n47p36O94O30j702L96J309j748Q3J242j94
2093C77j288J181l34j172J324j57q96M13J307j340l88J276p85l43Q29J42j511
2110a365J769N1j532O39P81r10l69K094j000o40J047j19j351J188Q98k020J334
2127D95O09j210K9O31k90o73J761p34p49O15M10j034L04J304j660J58J026r09
2145H3n87J550o30j233J337K30j081M84P39j483O45J163j725n0J532k78j510J024
2163B10j12j239N02P78r09P1J378j288k55J077p00r46Q81Q69j237Q29K00j228
2181a119J52J321j219m03J893j041o26J556l61j414Q43J193j451P53N77r36n97
$$ plain form
2198 -879 720 243 -991 351 358 -184 388 627 -642 -172 969 -259 -10 776 492 -327 1029 436
2216 436 -671 586 777 -154 202 1188 -281 -377 767 61 -331 609 637 -799 648 901 -774 -382
2234 -382 545 -140 -355 754 -409 -599 451 183 -874 -58 733 -1028 5 642 -394 -613 293 -41
2252 -41 -814 584 -148 -554 74 469 -700 -212 532 -666 42 551 -175 -642 525 0 -874 486 495
2271 495 -377 -97 939 -341 -216 823 -264 -254 819 885 -851 177 700 -271 -30 392 138 -376
2289 -376 1002 64 -361 680 361 -363 531 707 -830 421 583 -374 -250 495 -245 -765 921 128
2307 128 -812 -23 147 -862 -178 337 -913 -141 542 -234 -781 170 -313 -1090 89 -198 -407 -33 211
2326 211 -1074 -622 443 -650 -637 332 309 -804 207 -252 -953 -164 60 -758 -553 848 -596 -579 204
$$ packed form
2198h79J599m77j234J342Pn42N72K39j269M70J141j228K49P86k84q19J356n93
2216D36j107J257J91r31L56R86j469r6J144p06l92R40K8j436J447K53j675L92
2234c82R27o85k15J109j163j90J050k68j057Q16P91j761J033O37j036k19R06l34
2252d1p73J398p32m06O28L95j169M88P44j198P08N09p26m67J167n25q74J360R
2271D95q72K80J036j280J25J039j087J0J073O6j736J028N23r71K41M22k54n14
2289c76J378r38m25J041l19p24Q94J76j537J251J62r57J24P45p40n20J686p93
2307A28r40P89J70j009O84N15j250P72O83p76n47R51m83p77J179k87k09L74K44
2326B11j285M52J065j093J3R69k3j113J011m59p01P89K24q18K05J401j444J7P83
$$ plain form
2345 204 -352 -785 299 446 -799 258 358 -441 -22 446 -16 -491 1000 -184 -492 395 345 -621 158
2364 158 1001 -253 60 675 140 -9 378 -156 -382 1123 183 -286 429 618 -295 -115 738 -457 225
2383 225 762 -212 -555 793 173 -824 222 358 -459 -130 728 -419 -614 618 -248 -522 182 638 -433
2402 -433 248 225 -393 270 460 -104 -264 759 -188 -222 620 15 -403 290 956 -228 468 511 -413 169
2422 169 913 27 -557 974 652 -53 399 377 -260 178 828 -323 259 672 78 -181 460 89 -373 598
2442 598 225 -17 359 495 -538 -260 194 -444 -410 193 86 -610 120 -144 -1166 -404 288 -190 -871 342
2462 342 -668 -192 49 -409 -642 -264 -187 -843 115 51 -761 -682 343 -67 -676 496 -18 -102 130 3
2482 3 -523 -25 202 -160 114 520 -84 -24 410 10 -184 664 318 8 622 596 -20 159 617 -244 507
$$ packed form
2345B04n56m33J084J47j245J057J00p99M19M68m62m75J491j184l08Q87n0r66P79
2364A58Q43j254L13O15n35j49L87n34k26J505r40m69P15J89r13J80Q53j195O82
2383B25N37r74l43J348o20r97J046J36q17L29Q58j147j95J232q66k74P04M56j071
2402d33O81k3o18O63J90n64j60J023r47l4Q42o05m18O93O66j184O96M3r24N82
2422A69P44q86n84J531l22p05M52k2o37M38O50j151N82M13n94k59O41l71m62R71
2442E98l73k42L76J36j033K78M54o38L4O03j07o96P30k64j022P62O92m78o81J213
2462C42j010M76K41m58k33L78P7o56R58o4q12P9J025m10o09J172n14q4K32j27
2482Cn26M98K27l62K74M06o04O0M34m00j94Q48l46l10O14k6o16J79M58q61P51
$$ plain form
2503 507 675 164 -500 941 709 -429 367 377 133 242 733 -204 -258 357 -205 -321 361 240 -844 229
2523 229 81 -722 -206 -83 -520 -525 188 -456 -762 -215 -297 -851 -537 -80 -1147 -511 -102 -863 -753 -217 -437
2544 -437 -1015 -89 -566 -1066 -428 -325 -743 -194 -43 -912 -594 248 -92 -791 -390 26 -871 45 -33 -197
2564 -197 -22 529 -443 17 749 -63 -89 553 590 -194 714 559 -40 310 867 463 452 1209 146 100 1055
2585 1055 151 -40 677 1218 -158 275 770 304 442 741 255 -259 1067 -52 -160 591 581 -343 421
2604 421 444 -516 18 144 -251 -480 415 -507 -387 288 -9 -585 -420 258 -825 -396 447 -336 -334 475 -452
2625 -452 -774 -170 -384 -599 189 288 -433 -54 139 -503 -335 1 -677 -178 496 600 -292 155 49 -504
2645 -504 239 232 -320 88 718 41 -425 252 121 -196 569 906 -335 374 779 43 -65 501 141 -283
$$ packed form
2503E07J68n11o64J441k32j138P96J0k44J09M91r37n4O15n62j16O82j21j084J073
2523B29j48q03N16J23m37nP13o44l06N47q2n54L14M57j067O36M09p61J10N36k20
2544d37n78R26m77n00O38J03m18N49J51q69L18Q42l40o99M01M16q97R16p8j64
2564a97J75N51r72M60P32q12k6O42L7p84R08j55n99L50N57m04j1P57j063m6R55
2585A055r04j91P17N41j376M33M95m66J38K99m86n14J326j119j08P51j0r24P64
2604D21K3r60N34J26l95k29Q95r22J20O75k97n76J65O78j083M29Q43p83KQ09r27
2625d52l22O04k14k15P88R9p21L79J93o42J68L36o78M99O74J04q92M47j06n53
2645e04P43pn52M08O30o77m66O77j31l17P65L37j241P09M05p36j08N66l60m24
$$ plain form
2665 -283 639 215 -172 109 56 -154 202 500 -407 -186 110 -187 -489 21 29 -700 343 -93 -924 -360 146
2686 146 -723 -546 292 -702 -600 -44 63 -597 -147 -107 -804 -147 154 -394 -558 137 -278 -315 151 -337 -334
2707 -334 188 372 -443 165 310 -334 76 444 185 -145 652 187 49 663 388 -163 355 968 101 436
2727 436 583 170 305 736 407 -129 879 558 112 469 672 -50 93 867 136 182 537 231 -272 398
2747 398 441 -415 55 183 8 -21 171 -511 -374 281 -252 -440 -152 -151 -650 11 -151 -943 -326 -76 -535
2768 -535 -646 191 -741 -916 -36 -23 -729 -427 134 -683 -24 -60 -600 -664 47 -88 -411 109 -15 -236 197
2789 197 104 -327 27 498 -216 115 576 155 -205 494 711 222 840 539 147 744 1098 298 -163 799
2809 799 648 424 716 173 -12 594 413 -37 531 635 329 181 764 138 26 421 140 -91 80 245
$$ packed form
2665b83R22m24l87K81n3k10L56K98r07K21K96k97l02N10Qp29J043m36q31N64N06
2686A46q69J77Q38r94J02N56J07o60M50M0o97O57L01n48j64O95m15l7M66m88L
2707c34N22J84q15O08J45o44M10L68k59l30P97m65j38O14k75n51N18O13q67L35
2727D36J47m13J35M31l29n36J008l21m46L57K03p22J43P74p31M6L55l06n03O70
2747C98M3q56M70J28j75k9J92o82J37O55n33j88K88Jm99O61j62p92O17K50m59
2768e35j11Q37r32j75Q80J3p06L02N61q17O59l6n40o4P11j35l23N20j24k21M33
2789A97r3m31L54M71p14L31M61m21l60O99K17m89O18l01l92N97L54q00m61R62
2809G99j51k24K92n43j85O06j81m50N68J04l06j48N83o26j12L95k81k31J71J65
$$ plain form
2829 245 -493 8 170 -400 -265 10 -372 -446 201 -441 -662 -172 -450 -684 -341 -126 -913 -536 -254 -756
2849 -756 -693 -268 -573 -1002 -1 -246 -844 -621 -123 -574 -571 -80 -672 -373 -43 -177 -622 -154 59 -458 33
2870 33 0 -163 -28 237 -241 -66 443 -168 -80 277 367 -219 396 320 -152 221 491 72 -25 618 154 97
2892 97 518 214 -18 258 866 44 245 280 -112 -26 392 237 -249 603 203 12 265 208 -377 120 395
2913 395 -86 58 347 -112 -19 409 -239 -609 224 -76 -260 -164 268 -170 -409 78 -210 -99 135 -135 -291
2934 -291 25 118 -573 -37 194 -103 -283 57 -95 3 104 -429 -92 110 112 142 165 71 -45 -25 185 482 11
2957 11 267 -83 -411 418 527 -36 65 572 -196 168 243 -98 -76 364 89 -397 354 206 -138 -30 97
2978 97 -192 -171 317 -352 -180 137 -41 -424 -6 -10 -486 1 -36 -232 -314 45 -445 -310 168 -418 -357 -47
$$ packed form
2829B45p38N01J62n70J35K75l82p4O47o42k21M90k78k34L43K15p87L77K82n02
2849g56O3M25l05m29J001k45n98K23M98m51LM91n92K99L30j34m45M68K13n17M91
2870C3l3j63J35K65m78J75N09o11Q8L57R0n86O15p6m72L73K70m19r7O43m64n7
2892I7M21l04k32K76O08q22K01L5l92Q6M18j55m86Q52m00j91K53n7n85M97K75
2913C95m81J44K89m59R3M28o48l70Q33l00j84R6M32m38k39M87k88J11K34k70j56
2934b91L16R3o91N36K31k97j80L40j52R8J01n33L37K02KL0K3r4j16K0K10K97m71
2957A1K56l50l28Q29J09n63J01N07p68L64P5l41K2M40k75m86P51j48l44J08J27
2978I7k89K1M88o69J72L17j78l83M18mm76M87l7j96q2L59m90J35M78n86O1L10
$$ plain form
3000 -47 31 -511 -113 -75 -502 27 89 -333 -382 356 -153 -351 154 12 -215 22 345 -236 194 392 -67 -26
3022 -26 309 363 -38 389 186 160 371 299 28 252 744 58 309 440 219 130 622 392 -116 546 403 80
3044 80 171 492 -41 -75 544 78 25 136 182 -176 204 175 -316 69 157 -91 -265 104 -295 -281 110 -269 -259
3067 -259 -29 15 -578 -163 56 -407 -309 -99 -195 -337 158 -354 -517 -53 -47 -356 -286 73 -406 -49 49 -326
3089 -326 -279 167 24 -364 258 45 -174 42 242 -131 -103 433 -84 58 332 185 -173 223 329 -94 306
3110 306 211 120 140 419 -28 39 484 54 30 252 346 -122 211 244 -107 257 261 -10 -119 515 28 -209 168
3133 168 53 -87 -21 208 -322 59 199 -199 -211 36 27 -359 137 -185 -265 46 -44 -370 -167 187 -425 -160
3155 -160 2 -160 -364 -115 -126 -453 108 -95 -361 -238 57 -266 -362 85 -299 -118 -42 -85 -324 24 19 -397
$$ packed form
3000d7P8n42L98L8m27N29O2m22m9P38n09j98N05j42k27K37L23n81M30J98m59M1
3022b6L35N4m01M27k03k6K11p2k71K24M92o86K51J31k21q9M92k30n08O62j43l23
3044H0R1L21n33l4O19m66n3J11M6l58L80k9m91L85Q8k48j74L69l99J4L91l79J0
3067b59K30M4n93M15K19m63R8K10r6j42M95n12j63M64Ol09P0L59m79L57R8l75
3089c26M7M46j43l88O22k13k19K16K00l73K8N36n17J42K74j47l58L96J06m23M00
3110C06r5r1K0K79m47O7M45m30k4K22R4m68L33L3l51L64Mk71j09O34m87k37L77
3133A68j15j40O6K29n30L81J40l98j2K47rl86M96l22q0L11r0l26K03L54o12K65
3155a60J62j62k04K49j1l27N61k03k66J23K95l23r6M47l84J81P6m3k39L48nm16
$$ plain form
3177 -397 68 39 -77 -289 159 -197 -198 184 -111 -185 118 239 -355 30 172 -178 4 150 -28 -181 237
3198 237 22 -282 153 83 -60 -96 171 -280 -58 74 -239 -127 87 68 -372 266 42 -255 -66 -22 -230
3219 -230 -1 123 -287 -91 103 46 -235 153 123 -209 307 158 9 -15 184 -124 -44 292 -99 26 171
3240 171 324 -160 151 259 -8 182 397 169 -82 478 198 -5 288 22 116 168 431 -104 107 381 36
3261 36 8 200 129 -140 370 -17 -94 207 117 -124 10 257 -289 54 71 -108 -290 -64 -157 -238 66 -52 -162
3284 -162 -171 77 -237 -395 -6 -275 -80 -77 -182 -410 -133 93 -356 -53 0 -241 -135 -75 -132 -138 -4 -98 -405
3307 -405 135 377 -275 155 225 -157 209 -64 -8 -112 216 124 -51 311 192 99 389 256 -2 342 119
3328 119 105 -42 263 461 -91 390 368 -72 92 -4 39 178 472 69 215 150 734 126 108 393 -111 494
$$ packed form
3177c97M65k9j16k12M48l56jL82k95p4L03J21n94L85J42l50J82J46j78j53M18
3198B37k15l04M35p0j43l6K67m51K22J32l13J12K14j9m40O38k24k97J89M4k08
3219b30K29J24m10J96J94n7k81L88l0l32N16j49j49k4J99l08Q0L36l91J25J45
3240A71J53m84L11J08k67J90K15k28k51N60k80k03K93k66R4N2K63n35K11K74l45
3261C6k8J92p1k69N10l87p7L01r0k41J34K47n46L43J7j79j82K26r3q1L04j18j10
3284a62rK48l14j58L89k69J95Lj05k28K77K26m49L03N3k41J06O0n7oJ34r4l07
3307d05N40K42o52M30P0l82L66k73N6j04L28r2j75L62j19r3K90j33k58L44k23
3328A19j4j47L05J98n52M81k2m40J64r6M3J39K94m03J46o5N84o08j8K85n04O05
$$ plain form
3350 494 225 -339 89 235 221 152 423 -8 -456 -9 16 -292 -265 -227 -40 194 -117 -157 -367 250 208 -231
3372 -231 81 -207 -316 -86 -10 -593 -117 -19 -182 -600 -37 175 -352 -83 -267 -33 206 -24 -178 162 146
3393 146 -102 -24 -82 -349 -226 341 -13 -273 195 136 24 46 220 333 -94 343 -104 174 272 299 -122 184
3415 184 149 -207 356 235 318 -133 486 141 85 363 262 64 208 171 -358 219 288 15 -64 36 -33 -1 177
3438 177 -13 9 189 -9 121 -292 -49 -335 134 -223 -428 -666 -124 181 -584 297 198 -76 -33 18 -202
3459 -202 -657 -212 -379 -38 -117 -1 -62 -323 -68 -352 54 -73 -15 -126 91 -177 -129 72 -389 -323 -111 195
3481 195 -224 8 86 -342 15 214 277 -185 342 -72 -137 -132 114 174 -25 6 46 -265 57 -9 -114 0 3 -69
3505 -69 78 -253 -225 86 -76 -103 -216 139 -267 -294 -54 -175 -275 -199 -64 -365 -57 -186 -275 -126 -39 -181
$$ packed form
3350D94k69n64M28J46j4o9K71m31m48M47K5l08K7L8J87K34l11m0k10O17m2m39
3372b31L12k88j09K30P6n83M76R8j63m18N63K12n27K69j84K34K39k30j54L40j6
3393A46k48P8n8k67J23N67l54k60M68n9j12K2J74J13m27M37m47K78R8K7m21L06
3415A84l5l56N63j21Q3m51O19l45n6K78j01j98J44l7n29N77O9k73p9J00o9L2J78
3438A77j90K2J80j98J30m13K43k86M69l57k05k38N42L05p65Q81r9k74M3N1k20
3459b02m55M45j67L41p9J16o1k61K55k84M06j27N8j11K17k68M8K01m61O6K12L06
3481A95m19K32P8m28L57J99O3m62N27m14o5NK46O0j99L1M0l11L22o6j05J14Lp2
3505f9J47l31K8L11j62k7j13L55m06k7K40j21j00P6J35l01L08j29q9J49Q7j42
$$ plain form
3527 -181 -285 67 -250 -21 -31 66 -215 154 205 -135 41 62 -6 -23 123 91 -107 366 106 123 36 261 153
3550 153 258 241 73 281 225 131 58 353 142 29 166 227 101 125 313 -25 92 259 51 116 211 178 -112
3573 -112 106 258 -26 135 384 -65 -32 118 -214 -17 -7 -12 -218 -74 14 -112 16 -110 -123 -238 187 -119
3595 -119 -258 65 -98 -130 -84 -69 -281 2 -10 -264 -22 47 -113 -260 53 -2 -139 28 -63 9 10 187 -192
3618 -192 -55 160 23 -40 35 133 -31 258 162 32 138 206 101 109 322 50 109 194 119 189 217 156 -56 412
3642 412 244 42 30 235 162 45 265 -12 90 168 118 -34 90 221 -199 14 70 58 -178 -7 -34 -125 68
3665 68 -146 -192 -89 60 -197 -102 -100 -211 -74 -140 -198 -286 23 -124 -291 -92 -148 -229 -210 25 -267 -104 -31 -179
3689 -179 -145 3 61 -276 -8 -6 -66 -5 -5 -70 -47 268 -47 0 75 111 -8 73 141 -82 145 63 73 54 169 12
$$ packed form
3527a81j04L52l17K29j0R7k81L69N1l40J76K1o8j7J46l2j98M73k60J7q7K25j08
3550A53J05j7j68K08n6r4p3K95k11j13J37O1j26K4J88l38J17J67k08O5R5l3k90
3573a12K18J52k84J61K49m49L3J50l32J97J0nk06J44Q8j26J28j26j3j15M25l06
3595a19j39L23j63l2M6J5k12K83j2k54K42O9j60j47L13n5j37J67r1P2JJ77l79
3618a92J37K15j37o3P5R8j64K89r6j30J06O8j05QK13k72N9Q5p5P0K8o1k12M68
3642D12j68k02j2K05p3j17K20k77J02P8n0j52J24J31m20K13N6j2k36J71k7r1J93
3665F8k14m6J03J49k57R5Kj11J37o6n8q8L09j47j67J99n6q1J9K35k92J63P3j48
3689a79L4J48N8l37K68Ko0O1%o5K3L15l15M7P5L6j19Q1O8k23K27q2J0j9J15j57
$$ plain form
3715 12 -64 249 100 43 59 151 -18 228 149 -177 51 157 93 -90 143 40 -98 67 19 -35 -83 128 -187
3738 -187 -63 75 -56 -147 -67 4 -169 -26 -187 -162 -30 -50 -199 -169 56 -126 -149 -86 -136 -137 -30 -30 -300 18
3762 18 -33 -147 -65 -16 -70 -179 85 -110 9 54 -10 -193 16 210 -79 -1 78 73 -25 135 25 -98 186 53
3786 53 24 39 226 -21 49 163 48 117 95 50 -55 207 33 -105 105 92 10 -89 92 -163 8 66 -108 -142
3810 -142 13 61 -231 -47 -61 -74 -58 -28 -153 -148 23 -246 -138 -38 -54 -115 -120 -5 -92 38 -86 -111 -28 86 -73
3835 -73 -151 155 -29 -23 19 10 -112 91 140 -19 50 105 122 -43 208 155 65 152 108 116 138 240 10 134 312 121
3861 121 101 116 175 73 264 123 15 218 231 135 20 203 43 112 160 63 47 74 109 -132 136 89 -110 -51
3885 -51 94 26 -79 48 -163 -77 -19 -6 -212 -130 64 -198 -98 -107 -119 -177 7 -128 -229 -28 -137 -125 -90 36
$$ packed form
3715A2p6L13j49n7J6R2j69K46p9l26K28J06o4j83K33j03j38J65m8n4m8K11l15
3738a87J24J38j31r1Q0P1j73J43j61K5J32k0j49L0K25j82k3O3n0jJ07%k70L18
3762A8n1j14Q2M9n4j09K64j95J19M5o4j83K09J94k89P8P9nr8J60j10j23K84j33
3786E3k9J5J87k47P0J14j15O9k2m5j05K62j74j38K10j3q2r9J81k55J71N8j74l4
3810a42J55M8k92J84j4j3J6L0j25NJ71k69J08J00j6o1nJ15q7J30j24k5Q3J14j59
3835g3p8L06j84OM2rj22K03M9j59O9N5J7j65K51n3r0Q7m4QK2J02k30J24J78j91
3861A21k0J5N9j02J91j41j08K03J3r6j15J83j60O9M8r7j6K7L5k41K68m7j99N9
3885e1J45o8j05J27k11Q6N8J3k06Q2J94k62J00rj2n8J84j35j01K01j09J2L5J26
$$ plain form
3909 36 -134 -82 -59 -111 68 6 -60 -196 133 48 -128 -2 3 34 15 82 -47 16 125 5 -10 86 158 -55 141
3934 141 76 72 73 68 84 85 271 -8 43 129 161 31 39 140 -14 181 40 51 4 103 80 -83 137 -72 2 12 9 -82
3962 -82 34 25 -190 -61 50 64 -212 -69 -41 -84 -8 -245 -140 -103 -4 -193 -117 38 -162 -74 -86 -85 -189 -36 -51
3987 -51 -107 1 24 -116 -124 98 -95 -72 -5 -72 -17 19 94 -68 41 20 27 15 77 72 58 167 -25 96 120 76 -53
4014 -53 156 204 -27 68 25 125 141 178 -5 -36 213 64 -19 28 142 21 53 84 -2 103 35 51 -112 102 -30
4039 -30 -67 52 -20 -67 -127 21 -152 -101 16 -66 -153 -94 -18 -170 -56 -137 -166 -63 -96 -141 -178 55 -240 -181 -57
4064 -57 -45 -87 -171 -91 -152 94 -173 -175 -32 67 -29 -149 68 -16 -16 -57 37 44 41 110 -60 56 65 100 31 145 55 36 146
4093 146 -13 75 57 192 0 96 137 60 137 105 85 -41 141 77 -93 7 166 47 -126 151 -48 23 -108
$$ packed form
3909C6j70N2K3n2J79o2o6j36L29q5j76J26NL1j9O7j29O3J09j20j5R6P2k13J96
3934A41o5mJnJ6JJ86k79N1Q6L2j30QJ01j54J95j41J1m7R9k3j63K20k09P4J0lr1
3962h2J16rk15J29J11J4k76J43K8m3P6k37J05L7R9j89P6J55k00Q8j2Jj04J53j5
3987e1n6J08K3j40qK22j93K3O7o7N5L6P5j62J09k1Pj2O2nj4J09j92J21K4m4j29
4014e3K09M8k31R5m3J00J6L7j83l1K49j49q3M7J14j21L2L1q6J05o8J6j63K14j32
4039c0l7J19p2m7o0J48j73N1J17q2q7N9P6j52J14q1k9J03l3m5l7K33k95N9J24
4064e7J2m2q4Q0o1K46k67kJ43R9r6j20K17q4%m1R4PlO9j70J16RL5o9J14r0j9J10
4093A46j59Q8j8J35j92R6M1p7P7l2k0j26J82o4j70J00J59j19j73K77j99P1j31
$$ plain form
4116 -108 -66 8 -58 -6 -190 -11 -28 8 -74 -88 -74 -116 4 -177 -41 -4 -79 -186 -41 68 -177 6 -98 -13
4140 -13 -123 27 -5 -168 57 24 -67 -76 27 -13 42 22 -81 128 80 71 -57 199 119 -68 125 114 108 13 153 7
4166 7 127 165 32 57 103 219 -7 36 38 62 86 10 -13 32 119 -139 38 83 -11 -81 48 24 -199 67 25 -92
4192 -92 -202 37 61 -128 -68 -103 52 -106 -3 -140 -55 -12 -86 28 -62 20 -98 -8 19 -16 99 -105 -19 96
4216 96 108 -136 -2 153 36 78 22 103 -4 121 111 45 70 118 153 4 163 82 159 133 67 134 152 121 15 160
4242 160 112 116 86 37 96 36 161 -71 -9 60 71 -72 -70 60 -42 24 -106 -76 -66 -30 -130 -111 41 -179 -88 -77
4268 -77 -29 -138 -96 -84 -172 -108 -60 -101 -255 -98 -41 -173 -170 -140 -82 -168 -61 -164 -63 -96 -122 -83 -99 6 -91 -19 -117
4295 -117 -66 90 -72 -122 -57 101 -80 -27 -13 40 -9 10 113 -69 14 28 98 14 120 94 -13 61 -8 81 51 61
$$ packed form
4116a08M2P4o6N2j84J79j7L6q2j4J4m2J20j81J36L7p5j07J45J09k45J83j04Q5
4140a3j10J50l2j63K25l3r1rJ03m0N5k0j03K09m8rj28K56q0j87J93j1or5J40j46
4166GJ20L8j33K5M6J16k26M3KK4K4p6k3M5Q7k58J77M5r4p0J29k4k23K66m2j17
4192i2j10K39K4j89O0l5J55j58J03j37Q5M3p4J14r0Q2j18R0K7l5J15k04Q6J15
4216I6J2k44J34J55j17M2n6Q1j07J25j0o6K5M8L5j49J59q1P7k6o6O7J8l1j06J45
4242A60m8Ml0m9N9o0J25k32O2O9J1j43KJ30j02O6j30L0J0L6j00J9J52k20R1J1
4268g7M8j09M2J2q8O4M8m1j54J57N7j32LL0N8q6J07j03J01l3k6L9j6J05r7P2r8
4295a17N1J56j62n0O5J58j81N3J4N3m9J9J03j82Q3J4P0q4J06k6j07P4o9Q9l0J0
$$ plain form
4321 61 35 104 116 -32 84 73 54 40 77 8 18 92 13 39 22 128 -7 -13 24 48 96 -45 39 -2 88 -16 -54 48
4349 48 -31 -11 -78 39 -52 10 -8 -53 -53 10 57 -121 19 31 24 -67 -46 21 -42 -10 -102 -33 -2 76 -25 -60 26 -21 61
4378 61 -28 19 2 126 47 -69 95 15 15 -16 107 5 88 96 25 83 34 109 29 68 92 39 81 15 74 18 93 -74
4406 -74 97 84 3 51 -11 46 -36 28 -18 37 76 -8 -57 -101 58 -70 -57 -53 -30 -22 -60 -68 -108 28 -67 -94 -60 -53 -21 -79
4436 -79 -26 -96 -55 -80 -60 -73 -34 -17 -137 0 -94 38 -38 -5 -4 -61 69 -41 30 -39 101 -30 -6 -3 10 85 9 44
4464 44 -14 152 44 -31 58 37 90 -65 30 0 80 65 -9 5 32 132 -78 25 -14 108 -33 -20 12 -7 40 -123
4490 -123 -58 -28 20 -31 -59 -52 -145 2 -115 -105 -34 -8 -80 -114 -6 -85 -6 -112 -22 -32 -13 7 -94 -7 -15 22 -99 17
4518 17 47 23 20 -87 64 26 100 -52 -8 99 25 16 41 108 128 133 -17 49 96 67 124 42 171 98 95 17 105 149 66
$$ packed form
4321F1k6O9J2j48J16j1j9j4L7o9J0P4p9K6j7J06j35oL7K4M8j41Q4m1R0j04l8J02
4349D8p9K0o7J17r1O2j8m5%O3M7j78J40J2pr1K1O7o3L2r2O9L1P8j01l5Q6m7Q2
4378F1q9M7j7J24p9j16J64q0%l1J23j02Q3Qp1N8m9P5q0L9K4n3M2o6N9n6P5j67
4406g4J71j3q1M8o2N7q2O4m6N5L9q4m9m4J59j28J3MK3Ql8qm0J36r5k7L4PL2n8
4436g9N3p0M1k5K0j3L9J7j20J37r4J32p6L3Jn7J30j10P1o9J40j31K4LJ3P5p6L5
4464D4n8J66j08p5Q9k1N3j55R5l0Q0j5p4J4K7J00k10J03l9J22j41J3L2j9M7j63
4490a23O5L0M8n1k8Pr3J47j17J0P1K6p2l4J08p9P9j06R0j0J9K0j01Q7qL7j21J16
4518A7L0k4lj07J51l8P4j52M4J07p4rK5O7K0Nj50O6M7k9N7q2J29p3lp8Q8M4q3
$$ plain form
4547 66 155 -4 120 26 117 5 55 166 23 7 -56 73 10 8 -29 -5 74 -28 45 -37 -49 -43 -29 -68 -93 -24 -113 -45
4575 -45 -126 -21 -59 -74 -88 -94 -29 -129 -76 -94 -19 -77 -108 -80 -115 -27 -146 -81 -66 -9 -63 -78 -8 -30 37 -89 -8 -11 60
4604 60 39 -11 -17 18 79 -10 46 29 98 54 -1 49 26 105 1 80 50 7 56 4 36 -11 62 46 64 19 65 8 -27 26
4634 26 30 77 -65 -12 70 55 -24 -128 -21 -45 -22 -51 -89 -86 -72 -30 -121 -2 -61 -6 -100 -38 -7 -74 -117 -80 31 -31 -27
4663 -27 -87 -54 10 -97 -15 -83 13 -48 -19 50 23 47 2 60 -49 97 -42 19 13 39 51 -5 75 -13 105 42 43 27 28
4692 28 93 11 36 -1 72 -3 35 8 29 39 -33 -7 -77 24 35 4 -34 -42 18 -44 -26 -94 31 -27 -105 -42 -103 4 -82
4721 -82 -52 -33 8 -12 -119 -88 -20 36 -80 -4 -14 42 11 -70 -36 -19 49 -133 9 1 -36 25 20 49 -18 83 50 50 91
4750 91 101 36 -14 86 86 155 48 63 78 87 127 34 136 20 104 103 96 75 87 128 9 96 81 108 19 71 108 57 49 -24
$$ packed form
4547F6Q9j59J24r4R1j12N0J11j43j6o3J29o3kl7K4P9j02P3q2j2OJ4l9k5O9q9O8
4575d5q1J05l8j5j4oO5j00N3j8P5n8l1K8l5Q8j19O5J5N7n4j5P0k2O7j26Q1lP1
4604F0k1n0oL5O1q9N6j7O9m4n5N0k3P9j04P9l0m3M9n2L2m7P3j6J8m5M6n7l5N3
4634B6MM7j42N3Q2j5p9j04J07k4K3k9l8LJ4M2r1J19n9N5r4O2L1o7m3L7J11o2M
4663b7o0L3O4j07Q2o8R6o1K9O9k7K4m5N8j09J46j39O1oK6J2n6Q0q8J18o3Jj6J
4692B8O5q2K5l7P3p5L8k7K1J0p2K6p0J01J1l1l8qO0o2J8o8J25n8p8O3o1J07q6
4721h2L0J9M1k0j07L1O8N6j16P6j0N6l1q1L4J7O8j82J42ql7O1nK9o7J01l3%M1
4750I1J0o5n0J00%O9j07J5J5RM0r3J02j16Q4jpk1J2M1j19Q7j5K7q9N2L7n1qp3
$$ plain form
4780 -24 39 39 0 -7 -24 51 -40 -2 -76 -42 -31 -29 -117 -147 -4 -61 -105 -114 -46 -150 -166 -141 -116 -76 -109 -92 -212 -66 -96 -178
4810 -178 -164 -129 -145 -119 -84 -129 -52 -26 -89 -96 -68 -35 -118 -22 -60 6 -9 -19 7 -33 60 -57 36 -6 97 43 41 45 48 119 60
4841 60 108 63 111 85 119 98 116 115 68 170 69 112 167 -5 77 52 177 2 58 85 76 39 -34 36 19 60 -21 11 4
4870 4 4 -14 -62 7 -38 49 -36 -49 -21 -24 -101 -123 29 -69 -26 -102 -46 -79 -34 8 -92 -61 -27 -7 -56 -89 -80 -17 5 -84 24
4901 24 -6 10 -82 26 48 -49 42 2 92 -4 18 12 7 97 54 23 -19 98 7 106 29 -3 51 16 63 -17 103 51 14 13
4931 13 -25 14 -30 57 -60 0 45 -33 -40 -49 48 -126 -57 -109 -34 -99 -55 -67 -133 -39 -92 -90 -86 -22 -71 -91 -83 -137 -35 -59 -67 -66
4963 -66 -40 -38 -107 -71 -20 11 -18 53 -41 -13 30 -14 -16 -10 46 10 27 57 47 93 1 96 45 149 -35 65 110 67 40 62
4993 62 150 -8 164 87 21 48 112 125 -39 123 69 58 61 52 57 35 24 -61 63 -1 5 -43 27 -4 -39 12 -149 -81 34
$$ packed form
4780b4O3%l9pj7P5r1L8p4L4J1Kq8l0J43n7m4rO8j04j6K5K5M0l3J7j20J46l0q2
4810a78J4L5j6K6L5m5P7K6o3pK8L3q3R6l8O6j5j0K6m0R3j17R3m2J03n4kMLP1n9
4841F0M8m5M8k6L4k1J8jm7J02j01M3N5j72Q2k5J25j75N6K7rl7p3P0j7M1q1L2p
4870D%j8m8O9m5Q7q5j3K8lp7k2J52r8M3p6N6l3M5M2j00L1L4K0m9l3RO3K2q9J08
4901B4l0J6r2J08K2r7R1m0R0r6K2onR0m3l1m2J17r1R9p7l2N4l5M7q0J20n2l7j
4931A3l8L9m4Q7j17O0M5p8prR7j74O9n2P5o5M4j2o6R4n3KMO4m9k0Qn4J02k4qJ
4963f6K6Ko9L6N1L1k9P1r4K8M3m4kON6l6J7L0j0M6r2R5n1J04j84J00M5m3k7K2
4993F2Q8j58J72p7o6K7O4J3j64J62n4j1LrNk2j1q5J24o4Om8P0l1l5N1j61O8J15
$$ plain form
5022 34 -13 -128 -134 -46 -42 -68 -70 -58 -46 -21 -67 -147 -93 -37 -54 -146 -41 -77 -37 -2 -122 -29 23 -95 -125 26 -22 -48 -29
5051 -29 -33 49 3 31 7 0 102 27 10 32 126 28 112 45 96 126 56 45 30 188 58 -35 132 119 51 54 124 18 116
5080 116 74 62 -13 128 97 -20 71 37 121 -4 71 -9 9 47 -35 9 -49 73 -32 -12 -50 -75 67 -105 -75 -65
5106 -65 64 -55 -100 22 -14 -19 -82 8 -100 22 -32 -57 -17 36 -36 -63 6 -30 -2 -48 -17 -44 -31 34 -85 36 44 59
5134 59 -55 20 6 -89 84 -16 36 41 58 -50 -32 85 17 -27 -8 20 -28 112 17 -49 55 4 -29 -73 133 7
5160 7 3 2 -55 30 31 14 -141 -25 67 -78 -34 -11 -17 -90 29 -60 -1 40 -30 -13 -6 -7 -67 47 9 -33 -43 3 -56 -100 94
5191 94 -19 -19 -42 11 6 -22 60 -101 35 23 -4 -88 61 54 -111 13 36 48 -6 7 -59 33 63 -38 -52 4 37 -43
5219 -43 -35 54 -30 25 -21 -46 43 87 -74 -21 13 -51 -21 -16 8 -69 22 29 -47 -10 34 9 -117 -2 -104 4 -32 -37 -24 -18
$$ packed form
5022C4m7j15oQ8Mk6kJ2J2K5m6q0N4N6j7r2J05l6M0L5j20R3N2j18l0J51m8k6J9
5051b9mQ2m6K8k4pJ02p5j7K2R4r8Q4o7N1L0p0j1j5J58j30r3J67j3o8LP0j06R8
5080A16m2j2p5J41l1j17R1l4Q4j25P5q0J8L8q2M4n8J22j05K0l8k5J42j72L0J0
5106f5J29j19m5J22l6no3R0j08J22n4k5M0N3p2k7O9l6K8m6L1k7J3O5j19J21QJ5
5134E9j14P5j4r5J73j00N2NJ7j08J8J17o8m4J9K8m8J40r5o6J04n1l3m4K06j26
5160Gmjn7Q5Jj7j55J16R2j45M4K3op3J19q9N9M1p0J7Pjo0J14l8m2j0M6n9m4J94
5191I4j13%k3N3nk8Q2j61J36j2k7q4J49pj65J24K3J2n4J3o6R2L0j01j4N6L3q0
5219d3QQ9q4N5m6k5Q9M4j61N3L4o4L0NK4p7R1Pp6L7M4k5j26J15j02J08l6nJ3O
$$ plain form
5249 -18 59 -67 -14 39 9 -60 19 -44 -5 20 -41 12 -20 45 -52 -77 66 -4 29 -32 -5 5 96 -13 19 44 30 45 -75
5278 -75 73 37 82 31 -8 36 33 78 -43 56 132 28 52 31 24 4 160 11 -3 108 -31 -50 36 100 -11 47 21
5305 21 -2 16 3 -35 -29 61 -42 5 -25 98 -45 -45 -3 -131 9 -1 -29 -121 9 -18 -79 -37 -64 -53 -22 16 -147 -27
5333 -27 17 -87 -50 -38 -41 -104 28 26 34 -11 -31 -59 9 113 -64 -42 42 23 -4 -16 95 -8 96 46 1 21 71 27
5361 27 -88 119 63 47 58 54 -3 65 114 -7 -11 9 40 -17 34 56 4 133 5 -48 -3 36 -23 -94 63 -24 39 -19
5389 -19 18 -37 72 5 -135 42 4 0 -10 69 -96 -8 44 -15 20 -9 96 -62 102 28 -26 32 19 5 71 116 -26
5416 -26 0 -3 -6 -106 -48 99 -23 61 12 -9 2 45 -61 -69 81 -13 -13 29 73 16 -15 10 -81 7 33 14 -64 54 18
5445 18 -82 5 -22 -19 14 75 -79 -9 55 -80 -56 -5 -2 -33 -48 -51 -78 1 16 -54 -92 77 -66 -77 -1 35 1 11 9 2
$$ packed form
5249a8P7j26N3N3l0o9P9o3L9K5o1N3l2O5r7k5J43p0L3o1K7J0R1j09L2K5j4J5j20
5278g5J48l6M5n1l9M4lM5j21R9P6j04K4k1pk0J56j49j4J11j39j9Q6O4j11N8k6
5305B1k3J8j3l8OR0j03M7l0J23j43%M2j28J40j0k8r2J30k7o1M2k7J1L1L8j63J20
5333b7M4j04L7J2lo3J32kQm5k0k8O8J04j77K2Q4j9k7j2J11j03J04n0m5K0N0m4
5361B7j15K07n6j6J1mn7O8M9j21mK0L1n7N1K2n2J29j28n3M5L9n9p1J57q7O3n8
5389a9L7n5J09o7j40J77l8mj0P9j65Q8N2n9L5k9J05j58J64p4n4N8j3j4O6M5j42
5416b6K6llj00N8J47j22Q4m9k1J1M3j06qJ50r4%M2M4n7l1K5r1Q8K6j9p8J18l6
5445A8j00Q7k7LL3O1j54P0O4j35K4N1Ll1j5lk7P9J5p0l8J69j43j1P6L6l4J0kp
$$ plain form
5475 2 93 98 -48 38 71 68 12 17 -10 -17 58 53 10 32 168 33 81 151 33 59 17 -26 -63 117 53 55 122 250 -48 47
5505 47 198 26 127 118 -8 64 -13 18 -50 148 309 27 -161 92 -3 75 51 -57 2 140 100 0 198 -11
5529 -11 -116 37 12 -136 -13 5 -78 -21 31 -9 -95 -73 -87 -113 -23 -99 -123 -93 -78 -160 -174 -37 -71 -113 -87 -69 -115 -54
5557 -54 -77 -107 -61 -42 -69 -83 -79 51 -122 -21 -74 -165 -225 120 -61 -45 -141 -280 53 5 172 -62 69 -7 -36 121
5583 121 20 -7 45 85 3 14 55 102 -10 72 213 -35 168 40 -51 138 -1 61 -5 172 88 61 151 36 -22
5608 -22 108 109 -113 7 -6 10 88 141 79 -94 85 -20 -72 127 -11 -53 -82 31 -69 -38 -114 -107 -75 64 -109
5633 -109 -88 -16 -79 -65 17 20 -129 24 -44 -132 -84 -34 47 -115 -38 -19 -42 -26 -39 -14 -83 31 -59 -24 -38 1 -88 13
$$ packed form
5475BR1Nj46Q6L3ln6Nk7pP5nm3K2J36j35M8P0j18K6m2m3l7J80o4KO7J28k98R5
5505D7J51j72J01rj26P2p7L1o8J98J61k82j88K53r5P8k4j08N9J38m0j00J98k09
5529a1j05J53k5j48J23J8q3N7N2m0q6K2j4k6R0p6k4L0J5q2j4J37l4m2K6J8m6O1
5557e4k3l0M6J9k7j4MJ30j73J01n3r1o0L45j81J6r6j39L33m8J67k34J31p6k9J57
5583A21j01k7N2M0q2J1M1M7j12Q2J41k48K03j28r1J89j39O2o6J77q4k7R0j15n8
5608b2J30Jk22J20j3J6P8N3o2j73J79j05n2J99j38m2k9J13j00L1p6PL2J39j73
5633a09K1P2o3J4Q2Lj49J53o8q8M8N0Q1j62P7J9k3J6j3K5o9J14r0L5j4L9q9J01
$$ [...]
8191G1
##END NTUPLES=NMR FID
##END=
