##TITLE=1H_TG-2309-XY
 DMSO, 8 sc, 
 14.12.2020
##JCAMPDX= 6.0         $$ Bruker NMR JCAMP-DX V2.0
##DATA TYPE= NMR SPECTRUM
##DATA CLASS= NTUPLES
##ORIGIN= UXNMR, Bruker Analytische Messtechnik GmbH
##OWNER= root
$$ XWIN-NMR		Version 3.5
$$ Mon Dec 14 10:51:34 2020 Russian Standard Time (UT+4h)  she@DPX200
##.OBSERVE FREQUENCY= 200.1315066352
##.OBSERVE NUCLEUS= ^1H
##.ACQUISITION MODE= SIMULTANEOUS
##.ACQUISITION SCHEME= undefined
##.AVERAGES= 8
##.DIGITISER RES= 18
##SPECTROMETER/DATA SYSTEM= spect
##.PULSE SEQUENCE= zg30
##.SOLVENT NAME= C6D6
##.SHIFT REFERENCE= (INTERNAL, C6D6, 0, 15.9668)
##AUDIT TRAIL= $$ (NUMBER, WHEN, WHO, WHERE, WHAT)
$$ ##TITLE= Audit trail, XWIN-NMR		Version 3.5
$$ ##JCAMPDX= 5.01
$$ ##ORIGIN= Bruker BioSpin GmbH
$$ ##OWNER= she
$$ F:/spectra/data/she/nmr/H-F/1/pdata/1/auditp.txt
$$ ##AUDIT TRAIL=  $$ (NUMBER, WHEN, WHO, WHERE, WHAT)
(   1,<2020-12-14 10:50:22.26 +0400>,<she>,<DPX200>,
      <created by zg, POWCHK disabled, PULCHK disabled
       configuration hash MD5:
       00 E9 B6 7A A2 85 ED C7 34 08 36 98 17 FE 4E 26
       data hash MD5: 16K
       89 F0 C7 29 42 5C 96 4E 1C A3 75 36 BC EF 3E 1E>)
(   2,<2020-12-14 10:50:24.76 +0400>,<she>,<DPX200>,
      <Start of raw data processing
       efp BC_mod = 2 LB = 0.24 FT_mod = 6 PKNL = 1 PHC0 = -10758.17 PHC1 = 4.80088 SI = 16K 
       data hash MD5: 16K
       04 56 76 31 56 E3 73 53 B8 21 31 4A CB 2D 83 93>)
(   3,<2020-12-14 10:50:51.12 +0400>,<she>,<DPX200>,
      <pk PHC0 = -154.1497 PHC1 = -8 
       data hash MD5: 16K
       A3 21 9E 90 37 DD 81 80 AC 7D 30 A3 39 D7 AC 2B>)
(   4,<2020-12-14 10:50:54.89 +0400>,<she>,<DPX200>,
      <abs ABSG = 5 
       data hash MD5: 16K
       90 F6 76 16 19 D1 8C DA 29 70 F8 0A B3 CC 2A A0>)
$$ ##END=
$$ 
$$ hash MD5
$$ 19 0D 99 B5 AE BB CC 56 82 5F BF FF D8 2F ED 82
##$RELAX= 
##$RELAX= 
##$RELAX= 
##$RELAX= 
##$RELAX= 
##$RELAX= 
$$ Bruker specific parameters
$$ --------------------------
##$DU= <F:/spectra>
##$EXPNO= 1
##$NAME= <H-F>
##$PROCNO= 1
##$TYPE= <nmr>
##$USER= <she>
##$AMP= (0..31)
100 100 100 100 100 100 100 100 100 100 100 100 100 100 100 100 100 100 
100 100 100 100 100 100 100 100 100 100 100 100 100 100 
##$AQSEQ= 0
##$AQ_mod= 1
##$AUNM= <au_zg>
##$AUTOPOS= <>
##$BF1= 200.13
##$BF2= 200.13
##$BF3= 200.13
##$BF4= 200.13
##$BF5= 200.13
##$BF6= 200.13
##$BF7= 200.13
##$BF8= 200.13
##$BYTORDA= 1
##$CFDGTYP= 0
##$CFRGTYP= 5
##$CHEMSTR= <none>
##$CNST= (0..31)
1 1 145 1 1 1 1 1 1 1 1 1 1 1 1 1 1 1 1 1 1 1 1 1 1 1 1 1 1 1 1 1 
##$CPDPRG= <>
##$CPDPRG1= <>
##$CPDPRG2= <>
##$CPDPRG3= <>
##$CPDPRG4= <mlev>
##$CPDPRG5= <mlev>
##$CPDPRG6= <mlev>
##$CPDPRG7= <mlev>
##$CPDPRG8= <mlev>
##$CPDPRGB= <>
##$CPDPRGT= <>
##$D= (0..31)
0 1.2 0 0 0 0 0 0 0 0.06 0 0.03 0 0 0 0 0.0002 0 0 0 0 0 0 0 0 0 0 0 0 
0 0 0 
##$DATE= 1607928621
##$DBL= (0..7)
120 120 120 120 120 120 120 120 
##$DBP= (0..7)
150 150 150 150 150 150 150 150 
##$DBP07= 0
##$DBPNAM0= <>
##$DBPNAM1= <>
##$DBPNAM2= <>
##$DBPNAM3= <>
##$DBPNAM4= <>
$$ [...]
##$SUBNAM3= <"">
##$SUBNAM4= <"">
##$SUBNAM5= <"">
##$SUBNAM6= <"">
##$SUBNAM7= <"">
##$SUBNAM8= <"">
##$SUBNAM9= <"">
##$SW= 16.9725356469052
##$SWIBOX= (0..15)
0 0 2 0 0 0 0 0 0 0 0 0 0 0 0 0 
##$SW_h= 3396.73913043478
##$TD= 16384
##$TD0= 1
##$TE= 0
##$TE2= 300
##$TE3= 300
##$TEG= 300
##$TL= (0..7)
0 120 120 120 120 120 120 120 
##$TP= (0..7)
150 150 150 150 150 150 150 150 
##$TP07= 0
##$TPNAME0= <>
##$TPNAME1= <>
##$TPNAME2= <>
##$TPNAME3= <>
##$TPNAME4= <>
##$TPNAME5= <>
##$TPNAME6= <>
##$TPNAME7= <>
##$TPOAL= (0..7)
0.5 0.5 0.5 0.5 0.5 0.5 0.5 0.5 
##$TPOFFS= (0..7)
0 0 0 0 0 0 0 0 
##$TUNHIN= 0
##$TUNHOUT= 0
##$TUNXOUT= 0
##$USERA1= <user>
##$USERA2= <user>
##$USERA3= <user>
##$USERA4= <user>
##$USERA5= <user>
##$V9= 5
##$VALIST= <valist>
##$VCLIST= <CCCCCCCCCCCCCCC>
##$VD= 0
##$VDLIST= <DDDDDDDDDDDDDDD>
##$VPLIST= <PPPPPPPPPPPPPPP>
##$VTLIST= <TTTTTTTTTTTTTTT>
##$WBST= 1024
##$WBSW= 4
##$XGAIN= (0..3)
0 0 0 0 
##$XL= 0
##$YL= 0
##$YMAX_a= 398360
##$YMIN_a= -454232
##$ZGOPTNS= <>
##$ZL1= 120
##$ZL2= 120
##$ZL3= 120
##$ZL4= 120
##$ABSF1= 15.96678
##$ABSF2= -1.005882
##$ABSG= 5
##$ABSL= 3
##$ALPHA= 0
##$AQORDER= 0
##$ASSFAC= 0
##$ASSFACI= 0
##$ASSFACX= 0
##$ASSWID= 0
##$AUNMP= <proc_1d>
##$AZFE= 0.1
##$AZFW= 0.1
##$BCFW= 0
##$BC_mod= 2
##$BYTORDP= 0
##$COROFFS= 0
##$CY= -3
##$DATMOD= 1
##$DC= 0
##$DFILT= <>
##$DTYPP= 0
##$F1P= 0
##$F2P= 0
##$FCOR= 1
##$FTSIZE= 16384
##$FT_mod= 6
##$GAMMA= 0
##$GB= 0
##$INTBC= 1
##$INTSCL= 2.992141e-10
##$ISEN= 128
##$LB= 0.24
##$LEV0= 0
##$LPBIN= 0
##$MAXI= 10000
##$MC2= 0
##$MEAN= 0
##$ME_mod= 0
##$MI= 1.114404
##$NCOEF= 0
##$NC_proc= -5
##$NLEV= 6
##$NOISF1= 3.799351
##$NOISF2= 2.8
##$NSP= 0
##$NTH_PI= 0
##$NZP= 0
##$OFFSET= 15.96678
##$PC= 1
##$PHC0= -10912.32
##$PHC1= -3.19912
##$PH_mod= 1
##$PKNL= yes
##$PPARMOD= 0
##$PSCAL= 0
##$PSIGN= 0
##$REVERSE= no
##$SF= 200.130009573309
##$SI= 16384
##$SIGF1= 3
##$SIGF2= 2
##$SINO= 5.538805
##$SIOLD= 16384
##$SREGLST= <1H.CDCl3>
##$SSB= 0
##$STSI= 16384
##$STSR= 0
##$SW_p= 3396.73913043478
##$SYMM= 0
##$S_DEV= 0
##$TDeff= 16384
##$TDoff= 0
##$TI= <>
##$TILT= no
##$TM1= 0
##$TM2= 0
##$TOPLEV= 0
##$USERP1= <user>
##$USERP2= <user>
##$USERP3= <user>
##$USERP4= <user>
##$USERP5= <user>
##$WDW= 1
##$XDIM= 16384
##$YMAX_p= 333191092
##$YMIN_p= -312537
$$ End of Bruker specific parameters
$$ ---------------------------------
##NTUPLES= NMR SPECTRUM
##VAR_NAME=  FREQUENCY,     SPECTRUM/REAL,   SPECTRUM/IMAG
##SYMBOL=    X,             R,               I
##VAR_TYPE=  INDEPENDENT,   DEPENDENT,       DEPENDENT
##VAR_FORM=  AFFN,          ASDF,            ASDF
##VAR_DIM=   16384,         16384,           16384
##UNITS=     HZ,            ARBITRARY UNITS, ARBITRARY UNITS
##FACTOR=    0.207333158178281, 1,           1
##FIRST=     3195.43177598953, 0,            0
##LAST=      -201.307354445251, 0,           0
##MIN=       -201.307354445251, -312537,     0
##MAX=       3195.43177598953, 333191092,    0
$$ Real data points
##PAGE= N=1
##DATA TABLE= (X++(R..R)), XYDATA
$$ [...]
$$ plain form
12655 96298 -3383 -60827 -107166 -124650 -74541 6819 66038 46475 -56058 -157703 -147594
12644 -147594 -144073 -94072 -77519 -20086 -27412 -88599 -145293 -156246 -110698 -38671 -9868 11003
12632 11003 10239 -40733 -82420 -44819 12348 895 -14607 -52215 -50334 -97994 -100105 -108320 -64279
12619 -64279 -13392 -36601 -142434 -172734 -200143 -212344 -185218 -100230 -85533 -102153 -97776 -135797
12607 -135797 -170295 -201594 -125665 -49765 -90625 -85406 9724 25727 52714 73728 53496 -6666
12595 -6666 -8937 12982 26165 52793 80958 128602 168095 89022 -41814 -24551 13001 7799
12583 7799 894 24868 25775 -2209 -94500 -84213 -30599 -47635 -37437 29434 7677 -59718
12571 -59718 -104836 -82319 -73731 -64287 9569 26801 1244 -54799 -82197 -118386 -90627 -52423
$$ packed form
12655I6298r9681n7444m6339j7484N0109Q1360N9219j9563j02533j01645J0109
12644a47594L521N0001J6553N7433p326o1187n6694j0953M5548P2027K8803K0871
12632A1003p64n0972m1687L7601N7167j1453j5502l7608J881m7660k111q215M4041
12619f4279N0887k3209j05833l0300k7409j2201K7126Q4988J4697j6620M377l8021
12607a35797l4498l1299P5929P5900m0860N219R5130J6003K6987K1014k0232o0162
12595f666k271K1919J3183K6628K8165M7644L9493p9073j30836J7263L7552n202
12583G799o905K3974R07k7984r2291J0287N3614j7036J0198O6871k1757o7395
12571e9718m5118K2517Q588R444P3856J7232k5557n6043k7398l6189K7759L8204
$$ plain form
12559 -52423 46914 52863 -8916 -87343 -71997 -24885 36705 23146 45759 98160 30697 -34841
12547 -34841 6640 3659 -23655 -29246 50623 48245 -67161 -79930 -74742 -64079 -50484 -34816
12535 -34816 -40899 -36347 -144692 -209446 -200086 -170206 -175629 -118159 -105344 -119126 -168096 -172670
12523 -172670 -135690 -175318 -88976 -23271 -35290 -52263 -46141 11708 77230 -1034 -25363 43730
12511 43730 85922 16125 4158 102086 164996 83695 52284 120799 99720 28883 16986 29127
12499 29127 23247 -49357 -40560 -32602 -93683 -22677 -19181 16074 -32259 -58973 -94267 -83247
12487 -83247 -134127 -162647 -117322 -67064 -51185 -46878 24797 38573 -36313 -68053 -523 -87637
12475 -87637 -69873 53514 90232 34073 -17776 64573 46798 -27776 -17392 -53134 -22570
$$ packed form
12559e2423R9337N949o1779p8427J5346M7112O1590j3559K2613N2401o7463o5538
12547c4841M1481k981k7314n591P9869k378j15406j2769N188J0663J3595J5668
12535c4816o083M552j08345o4754R360K9880n423N7470J2815j3782m8970m574
12523a72670L6980l9628Q6342O5705j2019j6973O122N7849O5522p8264k4329O9093
12511D3730M2192o9797j1967R7928O2910q1301l1411O8515k1079p0837j1897J2141
12499B9127n880p2604Q797P958o1081P1006L496L5255m8333k6714l5294J1020
12487h3247n0880k8520M5325N0258J5879M307P1675J3776p4886l1740O7530q7114
12475h7637J7764J23387L6718n6159n1849Q2349j7775p4574J0384l5742L0564
$$ plain form
12464 -22570 -38675 -47694 -102285 -47085 40435 28854 1077 -96174 -99873 -89876 -10905 -18130
12452 -18130 67734 53866 -6848 -90787 -103769 -105684 -47526 -11887 4752 63400 -11141 -75283
12440 -75283 -103468 -40162 -41711 -53788 3827 42831 30912 -27755 -106944 -121472 -185771 -118732
12428 -118732 -95767 -63562 -96846 -74553 -72124 -168636 -227944 -185966 -214241 -147427 -87135 -86806
12416 -86806 -101109 -170978 -144653 -174429 -104820 -92676 4817 45225 24052 -42003 -25957 79565
12404 79565 79406 102218 103422 104477 80972 17004 19349 83794 110852 104801 49525 -16834 -67948
12391 -67948 -60141 -61644 -80145 -54891 20978 -27544 -134624 -226231 -214804 -154537 -93393 -149180
12379 -149180 -110670 -47293 -116304 -118288 -125032 -107054 -102180 -42953 -109217 -104651 -128759 -128717 -84641
$$ packed form
12464b2570j6105r019n4591N5200Q7520j1581k7777r7251l699R997P8971p225
12452a8130Q5864j3868o0714q3939j2982j915N8158L5639J6639N8648p4541o4142
12440g5283k8185O3306j549j2077N7615L9004j1919n8667p9189j4528o4299O7039
12428a18732K2965L2205l3284K2293K429r6512n9308M1978k8275O6814O0292L29
12416h6806j4303o9869K6325k9776O9609J2144R7493M0408k1173o6055J6046J05522
12404G9565j59K2812J204J055k3505o3968K345O4445K7058o051n5276o6359n1114
12391f7948P807j503j8501K5254P5869m8522j07080r1607J1427O0267O1144n5787
12379a49180L8510O3377o9011j984o744J7978M874N9227o6264M566k4108M2M4076
$$ plain form
12366 -84641 -6829 -4287 -50730 -3301 8445 -75419 -65200 -65747 -107862 -111293 -104695 -110901 -104881
12353 -104881 -125408 -121488 -72881 -103762 -102893 -124031 -93123 -128224 -137200 -114777 -35791 -12193
12341 -12193 -31651 -60242 -30711 -103996 -197398 -60720 -32756 -51369 8812 63526 -2073
12330 -2073 -96420 -120719 -74468 -42946 -90247 -100370 -81689 -79072 -98041 -135513 -79829 -37408
12318 -37408 -47628 -33481 -12778 -81703 -61969 -40298 -81625 -144399 -126937 22010 32179
12307 32179 -58502 -89367 3251 -36575 -119440 -132956 -88345 42902 12777 -55648 -25366
12296 -25366 -76496 -149723 -117428 -73309 -69598 -112900 -40910 -11400 -130327 -135423 -96943 19085
12284 19085 12238 4454 5387 -10240 -49722 -97622 -76000 -60005 -55267 -78952 -61276 -53558 -134755
$$ packed form
12366h4641P7812K542m6443M7429J1746q3864J0219n47m2115l431O598o206O020
12353a04881k0527L920M8607l0881Q69k1138L0908l5101q976K2423P8986K3598
12341a2193j9458k8591K9531p3285r3402J36678K7964j8613O0181N4714o5599
12330b073r4347k4299M6251L1522m7301j0123J8681K617j8969l7472N5684M2421
12318c7408j0220J4147K0703o8925J9734K1671m1327o2774J7462J48947J0169
12307C2179r0681l0865R2618l9826q2865j3516M4611J31247l0125o8425L0282
12296b5366n1130p3227L2295M4119L711m3302P1990K9510j18927n096L8480J16028
12284A9085o847p784R33j5627l9482m7900K1622J5995M738k3685J7676P718q1197
$$ plain form
12271 -134755 -106834 -42791 -56089 -62393 -52295 -21356 -110376 -142279 -24530 -4703 -46272
12260 -46272 -104062 -105571 -59823 -99967 -171101 -154522 -7230 -9746 -11973 19631 -34220 -59734
12248 -59734 -108583 -21555 -953 -37316 -34163 -57035 -57071 -79842 -97885 -55384 -65681 -110130
12236 -110130 -69295 -55469 -74867 -138391 -113040 -53006 -44402 -110135 -145257 -133715 -201433 -227352
12224 -227352 -128282 -41956 -42790 -95954 -94696 -122548 -117386 -37695 29322 87875 116464 68835
12212 68835 74810 37798 -18182 -6669 58549 94017 31376 53117 44557 -752 -22712 14092
12200 14092 66386 48651 -45478 -105549 -124862 -132676 -149106 -145736 -230040 -244329 -168628 -149990
12188 -149990 -160536 -217806 -182889 -70925 -57851 -133775 -175605 -105417 9697 32500 44866
$$ packed form
12271a34755K7921O4043j3298o304J0098L0939q9020l1903J17749J9827m1569
12260d6272n7790j509M5748m0144p1134J6579J47292k516k227L1604n3851k5514
12248e9734m8849Q7028K0602l6363L153k2872l6k2771j8043M2501j0297m4449
12236a10130M0835J3826j9398o3524K5351O0034Q604o5733l5122J1542o7718k5919
12224b27352R9070Q6326q34n3164J258k7852N162P9691O7017N8553K8589m7629
12212F8835N975l7012n5980J1513O5218L5468o2641K1741q560m5309k1960L6804
12200A4092N2294j7735r4129o0071j9313p814j6430L370q4304j4289P5701J8638
12188a49990j0546n7270L4917J11964J3074p5924m1830P0188J15114K2803J2366
$$ plain form
12177 44866 15330 -47442 -49789 -67801 -46036 44246 164250 217101 171186 71412 8457 53052
12165 53052 37127 34579 56452 32162 -36738 -110043 -146700 -130464 -124905 -52390 -1352 -22649
12153 -22649 -48965 -119058 -174185 -179324 -110337 -41031 -40644 -13085 -43505 -56331 -108874 -173521
12141 -173521 -155078 -74518 21682 10301 17692 5414 -26139 -53762 -107129 -21989 19926 31741
12129 31741 32703 -59296 -182561 -233714 -160851 -93436 -96393 -26174 80315 26905 -75698 -108714
12117 -108714 -36327 6909 64298 57417 54164 -18139 -106647 -67572 -90458 -64132 30676 61097
12105 61097 48751 -11947 13806 -1862 -39359 -49243 -18306 84390 70640 -12967 -92179 -89777
12093 -89777 -69277 -131180 -59369 18126 24329 32278 13862 -4429 -13710 -14194 65653 34227 6725
$$ packed form
12177D4866k9536o2772k347j8012K1765R0282J20004N2851m5915r9774o2955M4595
12165E3052j5925k548K1873k4290o8900p3305l6657J6236N559P2515N1038k1297
12153b2649k6316p0093n5127n139O8987O9306L87K7559l0420j2826n2543o4647
12141a73521J8443Q0560R6200j1381P391j2278l1553k7623n3367Q5140M1915J1815
12129C1741R62r1999j23265n1153P2863O7415k957P0219J06489n3410j02603l3016
12117a08714P2387M3236N7389o881l253p2303q8508L9075k2886K6326R4808L0421
12105F1097j2346o0698K5753j5668l7497r884L0937J02696j3750q3607p9212K402
12093h9777K0500o1903P1811P7495O203P949j8416j8291r281m84P9847l1426k7502
$$ plain form
12080 6725 2573 -39862 -102417 -145767 -64581 -21386 -35147 -88255 -137250 -65226 -41873 -29945
12068 -29945 21719 50476 45971 -33285 -42005 -76712 -58978 -35967 19955 72145 5439 -54794
12056 -54794 -16006 -33351 -61641 -53375 -20356 907 -32388 -69895 -46102 11677 -16533 -53726
12044 -53726 -108610 -169876 -169645 -74301 65 -30787 -103126 -15083 -51536 -40494 -54792 -80451
12032 -80451 -22150 -36800 -660 4273 2912 -21063 462 27718 44579 30735 19245 46689
12020 46689 74132 58447 96750 114043 122288 42165 -59851 -29765 -51767 -111028 -23863 -51678
12008 -51678 -69267 -68533 -71878 -113980 -116182 -67135 -50671 2840 -24988 -75608 -92541 -103507
11996 -103507 -127022 -104250 -45579 49923 53269 32069 -50521 -96456 -71462 -34243 29856 52947
$$ packed form
12080F725m152m2435o2555m3350Q1186M3195j3761n3108m8995P2024K3353J1928
12068b9945N1664K8757m505p9256q720l4707J7734K3011N5922N2190o6706o0233
12056e4794L8788j7345k8290Q266L3019K1263l3295l7507K3793N7779k8210l7193
12044e3726n4884o1266K31R5344P4366l0852p2339Q8043l6453J1042j4298k5659
12032h0451N8301j4650L6140M933j361k3975K1525K7256J6861j3844j1490K7444
12020D6689K7443j5685L8303J7293Q245q0123j02016L0086k2002n9261Q7165k7815
12008e1678j7589P34l345m2102k202M9047J6464N3511k7828n0620j6933j0966
11996a03507k3515K2772N8671R5502L346k1200q2590m5935K4994L7219O4099K3091
$$ plain form
11984 52947 106778 104768 3745 -73667 -154683 -124960 -29845 26520 23561 -17129 26136 -1370
11972 -1370 -25932 -41105 -32116 33819 127999 176114 89391 2893 64756 69421 70616 91873
11960 91873 107916 142476 93396 51876 24590 49312 126620 186451 142312 80183 74854 -18929
11948 -18929 -27816 -54122 -74310 47998 74667 -3019 -95124 -173649 -197717 -147243 -102507 -44343
11936 -44343 2615 78394 83847 -69908 -155441 -174933 -134221 -10757 73451 110083 70944
11925 70944 18542 -85354 -69043 -44621 69135 182710 190768 190805 108219 9450 4899 49626
11913 49626 51320 70800 129829 130725 11416 -18989 -36867 13813 88168 129917 95061 -1097
11901 -1097 39192 29282 66071 103337 59143 66663 44009 46633 -39493 -99037 57739 97193
$$ packed form
11984E2947N3831k010j01023p7412q1016K9723R5115N6365k959m0690M3265k7506
11972a370k4562j5173Q989O5935R4180M8115q6723q6498O1863M665J195K1257
11960I1873J6043L4560m9080m1520k7286K4722P7308N9831m4139o2129n329r3783
11948a8929q887k6306k0188J22308K6669p7686r2105p8525k4068N0474M4736N8164
11936d4343M6958P5779N453j53755q5533j9492M0712J23464Q4208L6632l9139
11925G0944n2402j03896J6311K4422J13756J13575Q058L7q2586r8769m551M4727
11913D9626J694J9480N9029Q96j19309l0405j7878N0680P4355M1749l4856r6158
11901a097M0289r910L6789L7266m4194P520k2654K624q6126n9544J56776L9454
$$ plain form
11889 97193 69845 19121 47379 58644 88531 65116 -11824 -29175 8804 -1104 -44361 -25783
11877 -25783 -33454 -23101 20167 -37242 -119935 -5491 48632 30325 72151 71475 78993 100781
11865 100781 51389 95960 60100 68910 50312 34829 -3311 13156 47108 36401 84292 99660
11853 99660 91395 64268 99902 98954 103686 116714 51489 -35297 63826 65721 25177 94730 143742
11840 143742 136588 63260 42805 30984 101701 173280 132310 173391 175638 133474 152883 114584
11828 114584 126046 88639 146743 158719 154779 144818 163174 239340 233743 155254 203891 250587
11816 250587 216103 218075 186349 204381 168925 198272 140869 145797 173109 195133 267646 253125
11804 253125 175578 138733 232612 232324 158747 184892 196535 226011 203133 142146 81262 94332
$$ packed form
11889I7193k7348n0724K8258J1265K9887k3415p6940j7351L7979r908m3257J8578
11877b5783p671J0353M3268n7409q2693J14444N4123j8307M1826o76P518K1788
11865A00781m9392M4571l5860Q810j8598j5483l8140J6467L3952j0707M7891J5368
11853I9660q265k7127L5634r48M732J3028o5225q6786R9123J895m0544O9553M9012
11840A43742p154p3328k0455j1821P0717P1579m0970M1081K247m2164J9409l8299
11828A14584J1462l7407N8104J1976l940r961J8356P6166n597p8489M8637M6696
11816B50587l4484J972l1726J8032l5456K9347n7403M928K7312K2024P2513j4521
11804B53125p7547l6845R3879k88p3577K6145J1643K9476k2878o0987o0884J3070
$$ plain form
11792 94332 96671 98523 104133 101710 75529 57988 104568 90856 104656 87357 137945 167458
11780 167458 88874 75748 65958 65202 46998 132801 126152 106779 180723 178058 104668 108625 185827
11767 185827 200886 282985 228547 148581 74060 131810 71614 47028 71016 84219 130630
11756 130630 97537 85194 46906 -12635 33917 49485 41362 44225 104872 147445 106637 70823
11744 70823 32103 67369 45883 29330 70380 164994 151515 100808 76390 189330 136541
11733 136541 165617 199325 151708 139545 158184 166083 90637 98623 141448 205855 162500 139253
11721 139253 168954 251160 253275 223659 256280 318720 305834 283915 267245 254906 295688 317213
11709 317213 287892 311841 227933 315792 369736 311451 267499 273467 320806 324527 377274 335969
$$ packed form
11792I4332K339J852N610k423k6181j7541M6580j3712J3800j7299N0588K9513
11780A67458p8584j3126r790p56j8204Q5803o649j9373P3944k665p3390L957P7202
11767A85827J5059Q2099n4438p9966p4521N7750o0196k4586K3988J3203M6411
11756A30630l3093j2343l8288n9541M6552J5568q123K863O0647M2573m0808l5814
11744G0823l8720L5266k1486j6553M1050R4614j3479n0707k4418J12940n2789
11733A36541K9076L3708m7617j2163J8639P899p5446P986M2825O4407m3355k3247
11721A39253K9701Q2206K115k9616L2621O2440j2886k1919j6670j2339M0782K1525
11709C17213k9321K3949q3908Q7859N3944n8285m3952N968M7339L721N2747m1305
$$ plain form
11697 335969 321946 217292 172599 104131 145001 160397 236387 302976 305644 251828 241268
11686 241268 206055 143668 209459 263890 338244 346004 316264 309971 265144 267925 294265 327090
11674 327090 360692 324344 350801 270292 334015 333636 363055 358277 368381 388738 318626 282545
11662 282545 276691 257184 321795 300691 274812 317699 287937 299475 236216 311492 313513 334191
11650 334191 321592 277098 281601 294698 276243 249254 209960 293975 339559 363473 289279 272065
11638 272065 280084 307125 255790 215703 291679 378323 394386 311985 308422 279075 297550 251384
11626 251384 317416 323039 343788 309278 261129 234448 267943 326395 414832 432162 377065 340432
11614 340432 334918 305153 287321 308698 373996 409368 332729 265451 239904 234086 225234 277704
$$ packed form
11697C35969j4023j04654m4693o8468M0870J5396P5990O6589K668n3816j0560
11686B41268l5213o2387O5791N4431P4354P760k9740o293m4827K781K6340L2825
11674C27090L3602l6348K6457q0509O3723l79K9419m778J0104K0357p0112l6081
11662B82545n854j9507O4611k1104k5879M2887k9762J1538o3259P5276K021K0678
11650C34191j2599m4494M503J3097j8455k6989l9294Q4015M5584K3914p4194j7214
11638B72065Q019K7041n1335m0087P5976Q6644J6063q2401l563k9347J8475m6166
11626B51384O6032N623K0749l4510m8149k6681L3495N8452Q8437J7330n5097l6633
11614C40432n514k9765j7832K1377O5298L5372p6639o7278k5547n818q852N2470
$$ plain form
11602 277704 281453 283073 229518 169711 113474 134305 124853 163662 145454 103910 39441 31482
11590 31482 63418 13526 -18129 47383 122609 78886 84082 69304 101769 39950 64582 135433
11578 135433 183472 116801 117855 141641 82323 65363 168451 215518 281614 271746 192499 128348
11566 128348 64996 87361 121401 153917 178507 228716 204684 139341 25624 71642 119404
11555 119404 224597 188169 142898 163252 245949 194548 136281 209107 198107 211258 236384
11544 236384 137365 94060 106933 175068 207554 182270 146679 115950 164076 107132 42435
11533 42435 53951 106464 78167 28548 -51843 -38648 -30935 -4804 -73301 -53016 -13443 2411
11521 2411 42787 1839 -34600 -5240 48005 21960 15212 95124 138815 140846 89968 41351
$$ packed form
11602B77704L749J620n3555n9807n6237K0831r452L8809j8208m1544o4469p959
11590C1482L1936m9892l1655O5512P5226m3723N196j4778L2465o1819K4632P0851
11578A35433M8039o6671J054K3786n9318j6960J03088M7067O6096r868p9247o4151
11566A28348o3352K2365L4040L2516K4590N0209k4032o5343j13717M6018M7762
11555A19404J05193l6428m5271K0354Q2697n1401n8267P2826j1000J3151K5126
11544B36384r9019m3305J2873O8135L2486k5284l5591l0729M8126n6944o4697
11533D2435J1516N2513k8297m9619q0391J3195P713K6131o8497K0285L9573J5854
11521B411M0376m0948l6439K9360N3245k6045o748P9912M3691K031n0878m8617
$$ plain form
11509 41351 64297 3295 -36214 -9560 70726 70499 63409 75826 13825 -66356 -61124 -124215
11497 -124215 -65784 -70908 -40566 -38191 -138645 -209124 -247493 -143730 -87117 -34764 2307
11486 2307 42551 -10896 -104270 -79325 -218 68325 107689 130283 205046 94450 46405 104764
11474 104764 148386 118464 148024 151536 149206 67103 7828 73469 164439 166465 117038 71144
11462 71144 -51678 -60211 -83883 -46153 -22803 1631 44222 20094 -51031 -74137 -82560 -46819
11450 -46819 -47115 -39529 -56141 -40399 -59153 -60263 -59091 -87706 -39907 16905 26560 -27834 -30589
11437 -30589 600 38907 38474 25789 43804 148819 108570 21391 -47390 -40960 34052 47739
11425 47739 -19213 -54198 -86868 -38133 -4644 -36567 -51319 -2136 80569 53358 -41717 -120266
$$ packed form
11509D1351K2946o1002l9509K6654Q0286k27p090J2417o2001q0181N232o3091
11497a24215N8431n124L0342K375j00454p0479l8369J03763N6613N2353L7071
11486B307M0244n3447r3374K4945P9107O8543L9364K2594P4763j10596m8045N8359
11474A04764M3622k9922K9560L512k330q2103n9275O5641R0970K026m9427m5894
11462G1144j22822q533k3672L7730K3350K4434M2591k4128p1125k3106q423L5741
11450d6819k96P586j6612J5742j8754j110J172k8615M7799N6812R655n4394k755
11437c0589L1189L8307m33j2685J8015J05015m0249q7179o8781O430P5012J3687
11425D7739o6952l4985l2670M8735L3489l1923j4752M9183Q2705k7211r5075p8549
$$ plain form
11413 -120266 -112034 -120275 -66149 -108317 -79563 -52923 -23063 -30743 -53667 -97367 -64963 13871
11401 13871 21783 -40247 -98317 -124807 -69417 -64307 -126867 -61331 43927 23565 -129249 -211311
11389 -211311 -176714 -74710 -9723 2125 -9186 37077 -6899 -73472 -135633 -67179 4605
11378 4605 52189 1304 -43383 -35905 -64708 -36705 -41552 4890 70652 93857 72199 -18932
11366 -18932 -51763 -79336 -112880 -55969 -17721 -27040 31066 77257 18290 -32185 -103074 -44598
11354 -44598 -7866 -3805 -3296 55870 49462 11828 -82489 -143375 -48273 -65312 -56955 -120080 -75217
11341 -75217 -53561 -85018 -62786 -4522 -11423 -5737 54767 23371 -55884 -97031 -140791 -118377
11329 -118377 -129509 -88168 -100226 -124458 -118194 -64565 -119378 -165448 -91369 -29615 -10151 -107390
$$ packed form
11413a20266Q232q241N4126m2168K8754K6640K9860p680k2924m3700L2404P8834
11401A3871P912o2030n8070k6490N5390N110o2560O5536J05258k0362j52814q2062
11389b11311L4597J02004O4987J1848j1311M6263m3976o6573o2161O8454P1784
11378D605M7584n0885m4687P478k8803K8003m847M6442O5762K3205k1658r1131
11366a8932l2831k7573l3544N6911L8248r319N8106M6191n8967n0475p0889N8476
11354d4598L6732M061N09N9166o408l7634r4317o0886R5102j7039Q357o3125M4863
11341g5217K1656l1457K2232N8264o901N686O0504l1396p9255m1147m3760K2414
11329a18377j1132M1341j2058k4232O264N3629n4813m6070P4079O1754J9464r7239
$$ plain form
11317 -107390 -89819 -77419 -23866 -113514 -73178 -63121 -3451 -54484 -174817 -193762 -150623
11306 -150623 -63445 -23658 5953 49068 48080 -30769 -66689 -105645 -148969 -113224 -21571 -28898
11294 -28898 -112268 -111591 -93261 -179037 -137526 -62049 13453 2786 6548 -48469 -32272 -83359
11282 -83359 -59485 -58875 -110157 -85924 -87246 -50313 -114435 -151411 -147932 -102754 -53199 -80470
11270 -80470 -170612 -79283 5113 -75908 -90510 -64678 -108683 -135238 -158638 -144432 -188029 -164480
11258 -164480 -154303 -31114 -23421 -4335 15650 3980 -50043 -60441 -4282 -70337 -24328
11247 -24328 -22852 2028 -122409 -146169 -86090 10376 28715 -15630 -54009 7026 17507 -57525
11235 -57525 -60493 -51402 -5893 20342 11733 -55321 -120726 -128150 -120084 -48773 -61802 -80455 25977
$$ packed form
11317a07390J7571J2400N3553q9648M0336J0057N9670n1033j20333j8945M3139
11306a50623Q7178L9787K9611M3115r88p8849l5920l8956m3324L5745R1653p327
11294b8898q3370O77J8330q5776M1511P5477P5502j0667L762n5017J6197n1087
11282h3359K3874O10n1282K4233j322L6933o4122l6976L479M5178M9555k7271
11270h0470r0142R1329Q4396q1021j4602K5832m4005k6555k3400J4206m3597K3549
11258a64480J0177J23189P693J9086J9985j1670n4023j0398N6159o6055M6009
11247b4328J476K4880j24437k3760O0079R6466J8339m4345l8379O1035J0481p5032
11235e7525k968R091M5509K6235q609o7054o5405p424Q066P1311j3029j8653J06432
$$ plain form
11222 25977 18756 -38864 -30740 25001 -36937 -2783 6987 -1852 -77873 -116155 -112315 -125208 -96590
11209 -96590 -91980 -45489 -24881 -35443 -89472 -70998 -136735 -182699 -130754 -80225 -57987 -101340
11197 -101340 -139734 -112800 -152367 -241982 -267185 -113434 -76668 -96794 -139100 -145171 -119507
11186 -119507 -77476 -76917 -48982 -19450 -2670 50165 -1739 -103029 -139658 -20987 17475
11175 17475 95731 154893 219901 115349 -43460 -87901 -50151 -66086 -71858 -32888 19704
11164 19704 -24666 -116427 -180275 -232487 -244361 -195738 -180849 -150056 -161156 -157424 -158315 -103835
11152 -103835 -98725 -75926 -31177 -160891 -181258 -187294 -149090 -144170 -60024 5428 58737 6554
11140 6554 -36715 -47690 -7433 58644 50637 138702 121871 7451 -99651 -127341 -165332 -166723
$$ packed form
11222B5977p221n7620Q124N5741o1938L4154R770q839p6021l8282L840j2893K8618
11209i6590M610M6491K0608j0562n4029J8474o5737m5964N1945N0529K2238m3353
11197a01340l8394K6934l9567q9615k5203J53751L6766k0126m2306o071K5664
11186a19507M2031N59K7935K9532J6780N2835n1904j01290l6629J18671L8462
11175A7475P8256N9162O5008j04552j58809m4441L7750j5935n772L8970N2592
11164A9704m4370r1761o3848n2212j1874M8623J4889L0793j1100L732q91N4480
11152a03835N110K2799M4749j29714k0367o036L8204M920Q4146O5452N3309n2183
11140F554m3269j0975M0257O6077q007Q8065j6831j14420j07102k7690l7991j391
$$ plain form
11128 -166723 -43954 9010 -18843 -147959 -176172 -139336 -172233 -174207 -176513 -75865 -15140
11117 -15140 38528 -57314 -122278 -94306 -41438 -100758 -144289 -87635 -91681 41276 94478 138783
11105 138783 82829 139526 51476 -45068 -64280 -6290 7092 -6263 51782 19889 -37237
11094 -37237 -80279 -78605 -30764 -67977 -102208 -65628 -55605 -36941 -56244 -107676 -165486 -111932
11082 -111932 -160128 -173223 -211881 -155369 -132424 -119680 -180722 -207016 -234499 -219899 -143399
11071 -143399 -75782 -42456 -97149 -78289 -112406 -198406 -201955 -168621 -191545 -63762 -2900
11060 -2900 -124245 -180132 -79764 -50996 -33427 8687 19339 -1778 -4486 -50258 -121285 -70494
11048 -70494 1986 -46100 -56643 -18559 -40668 -78369 -131108 -88793 -39940 -34355 -42708 24085
$$ packed form
11128a66723J22769N2964k7853j29116k8213L6836l2897j974k306J00648O0725
11117a5140N3668r5842o4964K7972N2868n9320m3531N6654m046J32957N3202M4305
11105A38783n5954N6697q8050r6544j9212N7990J3382j3355N8045l1893n7126
11094c7237m3042J674M7841l7213l4231L6580J0023J8664j9303n1432n7810N3554
11082a11932m8196j3095l8658N6512K2945J2744o1042k6294k7483J4600P6500
11071a43399O7617L3326n4693J8860l4117q6000l549L3334k2924J27783O0862
11060b900j21345n5887J00368K8768J7569M2114J0652k1117k708m5772p1027N0791
11048g0494P2480m8086j0543L8084k2109l7701n2739M2315M8853N585q353O6793
$$ plain form
11036 24085 28713 15789 2556 -28248 -34454 34395 46350 -23879 -45286 -65745 -6996 -9346
11024 -9346 13984 90174 154536 149736 72990 28843 -78751 -168364 -122606 -79016 -39221 -32251
11012 -32251 -53231 -110053 -106931 -178842 -245254 -242684 -154698 -55468 -77186 -86529 -106737 -203988
11000 -203988 -224751 -122046 -110486 -112169 -125062 -146222 -173257 -222735 -134562 -78555 -54153
10989 -54153 47441 77047 12321 -54097 -38133 -68123 -72459 -32963 11780 52334 7375 -98457
10977 -98457 -129315 -35788 88838 53589 -27667 -46513 -83122 -138185 -179784 -106075 -7182
10966 -7182 39117 10317 -109720 -146669 -183465 -180367 -189005 -152098 1413 3241 -19638 -101809
10954 -101809 -128238 -49678 5010 -11382 -73227 -52203 -49178 -93296 -93692 -177380 -196392 -118798
$$ packed form
11036B4085M628j2924j3233l0804o206O8849J1955p0229k1407k0459N8749k350
11024i346K3330P6190O4362m800p6746m4147j07594q9613M5758M3590L9795O970
11012c2251k0980n6822L122p1911o6412K570Q7986R9230k1718r343k0208r7251
11000b03988k0763J02705J1560j683j2893k1160k7035m9478Q8173N6007K4402
10989e4153J01594K9606o4726o6418J5964k9990m336L9496M4743M0554m4959j05832
10977i8457l0858R3527J24626l5249q1256j8846l6609n5063m1599P3709R8893
10966g182M6299k8800j20037l6949l6796L098q638L6907J53511J828k2879q2171
10954a01809k6429P8560N4688j6392o1845K1024L025m4118l96q3688j9012P7594
$$ plain form
10942 -118798 -53485 -92729 -148205 -151177 -184998 -114895 -138389 -227613 -207148 -117033 -110369 -144948
10930 -144948 -182452 -141292 -130685 -123518 -168893 -202493 -198056 -103374 5890 -11893 -14087 34674
10918 34674 44715 -55961 -83972 -115647 -113874 -68540 74315 36965 -21770 -84324 -104591
10907 -104591 -57858 -63945 -101055 -70640 30875 86859 12921 -66321 -94070 -97100 -69785 -81069
10895 -81069 -67772 -6573 105502 45446 31180 4712 27695 -7241 -17264 -41870 62197
10884 62197 64024 102146 127774 69864 37145 -67633 -189277 -231303 -189757 -143744 -72136
10873 -72136 -8112 -32073 -131865 -152308 -228786 -230199 -225240 -120774 -118087 -116303 -166491 -174566
10861 -174566 -218218 -198032 -181780 -181902 -151232 -132862 -127494 -159617 -145336 -206256 -127308 -79471
$$ packed form
10942a18798O5313l9244n5476k972l3821P0103k3494q9224K0465R0115O664l4579
10930a44948l7504M1160J0607P167m5375l3600M437R4682J09264j7783k194M8761
10918C4674J0041j00676k8011l1675J773M5334J42855l7350n8735o2554k0267
10907a04591M6733o087l7110L0415J01515N5984p3938p9242k7749l030K7315j1284
10895h1069J3297O1199J12075o0056j4266k6468K2983l4936j0023k4606J04067
10884F2197J827L8122K5628n7910l2719j04778j21644m2026M1546M6013P1608
10873g2136O4024k3961r9792k0443p6478j413M959J04466K687J784n0188q075
10861a74566m3652K0186J6252j22L0670J8370N368l2123J4281o0920P8948M7837
$$ plain form
10849 -79471 -112850 -146239 -90318 -111170 -180487 -198877 -156188 -150347 -160084 -159589 -167243 -151969 -87955
10836 -87955 -70542 -95182 -1850 -62977 -172225 -155411 -181046 -202429 -117438 -38624 -8866
10825 -8866 -96298 -21141 -38674 -99262 -83685 12907 7612 -73756 -98143 -96989 -80734 -67802
10813 -67802 -48671 -48705 -140018 -178112 -236759 -180712 -48143 -83031 -53131 1828 -17375 -142104
10801 -142104 -191232 -171864 -67850 9266 -7880 -119113 -161467 -210691 -146495 -82944 -41717
10790 -41717 -22207 -21332 18802 -99003 -139086 -85678 -77542 -97151 -94372 -29602 -77395 -128728
10778 -128728 -80412 -66118 -94062 -156397 -113055 -92207 -36881 -4651 3130 4412 -33298 -87245
10766 -87245 -168071 -140972 -128884 -143882 -116410 -28116 -106873 -141063 -78856 -19205 -69651 -84163
$$ packed form
10849g9471l3379l3389N5921k0852o9317j8390M2689N841r737M95p654J5274O4014
10836h7955J7413k4640R3332o1127j09248J6814k5635k1383Q4991P8814K9758
10825h866q7432P5157j7533o0588J5577R6592n295q1368k4387J154J6255J2932
10813f7802J9131l4r1313l8094n8647N6047J32569l4888K9900N4959j9203j24729
10801a42104m9128J9368J04014P7116j7146j11233m2354m9224O4196O3551M1227
10790d1717J9510Q75M0134j17805m0083N3408Q136j9609K779O4770m7793n1333
10778a28728M8316J4294k7944o2335M3342K0848N5326L2230P781J282l7710n3947
10766h7245q0826K7099J2088j4998K7472Q8294p8757l4190O2207N9651n0446j4512
$$ plain form
10754 -84163 -39555 -63863 -53667 -5950 -23911 -64033 -104827 -50429 -48998 -119554 -169229 -125074
10742 -125074 34294 85546 -6231 -85313 -28571 3980 -16031 -42338 -48957 -116420 -117641 -66813
10730 -66813 -60514 -104451 -90824 -31316 -79590 -97162 -136052 -65354 47239 -31998 -96742 -53196
10718 -53196 12930 -41945 -91192 -128035 -158210 -132786 -28494 2658 -69382 -108488 -31291
10707 -31291 -23991 -81742 -40420 33059 51931 24917 13098 -53881 -79891 -84168 -91214 -75199
10695 -75199 11592 32442 27975 77272 35177 -32325 7942 31569 48687 -8343 49331 74351
10683 74351 64007 23352 -29389 11431 10639 51034 -69241 -96040 -66099 36370 74687 26377
10671 26377 -2213 2626 23464 21625 -90280 -105700 -34316 -74 -48772 -43114 14210 17371
$$ packed form
10754h4163M4608k4308J0196M7717j7961m0122m0794N4398J431p0556m9675M4155
10742a25074J59368N1252r1777p9082N6742L2551k0011k6307o619o7463j221N0828
10730f6813O299m3937J3627N9508m8274j7572l8890P0698J12593p9237o4744M3546
10718e3196O6126n4875m9247l6843l0175K5424J04292L1152p2040l9106P7197
10707c1291P300n7751M1322P3479J8872k7014j1819o6979k6010m277p046J6015
10695g5199Q6791K0850m467M9297m2095o7502M0267K3627J7118n7030N7674K5020
10683G4351j0344m0655n2741M0820p92M0395j20275k6799K9941J02469L8317m8310
10671B6377k8590M839K0838j839j11905j5420P1384L4242m8698N658N7324L161
$$ plain form
10659 17371 55643 26063 -18297 -6774 70358 53515 -28823 -68542 -15729 -2748 47102 -33988
10647 -33988 -18555 14353 68560 104684 62384 48230 19732 71515 57813 64039 80685 119221
10635 119221 141476 89614 -3999 13958 22000 47441 31805 98712 152182 150534 102631 51083
10623 51083 -9705 24307 34949 13139 -4496 8945 90632 64981 -70683 -131328 -42771
10612 -42771 -11651 1898 -7023 31237 45253 22540 -15514 -29211 -43057 14442 46365 89515
10600 89515 65993 29105 97417 110721 121477 60667 10431 78278 109746 115705 78113 112656
10588 112656 181116 175619 143049 3012 -77822 -27859 101232 114078 51358 94278 122395
10577 122395 75761 -7181 -11411 83938 87267 107084 37381 -66786 -30164 38845 104365 91135
$$ packed form
10659A7371L8272k9580m4360J1523P7132j6843q2338l9719N2813J2981M9850q1090
10647c3988J5433L2908N4207L6124m2300j4154k8498N1783j3702O226J6646L8536
10635A19221K2255n1862r3613J7957Q042K5441j5636O6907N3470j648m7903n1548
10623E1083o0788L4012J0642k1810j7635J3441Q1687k5651j35664o0645Q8557
10612d2771L1120J3549q921L8260J4016k2713l8054j3697j3846N7499L1923M3150
10600H9515k3522l6888O8312J3304J0756o0810n0236O7847L1468N959l7592L4543
10588A12656O8460n497l2570j40037q0834M9963J29091J2846o2720M2920K8117
10577A22395m6634q2942m230R5349L329J9817o9703j04167L6622O9009O5520j3230
$$ plain form
10565 91135 117017 107121 112854 127127 124623 91372 164913 196056 118980 -10727 27648 101109
10553 101109 128600 104717 94717 167718 168954 74257 4381 -27972 21867 109989 168309 128320
10541 128320 136075 159730 127807 25926 -96484 22515 67905 96284 52918 60835 57149
10530 57149 51385 34623 27528 8634 64777 105984 53191 71960 21061 -17430 94529 182211
10518 182211 169304 148092 152640 153785 40628 30779 20515 17642 47892 168522 170718 102139
10506 102139 77905 107575 56582 -19624 -48074 -11641 78215 86089 123459 96303 158570 72027
10494 72027 15117 -46179 -26041 10683 69645 117190 116152 50406 43836 89819 43215 -797
10482 -797 40087 112314 98000 40942 95942 152660 101500 25673 29877 52946 -26475 -6791
$$ packed form
10565I1135K5882r896N733J4273k504l3251P3541L1143p7076j29707L8375P3461
10553A01109K7491k3883j0000P3001J236r4697o9876l2353M9839Q8122N8320l9989
10541A28320P755K3655l1923j01881j22410J18999M5390K8379m3366P917l686
10530E7149n764j6762p095j8894N6143M1207n2793J8769n0899l8491J11959Q7682
10518A82211j2907k1212M548J145j13157r849j0264k873L0250J20630K196o8579
10506A02139k4234K9670n0993p6206k8450L6433Q9856P874L7370k7156O2267q6543
10494G2027n6910o1296K0138L6724N8962M7545j038o5746o570M5983m6604m4012
10482g97M0884P2227j4314n7058N5000N6718n1160p5827M204K3069p9421J9684
$$ plain form
10470 -6791 -10871 101584 68001 85835 11399 -84602 -69389 -1268 108055 89713 102521 55574
10458 55574 99744 57932 15285 -59174 -14081 9096 6565 27535 81354 91095 26155 29300
10446 29300 -42256 -70126 -17169 81016 91326 52482 63262 62209 75892 14346 -9144 97259
10434 97259 89138 162761 153454 184234 87216 104780 111754 85992 97370 126508 186913 219515
10422 219515 149129 67657 111988 45661 8778 -4516 54897 33763 36744 -3568 24424 23614
10410 23614 18919 3073 9918 -7108 -51455 -3947 34341 -31437 -11219 91058 92703 81048
10398 81048 59459 34138 10466 64721 75006 135732 95838 45516 42092 73843 46888 9217
10386 9217 40420 27806 15154 -20664 -87627 -53941 15051 -23315 -12862 33298 77766 75231
$$ packed form
10470f791m080J12455l3583J7834p4436r6001J5213O8121J09323j8342J2808m6947
10458E5574M4170m1812m2647p4459M5093K3177k531K0970N3819R741o4940L145
10446B9300p1556k7870N2957R8185J0310l8844J0780j053J3683o1546k3490J06403
10434I7259q121P3623r307L0780r7018J7564O974k5762J1378K9138O0405L2602
10422B19515p0386q1472M4331o6327l6883j3294N9413k1134K981m0312K7992q10
10410B3614m695j5846O845j7026m4347M7508L8288o5778K0218J02277J645j1655
10398H1048k1589k5321k3672N4255J0285O0726l9894n0322l424L1751k6955l7671
10386I217L1203j2614j2652l5818o6963L3686O8992l8366J0453M6160M4468k535
$$ plain form
10374 75231 63760 -37852 -100698 -95357 -18115 20576 53545 99795 135414 112273 5772
10363 5772 -17085 61432 96511 69123 97147 97704 92533 7971 59368 83148 88118 48216 36862
10350 36862 30243 -5070 -61930 -7612 78767 42919 74077 148140 174896 63880 8396 49842
10338 49842 80828 10999 18258 103219 144534 128891 122760 98307 89181 33327 74519 39034
10326 39034 -192 81682 170423 120592 -14897 -65710 35288 59627 -82015 -103459 2369
10315 2369 54432 28312 28009 54392 76472 49569 35616 62890 70043 14850 40535 90892
10303 90892 115530 34455 83941 96331 54886 59217 92976 128018 85020 73997 117185 176291
10291 176291 67133 49717 77799 26210 42062 55183 62216 29596 -55862 -9154 59780
$$ packed form
10374G5231j1471j01612o2846N341P7242L8691L2969M6250L5619k3141j06501
10363E772k2857P8517L5079k7388K8024N57n171q4562N1397K3780M970l9902j1354
10350C6862o619l5313n6860N4318Q6379l5848L1158P4063K6756j11016n5484M1446
10338D9842L0986o9829P259Q4961M1315j5643o131k4453r126n5854M1192l5485
10326C9034l9226Q1874Q8741m9831j35489n0813J00998K4339j41642k1444J05828
10315B369N2063k6120l03K6383K2080k6903j3953K7274P153n5193K5685N0357
10303I0892K4638q1075M9486J2390m1445M331L3759L5042m2998j1023M3188N9106
10291A76291j09158j7416K8082n1589J5852J3121P033l2620q5458M6708O8934
$$ plain form
10280 59780 49233 -15805 9458 70961 48244 31902 89855 141571 71846 -21005 -21157 -20635
10268 -20635 -20493 11046 60281 131123 81301 18349 -5205 27454 -818 25337 65220 101104
10256 101104 71761 -22562 -70348 -118057 -66226 38344 71158 -10076 -97458 -22348 99620
10245 99620 31863 26645 116857 145695 128674 70237 89629 173563 135436 90824 82390 72190
10233 72190 70397 89857 120491 126715 96774 117789 182788 107947 117570 154850 172648 125702
10221 125702 39553 31018 64210 15456 -7366 78755 166183 155301 95823 97765 151914 137520
10209 137520 141010 173988 140127 69082 88345 184030 103009 -15898 11368 140231 69442
10198 69442 -28498 -43014 12649 48004 5128 16882 58271 59093 42937 -1952 -68052 -146098
$$ packed form
10280E9780j0547o5038K5263O1503k2717j6342N7953N1716o9725r2851j52N22
10268b0635J42L1539M9235P0842m9822o2952k3554L2659k8272K6155L9883L5884
10256A01104k9343r4323m7786m7709N1831J04570L2814q1234q7382P5110J21968
10245I9620o7757n218R0212K8838j7021n8437J9392Q3934l8127m4612q434j0200
10233G2190j793J9460L0634O224k9941K1015O4999p4841R623L7280J7798m6946
10221A25702q6149q535L3192m8754k2822Q6121Q7428j0882n9478J942N4149j4394
10209A37520L490L2978l3861p1045J9263R5685q1021j18907K7266J28863p0789
10198F9442r7940j4516N5663L5355m2876J1754M1389Q22j6156m4889o6100p8046
$$ plain form
10186 -146098 -149224 -97320 -28039 -48032 -20864 64914 8275 -11071 41880 98849 67936 44771
10174 44771 140290 161832 130429 119989 150084 182226 108752 13837 101421 151150 143601 121080
10162 121080 206024 216695 190561 166548 91642 91362 94832 145422 93055 23663 40425 88292
10150 88292 114417 118298 155130 163492 141388 110085 122314 271814 259267 259675 193296 190305
10138 190305 149583 113094 125650 178770 165320 125726 162742 125748 39524 -24408 88509
10127 88509 143273 148824 83255 55028 42099 24093 -44606 -68333 -16292 33719 29991 6369
10115 6369 -19711 5107 65075 97008 103220 176943 199166 232744 163373 68901 106803 132264
10103 132264 180684 174654 237870 169885 138983 54673 107283 181076 203075 162635 172487 203644
$$ packed form
10186a46098l126N1904O9281j9993K7168Q5778n6639j9346N2951N6969l0913k3165
10174D4771R5519K1542l1403j0440L0095L2142p3474r4915Q7584M9729p549k2521
10162A21080Q4944J0671k6134k4013p4906k80L470N0590n2367o9392J6762M7867
10150H8292K6125L881L6832Q362k2104l1303J2229J49500j2547M08o6379k991
10138A90305m0722l6489J2556N3120j3450l9594L7016l6994q6224o3932J12917
10127H8509N4764N551o5569k8227j2929j8006o8699k3727N2041N0011l728k3622
10115F369k6080K4818N9968L1933O212P3723K2223L3578o9371r4472L7902K5461
10103A32264M8420o030O3216o7985l0902q4310N2610P3793K1999m0440R852L1157
$$ plain form
10091 203644 145814 56955 11727 34435 54053 59855 23436 12511 -2080 42013 100192 173475
10079 173475 202539 184092 167524 177434 185496 208103 167607 232282 204641 247416 242450 207095
10067 207095 101101 144538 228926 158497 153820 155070 232350 164848 172354 129686 99228 53757
10055 53757 49881 79623 13193 -45598 -86451 8955 32556 -13877 60925 104584 120940 28118
10043 28118 20995 83526 135544 192889 195889 152599 50868 88242 175725 225298 174377 237634
10031 237634 264062 240563 175104 205436 258376 293188 235838 232320 259387 157376 93916
10020 93916 159464 228201 171921 156335 162654 82048 7996 28253 67369 151459 164544 239212
10008 239212 258399 256057 149547 69986 89221 98880 99810 189695 223485 216788 214262 223335 157493
$$ packed form
10091B03644n7830q8859m5228K2708J9618N802l6419j0925j4591M4093N8179P3283
10079A73475K9064j8447j6568R910Q062K2607m0496O4675k7641M2775m966l5355
10067B07095j05994M3437Q4388p0429m677J250P7280o7502P506m2668l0458m5471
10055E3757l876K9742o6430n8791m0853R5406K3601m6433P4802M3659J6356r2822
10043B8118p123O2531N2018N7345L000m3290j01731L7374Q7483M9573n0921O3257
10031B37634K6428k3499o5459L0332N2940L4812n7350l518K7067j02011o3460
10020I3916O5548O8737n6280j5586O319q0606p4052K0257L9116Q4090J3085P4668
10008B39212J9187k342j06510p9561J9235R659R30Q9885L3790o697k526R073o5842
$$ plain form
9995 157493 82621 81601 167129 172437 100973 115162 92888 97727 36585 48624 27737 23549
9983 23549 39151 57444 53499 38346 57575 123557 224087 162213 77102 56160 111420 149773
9971 149773 182840 196771 208921 203081 208248 93767 60594 95930 179697 245502 237681 237441
9959 237441 227524 180795 97348 62937 47750 140572 174564 170144 158321 227164 207685 182799
9947 182799 110029 144580 219944 219147 163741 199060 256290 265349 237568 213409 187858 162730
9935 162730 96607 86656 73627 59659 184795 221764 158685 59063 60718 51459 -5720 -42307
9923 -42307 -45712 72283 83368 63718 69737 57462 58747 58336 154975 135439 85466 82135 221101
9910 221101 254834 216578 224982 257567 238788 176913 219953 222725 207728 169499 235090 249053
$$ packed form
9995A57493p4872j020Q5528N308p1464J4189k2274M839o1142J2039k0887m188
9983B3549J5602J8293l945j5153J9229O5982J00530o1874q5111k0942N5260L8353
9971A49773L3067J3931J2150n840N167j14481l3173L5336Q3767O5805p821k40
9959B37441r917m6729q3447l4411j5187R2822L3992m420j1823O8843j9479k4886
9947A82799p2770L4551P5364p97n5406L5319N7230R059k7781k4159k5551k5128
9935A62730o6123r951j3029j3968J25136L6969o3079r9622J655r259n7179l6587
9923d2307l405J17995J1085j9650O019j2275J285m11R6639j9536m9973l331J38966
9910B21101L3733l8256Q404L2585j8779o1875M3040K772j4997l8229O5591J3963
$$ plain form
9898 249053 114814 60298 65776 107584 97581 96063 166196 180586 136337 106480 55511 13428
9886 13428 -243 72219 182312 156266 114495 161294 208427 144421 121217 226583 269959
9875 269959 251574 210970 291887 305539 257522 292067 307119 296514 241260 240803 299822 279676
9863 279676 256389 241685 222134 187405 248052 303128 273616 246206 251815 308140 313359 241732
9851 241732 256793 256213 287776 345711 336258 303227 285162 338477 365417 370633 314953 294496
9839 294496 298999 257763 194257 238337 356194 418838 340724 265836 228130 251526 227684 235399
9827 235399 277579 288543 345223 370044 321195 291315 339006 345216 384386 429193 481714 495576
9815 495576 457243 443040 437496 466717 535461 552017 532451 564900 571988 554669 514510 392223
$$ packed form
9898B49053j34239n4516N478M1808j0003j518P0133J4390m4249k9857n0969m2083
9886A3428j3671P2462J10093k6046m1771M6799M7133o4006k3204J05366M3376
9875B69959j8385m0604Q0917J3652m8017L4545J5052j0605n5254m57N9019k0146
9863B79676k3287j4704j9551l4729O0647N5076k9512k7410N609N6325N219p1627
9851B41732J5061n80L1563N7935r453l3031j8065N3315K6940N216n5680k0457
9839B94496M503m1236o3506M4080J17857O2644p8114p4888l7706K3396k3842P715
9827B35399M2180J0964N6680K4821m8849k9880M7691O210L9170M4807N2521J3862
9815D95576l8333j4203n544K9221O8744J6556j9566L2449P088j7319m0159j22287
$$ plain form
9803 392223 386640 458962 491529 508710 470223 440526 488799 452800 435557 418688 434489 485891
9791 485891 515456 530989 489601 525535 543806 621986 659654 707114 695769 602330 587334 618581
9779 618581 663715 737173 763645 830469 853458 773160 721530 733688 728134 695134 710728 751507
9767 751507 761457 751938 739044 694287 655320 726261 833777 836680 799687 769630 836763 768124
9755 768124 757381 824244 901496 959998 972348 926078 894885 889139 875879 951392 962806 938002
9743 938002 935300 971760 975632 938476 930079 970803 886475 790048 805781 884435 882745 876529 862202
9730 862202 907713 912917 946495 972790 909790 956640 1051421 1071189 1027723 1032066 1041883 1099651
9718 1099651 1047873 1060935 1111798 1216877 1172498 1158904 1166204 1174100 1190993 1139724 1154755 1162767
$$ packed form
9803C92223n583P2322L2567J7181l8487k9697M8273l5999j7243j6869J5801N1402
9791D85891K9565J5533m1388L5934J8271P8180L7668M7460j1345r3439j4996L1247
9779F18581M5134P3458K6472O6824K2989q0298n1630J2158n554l3000J5594M0779
9767G51507R950r519j2894m4757l8967P0941J07516K903l6993l0057O7133o8639
9755G68124j0743O6863P7252N8502J2350m6270l1193n746j3260P5513J1414k4804
9743I38002k702L6460L872l7156q397M0724q4328r6427J5733P8654j690o216j4327
9730H62202M5511N204L3578K6295o3000M6850R4781J9768m3466M343R817N7768
9718A099651n1778J3062N0863J05079m4379j3594P300P896J6893n1269J5031Q012
$$ plain form
9706 1162767 1151942 1197400 1279922 1292323 1207029 1157413 1206383 1155917 1149914 1191102 1279870 1251607
9694 1251607 1300008 1341370 1416879 1400220 1426552 1415927 1419434 1391101 1437623 1508202 1487730 1529940
9682 1529940 1579080 1626788 1579291 1582778 1580364 1650189 1635497 1595497 1610878 1640191 1613591 1586892
9670 1586892 1623260 1621198 1604244 1622628 1662483 1720508 1708259 1737956 1747462 1799598 1771714 1831040
9658 1831040 1844877 1816161 1851300 1881748 1962467 1887664 1911856 1916883 1845898 1796459 1797986 1873069
9646 1873069 1954085 1974167 1968950 1987100 2001981 1930424 1846564 1828976 1818541 1928471 2030533
9635 2030533 2092890 2057549 1994094 2045862 2115752 2150561 2157671 2212956 2264963 2213577 2248791 2275528
9623 2275528 2350983 2392688 2509601 2520744 2433196 2353690 2307920 2342778 2347080 2399846 2483820
$$ packed form
9706A162767j0825M5458Q2522J2401q5294m9616M8970n0466o003M1188Q8768k8263
9694A251607M8401M1362P5509j6659K6332j0625L507k8333M6522P0579k0472M2210
9682A529940M9140M7708m7497L487k414O9825j4692m0000J5381K9313k6600k6699
9670A586892L6368k062j6954J8384L9855N8025j2249K9697R506N2136k7884N9326
9658A831040J3837k8716L5139L0448Q0719p4803K4192N027p0985m9439J527P5083
9646A873069Q1016K0082n217J8150J4881p1557q3860j7588j0435J09930J02062
9635B030533O2357l5341o3455N1768O9890L4809P110N5285N2007n1386L5214K6737
9623B275528P5455M1705J16913J1143q7548p9506m5770L4858M302N2766Q3974
$$ plain form
9612 2483820 2595290 2532239 2493473 2486468 2503720 2510112 2508143 2597096 2655584 2698301 2658366 2772280
9600 2772280 2819409 2792962 2813783 2883280 2990539 2960200 2994240 3011205 3056161 3090947 3152605
9589 3152605 3231578 3230282 3144592 3132087 3172382 3109845 3141011 3204750 3306981 3303220 3264862 3249782
9577 3249782 3191968 3235980 3233188 3407016 3490118 3488124 3424285 3460276 3462268 3435853 3530275 3639303
9565 3639303 3791050 3773472 3837533 3891016 3846975 3795203 3841705 4014954 4068692 4072658 4078438
9554 4078438 4115318 4124490 4150104 4195863 4221674 4253291 4320553 4318016 4248165 4326188 4442009 4597458
9542 4597458 4597441 4501180 4528515 4571027 4584154 4574527 4741298 4932689 5137802 5091812 5038872 5044795
9530 5044795 5073689 5197539 5337896 5545352 5633653 5706808 5716856 5698354 5739794 5871559 5999537
$$ packed form
9612B483820J11470o3051l8766p005J7252O392j969Q8953N8488M2717l9935J13914
9600B772280M7129k6447K0821O9497J07259l0339L4040J6965M4956L4786O1658
9589C152605P8973j296q5690j2505M0295o2537L1166O3739J02231l761l8358j5080
9577C249782n7814M4012k792J73828Q3102j994o3839L5991J992k6415R4422J09028
9565C639303J51747j7578O4061N3483m4041n1772M6502J73249N3738L966N780
9554D078438L6880R172K5614M5759K5811L1617O7262k537o9851P8023J15821J55449
9542D597458j7r6261K7335M2512J3127r627J66771J91391K05113m5990n2940N923
9530E044795K8894J23850J40357K07456Q8301P3155J0048j8502M1440J31765J27978
$$ plain form
9519 5999537 6042216 6145843 6295494 6385218 6422017 6502619 6615967 6714263 6787814 6873719 6956189
9508 6956189 6981275 7123113 7261297 7434755 7546279 7642578 7673055 7829036 8055074 8154426
9498 8154426 8342805 8535073 8739361 8827927 8968252 9133876 9291298 9452337 9563398 9778629
9488 9778629 9980883 10224254 10410159 10539579 10685242 10854297 11045793 11341587 11660494 11973902
9478 11973902 12198575 12420123 12743927 12909264 13079776 13338215 13751413 14209882 14598636
9469 14598636 14907691 15171720 15555616 15932692 16359969 16789165 17274182 17789662 18295602
9460 18295602 18780779 19215613 19800075 20434461 21011954 21520139 22112619 22755742 23419523
9451 23419523 24137042 24955344 25870191 26708315 27535538 28308742 29157931 30046129 31036173
$$ packed form
9519E999537M2679J03627J49651Q9724L6799Q0602J13348R8296P3551Q5905Q2470
9508F956189K5086J41838J38184J73458J11524R6299L0477J55981K26038R9352
9498H154426J88379J92268K04288Q8566J40325J65624J57422J61039J11061K15231
9488I778629K02254K43371J85905J29420J45663J69055J91496K95794L18907L13408
9478A1973902K24673K21548L23804J65337J70512K58439M13198M58469L88754
9469A4598636L09055K64029L83896L77076M27277M29196M85017N15480N05940
9460A8295602M85177M34834N84462O34386N77493N08185N92480O43123O63781
9451B3419523P17519Q18302R14847Q38124Q27223P73204Q49189Q88198R90044
$$ plain form
9442 31036173 32113555 33236115 34382174 35420091 36490337 37472665 38436519 39471409
9434 39471409 40556287 41663212 42708659 43802888 44870372 45916889 46982737 48079854
9426 48079854 49241804 50486954 51692783 52908482 54147998 55449048 56881494 58449981
9418 58449981 60045512 61629674 63346649 65127132 67018265 68992056 71093342 73325815
9410 73325815 75616913 78076284 80561315 83146485 85867452 88695544 91705464 94796979
9402 94796979 97935017 101102522 104318247 107604138 110954061 114269829 117510024 120764796
9394 120764796 123978874 127118834 130191646 133107482 136028765 138802046 141304434 143613595
9386 143613595 145764872 147918445 149957853 151954100 153980926 156049870 158254309 160628709
$$ packed form
9442C1036173J077382J122560J146059J037917J070246R82328R63854J034890
9434C9471409J084878J106925J045447J094229J067484J046517J065848J097117
9426D8079854J161950J245150J205829J215699J239516J301050J432446J568487
9418E8449981J595531J584162J716975J780483J891133J973791K101286K232473
9410G3325815K291098K459371K485031K585170K720967K828092L009920L091515
9402I4796979L138038L167505L215725L285891L349923L315768L240195L254772
9394A20764796L214078L139960L072812K915836K921283K773281K502388K309161
9386A43613595K151277K153573K039408J996247K026826K068944K204439K374400
$$ plain form
9378 160628709 163223643 165992666 169187987 172639240 176326890 180198426 184274311 188546383
9370 188546383 192904732 197334158 201840467 206390392 211018098 215732033 220701228 226182399
9362 226182399 232150861 238621664 245542211 252831080 260485912 268262405 276085706 283832665
9354 283832665 291342799 298549119 305241708 311343006 316699713 321343722 325314762 328574894
9346 328574894 331039835 332595548 333191092 332686709 331127486 328605959 324917759 320031362
9338 320031362 314024487 306775671 298428873 289112158 279046139 268554633 257946903 247387023
9330 247387023 237133386 227272037 217911081 209057260 200683870 192846756 185401742 178283621
9322 178283621 171483214 164953058 158638136 152486093 146438141 140652753 134928052 129238667
$$ packed form
9378A60628709K594934K769023L195321L451253L687650L871536M075885M272072
9370A88546383M358349M429426M506309M549925M627706M713935M969195N481171
9362B26182399N968462O470803O920547P288869P654832P776493P823301P746959
9354B83832665P510134P206320O692589O101298N356707M644009L971040L260132
9346C28574894K464941J555713N95544n04383j559223k521527l688200m886397
9338C20031362o006875p248816q346798r316715j0066019j0491506j0607730j0559880
9330B47387023j0253637r861349r360956q853821q373390p837114p445014p118121
9322A78283621o800407o530156o314922o152043o047952n785388n724701n689385
$$ plain form
9314 129238667 123475636 117766564 112184753 106773391 101515631 96447196 91689934 87176292
9306 87176292 82906812 78894738 75152474 71734281 68516093 65596211 62888660 60354338
9298 60354338 57904774 55564073 53425526 51378644 49534949 47713511 45993379 44276371
9290 44276371 42718035 41290341 39880316 38541693 37358823 36278662 35117903 33896234
9282 33896234 32816372 31805441 30834016 29862263 29025600 28268335 27488932 26729642 25913275
9273 25913275 25144227 24367580 23613154 22956388 22411308 21806745 21195102 20635783 20198411
9264 20198411 19606956 19096570 18661252 18183553 17705710 17244624 16773725 16302862 15919619
9255 15919619 15609558 15321873 14958693 14547171 14231243 13925163 13568053 13304371 13014049
$$ packed form
9314A29238667n763031n709072n581811n411362n257760n068435m757262m513642
9306H7176292m269480m012074l742264l418193l218188k919882k707551k534322
9298F0354338k449564k340701k138547k046882j843695j821438j720132j717008
9290D4276371j558336j427694j410025j338623j182870j080161j160759j221669
9282C3896234j079862j010931r71425r71753q36663p57265p79403p59290q16367
9273B5913275p69048p76647p54426o56766n45080o04563o11643n59319m37372
9264B0198411n91455n10386m35318m77699m77843m61086m70899m70863l83243
9255A5919619l10061k87685l63180m11522l15928l06080l57110k63682k90322
$$ plain form
9246 13014049 12782542 12480682 12219026 11991844 11804577 11537097 11253932 11057513 10875230
9237 10875230 10692454 10484441 10341555 10138728 9913110 9756274 9629445 9459043 9308352
9228 9308352 9150651 9054195 8907604 8655508 8411414 8282357 8125037 8032239 7918062 7858719
9218 7858719 7757595 7686920 7533802 7343272 7208014 7144863 7084889 6912516 6809659 6713245
9208 6713245 6698017 6581716 6431585 6317252 6236784 6193284 6192518 6062617 5942397 5908651 5792502
9197 5792502 5688310 5646934 5627630 5542547 5448454 5385970 5268134 5152559 4963565 4936646 4959372
9186 4959372 4925895 4845235 4754634 4714127 4569236 4501975 4462013 4476649 4456950 4363153 4294019
9175 4294019 4192623 4062503 4002066 4045994 4006560 3960322 3942513 3970597 3874526 3769918 3722120
$$ packed form
9246A3014049k31507l01860k61656k27182j87267k67480k83165j96419j82283
9237A0875230j82776k08013j42886k02827k25618j56836j26829j70402j50691
9228I308352j57701r6456j46591k52096k44094j29057j57320r2798j14177n9343
9218G858719j01124p0675j53118j90530j35258o3151n9974j72373j02857r6414
9208F713245j5228j16301j50131j14333q0468m3500p66j29901j20220l3746j16149
9197E792502j04192m1376j9304q5083r4093o2484j17836j15575j88994k6919K2726
9186D959372l3477q0660r0601m0507j44891o7261l9962J4636j9699r3797o9134
9175D294019j01396j30120o0437M3928l9434m6238j7809K8084r6071j04608m7798
$$ plain form
9164 3722120 3786179 3790102 3671250 3582264 3524504 3455570 3361908 3404932 3386314 3292997 3250864
9153 3250864 3159914 3080066 2975608 3003476 3093021 3063921 2962195 2945096 3045129 3000997 2886755
9142 2886755 2771960 2773847 2816252 2813462 2781018 2749893 2731849 2757234 2817686 2744259 2676200 2650675
9130 2650675 2714828 2671836 2555752 2472307 2495276 2483496 2396389 2304642 2300717 2338573 2214366
9119 2214366 2123229 2106666 2071775 1983562 1952075 2006882 2003914 1983776 1976666 1978450 1884025 1831774
9107 1831774 1790508 1743454 1764157 1768408 1819456 1775588 1781385 1765644 1845721 1845091 1800674 1747554
9095 1747554 1726297 1717847 1608355 1526305 1492524 1575876 1571715 1557376 1538877 1450070 1367596 1329847
9083 1329847 1310907 1277451 1324288 1347264 1375673 1331720 1207202 1213951 1326936 1250249 1146863
$$ packed form
9164C722120O4059L923j18852q8986n7760o8934r3662M3024j8618r3317m2133
9153C250864r0950p9848j04458K7868Q9545k9100j01726j7099J00033m4132j14242
9142B886755j14795J887M2405k790l2444l1125j8044K5385O0452p3427o8059k5525
9130B650675O4153m2992j16084q3445K2969j1780q7107r1747l925L7856j24207
9119B214366r1137j6563l4891q8213l1487N4807k968k0138p110J784r4425n2251
9107A831774m1266m7054K0703M251N1048m3868N797j5741Q0077o30m4417n3120
9095A747554k1257q450j09492q2050l3781Q3352m161j4339j8499q8807q2474l7749
9083A329847j8940l3456M6837K2976K8409m3953j24518O749J12985p6687j03386
$$ plain form
9072 1146863 1198383 1192581 1155325 1084143 1108608 1214436 1318567 1369798 1258035 1275302 1190787
9061 1190787 1164958 1098518 1108228 1175370 1170982 1168041 1103899 1042874 1020462 1035258 1032631 988352
9049 988352 971342 1040499 978265 888195 892462 956333 905536 868344 821808 789199 779575 717681
9037 717681 748281 811975 774784 773163 771055 841805 796868 829714 856709 799653 819247 860748
9025 860748 868399 797293 757547 708111 742462 715797 724772 659080 675760 704247 666160 543961
9013 543961 482853 505055 536560 558591 525962 503604 451650 430898 379886 310825 394911 484991
9001 484991 471579 435070 458210 463720 414041 478685 455309 507025 525649 567932 451496 417139
8989 417139 372197 332964 281545 296805 365578 371908 320965 293272 325821 275576 274059 248206
$$ packed form
9072A146863N1520n802l7256p1182K4465J05828J04131N1231j11763J7267q4515
9061A190787k5829o6440R710O7142m388k941o4142o1025k2412J4796k627m4279
9049I88352j7010O9157o2234r0070M267O3871n0797l7192m6536l2609r624o1894
9037G17681L0600O3694l7191j621k108P0750m4937L2846K6995n7056J9594M1501
9025H60748P651p1106l9746m9436L4351k6665Q975o5692J6680K8487l8087j22199
9013E43961o1108K2202L1505K2031l2629k2358n1954k0752n1012o9061Q4086R0080
9001D84991j3412l6509K3140N510m9679O4644k3376N1716J8624M2283j16436l4357
8989D17139m4942l9233n1419J5260O8773O330n0943k7693L2549n0245j517k5853
$$ plain form
8977 248206 229063 190108 263098 232205 203835 132343 100606 104978 170898 145584 202295 266953
8965 266953 286325 228521 234689 290572 310464 366733 377879 343205 300671 281887 218998 303031
8953 303031 267037 276871 277124 303551 228466 301405 340948 328626 327840 343871 303420 267352 202662
8940 202662 147754 196559 216840 214504 274720 353524 320026 345663 336129 270721 205353 272706
8928 272706 308065 340141 368022 393655 338741 279849 163931 151125 128872 200660 201802 193046
8916 193046 214368 174537 165226 93277 118940 140189 149932 18866 14553 -58243 -72726 -16946
8904 -16946 -36718 -57555 -45609 -18591 -10016 -24876 25233 71990 160759 145776 80044 77861
8892 77861 76958 119951 165891 206962 227981 277547 175292 132382 96016 144404 114651 251148
$$ packed form
8977B48206j9143l8955P2990l0893k8370p1492l1737M372O5920k5314N6711O4658
8965B66953J9372n7804O168N5883J9892N6269J1146l4674m2534j8784o2889Q4033
8953C03031l5994R834K53K6427p5085P2939L9543j2322p86J6031m0451l6068o4690
8940B02662n4908M8805K0281k336O0216P8804l3498K5637r534o5408o5368O7353
8928B72706L5359L2076K7881K5633n4914n8892j15918j2806k2253P1788J142q756
8916A93046K1322l9831r311p1949K5663K1249R743j31066m313p2796j4483N5780
8904a6946j9772k0837J1946K7018Q575j4860N0109M6757Q8769j4983o5732k183
8892G7861r03M2993M5940M1071K1019M9566j02255m2910l6366M8388k9753J36497
$$ plain form
8880 251148 283014 233575 165286 177643 162999 63082 51223 113236 181439 98631 48119 91167
8868 91167 148651 137653 158543 182641 136493 145828 225113 253839 287082 259541 250530 243015
8856 243015 245287 185854 253843 291461 258495 254713 300917 288994 206422 195405 213309 188772
8844 188772 178218 225613 270432 260926 117393 77925 104290 116914 94822 142843 175854 152981
8832 152981 183893 219252 278476 230742 187715 256738 261567 173274 184678 317267 311917 324358
8820 324358 343567 315694 250485 148269 174787 217254 286184 326991 262794 203454 106565
8809 106565 1333 52149 78592 46616 38315 67625 54594 -53274 -61603 37746 130163 139361
8797 139361 113781 184594 170717 191352 224929 284916 295410 274709 276950 257695 269327 278520
$$ packed form
8880B51148L1866m9439o8289J2357j4644r9917j1859O2013O8203q2808n0512M3048
8868I1167N7484j0998K0890K4098m6148R335P9285K8726L3243k7541r011p515
8856B43015K272n9433O7989L7618l2966l782M6204j1923q2572j1017J7904k4537
8844A88772j0554M7395M4819r506j43533l9468K6365J2624k2092M8021L3011k2873
8832A52981L0912L5359N9224m7734m3027O9023M829q8293J1404J32589n350J2441
8820C24358J9209k7873o5209j02216K6518M2467O8930M0807o4197n9340r6889
8809A06565j05232N0816K6443l1976q301K9310j3031j07868q329R9349R2417R198
8797A39361k5580P0813j3877K0635L3577N9987J0494k0701K241j9255J1632R193
$$ plain form
8785 278520 355816 398291 369027 316099 321982 320496 307454 268785 216723 199508 229125 193638
8773 193638 192493 252523 266122 186274 137944 119763 87746 30214 122767 224365 245674 233633
8761 233633 205511 185637 116319 146906 186495 162243 70564 123152 134074 138093 99573 169312
8749 169312 208590 199845 104785 80700 162687 123555 95533 204327 295748 232891 179014 203413
8737 203413 209343 163772 207183 250518 296251 228447 250895 312276 384811 283269 241838 303699
8725 303699 289413 239819 264933 274769 295294 218091 189885 199781 72477 133683 246313 199645
8713 199645 84608 158675 180429 90483 21493 56371 114501 114930 51029 68483 49068 59936
8701 59936 17765 67575 116626 23042 -35614 32160 129130 104251 55947 86932 130738 71979
$$ packed form
8785B78520P7296M2475k9264n2928N883j486j3042l8669n2062j7215K9617l5487
8773A93638j145O0030J3599p9848m8330j8181l2017n7532R2553J01598K1309j2041
8761B33633k8122j9874o9318L0587L9589k4252r1679N2588J0922M019l8520O9739
8749A69312L9278q745r5060k4085Q1987l9132k8022J08794R1421o2857n3877K4399
8737B03413N930m5571M3411M3335M5733o7804K2448O1381P2535j01542m1431O1861
8725C03699j4286m9594K5114R836K0525p7203k8206R896j27304O1206J12630m6668
8713A99645j15037P4067K1754q9946o8990L4878N8130M29o3901J7454j9415J0868
8701E9936m2171M9810M9051r3584n8656O7774R6970k4879m8304L0985M3806n8759
$$ plain form
8689 71979 19569 12097 5335 5338 105007 91699 32484 25080 147953 161939 63234 41500 135895
8676 135895 148021 125871 28593 138876 208789 109528 89765 74348 57396 60296 202583
8665 202583 209845 123181 88712 156401 148557 95895 41056 129028 173929 191672 101200 44611
8653 44611 69044 103761 147824 170261 128642 152582 156224 119371 78257 16923 148798 195605
8641 195605 74199 -49165 53611 78685 35731 26780 49889 27250 6692 8311 39065
8630 39065 -5514 33379 47426 82586 60615 6105 -765 -11454 -22396 -432 63661 63434
8618 63434 132821 120843 64376 -50635 -13324 27313 75137 72085 109547 148597 171287 88024
8606 88024 -889 -25409 32878 69329 8125 2197 76713 136784 120670 92482 61896 22049
$$ packed form
8689G1979n2410p472o762LR9669j3308n9215p404J22873J3986r8705k1734R4395
8676A35895J2126k2150r7278J10283O9913r9261j9763j5417j6952K900J42287
8665B02583P262q6664l4469O7689p844n2662n4839Q7972M4901J7743r0472n6589
8653D4611K4433L4717M4063K2437m1619K3940L642l6853m1114o1334J31875M6807
8641A95605j21406j23364J02776K5074m2954q951K3109k2639k0558J619L0754
8630C9065m4579L8893J4047L5160k1971n4510o870j0689j0942K1964O4093k27
8618F3434O9387j1978n6467j15011L7311M0637M7824l052L7462L9050K2690q3263
8606H8024q8913k4520N8287L6451o1204n928P4516O0071j6114k8188l0586l9847
$$ plain form
8594 22049 -14148 14371 -4129 2935 14426 137159 77879 39741 -56813 -87624 -68425 -47704
8582 -47704 32121 46511 64718 51913 -6221 -76303 -49755 45779 57175 22567 28195 -30670
8570 -30670 21474 65333 92754 12748 67771 71149 51048 24575 43006 157211 216195 97967
8558 97967 12080 23934 26925 31535 55877 179255 184011 199400 114186 96101 53407 87551
8546 87551 159081 200432 150745 110371 170065 188822 114114 99771 87086 67425 110394 119728
8534 119728 128540 142640 111695 151164 176768 49747 -40812 14980 135205 81462 7952
8523 7952 -7666 102417 68757 56095 35894 25372 25730 26433 81866 66257 76989 157835 161884
8510 161884 43521 14901 27748 43771 114358 179927 201676 178404 142405 84239 64518
$$ packed form
8594B2049l6197K8519j8500P064J1491J22733n9280l8138r6554l0811J9199K0721
8582d7704P9825J4390J8207j2805n8134p0082K6548R5534J1396l4608N628n8865
8570c0670N2144M3859K7421q0006N5023L378k0101k6473J8431J14205N8984j18228
8558I7967q5887J1854K991M610K4342J23378M756J5389q5214j8085m2694L4144
8546H7551P1530M1351m9687m0374N9694J8757p4708j4343j2685j9661M2969R334
8534A19728Q812J4100l0945L9469K5604j27021r0559N5792J20225n3743p3510
8523G952j5618J10083l3660j2662k0201j0522L58P03N5433j5609J0732Q0846M049
8510A61884j18363k8620J2847J6023P0587O5569K1749k3272l5999n8166j9721
$$ plain form
8499 64518 11894 -23819 130072 226368 227095 87803 136607 154768 128773 75682 63247 167218
8487 167218 223428 260157 293000 390515 386678 303911 255699 238210 323487 374662 431815 460585
8475 460585 420745 417549 346973 288724 291606 371980 412637 435793 400751 444810 334820 317663
8463 317663 326254 291003 227385 210524 215641 240246 284985 321324 369205 412151 403617 305352
8451 305352 253161 260527 366810 363836 392785 402393 439410 414171 312926 246897 286090 303160
8439 303160 376179 363672 406920 404221 280497 227778 262694 295167 262389 244128 259130 323362
8427 323362 319719 345193 303439 335728 285702 379626 360131 387569 411907 504058 568276 482426
8415 482426 509010 475420 453764 440054 447418 488520 481921 463409 490744 469615 397010 325187
$$ packed form
8499F4518n2624l5713J53891R6296P27j39292M8804J8161k5995n3091j2435J03971
8487A67218N6210L6729L2843R7515l837q2767m8212j7489Q5277N1175N7153K8770
8475D60585l9840l196p0576n8249K882Q0374M0657K3156l5042M4059j09990j7157
8463C17663Q591l5251o3618j6861N117K4605M4739L6339M7881M2946q534r8265
8451C05352n2191P366J06283k974K8949R608L7017k5239j01245o6029L9193J7070
8439C03160P3019j2507M3248k699j23724n2719L4916L2473l2778j8261J5002O4232
8427C23362l643K5474m1754L2289n0026R3924j9495K7438K4338R2151O4218q5850
8415D82426K6584l3590k1656j3710P364M1102o599j8512K7335k1129p2605p1823
$$ plain form
8403 325187 442013 493080 526536 462122 509208 519282 526033 463965 449371 436451 501313 515689
8391 515689 549435 554472 579483 701027 711175 692808 620422 653574 707646 768856 769242 840451
8379 840451 839544 742483 668851 746243 750269 778610 877347 982511 953597 948398 1006819 1025085
8367 1025085 1017343 1079342 1172841 1240626 1218908 1153033 1243649 1274374 1377215 1486318 1575136
8356 1575136 1587976 1643538 1697269 1752683 1763698 1829526 1959046 2054706 1980596 1884343 1939329
8345 1939329 2012067 2078251 2124531 2258480 2254917 2220078 2176861 2141248 2153669 2230315 2327679
8334 2327679 2427114 2394436 2298226 2279160 2403667 2382350 2336131 2400939 2512036 2560200 2599212
8323 2599212 2641943 2598299 2598609 2689101 2852758 2853052 2751085 2814630 2963174 2810774 2724416
$$ packed form
8403C25187J16826N1067L3456o4414M7086J0074O751o2068j4594j2920O4862J4376
8391E15689L3746N037K5011J21544J0148j8367p2386L3152N4072O1210L86P1209
8379H40451r07r7061p3632P7392M026K8341R8737J05164k8914n199N8421J8266
8367A025085p742O1999R3499O7785k1718o5875R0616L0725J02841J09103Q8818
8356A575136J2840N5562N3731N5414J1015O5828J29520R5660p4110r6253N4986
8345A939329P2738O6184M6280J33949l563l4839m3217l5613J2421P6646R7364
8334B327679R9435l2678r6210j9066J24507k1317m6219O4808J11097M8164L9012
8323B599212M2731m3644L10R0492J63657K94j01967O3545J48544j52400q6358
$$ plain form
8312 2724416 2758092 2880507 2948650 2930433 2884070 2897942 2976059 2957961 2884912 2923898 3015966
8301 3015966 3011124 2956307 2834515 2667311 2647665 2680521 2703027 2688452 2626482 2587477 2503419
8290 2503419 2383150 2327875 2442300 2476994 2404631 2289451 2270859 2221068 2162841 2090866 2033980
8279 2033980 2008909 2027417 2003579 1942565 1793677 1704638 1732777 1686337 1597853 1563766 1611619
8268 1611619 1633772 1603569 1476402 1330926 1375479 1429348 1399524 1400916 1470593 1486056 1356718
8257 1356718 1390288 1332191 1240028 1234593 1295533 1337010 1341778 1270759 1217021 1245347 1226258 1183668
8245 1183668 1126418 1082650 1098287 1158389 1081761 1077112 1123582 1164794 1197756 1095201 995040
8234 995040 1001060 1134140 1142604 1017576 1070759 1136017 1163795 1072780 1071332 1097295 1131232 1103995
$$ packed form
8312B724416L3676J22415O8143j8217m6363J3872P8117j8098p3049L8986R2068
8301C015966m842n4817j21792j67204j9646L2856K2506j4575o1970l9005q4058
8290B503419j20269n5275J14425L4694p2363j15180j8592m9791n8227p1975n6886
8279B033980k5071J8508k3838o1014j48888q9039K8139m6440q8484l4087M7853
8268A611619K2153l0203j27167j45476M4553N3869k9824J392O9677J5463j29338
8257A356718L3570n8097r2163n435O0940M1477M768p1019n3738K8326j9089m2590
8245A183668n7250m3768J5637O0102p6628m649M6470M1212L2962j02555j00161
8234I95040O020J33080Q464j25028N3183O5258K7778r1015j448K5963L3937k7237
$$ plain form
8222 1103995 1085808 1135961 1117825 1099944 1101495 1050127 890990 925249 1017468 991685 920737
8211 920737 986753 1059444 1003443 858932 797624 941761 1047105 971934 986174 1018872 1083248
8200 1083248 1139250 1138219 1062330 1057729 1107848 1177273 1181300 1184856 1077459 1157297 1274386 1112446
8188 1112446 1107431 1241334 1238102 1037962 1095721 1206781 1257357 1235832 1185448 1148180 1075290
8177 1075290 1059417 1105456 1122110 1126423 1111733 1228213 1274396 1240900 1236160 1295252 1353925 1364232
8165 1364232 1409071 1443884 1540834 1485071 1431752 1581896 1639858 1608918 1691929 1763129 1727776
8154 1727776 1709468 1743847 1708455 1712442 1708531 1782589 1827667 1762429 1672819 1670095 1745796 1705100
8142 1705100 1746585 1851727 1807972 1805771 1829602 1855609 1866788 1818880 1879645 2057969 2123314
$$ packed form
8222A103995j8187N0153j8136j7881J551n1368j59137L4259R2219k5783p0948
8211I20737O6016P2691n6001j44511o1308J44137J05344p5171J4240L2698O4376
8200A083248N6002j031p5889m601N0119O9425M027L556j07397P9838J17089j61940
8188A112446n015J33903l232k00140N7759J11060N0576k1525n0384l7268p2890
8177A075290j5873M6039J6654M313j4690J16480M6183l3496m740N9092N8673J0307
8165A364232M4839L4813R6950n5763n3319J50144N7962l0940Q3011P1200l5353
8154A727776j8308L4379l5392L987l911P4058M5078o5238q9610k724P5701m0696
8142A705100M1485J05142m3755k201K3831K6007J1179m7908O0765J78324O5345
$$ plain form
8131 2123314 2057147 2099689 2132522 2158697 2136642 2150254 2238029 2334817 2412199 2400543 2346960
8120 2346960 2378043 2430241 2492001 2524231 2468958 2525520 2658137 2697060 2613062 2549133 2540451
8109 2540451 2657632 2742661 2725965 2720967 2788810 2756210 2724652 2722767 2803168 2822474 2884977 2982260
8097 2982260 2914238 2943023 2943462 2948304 2965254 2967624 3007710 3084104 3064094 3035116 3055507 3101015
8085 3101015 3109805 3153203 3166719 3194530 3163321 3143013 3121966 3148002 3148889 3145236 3185939 3224360
8073 3224360 3135843 3105572 3216693 3169627 3150285 3154398 3249276 3271363 3250867 3188604 3231207
8062 3231207 3252703 3276328 3253943 3199244 3165571 3191220 3144926 3078792 3019717 3053443 3135557
8051 3135557 3129055 3104653 3024095 2988725 2980592 3041357 3037992 3043906 2979623 2974382 2897512 2933903
$$ packed form
8131B123314o6167M2542L2833K6175k2055J3612Q7775R6788P7382j1656n3583
8120B346960L1083N2198O1760L2230n5273N6562J32617L8923q3998o3929q682
8109B540451J17181Q5029j6696m998O7843l2600l1558j885Q0401J9306O2503R7283
8097B982260o8022K8785M39M842J6950K370M0086P6394k0010k8978K0391M5508
8085C101015Q790M3398J3516K7811l1209k0308k1047K6036Q87l653M0703L8421
8073C224360q8517l0271J11121m7066j9342M113R4878K2087k0496o2263M2603
8062C231207K1496K3625k2385n4699l3673K5649m6294o6134n9075L3726Q2114
8051C135557o502k4402q0558l5370q133O0765l365N914o4283n241p6870L6391
$$ plain form
8039 2933903 2912448 2993318 2957217 2973689 2953337 2830119 2837056 2839795 2860652 2838833 2847367 2874977
8027 2874977 2887355 2884021 2843946 2753669 2738972 2656174 2672932 2655104 2685254 2645265 2640233 2667352
8015 2667352 2663436 2598863 2517785 2525907 2564051 2549573 2558163 2605970 2637946 2623744 2587495 2575632
8003 2575632 2502163 2538790 2504444 2515976 2480057 2500632 2526727 2562739 2542260 2512301 2501287
7992 2501287 2427971 2368733 2355281 2451896 2512243 2451810 2404287 2448735 2363457 2332270 2267435
7981 2267435 2402507 2448123 2451832 2448549 2417292 2390330 2360788 2347025 2419783 2403428 2437539 2509788
7969 2509788 2554748 2483932 2426411 2564872 2579128 2540015 2544861 2608310 2559744 2671725 2682755
7958 2682755 2647828 2615352 2611858 2581502 2561310 2566458 2651852 2714599 2636008 2563844 2546874 2608694
$$ packed form
8039B933903k1455Q0870l6101J6472k0352j23218O937K739K0857k1819Q534K7610
8027B874977J2378l334m0075r0277j4697q2798J6758j7828L0150l9989n032K7119
8015B667352l916o4573q1078Q122L8144j4478Q590M7807L1976j4202l6249j1863
8003B575632p3469L6627l4346J1532l5919K0575K6095L6012k0479k9959j1014
7992B501287p3316n9238j3452R6615O0347o0433m7523M4448q5278l1187o4835
7981B267435J35072M5616L709l283l1257k6962k9542j3763P2758j6355L4111P2249
7969B509788M4960p0816n7521J38461J4256l9113M846O3449m8566J11981J1030
7958B682755l4927l2476l494l0356k0192N148Q5394O2747p8591p2164j6970O1820
$$ plain form
7946 2608694 2622919 2579932 2525938 2594757 2642217 2546724 2449173 2533246 2606266 2674995 2621193
7935 2621193 2598568 2502408 2547072 2682269 2659969 2659439 2713059 2732023 2730480 2648161 2590387 2651433
7923 2651433 2702170 2733081 2683743 2653821 2572075 2653040 2623224 2613046 2540913 2493139 2544161
7912 2544161 2493415 2400776 2340438 2358103 2401743 2336403 2302249 2211659 2092988 2129880 2150817
7901 2150817 2134672 2147136 2228670 2188527 2192386 2145337 2011495 2003095 2095439 2155152 2173110 2129757
7889 2129757 2195033 2142861 2163779 2110592 2048115 2125280 2094425 2089251 2009352 2010927 2036806 2110410
7877 2110410 2065448 2035146 1965930 1861691 1817056 1749754 1688728 1826762 1896802 1854936 1725233
7866 1725233 1637641 1605224 1583463 1568117 1571016 1609424 1688623 1654250 1548117 1572709 1555505
$$ packed form
7946B608694J4225m2987n3994O8819M7460r5493r7551Q4073P3020O8729n3802
7935B621193k2625r6160M4664J35197k2300n30N3620J8964j543q2319n7774O1046
7923B651433N0737L0911m9338k9922q1746Q0965k9816j0178p2133m7774N1022
7912B544161n0746r2639o0338J7665M3640o5340l4154r0590j18671L6892K0937
7901B150817j6145J2464Q1534m0143L859m7049j33842q400R2344N9713J7958m3353
7889B129757O5276n2172K0918n3187o2477P7165l0855n174p9899J575K5879P3604
7877B110410m4962l0302o9216j04239m4635o7302o1026J38034P0040m1866j29703
7866A725233q7592l2417k1761j5346K899L8408P9199l4373j06133K4592j7204
$$ plain form
7855 1555505 1509754 1484109 1526621 1475681 1595561 1622896 1558855 1420818 1344360 1400938 1429568
7844 1429568 1421693 1435639 1445556 1392011 1364351 1315951 1230824 1171749 1210018 1275652 1288451 1262111
7832 1262111 1242821 1272399 1327530 1222765 1248162 1310179 1324718 1199927 1183335 1214208 1230665
7821 1230665 1268858 1305106 1279444 1178226 1147929 1042149 1045412 1051718 1125986 1148608 1129019
7810 1129019 1014942 926192 936983 850640 752626 793573 842454 838845 737831 734495 766099
7799 766099 716087 687170 736307 778759 770750 792356 796545 756764 683913 689258 677163 802097
7787 802097 813234 753578 703334 751724 668844 640837 785979 753476 829834 911414 866986
7776 866986 798605 778984 786140 774422 734074 748916 762175 756202 686854 657120 660938 657400
$$ packed form
7855A555505m5751k5645M2512n0940J19880K7335o4041j38037p6458N6578K8630
7844A429568p875J3946R917n3545k7660m8400q5127n9075L8269O5634J2799k6340
7832A262111j9290K9578N5131j04765K5397O2017J4539j24791j6592L0873J6457
7821A230665L8193L6248k5662j01218l0297j05780L263O306P4268K2622j9589
7810A129019j14077q8750J0791q6343r8014M0947M8881l609j01014l336L1604
7799G66099n0012k8917M9137M2452q009K1606M189l9781p2851N345j2095J24934
7787H02097J1137n9656n0244M8390q2880k8007J45142l2503P6358Q1580m4428
7776H66986o8381j9621P156j1718m0348J4842J3259n973o9348k9734L818l538
$$ plain form
7764 657400 654180 699829 697035 664980 610899 598399 617617 700329 639838 669678 668208 667410 616217
7751 616217 555892 648187 663285 771927 705474 668586 691372 688142 621756 655256 681076 646837
7739 646837 621379 613062 563557 577538 562963 571462 616405 631220 641864 582805 530021 531979
7727 531979 553342 602994 568300 486695 544917 587120 645880 504925 503565 538727 538188 504563
7715 504563 610417 690987 665018 706160 676414 609525 497293 518903 607524 685870 621507
7704 621507 590891 675733 712559 579655 543855 605810 550288 492470 533776 562183 549157
7693 549157 540289 577789 573380 516568 411218 430650 451496 437166 464115 554790 613997 542982
7681 542982 548560 574990 531712 477402 504231 559445 558610 479460 493196 589329 522460 504830
$$ packed form
7764F57400l220M5649k794l2055n4081j2500J9218Q2712o0491K9840j470p98n1193
7751F16217o0325R2295J5098J08642o6453l6888K2786l230o6386L3500K5820l4239
7739F46837k5458q317m9505J3981j4575Q499M4943J4815J0644n9059n2784J958
7727E31979K1363M9652l4694q1605N8222M2203N8760j40955j360L5162n39l3625
7715E04563J05854Q0570k5969M1142k9746o6889j12232K1610Q8621P8346o4363
7704F21507l0616Q4842L6826j32904l5800O1955n5522n7818M1306K8407j3026
7693E49157q868L7500m409n6812j05350J9432K0846j4330K6949R0675N9207p1015
7681E42982N578K6430m3278n4310K6829N5214q35p9150J3736R6133o6869j7630
$$ plain form
7669 504830 516476 487147 478338 501533 511363 574971 623780 537946 528835 510667 480145 480043 515140
7656 515140 572298 554231 619676 650535 541296 411889 375455 482166 587778 592780 582469
7645 582469 654489 616787 530277 467806 471543 526233 570225 570863 578891 532534 481600 549147
7633 549147 658037 659045 544911 601624 584213 510523 486418 510973 615136 706811 677541
7622 677541 571464 523763 457742 446830 549208 608637 636264 643287 673087 641411 504024
7611 504024 489212 572987 669993 630864 591109 604189 575173 481936 542523 606662 636585 584377
7599 584377 657816 704765 690449 606162 591785 680293 646133 606857 639091 777908 737433
7588 737433 679326 684927 698930 667191 689602 768393 804005 773622 796720 793534 744297 647711
$$ packed form
7669E04830J1646k9329q809K3195R830O3608M8809q5834r111j8168l0522j02L5097
7656E15140N7158j8067O5445L0859j09239j29407l6434J06711J05612N002j0311
7645E82469P2020l7702q6510o2471L737N4690M3992O38Q028m6357n0934O7547
7633E49147J08890J008j14134N6713j7411p3690k4105K4555J04163R1675k9270
7622F77541j06077m7701o6021j0912J02378N9429K7627P023K9800l1676j37387
7611E04024j4812Q3775R7006l9129l9755J3080k9016r3237O0587O4139K9923n2208
7599E84377P3439M6949j4316q4287j4377Q8508l4160l9276L2234J38817m0475
7588G37433n8107N601J4003l1739K2411P8791L5612l0383K3098l186m9237r6586
$$ plain form
7576 647711 673842 779740 766978 762168 815490 840543 795042 726009 727387 753305 776121 807396
7564 807396 814275 853584 747059 792280 859421 868345 768036 811216 859539 778741 711770 711693
7552 711693 853918 951861 962565 811159 787182 756352 718400 693145 755407 832019 910409
7541 910409 951809 848459 741580 723384 834739 962290 925046 925356 937347 956021 840539
7530 840539 810796 826845 925318 1049148 1012030 948412 865131 890998 879836 908399 890783
7519 890783 935485 933982 1006032 909239 842122 889595 872118 914055 864624 841779 865197 882887
7507 882887 860838 842589 931599 977744 998329 943786 945827 941269 858794 938592 963510 1041023
7495 1041023 901333 900288 898332 885827 835719 850876 868548 923360 975998 885546 850150 816780
$$ packed form
7576F47711K6131J05898j2762m810N3322K5053m5501o9033J378K5918K2816L1275
7564H07396O879L9309j06525M5221O7141Q924j00309M3180M8323q0798o6971p7
7552G11693J42225R7943J0704j51406k3977l0830l7952k5255O2262P6612P8390
7541I10409M1400j03350j06879j8196J11355J27551l7244L10J1991J8674j15482
7530H40539k9743J6049R8473J23830l7118o3618q3281K5867j1162K8563j7616
7519H90783M4702j503P2050r6793o7117M7473j7477M1937m9431k2845K3418J7690
7507H82887k2049j8249Q9010M6145K0585n4543K041m558q2475P9798K4918P7513
7495A041023j39690j045j956j2505n0108J5157J7672N4812N2638r0452l5396l3370
$$ plain form
7483 816780 822183 823794 832849 783146 818733 861566 801122 654018 618199 714898 759538 758943
7471 758943 744473 819104 899601 815290 824193 732614 761999 755056 834725 827498 798728 837037
7459 837037 877895 890190 789105 708585 756863 892424 834794 782349 796031 883263 826139
7448 826139 759414 674121 621901 641574 645976 560116 494130 564272 562571 546362 551826 474145
7436 474145 485225 473719 474568 470710 449896 499184 429300 441371 447044 501830 440986 417924
7424 417924 452639 510594 487664 492043 526517 584183 616897 540341 450849 442166 505988 469183
7412 469183 499727 432430 379688 336736 308517 308680 298375 344744 362477 304972 286867 224039
7400 224039 272993 307222 269898 196556 231723 220770 148836 108198 130333 216026 286401 257296
$$ packed form
7483H16780N403J611R055m9703L5587M2833o0444j47104l5819R6699M4640n95
7471G58943j4470P4631Q0497q4311Q903r1579K9385o943P9669p227k8770L8309
7459H37037M0858J2295j01085q0520M8278J35561n7630n2445J3682Q7232n7124
7448H26139o6725q5293n2220J9673M402q5860o5986P0142j701j6209N464p7681
7436D74145J1080j1506Q49l858k0814M9288o9884J2071N673N4786o0844k3062
7424D17924L4715N7955k2930M379L4474N7666L2714p6556q9492q683O3822l6805
7412D69183L0544o7297n2742m2952k8219J63j0305M6369J7733n7505j8105o2828
7400B24039M8954L4229l7324p3342L5167j0953p1934m0638K2135Q5693P0375k9105
$$ plain form
7388 257296 261076 322152 287298 335951 283187 302740 297857 325668 304999 186586 194974 237794
7376 237794 308628 329376 245349 261754 334419 305410 238631 276187 333435 336594 356384 287728
7364 287728 253213 234775 282982 298730 295014 271444 283065 285283 279713 237489 331347 408580
7352 408580 411716 383567 340930 364615 341344 369149 403533 487159 518819 518565 554035 570586
7340 570586 593272 600152 528377 482214 401129 277703 136588 155124 223504 194995 226844
7329 226844 207809 87588 43282 59221 32125 57142 153899 134819 118646 80462 39912
7318 39912 31811 74331 116883 121615 83306 65248 -3794 -34859 -13864 36010 83200 82461 15695
7305 15695 26967 26136 40575 82927 -1545 28321 67218 68658 8582 -26436 -42901 27744
$$ packed form
7388B57296L780O1076l4854M8653n2764J9553m883K7811k0669j18413Q388M2820
7376B37794P0834K0748q4027J6405P2665k9009o6779L7556N7248L159J9790o8656
7364B87728l4515j8438M8207J5748l716k3570J1621K218n570m2224R3858P7233
7352D08580L136k8149m2637K3685k3271K7805L4384Q3626L1660k54L5470J6551
7340E70586K2686O880p1775m6163q1085j23426j41115J8536O8380k8509L1849
7329B26844j9035j20221m4306J5939k7096K5017R6757j9080j6173l8184m0550
7318C9912q101M2520M2552M732l8309j8058o9042l1065K0995M9874M7190p39o6766
7305A5695J1272q31J4439M2352q4472K9866L8897J440o0076l5018j6465P0645
$$ plain form
7293 27744 42447 9382 -11685 72742 135128 78753 52049 47548 76839 126985 118367 77190
7281 77190 119167 166559 111840 62333 21294 9275 95106 69460 91997 61842 101616 113539
7269 113539 85352 24610 14654 -5731 -12603 34474 -46087 -101181 -180515 -149377 -96401 -96302 -78001
7256 -78001 -10062 -44321 -75612 -127947 -155438 -75687 -63404 -91526 -45808 -16528 -13556 -96950
7244 -96950 -84758 -46150 -54037 21011 -5834 -72430 -52234 -48276 -58510 -28775 21013 48732
7232 48732 1583 -62307 -81314 -72484 -150727 -162703 -157344 -151101 -57184 -77767 -50161 -14835
7220 -14835 -4474 -60254 -74300 -60293 -77254 -65496 -49240 -17279 -26767 -11208 30371 -9878
7208 -9878 -7418 14098 -22145 -35766 -102266 -100304 -24566 64274 115872 34501 -32628 -77158
$$ packed form
7293B7744J4703l3065k1067Q4427O2386n6375k6704m501K9291N0146q618m1177
7281G7190M1977M7392n4719m9507m1039j2019Q5831k5646K2537l0155L9774J1923
7269A13539k8187o0742r956k0385o872M7077q0561n5094p9334L1138N2976R9J8301
7256g8001O7939l4259l1291n2335k7491P9751J2283k8122M5718K9280K972q3394
7244i6950J2192L8608p887P5048k6845o6596K0196L958j0234K9735M9788K7719
7232D8732m7149o3890j9007Q830p8243j1976N359O243R3917k0583K7606L5326
7220a4835J0361n5780j4046J4007j6961J1758J6256L1961r488J5559M1579m0249
7208i878K460K1516l6243j3621o6500J962P5738Q8840N1598q1371o7129m4530
$$ plain form
7196 -77158 -117531 -126282 -132626 -74250 -71307 -29692 -93598 -144979 -96483 -16179 63611 3438
7184 3438 30382 -29347 -90346 -100471 -114072 -100419 -6027 60262 2618 -35041 -55916 -45912
7172 -45912 -114293 -72299 -42451 -22662 -31503 -100946 -155754 -137496 -132267 -168607 -194370 -152254
7160 -152254 -134530 -150176 -179800 -201056 -211717 -153846 -79238 -74887 -19851 19892 16608 -71928
7148 -71928 -107478 -102662 -82750 -81313 11250 37334 -13344 -32147 -62879 -35895 -9337 23988
7136 23988 -28864 -29872 -36189 -68573 -82623 -110493 -80448 -56928 -46502 -92719 -168621 -197891
7124 -197891 -188326 -196670 -175383 -85695 -61498 -55436 -48024 -108505 -143911 -142322 -70968 -36520 -46310
7111 -46310 -89574 -92043 -98826 -71030 -111067 -57100 95932 122242 37131 -85354 -83608 -95593
$$ packed form
7196g7158m0373q751o344N8376K943M1615o3906n1381M8496Q0304P9790o0173
7184C438K6944n9729o0999j0125j3601J3653R4392O6289n7644l7659k0875J0004
7172d5912o8381M1994K9848J9789q841o9443n4808J8258N229l6340k5763M2116
7160a52254J7724j5646k9624k1256j0661N7871P4608M351N5036L9743l284q8536
7148g1928l5550M816J9912J437R2563K6084n0678j8803l0732K6984K6558L3325
7136B3988n2852j008o317l2384j4050k7870L0045K3520J0426m6217p5902k9270
7124a97891R565q344K1287Q9688K4197O062P412o0481l5406J589P1354L4448r790
7111d6310m3264k469o783K7796m0037N3967J53032K6310q5111j22485J746j1985
$$ plain form
7099 -95593 -33938 -22446 -41287 -88042 -100569 -140880 -181715 -148753 -97790 -86377 -154915 -142238
7087 -142238 -116292 -116440 -138231 -126578 -45899 50487 -247 -113420 -145171 -111082 -110175 -134342
7075 -134342 -71023 -48339 -143477 -107173 -51211 -72412 -147024 -123690 -96831 -206207 -231228
7064 -231228 -223237 -196122 -220445 -219400 -268590 -231159 -245849 -200934 -123621 -143942 -181270 -188949
7052 -188949 -122592 -151186 -200059 -158640 -125489 -115457 -95669 -66669 -68059 -158455 -133717 -90513
7040 -90513 -37862 -120920 -141950 -99923 -29933 -85686 -115363 -123145 -8089 -26703 -124764 -149899
7028 -149899 -171138 -192918 -133250 7002 -11263 14584 10520 -41582 -144325 -54905 -2584
7017 -2584 6162 -50578 -64687 -77734 -103425 -138879 -112684 -29225 -44385 -151498 -166043 -205181
$$ packed form
7099i5593O1655J1492j8841m6755j2527m0311m0835L2962N0963J1413o8538J2677
7087a42238K5946j48k1791J1653Q0679R6386n0734j13173l1751L4089R07k4167
7075a34342O3319K2684r5138L6304N5962k1201p4612K3334K6859j09376k5021
7064b31228P991K7115k4323J045m9190L7431j4690M4915P7313k0321l7328p679
7052a88949O6357k8594m8873M1419L3151J0032J9788K9000j390r0396K4738M3204
7040i0513N2651q3058k1030M2027O9990n5753k9677p782J15056j8614r8061k5135
7028a49899k1239k1780N9668J40252j8265K5847m064n2102j02743Q9420N2321
7017b584Q746n6740j4109j3047k5691l5454K6195Q3459j5160j07113j4545l9138
$$ plain form
7005 -205181 -162170 -180854 -237984 -113424 -74414 -83366 -124391 -102052 -256795 -235171 -138953
6994 -138953 -115542 -196933 -176554 -130791 -129669 -52794 -70167 -104905 -57043 -69054 -151010 -127341
6982 -127341 -128205 -134030 -124665 -65410 -67691 -115938 -153138 -171839 -191662 -203770 -211070 -144276 -111218
6969 -111218 -21687 -76641 -160129 -272160 -253991 -169756 -97223 -42340 -82716 -96448 -102271 -124436
6957 -124436 -250752 -210024 -75048 -25745 43282 42020 -30609 -73794 -88362 -148732 -203835
6946 -203835 -138992 -42808 23386 37121 -49106 -134028 -89811 -110880 -155752 -141080 -62084 -47785
6934 -47785 -107892 -142444 -53853 -34664 -146915 -164798 -150864 -187255 -176022 -186965 -188441 -160866
6922 -160866 -106192 -126308 -127515 -188697 -269517 -287098 -240395 -189472 -149199 -23257 -65017 -167437
$$ packed form
7005b05181M3011j8684n7130J24560L9010q952m1025K2339j54743K1624R6218
6994a38953K3411q1391K0379M5763J122P6875j7373l4738M7862j2011q1956K3669
6982a27341q64n825R365N9255k281m8247l7200j8701j9823j2108p300O6794L3058
6969a11218Q9531n4954q3488j12031J8169Q4235P2533N4883m0376j3732n823k2165
6957a24436j26316M0728J34976M9303O9027j262p2629m3185j4568o0370n5103
6946b03835O4843R6184O6194J3735q6227q4922M4217k1069m4872J4672P8996J4299
6934d7785o0107l4552Q8591J9189j12251j7883J3934l6391J1233j0943j476K7575
6922a60866N4674k0116j207o1182q0820j7581M6703N0923M0273J25942m1760j02420
$$ plain form
6910 -167437 -201335 -223987 -284765 -204145 -45375 10283 -16916 -72585 -93439 -80942 -155698
6899 -155698 -202822 -122052 -77244 -34508 -26136 -42033 -64485 -67115 -119502 -157101 -182739 -172270
6887 -172270 -128561 -77017 -102693 -205590 -177239 -140232 -165018 -158550 -160449 -223726 -161876 -90072
6875 -90072 -48366 -107623 -137067 -96138 -39023 -84947 -141236 -45810 39855 13659 -50706 -60522
6863 -60522 -23013 -79626 -117671 -114501 -40925 -24418 -64833 -67152 -127198 -161377 -189511 -192430
6851 -192430 -266760 -181686 -150762 -146295 -153270 -189028 -223654 -242547 -279262 -298480 -250394 -190710
6839 -190710 -142630 -143441 -115342 -118620 -183747 -130492 -76197 -139052 -185620 -147082 -50473 -75392
6827 -75392 -181520 -152253 -39428 -57869 -51074 -157116 -231775 -176248 -107897 -137017 -188354
$$ packed form
6910a67437l3898k2652o0778Q0620J58770N5658k7199n5669k0854J2497p4756
6899a55698m7124Q0770M4808M2736Q372j5897k2452k630n2387l7599k5638J0469
6887a72270M3709N1544k5676j02897K8351L7007k4786O468j899o3277O1850P1804
6875i0072M1706n9257k9444M0929N7115m5924n6289R5426Q5665k6196o4365r816
6863f0522L7509n6613l8045L170P3576J6507m0415k319o0046l4179k8134k919
6851a92430p4330Q5074L0924M467o975l5758l4626j8893l6715j9218M8086N9684
6839a90710M8080q11K8099l278o5127N3255N4295o2855m6568L8538R6609k4919
6827g5392j06128K9267J12825j8441O795j06042p4659N5527O8351k9120n1337
$$ plain form
6816 -188354 -152858 -121708 -103766 -150442 -197490 -217720 -165910 -134342 -130688 -96454 -110253 -135497
6804 -135497 -128540 -136108 -129755 -105714 -51573 -14463 -31934 -133137 -124373 -92089 -110195 -129446
6792 -129446 -115304 -90526 -39102 -38921 -90081 -175065 -220916 -188888 -146071 -104108 -119545 -96323
6780 -96323 -148014 -157152 -214754 -177959 -174368 -154123 -93506 -86318 -130779 -160191 -139753 -155877
6768 -155877 -182876 -87872 -35787 -46676 -130299 -154157 -164516 -182900 -185806 -130338 -74712 -90782
6756 -90782 -83173 -190699 -265882 -291697 -212907 -150434 -99004 -167131 -160093 -118182 -115126 -203602
6744 -203602 -207213 -116721 -58999 -46668 -74328 -59971 -45372 -52739 1007 -72926 -105581 -94382
6732 -94382 -64864 -66605 -193104 -125174 -86484 -100210 -150921 -136608 -152627 -188409 -213976 -181362
$$ packed form
6816a88354L5496L1150J7942m6676m7048k0230N1810L1568L654L4234j3799k5244
6804a35497O957p568O353K4041N4141L7110j7471j01203Q764L2284j8106j9251
6792a29446J4142K4778N1424J81n1160q4984m5851L2028M2817M1963j5437K3222
6780i6323n1691r138n7602L6795L591K0245O0617P188m4461k9412K0438j6124
6768a55877k6999R5004N2085j0889q3623k3858j0359j8384k906N5468N5626j6070
6756i0782P609j07526p5183k5815P8790O2473N1430o8127P038M1911L056q8476
6744b03602l611R0492N7722J2331k7660J4357J4599p367N3746p3933l2655J1199
6732i4382K9518j741j26499O7930L8690j3726n0711J4313j6019l5782k5567L2614
$$ plain form
6720 -181362 -126935 -145973 -189840 -112862 -101339 -103785 -105194 -130034 -133490 -138457 -83226 -82891 -46052
6707 -46052 -90545 -55966 -52327 -125678 -152509 -128694 -113560 -101053 -82503 -79988 -136032 -138107
6695 -138107 -142893 -150112 -198984 -208581 -140075 -83532 -115292 -229566 -193552 -141172 -170442 -178608
6683 -178608 -101914 -62910 -54113 -65217 -55268 -74585 -102920 -116480 -40308 -8205 -25574 -48885
6671 -48885 -39657 -10339 -642 -39749 -117707 -144767 -119580 -112418 -139694 -159253 -84840 -6546
6659 -6546 -47208 -175263 -265306 -221841 -203755 -141164 -104196 -54743 -47926 -69772 -101123 -139555
6647 -139555 -86121 -79233 -32276 51527 4508 -53488 -57014 -51596 -31662 -8019 9480 -64905
6635 -64905 -95549 -143676 -168555 -202982 -113209 -3853 13491 -38576 -87621 -143220 -223964 -207721
$$ packed form
6720a81362N4427j9038m3867P6978J1523k446j409k4840l456m967N5231L35L6839
6707d6052m4493L4579L639p3351k6831K3815J5134J2507J8550K515n6044k075
6695a38107m786p219m8872r597O8506N6543l1760j14274L6014N2380k9270q166
6683a78608P6694L9004Q797j1104R949j9317k8335j3560P6172L2103j7369k3311
6671d8885R228K9318R697l9107p7958k7060K5187P162k7276j9559P4413P8294
6659f546m0662j28055r0043M3465J8086O2591L6968M9453O817k1846l1351l8432
6647a39555N3434O888M6957Q3803m7019n7996l526N418J9934K3643J7499p4385
6635f4905l0644m8127k4879l4427Q9773J09356J7344n2067m9045n5599q0744J6243
$$ plain form
6623 -207721 -139479 -45876 -9709 8367 5685 -59226 -105953 -27356 14864 123229 180495 175547
6611 175547 96691 49686 12460 77386 123112 172576 171718 127780 51310 55686 38626 24004
6599 24004 76470 130868 247059 189396 145024 89145 97725 127233 145304 172321 172026 180469
6587 180469 141629 127068 166952 180715 221269 235955 302998 291231 266415 236140 209802 205037
6575 205037 245905 321909 327047 314370 369784 378828 330459 389299 437933 482217 514701 544416
6563 544416 546431 548178 600310 673000 748845 779096 895627 934372 944876 959848 1009988 1147340
6551 1147340 1276276 1324915 1278545 1299315 1312321 1269541 1218131 1202552 1226443 1164956 1169516
6540 1169516 1101096 1020508 996751 909185 899946 829371 874135 932659 913508 838789 798203 789085
$$ packed form
6623b07721O8242R3603L6167J8076k682o4911m6727P8597M2220J08365N7266m948
6611A75547p8856m7005l7226O4926M5726M9464q58m3938p6470M376j7060j4622
6599B4004N2466N4398J16191n7663m4372n5879Q580K9508J8071K7017k95Q443
6587A80469l8840j4561L9884J3763M0554J4686O7043j1767k4816l0275k6338m765
6575B05037M0868P6004N138j2677N5414R044m8369N8840M8634M4284L2484K9715
6563E44416K015J747N2132P2690P5845L0251J16531L8745J0504J4972N0140J37352
6551A147340J28936M8639m6370K0770J3006m2780n1410j5579K3891o1487M560
6540A169516o8420q0588k3757q7566r239p0575M4764N8524j9151p4719m0586r118
$$ plain form
6528 789085 717853 695333 714190 723972 691789 626169 584688 602077 586771 583418 575027 592128
6516 592128 527833 524147 568155 504718 460451 517521 596421 568048 478590 377198 367141 391840
6504 391840 454298 480564 430785 338020 328753 292264 310022 360678 444600 451517 440916 273393
6492 273393 166629 194702 197609 267798 349247 409157 292377 227870 193139 170784 107133
6481 107133 97432 108600 232957 213647 119876 104816 153260 175312 114880 40476 115 35891
6469 35891 27319 -6693 -27875 26289 143644 118170 34175 -41022 -42982 50431 51538 125695
6457 125695 123826 173853 128597 118896 6437 -19341 67312 83749 140947 122873 154557 140240
6445 140240 111919 32383 13619 41028 110598 117330 89406 67024 94999 113556 32665 -2292
$$ packed form
6528G89085p1232k2520J8857R782l2183o5620m1481J7389j5306l353q391J7101
6516E92128o4295l686M4008o3437m4267N7070P8900k8373q9458j01392j0057K4699
6504C91840O2458K6266m9779r2765r267l6489J7758N0656Q3922O917j0601j67523
6492B73393j06764K8073K907P0189Q1449N9910j16780o4507l4731k2355o3651
6481A07133r701J1168J24357j9310r3771j5060M8444K2052o0432p4404m0361L5776
6469C5891q572l4012k1182N4164J17355k5474q3995p5197j960R3413J107P4157
6457A25695j869N0027m5256r701j12459k5778Q6653J6437N7198j8074L1684j4317
6445A40240k8321p9536j8764K7409O9570O732k7924k2382K7975J8557q0891l4957
$$ plain form
6433 -2292 17436 42427 61468 31058 12504 13190 50295 -25936 -55194 -24898 -10564 80122
6421 80122 112883 103724 -11262 -22727 -23757 -39998 -85004 -80740 16818 68275 49368 -77792
6409 -77792 -113769 -164377 -119103 -95345 -141103 -174368 -160660 -138189 -204956 -255314 -272833 -206225
6397 -206225 -182097 -147673 -87040 -110506 -169486 -184514 -147530 -110716 -84869 -53061 -3374 9273
6385 9273 -36692 -68764 -35827 -7257 11879 22068 49021 122215 48719 47827 76136 96858
6373 96858 55054 7292 52529 -16553 -5308 -25311 7375 -31365 5377 58991 -97172 -144785
6361 -144785 -164628 -119654 -158857 -150389 -73306 -18706 -44366 -43464 -106686 -208499 -254194 -211803
6349 -211803 -106868 -95498 -103351 -49764 19464 -43894 -116585 -134858 -97112 44828 45991 10113
$$ packed form
6433b292J9728K4991J9041l0410j8554O86L7105p6231k9258L0296J4334R0686
6421H0122L2761r159j14986j1465j030j6241m5006M264R7558N1457j8907j27160
6409g7792l5977n0608M5274K3758m5758l3265J3708K2471o6767n0358j7519O6608
6397b06225K4128L4424O0633k3466n8980j5028L6984L6814K5847L1808M9687J2647
6385I273m5965l2072L2937K8570J9136J0189K6953P3194p3496q92K8309K0722
6373I6858m1804m7762M5237o9082J1245k0003L2686l8740L6742N3614j56163m7613
6361a44785j9843M4974l9203Q468P7083N4600k5660R02o3222j01813m5695M2391
6349b11803J04935J1370p853N3587O9228o3358p2691j8273L7746J41940J163l5878
$$ plain form
6337 10113 18726 38064 73751 36033 45948 -42208 28383 52469 28449 -33575 28697 119571
6325 119571 67884 29027 -5022 53677 19851 1903 36655 4086 -15015 62975 7770 -89185
6313 -89185 -108855 -41211 10862 -9156 -57333 -63485 -74524 -68755 -76527 -88128 -49810 10032
6301 10032 28067 -40785 -107052 -76121 -18216 -73603 -88309 -22983 42472 8453 -6786 -92974
6289 -92974 -42443 -35712 -95865 -114298 -109729 -74873 -75803 -61777 -29620 -12162 -51985 -46266 -59034
6276 -59034 -104308 -113048 -84356 -26887 7729 9890 -60318 -106039 -77267 -51454 -51393 -56152 37360
6263 37360 -219 -1018 -18351 1300 55041 57383 49739 27501 36187 37963 98256 84738 65406
6250 65406 -2101 36397 58901 7487 -9277 5013 29201 -10203 566 -49149 -89331 -109679
$$ packed form
6337A0113Q613J9338L5687l7718R915q8156P0591K4086k4020o2024O2272R0874
6325A19571n1687l8857l4049N8699l3826j7948L4752l2569j9101P7990n5205r6955
6313h9185j9670O7644N2073k0018m8177o152j1039N769p772j1601L8318N9842
6301A0032J8035o8852o6267L0931N7905n5387j4706O5326O5455l4019j5239q6188
6289i2974N0531O731o0153j8433M569L4856r30J4026L2157J7458l9823N719j2768
6276e9034m5274q740K8692N7469L4616K161p0208m5721K8772K5813O1m759R3512
6263C7360l7579p99j7333J9651N3741K342p644k2238Q686J776O0293j3518j9332
6250F5406o7507L8498K2504n1414j6764J4290K4188l9404J0769m9715m0182k0348
$$ plain form
6238 -109679 -84179 -57912 -81343 -40072 -38599 -114672 -172305 -208778 -119997 -80982 -108340 -150269
6226 -150269 -147177 -31465 -67211 -105832 -56128 -23328 -49627 -121749 -131932 -177952 -106440 -36289
6214 -36289 -23022 -10445 -46215 -353 -28330 -132938 -185368 -139299 -67546 -68355 -68743 -79055
6202 -79055 -43170 -73335 -70420 -65600 -108408 -109391 -50589 -19283 -46380 -72289 28202 106314
6190 106314 -7930 -46794 -109124 -118597 -63988 19165 37433 68067 53479 -8886 -43893 -101634
6178 -101634 -104385 -72323 -38240 -6767 -22130 -55132 -71674 -84164 -95580 -67317 -61038 -66490
6166 -66490 -117519 -156017 -151777 -192286 -128610 -102431 -120413 -178678 -168886 -206218 -180112 -135477
6154 -135477 -129348 -113384 -168904 -189959 -147813 -110313 -83883 -60593 -77254 -134797 -212513 -213027
$$ packed form
6238a09679K5500K6267k3431M1271J473p6073n7633l6473Q8781L9015k7358m1929
6226a50269L092J15712l5746l8621M9704L2800k6299p2122j0183m6020P1512P0151
6214c6289J3267J2577l5770M5862k7977j04608n2430M6069P1753q09l88j0312
6202g9055L5885l0165K915M820m2808r83N8802L1306k7097k5909J00491P8112
6190A06314j14244l8864o2330r473N4609Q3153J8268L0634j4588o2365l5007n7741
6178a01634k751L2062L4083L1473j5363l3002j6542j2490j1416K8263O279n452
6166f6490n1029l8498M240m0509O3676K6179j7982n8265R792l7332K6106M4635
6154a35477O129J5964n5520k1055M2146L7500K6430K3290j6661n7543p7716n14
$$ plain form
6142 -213027 -196533 -177889 -121862 -78174 -81594 -96712 -169087 -138016 -147449 -93214 -87105 -62399
6130 -62399 -88767 -34474 -48935 -68062 -39977 -58948 -38519 -86991 -103666 -135132 -74326 -59043
6118 -59043 -100983 -100178 -45059 -95636 -196713 -164276 -92480 -150736 -161120 -159400 -139565 -147453
6106 -147453 -176954 -145237 -85196 -101748 -96803 -95417 -155164 -121593 -69373 -77967 -82957 -41848
6094 -41848 -93848 -81530 -84730 -77158 -113344 -77247 -68332 -77140 -50872 -60976 -122712 -169041 -108417
6081 -108417 -107657 -119775 -151289 -155532 -190570 -231840 -284975 -199444 -168658 -171449 -193766 -156815
6069 -156815 -211570 -243196 -229243 -225849 -240919 -171817 -138627 -120790 -154970 -217208 -258770 -243446
6057 -243446 -224932 -227755 -208531 -183015 -106933 -157057 -196285 -186861 -123900 -138695 -114059 -128070
$$ packed form
6142b13027J6494J8644N6027M3688l420j5118p2375L1071r433N4235O109K4706
6130f2399k6368N4293j4461j9127K8085j8971K0429m8472j6675l1466O0806J5283
6118e9043m1940Q05N5119n0577j01077L2437P1796n8256j0384J720J9835p888
6106a47453k9501L1717O0041j6552M945J386n9747L3571N2220q594m990M1109
6094d1848n2000J2318l200P572l6186L6097Q915q808K6268j0104o1736m6329O0624
6081a08417P60j2118l1514m243l5038m1270n3135Q5531L0786k791k2317L6951
6069a56815n4755l1626J3953L394j5070O9102L3190J7837l4180o2238m1562J5324
6057b43446J8514k823J9224K5516P6082n0124l9228R424O2961j4795K4636j4011
$$ plain form
6045 -128070 -124604 -176299 -131072 -125743 -146910 -120568 -52659 -93376 -140707 -146799 -162593 -142084
6033 -142084 -136869 -98842 -31192 1476 -70554 -150074 -180122 -140682 -149242 -155714 -70794 -51086
$$ packed form
6045a28070L466n1695M5227N329k1167K6342O7909m0717m7331o092j5794K0509
6033a42084N215L8027O7650L2668p2030p9520l0048L9440q560o472Q4920J9708
$$ [...]
##END NTUPLES=NMR SPECTRUM
##END=
