##TITLE=1H_TG-2309-7
 DMSO, 8 sc, 
 16.12.2020
##JCAMPDX= 6.0         $$ Bruker NMR JCAMP-DX V2.0
##DATA TYPE= NMR SPECTRUM
##DATA CLASS= NTUPLES
##ORIGIN= UXNMR, Bruker Analytische Messtechnik GmbH
##OWNER= root
$$ XWIN-NMR		Version 3.5
$$ Wed Dec 16 10:14:18 2020 Russian Standard Time (UT+4h)  she@DPX200
##.OBSERVE FREQUENCY= 200.1315066352
##.OBSERVE NUCLEUS= ^1H
##.ACQUISITION MODE= SIMULTANEOUS
##.ACQUISITION SCHEME= undefined
##.AVERAGES= 8
##.DIGITISER RES= 18
##SPECTROMETER/DATA SYSTEM= spect
##.PULSE SEQUENCE= zg30
##.SOLVENT NAME= CDCl3
##.SHIFT REFERENCE= (INTERNAL, CDCl3, 0, 15.9833)
##AUDIT TRAIL= $$ (NUMBER, WHEN, WHO, WHERE, WHAT)
$$ ##TITLE= Audit trail, XWIN-NMR		Version 3.5
$$ ##JCAMPDX= 5.01
$$ ##ORIGIN= Bruker BioSpin GmbH
$$ ##OWNER= she
$$ F:/spectra/data/she/nmr/H-F/1/pdata/1/auditp.txt
$$ ##AUDIT TRAIL=  $$ (NUMBER, WHEN, WHO, WHERE, WHAT)
(   1,<2020-12-16 10:12:57.98 +0400>,<she>,<DPX200>,
      <created by zg, POWCHK disabled, PULCHK disabled
       configuration hash MD5:
       00 E9 B6 7A A2 85 ED C7 34 08 36 98 17 FE 4E 26
       data hash MD5: 16K
       0B D0 2D 82 7A B8 2F A3 92 1D 7C 9D 98 D0 1A 76>)
(   2,<2020-12-16 10:13:00.59 +0400>,<she>,<DPX200>,
      <Start of raw data processing
       efp BC_mod = 2 LB = 0.24 FT_mod = 6 PKNL = 1 PHC0 = -10763.01 PHC1 = 19.60089 SI = 16K 
       data hash MD5: 16K
       33 80 0D 31 F4 DE 27 3A 9E 63 CB D6 9A C0 DD 49>)
(   3,<2020-12-16 10:13:13.26 +0400>,<she>,<DPX200>,
      <pk PHC0 = -5.207018 PHC1 = 0.8000003 
       data hash MD5: 16K
       8E 73 D5 8B FB 7C AD CE A1 C2 17 F5 12 7B 63 BE>)
(   4,<2020-12-16 10:13:16.18 +0400>,<she>,<DPX200>,
      <abs ABSG = 5 
       data hash MD5: 16K
       49 1F 43 F7 ED 82 6B 13 0E 88 C5 1B 04 97 77 CA>)
(   5,<2020-12-16 10:13:30.78 +0400>,<she>,<DPX200>,
      <pk PHC0 = 6.149789 PHC1 = -7.8 
       data hash MD5: 16K
       68 97 DD 37 17 B8 7F 19 26 99 76 3D 0F EF 03 0F>)
(   6,<2020-12-16 10:13:34.64 +0400>,<she>,<DPX200>,
      <abs ABSG = 5 
       data hash MD5: 16K
       AA 95 5C 32 47 C3 F9 25 7C 38 CC C2 13 B7 BC B5>)
$$ ##END=
$$ 
$$ hash MD5
$$ 99 FE ED DC 2C 79 31 BA 7C 9E 88 F9 AB BC AF 82
##$RELAX= 
##$RELAX= 
##$RELAX= 
##$RELAX= 
##$RELAX= 
##$RELAX= 
$$ Bruker specific parameters
$$ --------------------------
##$DU= <F:/spectra>
##$EXPNO= 1
##$NAME= <H-F>
##$PROCNO= 1
##$TYPE= <nmr>
##$USER= <she>
##$AMP= (0..31)
100 100 100 100 100 100 100 100 100 100 100 100 100 100 100 100 100 100 
100 100 100 100 100 100 100 100 100 100 100 100 100 100 
##$AQSEQ= 0
##$AQ_mod= 1
##$AUNM= <au_zg>
##$AUTOPOS= <>
##$BF1= 200.13
##$BF2= 200.13
##$BF3= 200.13
##$BF4= 200.13
##$BF5= 200.13
##$BF6= 200.13
##$BF7= 200.13
##$BF8= 200.13
##$BYTORDA= 1
##$CFDGTYP= 0
##$CFRGTYP= 5
##$CHEMSTR= <none>
##$CNST= (0..31)
1 1 145 1 1 1 1 1 1 1 1 1 1 1 1 1 1 1 1 1 1 1 1 1 1 1 1 1 1 1 1 1 
##$CPDPRG= <>
##$CPDPRG1= <>
##$CPDPRG2= <>
##$CPDPRG3= <>
##$CPDPRG4= <mlev>
##$CPDPRG5= <mlev>
##$CPDPRG6= <mlev>
##$CPDPRG7= <mlev>
$$ [...]
##$SUBNAM3= <"">
##$SUBNAM4= <"">
##$SUBNAM5= <"">
##$SUBNAM6= <"">
##$SUBNAM7= <"">
##$SUBNAM8= <"">
##$SUBNAM9= <"">
##$SW= 16.9725356469052
##$SWIBOX= (0..15)
0 0 2 0 0 0 0 0 0 0 0 0 0 0 0 0 
##$SW_h= 3396.73913043478
##$TD= 16384
##$TD0= 1
##$TE= 0
##$TE2= 300
##$TE3= 300
##$TEG= 300
##$TL= (0..7)
0 120 120 120 120 120 120 120 
##$TP= (0..7)
150 150 150 150 150 150 150 150 
##$TP07= 0
##$TPNAME0= <>
##$TPNAME1= <>
##$TPNAME2= <>
##$TPNAME3= <>
##$TPNAME4= <>
##$TPNAME5= <>
##$TPNAME6= <>
##$TPNAME7= <>
##$TPOAL= (0..7)
0.5 0.5 0.5 0.5 0.5 0.5 0.5 0.5 
##$TPOFFS= (0..7)
0 0 0 0 0 0 0 0 
##$TUNHIN= 0
##$TUNHOUT= 0
##$TUNXOUT= 0
##$USERA1= <user>
##$USERA2= <user>
##$USERA3= <user>
##$USERA4= <user>
##$USERA5= <user>
##$V9= 5
##$VALIST= <valist>
##$VCLIST= <CCCCCCCCCCCCCCC>
##$VD= 0
##$VDLIST= <DDDDDDDDDDDDDDD>
##$VPLIST= <PPPPPPPPPPPPPPP>
##$VTLIST= <TTTTTTTTTTTTTTT>
##$WBST= 1024
##$WBSW= 4
##$XGAIN= (0..3)
0 0 0 0 
##$XL= 0
##$YL= 0
##$YMAX_a= 628818
##$YMIN_a= -338068
##$ZGOPTNS= <>
##$ZL1= 120
##$ZL2= 120
##$ZL3= 120
##$ZL4= 120
##$ABSF1= 15.98335
##$ABSF2= -0.9893122
##$ABSG= 5
##$ABSL= 3
##$ALPHA= 0
##$AQORDER= 0
##$ASSFAC= 0
##$ASSFACI= 0
##$ASSFACX= 0
##$ASSWID= 0
##$AUNMP= <proc_1d>
##$AZFE= 0.1
##$AZFW= 0.1
##$BCFW= 0
##$BC_mod= 2
##$BYTORDP= 0
##$COROFFS= 0
##$CY= -3
##$DATMOD= 1
##$DC= 0
##$DFILT= <>
##$DTYPP= 0
##$F1P= 0
##$F2P= 0
##$FCOR= 1
##$FTSIZE= 16384
##$FT_mod= 6
##$GAMMA= 0
##$GB= 0
##$INTBC= 1
##$INTSCL= 2.992141e-10
##$ISEN= 128
##$LB= 0.24
##$LEV0= 0
##$LPBIN= 0
##$MAXI= 10000
##$MC2= 0
##$MEAN= 0
##$ME_mod= 0
##$MI= 1.114404
##$NCOEF= 0
##$NC_proc= -6
##$NLEV= 6
##$NOISF1= 3.799351
##$NOISF2= 2.8
##$NSP= 0
##$NTH_PI= 0
##$NZP= 0
##$OFFSET= 15.98335
##$PC= 1
##$PHC0= -10762.07
##$PHC1= 12.60089
##$PH_mod= 1
##$PKNL= yes
##$PPARMOD= 0
##$PSCAL= 0
##$PSIGN= 0
##$REVERSE= no
##$SF= 200.130006257245
##$SI= 16384
##$SIGF1= 3
##$SIGF2= 2
##$SINO= 5.538805
##$SIOLD= 16384
##$SREGLST= <1H.CDCl3>
##$SSB= 0
##$STSI= 16384
##$STSR= 0
##$SW_p= 3396.73913043478
##$SYMM= 0
##$S_DEV= 0
##$TDeff= 16384
##$TDoff= 0
##$TI= <>
##$TILT= no
##$TM1= 0
##$TM2= 0
##$TOPLEV= 0
##$USERP1= <user>
##$USERP2= <user>
##$USERP3= <user>
##$USERP4= <user>
##$USERP5= <user>
##$WDW= 1
##$XDIM= 16384
##$YMAX_p= 346667946
##$YMIN_p= -1714530
$$ End of Bruker specific parameters
$$ ---------------------------------
##NTUPLES= NMR SPECTRUM
##VAR_NAME=  FREQUENCY,     SPECTRUM/REAL,   SPECTRUM/IMAG
##SYMBOL=    X,             R,               I
##VAR_TYPE=  INDEPENDENT,   DEPENDENT,       DEPENDENT
##VAR_FORM=  AFFN,          ASDF,            ASDF
##VAR_DIM=   16384,         16384,           16384
##UNITS=     HZ,            ARBITRARY UNITS, ARBITRARY UNITS
##FACTOR=    0.207333158178281, 1,           1
##FIRST=     3198.74789550772, 0,            0
##LAST=      -197.991234927058, 0,           0
##MIN=       -197.991234927058, -1714530,    0
##MAX=       3198.74789550772, 346667946,    0
$$ Real data points
##PAGE= N=1
##DATA TABLE= (X++(R..R)), XYDATA
$$ [...]
7203A68527L07778K46089l96547m2480j65831m6370J92816l6680K9227j08093
7193A48436j46449K00258L2128n8589L35582K2186o09008j34185R2153J35856
7183A8368j37274J09945K09283j21009r4923K50663J04431j02484J29930j58403
7173B08527k70571n449K19310m4282k6791j76370J15368N3334k64844o4002J34692
7162a21078p8388K07872k752o8885K89238k29335M2262R6903j02714N0525K31962
7151C15610k98479K6744J53652l06207j59200M9293K67471k9059o5557k07167
7141b52899j80328k1493J32267K3343n44537K80959K99712n1588j59509R5027
7131c79046J48488j64171r2406L4443j4482q9552R1823r4615L10511k74597J86611
$$ plain form
7203 168527 476305 722394 325847 283367 117536 71166 263982 227302 256529 148436
7193 148436 1987 202245 234373 175784 511366 533552 -75456 -209641 -117488 18368
7183 18368 -118906 -8961 200322 79313 -15610 235053 339484 237000 366930 208527
7173 208527 -62044 -67493 151817 107535 80744 -95626 19742 73076 -191768 -255770 -121078
7162 -121078 -199466 8406 5654 -63231 226007 -3328 38934 135837 33123 83648 315610
7151 315610 17131 43875 197527 -108680 -267880 -218587 48884 19825 -45732 -252899
7141 -252899 -433227 -454720 -322453 -299110 -843647 -562688 -262976 -314564 -474073 -379046
7131 -379046 -230558 -394729 -487135 -452692 -467174 -556726 -464903 -559518 -249007 -523604 -336993
7120c36993L12341n9247N8233k00540O9404q769k6524J22311j81060P1352J3913
7109a65579k82206L12048O04k4818P5116P462j86213q6281j67408J76526p1187
7098d11936r9348K02811L74513l31330k92984J91621J25417k0297n02437N06482
7088b57488j66567j61994L7462n4425j17688J13740J02491J04210j36043k9282
7078e65584P2662J9018R7694m41241R2487r4117K89195K97895l90541L24734n5398
7067c53196k73399m4380O3640l44882r0749K10377P3481N8783k9606K46755k75740
7056g58916K16732R3580K6578k05605j87056L43268O159Q6168j77209R3100P9142
7045c84059k06202J57322r7309m8888j11104L018m2093P8102J48675K15336l18920
$$ plain form
7120 -336993 -24652 -83899 -25666 -226206 -156802 -165571 -192095 -69784 -250844 -179492 -165579
7109 -165579 -447785 -135737 -135133 -159951 -84835 -77373 -263586 -349867 -517275 -340749 -411936
7098 -411936 -511284 -308473 66040 -265290 -558274 -366653 -241236 -261533 -763970 -257488
7088 -257488 -424055 -586049 -548587 -603012 -720700 -606960 -504469 -400259 -536302 -565584
7078 -565584 -492922 -473904 -376210 -817451 -724964 -819081 -529886 -231991 -622532 -297798 -353196
7067 -353196 -626595 -670975 -607335 -952217 -1042966 -832589 -759108 -700325 -729931 -483176 -758916
7056 -758916 -542184 -448604 -422026 -627631 -814687 -471419 -465260 -379092 -556301 -463201 -384059
7045 -384059 -590261 -432939 -530248 -579136 -690240 -687222 -729315 -651213 -502538 -287202 -606122
7034f06122K28332J55792k96420q1610L6050P047r778J51874l53167J65021l66558
7023i69539N45060L9440j52113n8030k86797K51715J17850O7201J21695R5500
7013b28018k72809L17815j96680J67054l3383j38298J90038k84853L60247k33419
7003c52306j32107J60901K05325k3686j59319k38946o4090m39059K64631R4369
6993f84287l19321j34034R3715L75859n22178J22470J00183M47427l4662K49495
6983c05333l21784J23907k22364P0152Q1851p2498o2582K9455N32101k56482J09814
6972b93763j18669j58292j41106J44425l2200Q4163l69403J1300k9972j92391
6962a095908k467k16931M30755J70274K0197l32367j02394j32331K8853n4104
$$ plain form
7034 -606122 -377790 -221998 -518418 -600028 -563978 -556931 -566709 -414835 -768002 -602981 -969539
7023 -969539 -424479 -385039 -537152 -595182 -881979 -630264 -512414 -445213 -323518 -228018
7013 -228018 -500827 -183012 -379692 -212638 -246021 -384319 -194281 -479134 -118887 -352306
7003 -352306 -484413 -323512 -118187 -141873 -301192 -540138 -604228 -1043287 -778656 -684287
6993 -684287 -1003608 -1137642 -1043927 -668068 -1190246 -1067776 -967593 -520166 -554828 -305333
6983 -305333 -627117 -503210 -725574 -655422 -573571 -646069 -708651 -679196 -147095 -403577 -293763
6972 -293763 -412432 -570724 -711830 -567405 -599605 -515442 -884845 -873545 -903517 -1095908
6962 -1095908 -1098375 -1315306 -884551 -714277 -694080 -1026447 -1128841 -1261172 -1232319 -1286423
6952a286423J12789j76791j19345P9012J79103J33534l18638K08876J29803Q7023
6942i71057j98871J75421m04747L1K46326K8567j63516K24908M14564k14131l35351
6931a197856M0404l4842j12387J41936K9922J02567k74469j37618j36969M9750
6921a529562L95442o742k47575L34786K39845l64202k02609J34824J46129n26985
6911a626649q7881M84632K5581O7217J68358k4146j53780q1000M12724q6295N8698
6900h42541J00409q5883q1368p3766K53696j62437M0938J58464j83755j67384
6890a043627O7195J27698o6894J30639l0708j80672O4498K25934j57836k95649
6880a159422k0973K42733N5274m7375J00375j27615k87850l26633K19246L4412
$$ plain form
6952 -1286423 -1173634 -1350425 -1469770 -1390758 -1211655 -1078121 -1396759 -1187883 -1058080 -971057
6942 -971057 -1169928 -994507 -1399254 -1399223 -1152897 -1124330 -1287846 -1062938 -648374 -862505 -1197856
6931 -1197856 -1157452 -1192294 -1304681 -1162745 -1132823 -1030256 -1304725 -1442343 -1579312 -1529562
6921 -1529562 -1134120 -1140862 -1388437 -1053651 -813806 -1178008 -1380617 -1245793 -1099664 -1626649
6911 -1626649 -1714530 -1229898 -1204317 -1137100 -968742 -992888 -1146668 -1227668 -814944 -901239 -842541
6900 -842541 -742132 -828015 -909383 -983149 -729453 -891890 -850952 -692488 -876243 -1043627
6890 -1043627 -976432 -848734 -915628 -784989 -815697 -996369 -931871 -705937 -863773 -1159422
6880 -1159422 -1180395 -937662 -882388 -929763 -829388 -957003 -1244853 -1571486 -1352240 -1317828
6870a317828N1144j2558j01180R2670j48302L6043Q2190L0929L65516o7950N0283
6859i39043O2569k11377O5088j53192J17698j154p4746J33021l37011K67301k6848
6848a097694l54290L81674J21219J53901J44474j18541k19205j60064K80239J51677
6838g16610j23567P4468j507k33176R437K62L46794j85516J14852L98093l79918
6827f96388o2340L2195P4695K13934K1373K0201k07211l10498K54744k61123q4163
6816a004581o6936j10683J31092j9M2513k96682J17545L15450l3966l81323M66754
6805h20836K26665l8005j20804J35863O5334n36129N8422N38594l04117j60922
6795i55935J45891j82607J28737J71517P5176j62064O0795m85J50363l58720k07816
$$ plain form
6870 -1317828 -1266684 -1279242 -1380422 -1287752 -1436054 -1400011 -1317821 -1286892 -921376 -989326 -939043
6859 -939043 -876474 -1087851 -1022763 -1175955 -1058257 -1059411 -1134157 -1001136 -1338147 -1070846 -1097694
6848 -1097694 -1451984 -1070310 -949091 -795190 -650716 -769257 -988462 -1148526 -868287 -716610
6838 -716610 -840177 -765709 -767216 -1000392 -990955 -990693 -643899 -829415 -714563 -316470 -696388
6827 -696388 -758728 -726533 -651838 -437904 -416531 -396330 -603541 -914039 -659295 -920418 -1004581
6816 -1004581 -1071517 -1182200 -1051108 -1051127 -1008614 -1305296 -1187751 -872301 -906267 -1287590 -820836
6805 -820836 -594171 -632176 -752980 -617117 -551783 -1087912 -1029490 -490896 -795013 -955935
6795 -955935 -810044 -992651 -863914 -692397 -617221 -779285 -718490 -718975 -568612 -927332 -1135148
6784a135148N1822J57777r3479j80373J71581L64691J53953k37475K1798M574
6774g20279p6776j94044K9961P5251q5697k89362j05254L93860j06329J73410
6764i05259J7744J16150n4590l9451k64502L7341P9464J13323K39619l31336K2510
6753i68987n076k16794k60618L01670k2418J14045J43295m8544j09116M0335J32118
6742i00090n4390Q3014J09257O0488m85984M0970K36049j21803j97884K34822
6732i95551K00757R2279J01041l99684O5785J58973L28484K09827r171j30816
6722c78076j00565l73100N2289K17281n0194K21840J61483P3179k46826k59638
6712f82327K72826J41447k11311Q8744J2807P7013L19476k6837k16180o1651N8855
$$ plain form
6784 -1135148 -1083326 -925549 -1019028 -1199401 -1027820 -663129 -509176 -746651 -724853 -720279
6774 -720279 -797055 -991099 -961138 -885887 -971584 -1260946 -1366200 -972340 -1078669 -905259
6764 -905259 -887515 -771365 -825955 -865406 -1129908 -1092567 -1013103 -899780 -660161 -991497 -968987
6753 -968987 -974063 -1190857 -1451475 -1149805 -1172223 -1058178 -914883 -963427 -1072543 -1032208 -900090
6742 -900090 -954480 -871466 -762209 -701721 -1187705 -1146735 -910686 -1032489 -1230373 -995551
6732 -995551 -794794 -702515 -601474 -1001158 -935373 -776400 -447916 -238089 -247260 -378076
6722 -378076 -478641 -851741 -799452 -582171 -632365 -410525 -249042 -175863 -422689 -682327
6712 -682327 -409501 -268054 -479365 -390621 -377814 -300801 18675 -8162 -224342 -285993 -227138
6701b27138l5746N4545K92086l44399k31276N7259l9919J22347R6740K31163J10505
6690H6167J86058j46359l02133j45144m7628N9438n6722K7002K59521k56331k16231
6679e52362l6456J441j33301O714J43985j12260L72062J19155J6344j24287L06077
6668G112j27380j81911q0857M36136k37463j82020J73514k6828L05910r2899J44361
6657A37675l7151k72591j21951r6682j73179L3668J14645j79767J58959J30660
6647c05714k10647k4902Q470K41806M6696r7221j45021K4725j57377k285k53971
6636h75441L61960J27316J00956R926J70145L04805m03569l24912K36203J64344
6626a28267q5853k27789L90314R8997n09227Q7196J50042J08207k93988M16462
$$ plain form
6701 -227138 -262884 -208339 83747 -260652 -491928 -434669 -474588 -352241 -255501 -24338 86167
6690 86167 272225 125866 -176267 -321411 -369039 -309601 -366323 -339321 -79800 -336131 -552362
6679 -552362 -588818 -587377 -720678 -713964 -569979 -682239 -310177 -191022 -174678 -298965 7112
6668 7112 -120268 -302179 -383036 53100 -184363 -366383 -192869 -219697 86213 -6686 137675
6657 137675 100524 -172067 -294018 -390700 -563879 -530211 -415566 -595333 -436374 -305714
6647 -305714 -516361 -541263 -532793 -290987 -244291 -341512 -486533 -461808 -619185 -621470 -875441
6636 -875441 -513481 -386165 -285209 -275283 -105138 199667 -203902 -528814 -292611 -128267
6626 -128267 -214120 -441909 -51595 47402 -461825 -374629 -224587 -116380 -410368 6094
6616F094N3626j72458r7494j02002K10623k09677k09575J35271O2209k1534r2858
6605d37775k6261J64880N0255p2219j56593K74356J20515n9513j42409J99092
6595h5672j6964l90043J30691J17966R2362J8703j17625m3577P5621K17732J41669
6584A40863m8512J21968J1824J86310j73504Q7716J91390o8979K94399k97416
6574D46059R2489R15K9697R846j52506k44922K37192J88748L0157p087J07837
6563G38425k39864j68131M12383l12754L31890k04683N9325q7568j84149n9558
6553B85316M5869l33203J09299J81781j99363j14949Q3061M43795o4337J77465
6543F14734J04802l22573j89492P7871O8942j01654J01495K14331J28681j19291
$$ plain form
6616 6094 59720 -112738 -210232 -312234 -101611 -311288 -520863 -385592 -323383 -344917 -437775
6605 -437775 -464036 -299156 -248901 -321120 -477713 -203357 -82842 -142355 -284764 -85672
6595 -85672 -102636 -492679 -361988 -244022 -151660 -132957 -250582 -294159 -218538 -806 140863
6584 140863 92351 214319 226143 412453 238949 326665 518055 449076 743475 446059
6574 446059 538548 539463 569160 579006 426500 181578 418770 607518 637675 630588 738425
6563 738425 498561 330430 742813 430059 761949 557266 616591 529023 344874 285316
6553 285316 331185 -2018 107281 289062 89699 -25250 57811 501606 437269 614734
6543 614734 719536 396963 207471 285342 354284 252630 354125 568456 697137 577846
6533E77846j42853J27406J83625J8588M2185O0341J91607o716J21614L02098p5502
6522A400239j86707l36019O8295N9998k00068j93346P6726J04891k0766K09903
6512I83146n7077K7213J27585R5091M0679j72464j93545P2254J46872j3090J86891
6501A243555J17812n5048j6034J46916p5120l40069k20863L40135K94694j41458
6491A294520j49592J62947J91876K19269m8596q1618l1262k14719N0488n2551
6481A340762o7239J63303l8442K94414J37273r9980J24819k6223J72192J84846
6471B185725j96445k2275j41800j06676N5005m5327Q2168m2315j27907L15263
6461A955416j10956j24914j84178L4911O8114l7658L3058k58912j16247J30115
$$ plain form
6533 577846 434993 562399 746024 764612 806797 867138 1058745 1052029 1173643 1475741 1400239
6522 1400239 1213532 877513 945808 1005806 805738 612392 689118 794009 773243 983146
6512 983146 926069 953282 1080867 1175958 1216637 1044173 850628 922882 1069754 1056664 1243555
6501 1243555 1361367 1306319 1290285 1437201 1362081 1022012 801149 1141284 1435978 1294520
6491 1294520 1144928 1307875 1499751 1719020 1670424 1588806 1557544 1342825 1393313 1340762
6481 1340762 1273523 1436826 1398384 1692798 1830071 1730091 1854910 1828687 2000879 2185725
6471 2185725 1989280 1967005 1825205 1718529 1773534 1728207 1810375 1768060 1640153 1955416
6461 1955416 1844460 1719546 1535368 1570279 1638393 1600735 1633793 1374881 1258634 1388749
6451A388749M98199m20327o0537J89270J494o723j57496K49716L16292p7994J30895
6440B051538J90532l34006O4948j93094K14390M865j58858k09141K40600K9510
6430A901284J26508l5141j97550J27389q9011k18622k3040j6466l42013K23329
6420A456667j91074J85738K50903j09369k25260L21450R5189j25441k77201R9530
6410A481132L77089J02578j97101l9691L29546q5697K816j85120P6163j10640
6400A751075K2949N8638l9882M6805K03656K5728k7459M34606j01199q9917J41479
6389B426479K5813K56839N753k25990J65485l8096J9317J1524M75763j31778p4502
6378B916607p7649j97944j31625q5762k21234l49759k6532o3804r5447J3180L48833
$$ plain form
6451 1388749 1886948 1466621 1406084 1595354 1596848 1590125 1432629 1682345 1998637 1920643 2051538
6440 2051538 2242070 1908064 1973012 1779918 1994308 1999173 1840315 1631174 1871774 1901284
6430 1901284 2027792 1992651 1795101 1922490 1833479 1614857 1591817 1575351 1233338 1456667
6420 1456667 1265593 1451331 1702234 1592865 1367605 1689055 1784244 1658803 1381602 1481132
6410 1481132 1858221 1960799 1763698 1724007 2053553 1967856 1970672 1785552 1861715 1751075
6400 1751075 1774024 1832662 1792780 1839585 2043241 2068969 2041510 2476116 2374917 2285000 2426479
6389 2426479 2452292 2709131 2714884 2488894 2654379 2616283 2635600 2647124 3122887 2991109 2916607
6378 2916607 2838958 2641014 2509389 2423627 2202393 1852634 1826102 1762298 1666851 1680031 2028864
6367B028864j4657j06038j86238j06324L0897k05040n9911J02024K3282k53927
6357A252932K02620L40706l512K85096l06432n341J17107m00061J90690p2374
6347A601431l3173K69911j00105n7450K28611L0958J06254R13O9615j42384k01198
6336A773383j33936o0995K87830j41776M3994J58740K01129q0468k15217j20931
6326A711753P1560r2061L40952l07892l3204J12349j60722K68751J37119R7864
6316B146469P2210q9560k34218L44976J20516j63502l6318P1995j11155J35999
6306B257412j00996k81606L40569L45161k48789N4069k16300K79489J46946q9092
6296B486863J22216O2681R1773Q7308j7602j71J37408k24470L77570j2204Q8076
$$ plain form
6367 2028864 2014207 1908169 1721931 1615607 1646504 1441464 1381553 1483577 1506859 1252932
6357 1252932 1455552 1796258 1792746 2077842 1771410 1766069 1883176 1483115 1673805 1601431
6347 1601431 1568258 1838169 1738064 1680614 1909225 1940183 2046437 2047350 2116965 1974581 1773383
6336 1773383 1639447 1578452 1866282 1724506 1768500 1927240 2128369 2047901 1832684 1711753
6326 1711753 1783313 1691252 2032204 1724312 1691108 1803457 1642735 1911486 2048605 2146469
6316 2146469 2218679 2129119 1894901 2239877 2360393 2196891 2160573 2232568 2121413 2257412
6306 2257412 2156416 1874810 2215379 2560540 2311751 2365820 2149520 2429009 2575955 2486863
6296 2486863 2609079 2671760 2763533 2850841 2833239 2833068 2970476 2746006 3123576 3111372 3199448
6285C199448K63725J19684L1809O17952j03605p6856J3025M74428L59951K26931
6275E126492r3917k29559R4041m02189j34539j04871K24208r4514L16155j2269
6265D689038o6010j6309o1597M50009k07572l34148J57484k00004j04730J16604
6255D422765R7171K12557j26929K4053J17982k62928R08K80947j88719J2625J72221
6244D762653J90933j14048j57493L36482j50058k44093j25540K43691q1694j80687
6234D480146k61266K64624l562k77545j68167M1997j7007M1226K88418N7165J28534
6223D574563n3904j54688j37948N02384k57437j2508O4624l14081k91015K2426
6213C942416Q7816j92322R3977K69904j28273l46769n3106P9443J43431k00301
$$ plain form
6285 3199448 3463173 3582857 3614666 4232618 4129013 4052157 4065182 4539610 4899561 5126492
6275 5126492 5032575 4803016 4897057 4494868 4360329 4255458 4479666 4385152 4701307 4689038
6265 4689038 4623028 4606719 4545122 4995131 4787559 4453411 4610895 4410891 4306161 4422765
6255 4422765 4519936 4732493 4605564 4629617 4747599 4484671 4485579 4766526 4577807 4590432 4762653
6244 4762653 4953586 4839538 4682045 5018527 4868469 4624376 4498836 4742527 4660833 4480146
6234 4480146 4218880 4483504 4479942 4202397 4034230 4076227 4059220 4100446 4388864 4446029 4574563
6223 4574563 4520659 4365971 4228023 4730407 4472970 4460462 4525086 4211005 3919990 3942416
6213 3942416 4030232 3837910 3931887 4201791 4073518 3726749 3673643 3753086 3896517 3696216
6203C696216O9979j15228J44631m2301J31856L35821q7316j42377J35615K0337
6193D147233J01073r868o103J6134j72735K16480J2422L06676K47440P422L99943
6182E266117l16897l68721L41160k04332K29758Q0593j27985j19162k53421J92947
6172D720057O8131J7705k47030j63626O0089j17847R6443j04425l8205j34780
6162D156512j74201J40730K71131K004k61970M08204j70820k23821l1896k30553
6152C885320j2503N298J60348k19995o4996L28007j4288m49393o2324p5469j89291
6141C290714j04190j4461K3230j29071k30023J40994j9336p2234K6233l20241
6131B591615J159K84275M7651n00412k8879J96582K35767j51962p4799R4685p9545
$$ plain form
6203 3696216 3766195 3650967 3795598 3753297 3885153 4220974 4133658 3991281 4126896 4147233
6193 4147233 4248306 4238438 4232335 4248469 4075734 4292214 4304636 4611312 4858752 4866174 5266117
6182 5266117 4949220 4580499 4921659 4717327 4947085 5027678 4899693 4780531 4527110 4720057
6172 4720057 4788188 4805893 4558863 4395237 4455326 4337479 4433922 4329497 4291292 4156512
6162 4156512 3982311 4123041 4394172 4396176 4134206 4542410 4371590 4147769 4115873 3885320
6152 3885320 3872817 3878115 4038463 3818468 3753472 4081479 4067191 3617798 3555474 3480005 3290714
6141 3290714 3186524 3172063 3195293 3066222 2836199 2977193 2957857 2885623 2911856 2591615
6131 2591615 2592774 2877049 2924700 2424288 2395409 2591991 2827758 2675796 2600997 2695682 2616137
6120B616137l4207K8956J35105j86483j31445k71033K92441k9359r383K28919
6110B639648j51801R3762M3109r9439j94235N9184M7939j05891j13365M2378j09671
6099B151618L7877k34145r1135j45007k78231K05984L61046r0755j67951R666
6089A758967j38239P5977k57621J69149k34763J4335J76189k8860J40798P3372
6079A749304J3214J02801l9910J6941j92898O8734K78014m33466k58288j32156
6069A172290L5798j44636J36235Q8480N471j26710J85462q0789j67178N3207K7363
6058A184993r1554L3160m76N6919J49328j28903J53964j23603O9716k76564K02059
6047A229039J06600l08414K64098j41426K13797P7678J01846J31752l04291K02684
$$ plain form
6120 2616137 2581930 2610886 2745991 2559508 2428063 2157030 2449471 2420112 2410729 2639648
6110 2639648 2487847 2581609 2624718 2525279 2331044 2390228 2438167 2332276 2218911 2261289 2151618
6099 2151618 2189495 1955350 1864215 1719208 1440977 1646961 2008007 1917252 1749301 1758967
6089 1758967 1620728 1696705 1439084 1608233 1373470 1387805 1563994 1535134 1675932 1749304
6079 1749304 1762518 1865319 1825409 1842350 1649452 1718186 1996200 1562734 1304446 1172290
6069 1172290 1208088 1063452 1199687 1288167 1293638 1166928 1352390 1271601 1104423 1157630 1184993
6058 1184993 1093439 1126599 1126123 1183042 1332370 1203467 1357431 1233828 1303544 1026980 1229039
6047 1229039 1335639 1027225 1291323 1149897 1363694 1441372 1543218 1674970 1370679 1573363
6037A573363P1888l70269k6531L41247k88545k6358L21738q8573l04164P9783
6027A283579K17188j98609p2356K22299l14079k07904J82939j37195o091p8393
6017H91378K69738K42876j99204j58466q1018n5968K06931k89248J08098m949
6007I30168O0236M23175m56527M0879K33340J03746l9517J66606j8953k72771
5997A170382l02433K62063J8615J71570M3281n6561N7301l6724o6465k15379M07703
5986A453353j8317L6140m02263k00730J41158J51478m6042k1960J01698N9726
5976A254241k5935J29632K44644r8511J23910P7903K4543r2698J59917J14730
5966A912376j37628j18978K0898p2417j29442L40839J33829n3186l82605j78858
$$ plain form
6037 1573363 1645251 1274982 1248451 1589698 1301153 1274795 1596533 1507960 1203796 1283579
6027 1283579 1500767 1302158 1229802 1452101 1138022 930118 1113057 975862 969771 891378
6017 891378 1161116 1403992 1204788 1046322 965304 909336 1116267 827019 935117 930168
6007 930168 990404 1413579 957052 997931 1231271 1335017 1295500 1462106 1443153 1170382
5997 1170382 867949 1130012 1148627 1320197 1363478 1306917 1364218 1327494 1261029 1045650 1453353
5986 1453353 1435036 1471176 1068913 868183 1009341 1160819 1114777 1092817 1194515 1254241
5976 1254241 1228306 1357938 1602582 1504071 1627981 1705884 1730427 1637729 1797646 1912376
5966 1912376 1774748 1655770 1676668 1604251 1474809 1815648 1949477 1896291 1513686 1334828
5956A334828K1542L4903K0864j95957j69316J25578K256J082J07972J26536K43102
5945A653390q3017k23533M7260r102j33051L6748j27138K53529l33927P2968J91208
5934A345335O9638J4513j83607K2254j38877J14307k90478J08109L7971K77886
5924A377051j61311J6201J25724j44805j90425P4753j41644k28060J13510J75162
5914A016156m5217O3383J62882l47871K18623n9879K2670n7315m31597K29253
5904G71088L89245J0958k41281j29397P9428j68622r202l6236j38490k07097J55555
5893D75949O3471j46338j15084K57133j35846K19929J30189j0064o4988P151K21941
5882I03443l92210l01958q7283J58707M59069M4775o5075J8304M0618j6769j25888
$$ plain form
5956 1334828 1356370 1391273 1412137 1216180 1046864 1172442 1174698 1175780 1283752 1410288 1653390
5945 1653390 1570373 1346840 1394100 1384998 1251947 1288695 1161557 1415086 1081159 1154127 1345335
5934 1345335 1414973 1429486 1245879 1268133 1129256 1243563 953085 1061194 1099165 1377051
5924 1377051 1215740 1231941 1357665 1212860 1022435 1097188 955544 727484 840994 1016156
5914 1016156 970939 1034322 1197204 849333 1067956 1008077 1030747 973432 541835 771088
5904 771088 1160333 1171291 930010 800613 880041 711419 702217 665981 527491 320394 475949
5893 475949 539420 393082 277998 535131 399285 619214 749403 739339 674351 681502 903443
5882 903443 511233 209275 121992 280699 739768 784543 719468 737772 778390 761621 635733
5871F35733j07783L420r7634L53089O9192k09136j0714m54525J89627N375J81814
5860E58458k22009o5889Q1568L8733J03155N6601L03669j32325J98238k80077
5850F40122n97446q8177J60263L49925J43100R3989J35020m95554k55655L03401
5840C88988M9268J05718l95119J76648J86251j58356k03411k96186N57501j18772
5830B92530j55J0902P1570L5370K23710k37412m52526K19095j66647K18061J76782
5819C91280q0915J05036j34356k8867K46059J19787j70057k36016o7228k8717
5809A16006m4940j64673J51489m6308J34368k20078j86110J39910J10100j10303
5799a20539J07824J06144K34319j39201k34794o9361o5631J81552j98152L4242
$$ plain form
5871 635733 527950 531370 433736 786825 856017 646881 636167 181642 371269 376644 558458
5860 558458 336449 270560 352128 390861 494016 550617 854286 721961 920199 640122
5850 640122 42676 -45501 114762 464687 607787 701776 836796 341242 85587 388988
5840 388988 438256 543974 148855 325503 511754 353398 149987 -146199 411302 292530
5830 292530 292375 303277 374847 410217 633927 396515 -56011 163084 -3563 214498 391280
5819 391280 310365 415401 281045 252178 498237 618024 447967 211951 144723 116006
5809 116006 71066 -93607 57882 11574 145942 -74136 -260246 -120336 -10236 -120539
5799 -120539 -12715 93429 327748 188547 -46247 -115608 -181239 313 -197839 -163597
5789a63597P2190J43190K56654j02469m8156j55939j6993K5443J17079q7009N5736
5778I6129J16897l4967l35886j15964K60804l20891L40096P146J78224n4118l19536
5767a82066o0694J31190l3376j85382j61081j69203R7913J03337L37240k06130
5757c28252K93747J77064k04568P0613k07554N3843n9855L5188K01713j98259
5747a66320q1775p0097J26527j32338J30467j38919j36751K52655k17249p5722
5737e09522q1921K47230j52476l06435K85983j2755j45987J92709J25241K19612
5727a38321k71957n54013J89933M28267J2093o8196K2476j01861k94124L90124
5717c85579L32280J85969l4904j74279n6953J41708k94601L88084O925L882j37530
$$ plain form
5789 -163597 -91407 51783 308437 205968 157812 1873 -15120 10323 127402 40393 96129
5778 96129 213026 178059 -157827 -273791 -12987 -333878 6218 13364 191588 137470 -182066
5767 -182066 -242760 -111570 -144946 -330328 -491409 -660612 -562699 -459362 -122122 -328252
5757 -328252 -34505 142559 -62009 8604 -198950 -145107 -204962 -169774 31939 -166320
5747 -166320 -248095 -318192 -191665 -324003 -193536 -332455 -469206 -216551 -433800 -509522
5737 -509522 -591443 -344213 -496689 -803124 -517141 -529896 -675883 -483174 -357933 -138321
5727 -138321 -410278 -964291 -774358 -346091 -333998 -402194 -379718 -481579 -775703 -385579
5717 -385579 -53299 132670 97766 -76513 -133466 8242 -286359 101725 108650 112532 -24998
5706b4998m37636K02158j82383J95395k37894K88503r3539k73561N6646J72339
5696c34970O8512r3498J04948j13538j13575J12658K54437j67817k09608K64785
5686b27666r3159P4630N7666J45168J3508l36421K0444M84924j81422n5774M10913
5675C12811m7470l46380j56439Q8538k24685J99608l4027m2179j3703L9543J52338
5664g2045L47919k03550k4575l22513j30744Q1006J25258J95307j7703j14570
5654a36210l93833J51161J54115m5018n7328L70970j25781n2694l19066J33976
5644c19708K8700K41310o735r7496Q0195p2141J09392J00740J62773n19051R3603
5633a98418j73035M8286M30441j03740j40699k5964K10461J35368j13221Q9441
$$ plain form
5706 -24998 -462634 -260476 -442859 -247464 -485358 -196855 -290394 -563955 -507309 -334970
5696 -334970 -266458 -359956 -255008 -368546 -482121 -369463 -115026 -282843 -492451 -227666
5686 -227666 -320825 -246195 -188529 -43361 -29853 -366274 -345830 139094 -42328 -98102 312811
5675 312811 265341 -81039 -237478 -148940 -373625 -174017 -208044 -250223 -263926 -224383 -72045
5664 -72045 275874 72324 47749 -274764 -405508 -324502 -199244 -3937 -21640 -136210
5654 -136210 -530043 -378882 -224767 -269785 -327113 43857 -81924 -134618 -453684 -319708
5644 -319708 -291008 -49698 -56433 -153929 -73734 -145875 -36483 64257 227030 -292021 -198418
5633 -198418 -371453 -323167 107274 3534 -137165 -163129 47332 182700 69479 158920
5623A58920k37499n6423J4084l10468J48701K2686J05438L02770l68035k31618
5613d51444K33843L103O9830K01225J73884k41541m09455Q1417J49106O3212L7437
5602h9383j87022n7365L60628j69702M2650p3759L62313J2162j91625O2860r844
5591F1913J54436r270j8485k59561k07507j9725K28053l17119Q8083J81384M845
5580a12953J16968P166k84775P9769O5335K00268Q6714m07725N1618K05310J18944
5569A26639k82857J52900J26211l9133k34243Q2802J70728m97703m4602p6031
5559e15289Q7120j14842K11416O8676J56205J08648p2869k74548M25629Q2608
5549A62754q5247k4427K28284J01555m03398M85236k00489k1349l17363j35603
$$ plain form
5623 158920 -78579 -135002 -120918 -431386 -282685 -259999 -154561 148209 -219826 -451444
5613 -451444 -217601 -214498 -144668 56557 230441 -11100 -420555 -339138 -190032 -126820 -89383
5602 -89383 -276405 -333770 26858 -142844 -100194 -173953 188360 200522 8897 71757 61913
5591 61913 216349 207079 188594 -70967 -278474 -298199 -70146 -387265 -299182 -117798 -112953
5580 -112953 4015 11181 -273594 -193825 -128490 71778 158492 -249233 -197615 7695 126639
5569 126639 -156218 -3318 122893 83760 -150483 -67681 103047 -394656 -439258 -515289
5559 -515289 -428169 -543011 -331595 -262919 -106714 1934 -70935 -345483 80146 162754
5549 162754 77507 53080 281364 382919 -20479 464757 264268 242919 -74444 -210047
5539b10047J98862K74321k3264M4264m777o2416J28890k14174l42921n1817J45339
5528a17740k78872K63964J29357P6385j90703L2672R39j65873L33492N4429l9047
5517I9003L3344m1039l02246J74782P100J3790o6759K98746K13313m68280P8914
5506D0668P448O1752n300j07949j11254J78726n4340K12293k92419j12157K80017
5495I7485k7339R8230K00147j5502k56733k27506k70694K10308j47403J50964
5485a88043q7674R9017r8749J08540L87709N4292q5418L00853k02260j28673O0241
5474B19835r1265p6782K0672r7043Q8056J6477J56589J52331k24794K70666l6680
5463C98062L6887J72274l3934K26781L8813N1512J47191k29476P7093O7825j99023
$$ plain form
5539 -210047 -11185 263136 239872 284136 279359 216943 345833 131659 -211262 -263079 -117740
5528 -117740 -396612 -132648 -3291 73094 -117609 -84937 -83998 -249871 83621 138050 99003
5517 99003 132347 91308 -210938 -36156 -29056 -15266 -82025 216721 430034 -38246 40668
5506 40668 48116 109868 104568 -3381 -114635 64091 9751 222044 -70375 -182532 97485
5495 97485 70146 168376 368523 353021 96288 -131218 -401912 -191604 -339007 -188043
5485 -188043 -275717 -176700 -275449 -166909 220800 275092 189674 490527 288267 159594 219835
5474 219835 128570 51788 72460 -24583 63473 79950 236539 388870 164076 434742 398062
5463 398062 434949 607223 573289 800070 838883 890395 1037586 808110 885203 953028 754005
5452G54005p4955j50280J12632r6218M6647N35390J05699o6603k07596J55501
5442A114222k40962n8390k59680m596j937K68969O843p6084J27271J15258K8840
5431A019754K39368L40524j75899O5079j30195l4736P154j21287r8447j57895
5421I53420J0976L36841q4410L0113Q4435L4036k20865k31219j05491j57081k53259
5410C97496K22786j05208K84634M16522L6755j06561j75344K23926N6438k23045
5400A028399j79874J60953J08134N1382m25599J31457J94731j17396j15889p3168
5390G63130J1148J891N8454j56278n7620Q5919j82645j1831J94010j39093K6905
5379E93990O288k2985J20999K71072k37238k44967K06832L36079L6092k07490
$$ plain form
5452 754005 679050 528770 641402 545184 591831 1127221 1232920 1166317 958721 1114222
5442 1114222 873260 814870 555190 550594 548657 817626 824469 748385 875656 990914 1019754
5431 1019754 1259122 1599646 1423747 1488826 1358631 1323895 1331049 1209762 1111315 953420
5421 953420 964396 1301237 1216827 1246940 1331375 1365411 1144546 913327 807836 650755 397496
5410 397496 620282 515074 799708 1216230 1252985 1146424 971080 1195006 1251444 1028399
5400 1028399 848525 1009478 1117612 1168994 743395 874852 1069583 952187 836298 763130
5390 763130 774278 776169 834623 678345 620725 706644 523999 512168 706178 567085 593990
5379 593990 600278 577293 698292 969364 732126 487159 693991 1030070 1066162 858672
5369H58672J62979j05532Q5869l00862K0628J16355J03999n3166J2652n7689N9295
5358I03200j23147l63246K50324j95142j00583j80613Q3630L3059Q4702j64613
5348B27571p9297K20636Q5080J27585k49470k06554j69095L34877K02529j82631
5338C11231P4650K7231j85224j85661O3242J37270R1165J28818K60511k76347
5328D46886r686K750k14307m9629K59932j58506j23737M6980k12555K70246j91396
5317F6978k24818J43079R6950r3842J09992Q2370j9761l57453L23812M3762P375
5306A78444J35274j67326j37113Q3450K0542J71265J63533J69709j78572l07840
5296A31366K64260k26369j95077j49612L11976n3097o0006J44172J88149l9214
$$ plain form
5369 858672 1021651 916119 1001988 701126 721754 838109 942108 888942 901594 843905 903200
5358 903200 780053 416807 667131 471989 371406 190793 274423 307482 392184 227571
5348 227571 148274 368910 453990 581575 332105 125551 -43544 291333 493862 311231
5338 311231 385881 413112 227888 42227 105469 242739 333904 462722 723233 446886
5328 446886 437200 439950 225643 176014 435946 277440 153703 200683 -11872 258374 66978
5317 66978 -157840 -14761 82189 -11653 98339 180709 160948 -196505 127307 171069 178444
5306 178444 313718 146392 9279 92729 113271 284536 448069 617778 439206 131366
5296 131366 395626 169257 -25820 -175432 136544 83447 23441 167613 355762 316548
5286C16548l08864o1157J00670m5110o3654J97853J57191j26896o6563k22287
5276a22269J9491j41918J42089J62902Q7501J59534j56664K06112l40037l2467
5266a5726L7962M248K35907p1555q1333J79794p1014k72978j2433M01238K08781
5255E42891n14510M47839J54742l79001k18234K93578K94713j34220P0591k89568
5245B68821k06876N9854J32927K24165K76046k12109m9565M3065J87641J29667
5235H53636l29530K03713J88426j2026n9307j57086k73604J28879J54434n8401
5225F39134m5326j04130N5244j91666o0790p2731J86952l17973J42139N6231j63756
5214A23328k5725r5820J28711J13859J51387k53497n636m6031J32551k11664J53624
$$ plain form
5286 316548 7684 -53473 47197 2087 -61567 136286 293477 166581 100018 -122269
5276 -122269 -102778 -244696 -102607 60295 147796 307330 150666 356778 16741 -15726
5266 -15726 22236 26484 262391 190836 109503 289297 218283 -54695 -67128 334110 542891
5255 542891 28381 476220 630962 251961 33727 327305 622018 487798 558389 268821
5245 268821 61945 121799 254726 478891 754937 542828 493263 536328 723969 853636
5235 853636 524106 727819 916245 904219 844912 687826 414222 543101 697535 639134
5225 639134 593808 489678 544922 353256 292466 219735 406687 88714 230853 287084 123328
5214 123328 97603 1783 130494 244353 395740 142243 136607 90576 223127 11463 165087
5203A65087J41523K12203j19376M24386P130m61847o8281M9990j16673o9090L75873
5192E40925n1836p4174J49299K29984k95410p7262O2076q7704k08548J69221J66183
5181E22754j55437l5396j3359n2267o7651K07801k9475l79251K78977M00195j26612
5170E50279j46536R6806j29382l67905o2598K30657R6602R460J69070L97953j22200
5159G22206k2277k04285R3658r9951j1296j11647J68623K24490r4611O4378k09331
5148E19957Q1334j5648L0508J18290J27429j48037J10262J43711J86806o7766
5138A086846j25488k08633j6484K88136J41691j66082k87197K3737K06808o5816
5128H77518j09841J16749j00779k1570J45808Q5617P7416j86847O602L91756q2496
$$ plain form
5203 165087 306610 518813 399437 823823 830953 369106 300825 350815 234142 165052 540925
5192 540925 489089 414915 564214 794198 498788 421526 483602 395898 187350 356571 522754
5181 522754 367317 331921 318562 266295 198644 406445 376970 -2281 276696 676891 550279
5170 550279 403743 500549 371167 3262 -59336 171321 267923 277383 446453 844406 722206
5159 722206 699929 495644 589302 489351 478055 366408 535031 759521 664910 729288 519957
5148 519957 601291 585643 616151 734441 861870 713833 824095 967806 1154612 1086846
5138 1086846 961358 752725 736241 1024377 1166068 999986 712789 736526 943334 877518
5128 877518 767677 884426 783647 762077 907885 993502 1070918 884071 890673 1282429 1199933
5117A199933j19755k7154M28843l3333j6588j59669j03000J47670J04600m8016
5107A373531Q7701J57525j43797J74659J61181j7398k3323j92255j46833J99779
5097A630770K06127J71342j58085j86192K52817K48968j95331j02248q629K27553
5087B087092p2976j57348j05358K01144k5340k24421n2752P8550J48781k03414
5077A673958L91209j1755Q3220k40496j91694N2750J07925K20897J57395r0834
5067B152575J74038R1586q6890L24554k11781p1395l04408M1370J25862Q9826
5057B325337L6942J63305j14290P8519K9910j2914m7424j86895J89399m9871j14223
5046B297795K10924J54783J34768R0180M6295k7068J10046l03510M1978J42063
$$ plain form
5117 1199933 1080178 1053024 1481867 1448534 1431946 1272277 1169277 1316947 1421547 1373531
5107 1373531 1461232 1618757 1474960 1649619 1810800 1793402 1770079 1577824 1430991 1630770
5097 1630770 1836897 2008239 1850154 1663962 1916779 2165747 1970416 1868168 1859539 2087092
5087 2087092 2014116 1856768 1751410 1952554 1927214 1702793 1650041 1728591 1877372 1673958
5077 1673958 2065167 2053412 2136632 1896136 1704442 1757192 1865117 2086014 2243409 2152575
5067 2152575 2326613 2418199 2331309 2655863 2444082 2372687 2068279 2109649 2235511 2325337
5057 2325337 2362279 2525584 2411294 2489813 2519723 2506809 2459385 2272490 2461889 2412018 2297795
5046 2297795 2508719 2663502 2798270 2888450 2934745 2907677 3017723 2714213 2756191 2898254
5036B898254k08007J55015O9466n1953K19832J78610P1369o9348R6537L5743m177
5025C391341l9651j90285p172K42591J40355m4896N5673K5778L27953n1501l91178
5014C459008L9059K0321Q3861P4193M3508J03369L2428L76607l4974j71598J05605
5003D131387L4475m24623j26480K36163R7521k77364m3101J68993K7606J08704
4993C933281l9930l0367R3152J3840j11134J10002q3780K63293j32075j29739
4983C886543J93940N5835O8126k3524L92815m8638R6578O6848o1910P811P925
4972D642349J86462k55637m6966L41543Q0298j99633j45910N56624m33235j77855
4962D548040L61844J37389o4359J61687j5294N4830J36208J79621M75846m526
$$ plain form
5036 2898254 2690247 2845262 2914728 2862775 3082607 3261217 3332586 3263238 3359775 3395518 3391341
5025 3391341 3351690 3161405 3154233 3396824 3537179 3492283 3547956 3573734 3901687 3850186 3459008
5014 3459008 3498067 3518388 3602249 3676442 3719950 3823319 3855747 4232354 4197380 4025782 4131387
5003 4131387 4165862 3741239 3614759 3850922 3948443 3671079 3627978 3796971 3824577 3933281
4993 3933281 3893351 3862984 3956136 3969976 3858842 3968844 3885064 4148357 4016282 3886543
4983 3886543 4080483 4136318 4204444 4180920 4573735 4525097 4621675 4688523 4626613 4634424 4642349
4972 4642349 4828811 4573174 4526208 4867751 4948049 4748416 4602506 5159130 4725895 4548040
4962 4548040 4909884 5047273 4982914 5144601 5129307 5184137 5320345 5499966 5975812 5971286
4952E971286K92752J07814j82489k8224K87350N81373P3557k7856L99216j3201
4942G461578m38558J35993K32994M16228j30053l60360J33151k22743K30721j50402
4932G308549K63314L04176M7917j03778k04496L66350k18818k36195K13774K55129
4922G995922r3218N1499K64161L17097n0263P5829j05785j20869M21854N90699
4912I346926L35496j39500R2556J69652o1026j47910M84689P6847P4595J18759
4902A0351084L1754k20807j04173N49175K58913K41388J81915m9092p0854p1770
4892A1097533O86113K07309J72258K28731L57345K73117L75292K30504N57792
4883A4185994R60638P43560R22949R52589N50614J14025m12090o55803l13062
$$ plain form
4952 5971286 6264038 6371852 6189363 6161139 6448489 7029862 7103419 7075563 7474779 7461578
4942 7461578 7023020 7159013 7392007 7808235 7678182 7317822 7450973 7228230 7458951 7308549
4932 7308549 7571863 7876039 7923956 7820178 7615682 7982032 7763214 7527019 7740793 7995922
4922 7995922 7902704 7954203 8218364 8535461 8485198 8561027 8455242 8334373 8756227 9346926
4912 9346926 9682422 9542922 9635478 9805130 9744104 9596194 10080883 10157730 10232325 10351084
4902 10351084 10382838 10162031 10057858 10607033 10865946 11107334 11289249 11240157 11169303 11097533
4892 11097533 11783646 11990955 12163213 12391944 12749289 13022406 13397698 13628202 14185994
4883 14185994 15146632 15890192 16813141 17765730 18316344 18430369 18018279 17362476 17049414
4874A7049414j066739k29817k03888n2377l14453j15044j00493l54972K9950k16712
4864A4424869J21320N2239J73757K66982N27385j22368L20501O34418K58213O51437
4854A7308753N53574O87716J168271J128171J138842J578600K078354K454690
4846B8096971K971972K537222R16537j305862k559047k985369k274334j807360
4838B3590730j151081j239781j136386k38150l39927n81797o42125L9125l03477
4829A7997131j8260n77031J23785J17115M62369K45145K52094M86714M48001Q02706
4819B0339769N48740J124076Q69801J089792J378803K126150K211322K366566
4811C2055019K676385J753049n8176k392316k967949k815506k625999j279503
$$ plain form
4874 17049414 15982675 15752858 15548970 15496593 15182140 15067096 14966603 14611631 14641581 14424869
4864 14424869 14546189 14598428 14772185 15039167 15566552 15444184 15764685 16399103 16657316 17308753
4854 17308753 17862327 18550043 19718314 20846485 21985327 23563927 25642281 28096971
4846 28096971 31068943 33606165 34522702 33216840 30657793 27672424 25398090 23590730
4838 23590730 22439649 21199868 20063482 19825332 19485405 18903608 18261483 18300608 17997131
4829 17997131 17978871 17401840 17525625 17642740 18105109 18350254 18602348 19089062 19537063 20339769
4819 20339769 20888509 22012585 22882386 23972178 25350981 27477131 29688453 32055019
4811 32055019 34731404 36484453 36426277 34033961 31066012 28250506 25624507 24345004
4803B4345004j183469j248603n99897k94759k80071o31712j84119m02430l56457
4794A9163487j40743l4352J47799o7012k62546J63289q71J5356j2963L16537O39157
4783A9927138K92554O45822K20298M75749Q93873Q81864P00681O23559o5610p90710
4773B3805218p82983j025583p84203m45760p69201k00989l13561k21083l95193
4764A8866662j61571j74795k90366N1086l46595J44534r3084j00850j79265j35721
4754A7580035j86670l04414n432M55503J18527n63352k40361N5009j30145k60636
4744A6518064p2966j84837K30393j53576k81675K71415J09125k70336Q6658n1608
4734A6200657K39706k1339l01729J28059m6929J09794l85477j00615J13468j32582
$$ plain form
4803 24345004 23161535 21912932 21313035 21018276 20738205 20106493 19922374 19519944 19163487
4794 19163487 19022744 18988392 19136191 19069179 18806633 18969922 18969051 18984407 18971444 19287981 19927138
4783 19927138 20219692 20865514 21085812 21561561 22455434 23337298 24037979 24661538 24595928 23805218
4773 23805218 23022235 21996652 21212449 20766689 19997488 19796499 19482938 19261855 18866662
4764 18866662 18705091 18530296 18239930 18291016 17944421 18088955 17995871 17895021 17715756 17580035
4754 17580035 17393365 17088951 17083519 17539022 17657549 17094197 16853836 16908845 16778700 16518064
4744 16518064 16445098 16260261 16490654 16337078 16055403 16326818 16435943 16165607 16252265 16200657
4734 16200657 16440363 16419024 16117295 16245354 16198425 16308219 15922742 15822127 15935595 15803013
4724A5803013q2069j74573J20562j05137m9565k85491n13381k0508L6860l81179
4714A4348532j70363K91163m8629k70073o1821m1922n6873J641p9233J75037P438
4703A4094897r7368k18157q9021Q2961m1963K5244R1280l6587M4376r6692K2819
4692A3781789K3784J27944n2904N3741p4992l87245R7846k12504N0458J39668
4682A3547585R0890j08048j17711M1718L58188J9161k52700Q1660q689p6063k32345
4671A3343646L21633J31383k3456j25308L69170M2698p5640P6612K87269K08285
4661A4556292j37184P7461j07663O1316j19960q0038q5352N162l22407j26356
4651A3721271k57810n5661K61031k51036J95024o9325k58715J30443j21662k10659
$$ plain form
4724 15803013 15720944 15546371 15666933 15561796 15512231 15226740 14713359 14692851 14729711 14348532
4714 14348532 14178169 14469332 14420703 14150630 14088809 14046887 13990014 13991655 13912422 14087459 14094897
4703 14094897 13997529 13779372 13690351 13773312 13731349 13756593 13847873 13811286 13855662 13758970 13781789
4692 13781789 13805573 13933517 13880613 13934354 13859362 13472117 13569963 13357459 13407917 13547585
4682 13547585 13638475 13530427 13412716 13454434 13812622 13831783 13579083 13660743 13652054 13575991 13343646
4671 13343646 13665279 13796662 13773206 13647898 14017068 14059766 13984126 14060738 14348007 14556292
4661 14556292 14419108 14496569 14388906 14450222 14330262 14250224 14164872 14170034 13847627 13721271
4651 13721271 13463461 13407800 13668831 13417795 13612819 13543494 13284779 13415222 13293560 13082901
4641A3082901k82819o9139k4869k89196n336O34288M2493p9365l0503J77764l99332
4630A2756887m11993M95392o4249k13096J68852R7572r0909R7797j15276j3350
4620A2707627o8300L7228l8642l83005N5760K96916j40817J35253J23652j51071
4610A2574601p0220R9486J61056J60281l27299J78621j29309j93468L58610J16533
4600A2928892j921k34558L81587K25637k23748r8452j17152R5642r9814j4124
4590A2841989l4272K8037M06451j4374o2215R9833k42221J85132M4905m9247R729
4579A3213747j46144K11099k03188J82219K00855k01125N6001J1187L4461j65717
4569A3193395j78172N5027M2125P2409k57543j67182Q8315K14843j71582J82793
$$ plain form
4641 13082901 12800082 12730943 12706074 12416878 12411542 13045830 13088323 13008958 12978455 13156219 12756887
4630 12756887 12344894 12840286 12776037 12562941 12731793 12829365 12738456 12836253 12720977 12707627
4620 12707627 12639327 12676555 12637913 12254908 12310668 12607584 12466767 12602020 12725672 12574601
4610 12574601 12504381 12603867 12764923 12925204 12597905 12776526 12647217 12453749 12812359 12928892
4600 12928892 12926971 12692413 13074000 13299637 13075889 12977437 12860285 12955927 12856113 12841989
4590 12841989 12807717 12835754 13242205 13227831 13165616 13265449 13023228 13208360 13253265 13204018 13213747
4579 13213747 13067603 13278702 13075514 13257733 13458588 13257463 13313464 13324651 13359112 13193395
4569 13193395 13015223 13070250 13112375 13184784 12927241 12760059 12848374 13063217 12891635 13074428
4559A3074428J61849M5333Q2332l1719Q2453o2330j62004K56292r1279p7970J59027
4548A3436412K53542k90966O3769L18223r4056q7220J16110L72124K62607L04498
4538A4655043k18430O5996K9127q4999l05078o7524J70198Q8309N3115J18121
4528A4503878j98889K71729K1348p747P6956o1888l7975j58995K02993k9388N50323
4517A5132345l8999P4511Q7285j90461q1737k81924K18250m6450o113K41934P8295
4506A5186936J04433J92489M7847l1639J23698r1447O1869J51091m0687n5406
4496A5649184m563L11263j56636J0713K64390N9330L05498J40951K17314p3809
4486A6723635J94732M40713J78528k74006J17280K17045K82096J04718k70784
$$ plain form
4559 13074428 13236277 13281610 13363942 13332223 13414676 13352346 13190342 13446634 13355355 13277385 13436412
4548 13436412 13689954 13398988 13462757 13780980 13686924 13599704 13715814 14087938 14350545 14655043
4538 14655043 14436613 14502609 14531736 14446737 14141659 14074135 14244333 14332642 14385757 14503878
4528 14503878 14304989 14576718 14598066 14590319 14667275 14605387 14567412 14408417 14611410 14582022 15132345
4517 15132345 15093346 15167857 15255142 15064681 14982944 14701020 14919270 14872820 14866707 15108641 15186936
4506 15186936 15291369 15483858 15531705 15500066 15623764 15532317 15594186 15745277 15704590 15649184
4496 15649184 15644621 15955884 15799248 15809961 16074351 16133681 16439179 16580130 16797444 16723635
4486 16723635 16918367 17359080 17537608 17263602 17380882 17597927 17880023 17984741 17713957
4477A7713957L30972r7287J69257K56652K82792J00201L8878N4811L74077J61984
4467A9386294j03055Q5357K5964N59328k59149J68820L24853L93233L56858K3574
4457B0962077L4358J04455L72549L49350K55640K5088K84510N7904L72220J46182
4447B2964333K72373P6334l9546K68233P23946L66288j19035K65418K93015L92047
4437B5463406o0523P6108M34010J73313Q2117K39659M74308K30034K67262N08440
4427B7888134N92995J13064K53741L86536M33078N66276L00754O14172N1442L00488
4417C1500680O52225L82074L54073L92868O09067K23245M81572L78950M42566
4408C5417320M91062N28515M65322M25340P02989M77860M66185M44650P59060
$$ plain form
4477 17713957 18044929 17947642 18116899 18373551 18656343 18756544 18795422 18850233 19224310 19386294
4467 19386294 19283239 19368596 19394560 19953888 19694739 19863559 20188412 20581645 20938503 20962077
4457 20962077 20996435 21100890 21473439 21822789 22078429 22103517 22388027 22445931 22818151 22964333
4447 22964333 23236706 23313040 23273494 23541727 24265673 24631961 24512926 24778344 25071359 25463406
4437 25463406 25402883 25478991 25913001 26086314 26168431 26408090 26882398 27112432 27379694 27888134
4427 27888134 28481129 28594193 28847934 29234470 29667548 30233824 30534578 31148750 31200192 31500680
4417 31500680 32152905 32534979 32889052 33281920 33890987 34114232 34595804 34974754 35417320
4408 35417320 35908382 36436897 36902219 37327559 38030548 38508408 38974593 39419243 40178303
4399D0178303O02135M16049O58616O15423N41679O36043P57394P76861R01847
4390D6084350P74030P77088N24091J232099R31679M56486J018470R00928O71531
4381E3370752Q38082R00686P74214P85104R18020Q78716Q75301J228587P67126
4372F1336588J462193J361552J162511J332393J077628J091599J285408J324090
4364G1433962J361376J327716J240377J217095J674958J405603J504454J795077
4356H2960618K094177J826813J760952J811064J618632K165190J806770J978984
4348I8023200K335942K149121K253365K397230K737169K686730K611683K804014
4340A17998454K875439L353706L065028L168543L292116L597218L673598L702667
$$ plain form
4399 40178303 40780438 41196487 41855103 42470526 43012205 43648248 44405642 45182503 46084350
4390 46084350 46858380 47635468 48159559 49391658 50323337 50779823 51798293 52699221 53370752
4381 53370752 54208834 55109520 55883734 56668838 57586858 58465574 59340875 60569462 61336588
4372 61336588 62798781 64160333 65322844 66655237 67732865 68824464 70109872 71433962
4364 71433962 72795338 74123054 75363431 76580526 78255484 79661087 81165541 82960618
4356 82960618 85054795 86881608 88642560 90453624 92072256 94237446 96044216 98023200
4348 98023200 100359142 102508263 104761628 107158858 109896027 112582757 115194440 117998454
4340 117998454 120873893 124227599 127292627 130461170 133753286 137350504 141024102 144726769
4332A44726769L872708M377928M699417M369350M466086M620403N071735M789490
4324A80993886N338955N752161N528469N602182O031715O014303O461669O635171
4316B28358511O267570O745992O834664P034678O806874O920844P170683P048783
4308B83188599O823617O562108O414797O444293O016014N448505N438749M434917
4300C30771599M164881L502578L065170K466698J799906Q97114j66110o02777
4292C45899059j215501k698184l118312l365471m192791m896590n224442n505214
4284C15682554o234375o435550o702213o630339p369450p154272p561123p311678
4276B60283554p034528o828882p118134o835533o679216o596161o319471o092614
$$ plain form
4332 144726769 148599477 152977405 157676822 162046172 166512258 171132661 176204396 180993886
4324 180993886 186332841 192085002 197613471 203215653 209247368 215261671 221723340 228358511
4316 228358511 234626081 241372073 248206737 255241415 262048289 268969133 276139816 283188599
4308 283188599 290012216 296574324 302989121 309433414 315449428 320897933 326336682 330771599
4300 330771599 334936480 338439058 341504228 343970926 345770832 346667946 346501836 345899059
4292 345899059 344683558 341985374 338867062 335501591 331308800 326412210 321187768 315682554
4284 315682554 309448179 303012629 296310416 289680077 282310627 275156355 267595232 260283554
4276 260283554 253249026 246420144 239302010 232466477 225787261 219191100 212871629 206779015
4268B06779015o178708o187871n734099n215312n325888n654737m858706m810739
4260A62812955m658056m617474m343967m014812m416299l604555l818999l836305
4252A29502488l209343l446674l173407l179637l233031k867252k696354k725625
4244A04971165k270281k526374k228499k387641k319341j821618k283611k226772
4236H6907028j901799j714548j745225j815305j623834j642277j910327j754065
4228G2799648j368838j412573j423823j405155j200964j147971j371172j142325
4220F2326827j200768j362108o14447j379515j308109q34172j116497r72066q85712
4211E2653433j030746j106083j084421m77428n85920j114292p25625q07678n68881
$$ plain form
4268 206779015 200600307 194412436 188678337 183463025 178137137 172482400 167623694 162812955
4260 162812955 158154899 153537425 149193458 145178646 140762347 137157792 133338793 129502488
4252 129502488 126293145 122846471 119673064 116493427 113260396 110393144 107696790 104971165
4244 104971165 102700884 100174510 97946011 95558370 93239029 91417411 89133800 86907028
4236 86907028 85005229 83290681 81545456 79730151 78106317 76464040 74553713 72799648
4228 72799648 71430810 70018237 68594414 67189259 65988295 64840324 63469152 62326827
4220 62326827 61126059 59763951 59149504 57769989 56461880 55627708 54511211 53539145 52653433
4211 52653433 51622687 50516604 49432183 48954755 48368835 47254543 46528918 45721240 45152359
4202D5152359r61188o07108o33601r58048q30076n75679p27366o27424l35864
4193C8896005n07142n20751m25902p17919q39576p85193q2959j59820n41124p81797
4183C3533822p30863k72726o24911o58820n30990k50934n47768m16881m82342
4174B9017587j44570o35801o60224j23114J0100m41269p40065m85725l64460k75032
4164B5157427m39018p0029o37837j78460K07705l58434l42939k42231j94811l23627
4154B2577746l82462k72295k81940j85654j40947j76427j47488m44771l58463
4145B0187299j00308J24893j21846p98069n45904p4381o8854j39369k41817M8000
4135A8269644j82820q6003j02998k30278m16287l96160M8311o7735l90489l87810
$$ plain form
4202 45152359 44191171 43584063 42950462 41992414 41162338 40586659 39859293 39231869 38896005
4193 38896005 38388863 37868112 37442210 36724291 35884715 35099522 35016563 34856743 34315619 33533822
4183 33533822 32802959 32530233 31905322 31246502 30715512 30464578 29916810 29499929 29017587
4174 29017587 28873017 28237216 27576992 27453878 27463978 27022709 26282644 25796919 25432459 25157427
4164 25157427 24718409 24648380 24010543 23832083 24039788 23681354 23338415 23096184 22901373 22577746
4154 22577746 22195284 21922989 21641049 21455395 21314448 21138021 20990533 20545762 20187299
4145 20187299 20086991 20211884 20090038 19291969 18746065 18671684 18602830 18463461 18221644 18269644
4135 18269644 18086824 18000821 17897823 17667545 17251258 16855098 16903409 16835674 16445185 16057375
4125A6057375j45808K5882k48112j33803K89976l73364q7499j62734k74432j62161
4115A4785320n64949l39044P3887j16392j21481P8551j63648k24384J9158j36268
4105A3290750j17712M0119j94295j35042n4446l7845k30507j59932q9924L28899
4095A2640065j76048l14821M0576j17129O5098j64891j22471k5279J86238N4792
4085A2066130J0941Q1940k41806J59930L870K14176k08024k64392k07972l08110
4075A1306683K1572j17764K51442K9055n2939J74040k73720k41909K74570m01002
4065A0970028J14899l1296j5530K5145k45991O9145J15300m9455m1794j85843
4055A0724608J05100K25057K79612J688k29960q14k2671J47394n7526K77501l05298
$$ plain form
4125 16057375 15911567 15937449 15689337 15555534 15845510 15472146 15384647 15221913 14947481 14785320
4115 14785320 14220371 13881327 13955214 13838822 13717341 13795892 13632244 13407860 13427018 13290750
4105 13290750 13173038 13213157 13018862 12883820 12829374 12791529 12561022 12401090 12311166 12640065
4095 12640065 12464017 12149196 12189772 12072643 12137741 11972850 11850379 11825100 12011338 12066130
4085 12066130 12077071 12159011 11917205 12077135 12081005 12295181 12087157 11822765 11614793 11306683
4075 11306683 11328255 11210491 11461933 11490988 11438049 11612089 11338369 11096460 11371030 10970028
4065 10970028 11084927 11053631 11038101 11063246 10817255 10886400 11001700 10952245 10910451 10724608
4055 10724608 10829708 11054765 11334377 11336065 11106105 11105291 11082620 11230014 11172488 11449989 11144691
4044A1144691l5829q4928L28903m263l19889P6458J79024J13361n73148j9321
4034A0805059K40192m5877q7919k70439J46129O1098j05604K38402j46505K47337
4024A1081873j77541P5618J46398j64438J62617L2k45328J5710K7128l07722M1894
4013A0656241k6983O0871N3454p0674l39477M5556j28797L2258j50828K67532
4003A0399153k26031o6890J19174m28849K22553j51083J92711j57426j93967j15790
3993I593555J18854k41503J19845M8745M5624l2927j88114M2588j87748r0526
3983I228393j6944k7677j85207j17863j16285Q1343K09369j80476K79309q1704
3973I072258J59040j44896k47575j51335l98228r5574n605K82274J72156j4012
$$ plain form
4044 11144691 11108862 11023934 11352837 11348574 11028685 11105143 11284167 11397528 10824380 10805059
4034 10805059 11045251 10999374 10911455 10641016 10787145 10848243 10742639 10981041 10834536 11081873
4024 11081873 10904332 10979950 11126348 10961910 11124527 11124559 10879231 10894941 10922069 10614347 10656241
4013 10656241 10629258 10690129 10743583 10672909 10333432 10378988 10250191 10282449 10131621 10399153
4003 10399153 10173122 10106232 10225406 9796557 10019110 9868027 10060738 9903312 9709345 9593555
3993 9593555 9712409 9470906 9590751 9639496 9685120 9652193 9464079 9506667 9318919 9228393
3983 9228393 9211449 9183772 8998565 8880702 8764417 8845760 9055129 8874653 9153962 9072258
3973 9072258 9231298 9086402 8838827 8687492 8289264 8193690 8188085 8470359 8642515 8628503
3963H628503R9028J5468m92571M2202k75230l00400j64163K43258j588l15108
3953G479399J98663R112J01295M23982P7001k42827l69915J10692J67645n7800
3943G897247j26854j44418m8259J80888k57817k73213K1586o2549J59331l5973
3933G309969J49498J14125j71647M9761j9284k17484j25648j2965J54671k16218
3923G014778N1998O140k62707P4475J50222L46902j49589R6929J60399J53831
3913G643378l4547j96179p7059k95034L1223O1475k4082P4903J15047j9241j72468
3902G107416k79388k4947J49174j33185K23871K41371k446j55466j33324M42698
3892G435774j8613l0613q8214n5512o808R6449j43498k31065J85970J62783J99022
$$ plain form
3963 8628503 8727531 8742999 8250428 8292630 8017400 7717000 7552837 7796095 7794507 7479399
3953 7479399 7678062 7687174 7788469 8212451 8289452 8046625 7676710 7787402 7955047 7897247
3943 7897247 7770393 7625975 7577716 7758604 7500787 7227574 7249160 7186611 7345942 7309969
3933 7309969 7459467 7573592 7401945 7451706 7432422 7214938 7089290 7076325 7230996 7014778
3923 7014778 7066776 7072916 6810209 6884684 7034906 7381808 7232219 7329148 7489547 7643378
3913 7643378 7608831 7412652 7335593 7040559 7071782 7133257 7109175 7184078 7299125 7279884 7107416
3902 7107416 6828028 6803081 6952255 6819070 7042941 7284312 7281866 7126400 6993076 7435774
3892 7435774 7417161 7386548 7298334 7242822 7236014 7332463 7188965 6957900 7143870 7306653 7505675
3881G505675p6847K39810P3234L7712K54939O7480j6609j77405n5593N0157J5957
3870G918510O7253l21626j11006R2947q3785j32443q652K11984q3299K6238M12271
3859G988392k0413N2953J31322J62370l8173n95790k03720l2090R6647J22481
3849G663979L3858m8579K69721p1769J05874k01463j11948N4800n4682K14085
3839G853876L5574q5169J81955L94321J70445Q9130j77597k8533r3909J87423
3829H527516j42091j71224K78963L4739l13806P5154K91319J04639n7503J56168
3819H783874J94587j9222j17579N076J10831K81011j50452k54209J09914L17238
3809I261069L5589j94560k12192j42696P5078l7445j23194N1241J35276j2127
$$ plain form
3881 7505675 7428828 7668638 7741872 7779584 8034523 8102003 8085394 7907989 7852396 7902553 7918510
3870 7918510 7985763 7664137 7553131 7646078 7562293 7429850 7421198 7633182 7549883 7576121 7988392
3859 7988392 7967979 8020932 8152254 8314624 8276451 7680661 7476941 7444851 7541498 7663979
3849 7663979 7697837 7649258 7918979 7847210 7953084 7751621 7639673 7694473 7639791 7853876
3839 7853876 7889450 7804281 7986236 8380557 8551002 8640132 8462535 8434002 8340093 8527516
3829 8527516 8385425 8214201 8493164 8527903 8214097 8289251 8580570 8685209 8627706 8783874
3819 8783874 8978461 8959239 8841660 8846736 8957567 9238578 9088126 8833917 8943831 9261069
3809 9261069 9296658 9102098 8889906 8747210 8822288 8784843 8661649 8712890 8848166 8836039
3799H836039J14335k96953K31172j97680j50140j33585J65829Q1187O5214K30590
3789H946008l6592j74072k26428M8925p5050L36514J3135J45897J07611o469J96179
3778I275658L13196J9615k86980k05256k47838r860k29768J64119K30046n8628
3768H964304O6126m8271J8314K60414j95696J84130J51529j84397J10565k8589
3758I298429J75262k74488K6681k42708N9337J03959L15252J08033r5060K48759
3748I723456J13239J6682N987L88918J15294k09780r4054J18862j18383K89410
3738A0349631J11003k83277k07474K01563J72299O2874K45927L70470l18727j58269
3728A0546020K89484n9931J33806K47009K47150j220m65909K31027J31205k93694
$$ plain form
3799 8836039 8950374 8653421 8884593 8686913 8536773 8403188 8569017 8650204 8715418 8946008
3789 8946008 8909416 8735344 8508916 8557841 8482791 8819305 8832440 8978337 9085948 9079479 9275658
3778 9275658 9588854 9608469 9321489 9116233 8868395 8858535 8628767 8792886 9022932 8964304
3768 8964304 9030430 8982159 9000473 9260887 9065191 9249321 9400850 9216453 9327018 9298429
3758 9298429 9473691 9199203 9225884 8983176 9042513 9146472 9461724 9569757 9474697 9723456
3748 9723456 9836695 9853377 9859364 10248282 10363576 10153796 10059742 10178604 10060221 10349631
3738 10349631 10460634 10177357 9969883 10171446 10343745 10406619 10652546 11023016 10704289 10546020
3728 10546020 10835504 10775573 10909379 11156388 11403538 11402318 10936409 11167436 11298641 11004947
3718A1004947j75211K88382J83123j52015J76765N1599m9739q5992N1238J60090
3708A1453187j5576J7257M19958j54167n2998L11597K57496j10958r3149O8854
3698A2101501J46666N7975j14006j61548M05089J72224M7811j0985K78627J32886
3688A3056240m49989j14088L08514m9235k64927J51781Q04K69422J12476P681
3678A3028679J2034j03513L7618J22713j13824K3152k6887K0835J4055n0089Q2076
3667A3046849j47040m7582l70000k18358M06602j81674q4168J17070J26747j82410
3657A2466036J66556j0180J46598p4185K55524O3600m55538J91154K81089K09853
3647A3240507j58646K03716p561j18870j25814O6282J26431K2570k89123J24912
$$ plain form
3718 11004947 10829736 11118118 11301241 11149226 11325991 11377590 11327851 11241859 11293097 11453187
3708 11453187 11437611 11454868 11874826 11720659 11667661 11979258 12236754 12125796 12032647 12101501
3698 12101501 12248167 12306142 12192136 12030588 12435677 12607901 12655712 12644727 12923354 13056240
3688 13056240 12606251 12492163 12800677 12751442 12486515 12638296 12639100 12908522 13020998 13028679
3678 13028679 13040713 12937200 12974818 13097531 12983707 13006859 12979972 13000807 13014862 12964773 13046849
3667 13046849 12899809 12852227 12482227 12263869 12670471 12488797 12404629 12521699 12648446 12466036
3657 12466036 12632592 12622412 12769010 12694825 12950349 13013949 12558411 12749565 13030654 13240507
3647 13240507 13081861 13285577 13278016 13159146 13033332 13099614 13226045 13248615 12959492 13084404
3637A3084404M5884l9782j74792j13432K24249L81969l46343j25302k02943N7991
3627A2791903m46328p051J5087n94360J19700K58012k69444n54515M25085Q7929
3617A1826018m6454N7714N26037l34165j52845M9159J19718j70221j14048j62572
3607A1598341J53853N3092J2313J40125N4748j89629j6532k26564j77867Q5171
3597A1487051o2535L56542J82448q4713j73051L07376q210j05920k32703j64400
3587A1501885j04286j81183K67373L07201P5055J27474j86774J95542l25535l2731
3577A1644021K51275O8263j04951k01592K262K42791k13172K86879j49332j74958
3567A1651486j06969k23164L54833j92239j18247l1970K64304j73075L31149Q0664
$$ plain form
3637 13084404 13130288 13090506 12915714 12802282 13026531 13408500 13062157 12936855 12733912 12791903
3627 12791903 12345575 12338524 12353611 11759251 11878951 12136963 11867519 11313004 11738089 11826018
3617 11826018 11779564 11837278 12363315 12029150 11876305 11925464 12045182 11874961 11760913 11598341
3607 11598341 11752194 11805286 11817599 11957724 12012472 11822843 11806311 11579747 11401880 11487051
3597 11487051 11424516 11781058 11963506 11878793 11705742 12013118 12004908 11898988 11666285 11501885
3587 11501885 11397599 11216416 11483789 11790990 11866045 11993519 11806745 12002287 11676752 11644021
3577 11644021 11895296 11963559 11858608 11657016 11659278 11902069 11688897 11975776 11826444 11651486
3567 11651486 11544517 11321353 11676186 11483947 11365700 11333730 11598034 11424959 11756108 11836772
3557A1836772j65261N3308K37268k89413j52929J3744K59364l707m3574p1014
3547A1674558L77475K43713k92800K57388J7151R1222j01535l6625K23520j6901
3537A2437166j89825r2992K44892M13504n71889k30720J10414l9695J3196K8179
3527A2122230J2680Q7481L65039M3087k70580J08520Q7447L0576P1328K8087k2679
3516A2663216j84702j53768K00098J84616J7271k29879L72629K43040M8152j13992
3506A3046681K8407J61849K4502J85342m39352o2650J52311n2671O104j86017
3496A2864506j37744R2547K42136J20647m1279J59269m02137N6107O28105J55909
3486A3738066R8480J7476L5244K17485j14140k08945P0879P5729M98100o9517
$$ plain form
3557 11836772 11671511 11724819 11962087 11672674 11519745 11533489 11792853 11789146 11745572 11674558
3547 11674558 12052033 12295746 12002946 12260334 12277485 12368707 12267172 12230547 12454067 12437166
3537 12437166 12247341 12154349 12399241 12812745 12240856 12010136 12120550 12080855 12094051 12122230
3527 12122230 12134910 12222391 12587430 12630517 12359937 12468457 12555904 12586480 12657808 12685895 12663216
3516 12663216 12478514 12324746 12524844 12709460 12726731 12496852 12869481 13112521 13160673 13046681
3506 13046681 13075088 13236937 13261439 13446781 13007429 12944779 13097090 13044419 13050523 12864506
3496 12864506 12726762 12819309 13061445 13182092 13140813 13300082 12897945 12954052 13582157 13738066
3486 13738066 13836546 13854022 13889266 14106751 13992611 13783666 13854545 13930274 14428374 14358857
3476A4358857m90350M35103j38949M10580N7526J79278j38789j72397K06326o1731
3466A4645454O7320L6421Q1301K03102L46182m3126M02611k35871L16502J31750
3456A5951646j4791k66692K21451J28408N4585K49104j47147J62764L94132K87773
3446A7021233j7976K24275q8647J44671O9239J33217m25814n7669J73180j4968
3436A7160741O2056J91481J7439R1666J6802L56280L23198M3640M1496K1753l0490
3425A8296062J41721j21675L1870Q0441K2149L38375k00145K30441l6573N10114
3415A9292780J94122q2426k4123j1542L04766j84524k15056O03984L15359J98873
3405B0392213J28527K31571K44564O3354L96423L70172L41048N93448L91632M26879
$$ plain form
3476 14358857 13868507 14303610 14164661 14575241 14632767 14812045 14673256 14500859 14707185 14645454
3466 14645454 14712774 14749195 14830496 15033598 15379780 15336654 15739265 15503394 15819896 15951646
3456 15951646 15936855 15670163 15891614 16020022 16074607 16323711 16176564 16339328 16733460 17021233
3446 17021233 17003257 17227532 17138885 17283556 17352795 17486012 17060198 17002529 17175709 17160741
3436 17160741 17222797 17414278 17431717 17523383 17540185 17896465 18219663 18263303 18304799 18326552 18296062
3425 18296062 18437783 18316108 18347978 18428419 18450568 18788943 18588798 18819239 18782666 19292780
3415 19292780 19486902 19404476 19380353 19368811 19673577 19489053 19273997 19877981 20193340 20392213
3405 20392213 20520740 20752311 20996875 21060229 21456652 21826824 22167872 22761320 23152952 23579831
3395B3579831K57741O93587N45594M15119R33994J037267R99884J078099J427068
3386C0968184J123282J815484J743694J578769K202547L077688K924937K721790
3378D8156375K708050K270856K080741J967655K602723L114713L844915M128995
3370G0875023M009663K937423J007062N50720L32693J024142J670002K670960
3362H5077688L095541K466790J098357j027703k820076l798091l160583j481544
3354G9450379m85264m99373j122672j593392k832600m129345m011786l378017
3346F1397930k810069j990095j466059j818060k180333k958243k704429k923826
3338D2546816k992214k461781k266737k095249j919961j280593p90428j273175
$$ plain form
3395 23579831 23837572 24531159 25076753 25491872 26425866 27463133 28463017 29541116 30968184
3386 30968184 32091466 33906950 35650644 37229413 39431960 42509648 45434585 48156375
3378 48156375 50864425 53135281 55216022 57183677 59786400 62901113 66746028 70875023
3370 70875023 74884686 77822109 78829171 79379891 79712584 80736726 82406728 85077688
3362 85077688 88173229 90640019 91738376 90710673 87890597 84092506 80931923 79450379
3354 79450379 78965115 78465742 77343070 75749678 72917078 68787733 64775947 61397930
3346 61397930 58587861 56597766 55131707 53313647 51133314 48175071 45470642 42546816
3338 42546816 39554602 37092821 34826084 32730835 30810874 29530281 28739853 27466678
3330B7466678o99991r53242m33605m04191q23463m33678l27928j73971o01066
3321B2615543m16904m17727k69209l16110K60727j19732j82743j80597N8840j01025
3311B0931063l87771o36396J05859k24812K8401J01773r9500o2212n81891N30411
3301A9704925j95947m56701K95597r8665j61199j04534l18995N5192j91376J84936
3291A8713233J79938K11532j94224k72278J4343k5503j0084O1946j27981J15910
3281A8666832j5979J50343k83697j32491J77984n7843N2826K4968L37251l79778
3271A8540416J72761j50028k14293K05279j69825K73351O9230J4408j55000j64785
3261A8421514J30847J45940Q6968j9552j8310K35459k06630l87263J94246k2761
$$ plain form
3330 27466678 26766687 25813445 25379840 24975649 24152186 23718508 23390580 23216609 22615543
3321 22615543 22198639 21780912 21511703 21195593 21456320 21336588 21153845 20973248 21032088 20931063
3311 20931063 20543292 19906896 20012755 19787943 19816344 19918117 19818617 19756405 19174514 19704925
3301 19704925 19508978 19052277 19347874 19249209 19088010 18983476 18664481 18719673 18528297 18713233
3291 18713233 18893171 19104703 18910479 18638201 18652544 18627041 18616957 18678903 18550922 18666832
3281 18666832 18650853 18801196 18517499 18385008 18562992 18505149 18557975 18582943 18920194 18540416
3271 18540416 18713177 18563149 18348856 18554135 18384310 18657661 18726891 18741299 18586299 18421514
3261 18421514 18552361 18698301 18785269 18765717 18747407 18982866 18776236 18388973 18583219 18560458
3251A8560458M0744l30306L554k51669j63429Q9658n41831j49642L7069J69881
3241A7464487m36412p3757K22783j95615l74728q5312J47877k13145k28391J06827
3231A6334614L52240m49099j65379j49889k85796J06087N91392j02574k0529L36144
3221A6547211j91513k05041k10981M45301Q223q1430J68367l75729k22133Q2649
3211A5964924K82232K75773L76560Q9932j02837r3878m9900K18514l25541j29081
3201A6506698K61984n3129j40288p1122J16290n17331L00960L06696q8003J39048
3191A6761803N7564K23102j55773R2648Q256p7905O249L32554R3373O0486M8727
3180A7451084J66099L4428j34989K5947k0644J77611K01339J83391k68714k2206
$$ plain form
3251 18560458 18601202 18270896 18274450 18022781 17859352 17949010 17407179 17257537 17294606 17464487
3241 17464487 17028075 16954318 17177101 16981486 16606758 16521446 16669323 16456178 16227787 16334614
3231 16334614 16686854 16237755 16072376 15922487 15636691 15742778 16334170 16231596 16211067 16547211
3221 16547211 16355698 16150657 15939676 16384977 16393200 16311770 16480137 16104408 15882275 15964924
3211 15964924 16247156 16522929 16899489 16989421 16886584 16792706 16742806 16961320 16635779 16506698
3201 16506698 16768682 16715553 16575265 16504143 16620433 16103102 16404062 16710758 16622755 16761803
3191 16761803 16819367 17042469 16886696 16979344 16987600 16909695 16915944 17248498 17341871 17402357 17451084
3180 17451084 17617183 17651611 17516622 17542569 17521925 17699536 17900875 18084266 17815552 17793346
3170A7793346M2940L04315O0512p3804L4956o14247O3190j54937k15117L23595
3160A7564749J42460L57097l20003n4711J38764p5927J25060K85873L93365j83213
3150A8373514k91795K79798L49732J70345k282K46708O56572J55920K4546K85075
3140B0248133K89752M7254J6059m7310O13895K11310k54344J6659j6137l58892
3130B0766379j99390l95204J71548j55146j00090k35493K8063M8450N0509O5944
3120B0045570K86034K86851o3913o2187j7243r5458r0881L80349k21858J41909
3110B0589173J56035L04436k07090K46467L3792J89356K96681n6142L92697R0384
3100B2035789k13134L11007J85126J59061L41394M81593L71587j47866J42067
$$ plain form
3170 17793346 17836286 18140601 18201113 18127309 18162265 17548018 17611208 17456271 17241154 17564749
3160 17564749 17707209 18064306 17744303 17689592 17828356 17752429 17877489 18163362 18556727 18373514
3150 18373514 18081719 18361517 18711249 18881594 18879312 19126020 19782592 19938512 19963058 20248133
3140 20248133 20537885 20585139 20601198 20553888 21167783 21379093 21124749 21141408 21125271 20766379
3130 20766379 20566989 20171785 20343333 20188187 20088097 19852604 19880667 19929117 19979626 20045570
3120 20045570 20331604 20618455 20554542 20492355 20475112 20379654 20288773 20669122 20447264 20589173
3110 20589173 20745208 21049644 20842554 21089021 21122813 21312169 21608850 21552708 21945405 22035789
3100 22035789 21822655 22133662 22318788 22477849 22819243 23300836 23672423 23524557 23666624
3091B3666624j7873j79841J5450J11555M30602p4410K09525K16335m0890K73436
3081B4610513k54828K99310K65618J46260O8841J84450J06566J16372J29772J05980
3071B5778854K11157J51313l2307K34351K62951O2039J83132J08337J74105K09000
3061B7342932M5287K06295M28953j4462N40448L45268K92176O08163L99086L97825
3051C0591971M63038L57652L18993M52228N73073N50204L47828J93961N44699
3042C4393647N09891L53187M99842O87326P72789K36216O16739Q51082O98008
3033C9618727O04261O88789O48792N49881P09961O25553K97723J91867N41900
3024D4477454J73176K32348l1506O68686Q95610K27132J65998N63221L93196P02412
$$ plain form
3091 23666624 23648751 23468910 23484360 23595915 24026517 23952107 24161632 24377967 24337077 24610513
3081 24610513 24355685 24654995 24920613 25066873 25135714 25320164 25426730 25543102 25672874 25778854
3071 25778854 25990011 26141324 26109017 26343368 26606319 26668358 26851490 26959827 27133932 27342932
3061 27342932 27388219 27594514 28023467 28009005 28549453 28894721 29186897 29795060 30194146 30591971
3051 30591971 31055009 31412661 31731654 32183882 32756955 33307159 33654987 33848948 34393647
3042 34393647 34903538 35256725 35756567 36443893 37216682 37452898 38069637 38920719 39618727
3033 39618727 40222988 40911777 41560569 42110450 42820411 43445964 43743687 43935554 44477454
3024 44477454 44650630 44882978 44851472 45520158 46415768 46642900 46808898 47372119 47765315 48467727
3014D8467727P18558N24548O50394K79071J21765N41874P46145N64188L20658
3005E2934928M72735R68152L11248N99025P47717O12327O91595M43370M88456
2996E8269553k1462l7267L70271L77912J37242P02839O18522P08681p8031N967
2986F1054227M22023j28516k52644L04562J17780O2899l3800K23227N50923L33772
2976F2654453M98702K75458Q79728O86600P26597J115866O45142J383755J683928
2967G0550229K103620K860055K703200L729370M481169N579314P142681Q173618
2959A07323256R032117J1220994J5040162K0456878K6165609L3940876L9592941
2952B62772833K3745498j9418912m1434964m0317211l1946067k0939088j5269914
$$ plain form
3014 48467727 49186285 49710833 50361227 50640298 50762063 51303937 52050082 52614270 52934928
3005 52934928 53407663 54375815 54687063 55286088 56033805 56646132 57337727 57781097 58269553
2996 58269553 58248091 58210824 58581095 58959007 59096249 59799088 60417610 61126291 61048260 61054227
2986 61054227 61476250 61347734 61095090 61399652 61517432 61580331 61546531 61769758 62320681 62654453
2976 62654453 63153155 63428613 64308341 64994941 65721538 66837404 67482546 68866301 70550229
2967 70550229 72653849 75513904 78217104 81946474 86427643 92006957 99149638 107323256
2959 107323256 116355373 127576367 142616529 163073407 189239016 223179892 262772833
2952 262772833 286518331 267099419 225664455 185347244 153401177 132462089 117192175
2945A17192175j2543012j0831300q657359p150504n265448m775985m227254l643629
2937F0097684k909085k463073k215330k470568j930817j981963j758712j904412
2929D2463724j304122j556980j212602r57340j024594j165405r96358p38406r44210
2920C2563707q23887n78406l19812p50675k04445l24560l59614j98715l85916
2911B8617677m34156j86210m86425o74465l17987m53162j52954r12600m31743
2902B4567975j36139k87075J7807Q6028j26888l47041k62746k7374m06928M4276
2892B3121895p823j21730J12294K62458L02558R5028M50J26286K90192m3961K68583
2881B4406230K12035K01010L10184m03960P64343J131440N63555Q79017P41793
$$ plain form
2945 117192175 104649163 93817863 85160504 78010000 72744552 67968567 63741313 60097684
2937 60097684 57188599 54725526 52510196 50039628 48108811 46126848 44368136 42463724
2929 42463724 41159602 39602622 38390020 37432680 36408086 35242681 34246323 33507917 32563707
2920 32563707 31739820 31161414 30841602 30090927 29886482 29561922 29202308 29003593 28617677
2911 28617677 28183521 27997311 27510886 26836421 26518434 26065272 25912318 24999718 24567975
2902 24567975 24431836 24144761 24162568 24248596 24121708 23774667 23511921 23484547 23077619 23121895
2892 23121895 23114072 22992342 23104636 23367094 23669652 23764680 23765130 23891416 24181608 24137647 24406230
2881 24406230 24618265 24819275 25129459 24725499 25489842 26621282 27184837 28063854 28805647
2872B8805647J066731J358740J430229K596984K778236L213669L753577M524931
2864D9528744O034504Q056221J0177029J3136977J3299494O120429n723197j3868587
2856H6761614j4038779j1624854q419250o280731m882302m120694l097111k501810
2848C1796083j919299k378564j700036j304818j355137m40814o01381o73418r21651
2839B0500965o73442o15931q32150o57049l89150l23351m39315p78768m57903
2830A5333906j56256j01549j77708k74589l15017k03413J00921k75368j71218
2821A3759709o08544l29453j87209j43126N1707j36513M0682m27200k59122K61997
2811A2022928l1175l24434p7499O9091n7981n93472J418j79043K05831J91789
$$ plain form
2872 28805647 29872378 31231118 32661347 35258331 38036567 41250236 45003813 49528744
2864 49528744 55563248 63619469 73796498 86933475 100232969 106353398 100630201 86761614
2856 86761614 72722835 61097981 52678731 46398000 41515698 37395004 34297893 31796083
2848 31796083 29876784 27498220 25798184 24493366 23138229 22697415 22096034 21422616 20500965
2839 20500965 19827523 19211592 18379442 17722393 17333243 17009892 16570577 15791809 15333906
2830 15333906 15177650 15076101 14898393 14623804 14308787 14105374 14206295 13930927 13759709
2821 13759709 13151165 12821712 12634503 12491377 12543084 12406571 12447253 12020053 11760931 12022928
2811 12022928 11991753 11667319 11589820 11658911 11600930 11007458 11008876 10829833 11035664 11227453
2801A1227453J47711J52181k32694M1291r092n3027n53431O8241R559O4998N4466
2790A0917656Q1909l8734k97095r9663j03849n9312j97851r1645L3974p9140k57947
2779I808303r796k65610j19676k8473j98272m3175l88876j11621L5039j4312j84449
2768H479082j15619J86981J17219J13747j25465k06038l38190m1117K44501R9594
2758H414695j60376j02445l7933k76928r5144M7092k07693K0197j66526P0186
2748G505125q6286m39672k72048j87701J85555j31394l14338l22062K04316k88768
2738E852727r8335j05204J38253K16533P6028q9137q6156k11679j59683P3973
2728E607320j03390M09469o5751J23438m4089R4636L5291r2785m6872j76318L795
$$ plain form
2801 11227453 11375164 11527345 11294651 11335942 11326850 11273823 10720392 10788633 10798192 10863190 10917656
2790 10917656 10999565 10960831 10663736 10564073 10460224 10400912 10203061 10111416 10145390 10066250 9808303
2779 9808303 9798507 9532897 9413221 9384748 9186476 9143301 8754425 8642804 8677843 8663531 8479082
2768 8479082 8363463 8550444 8667663 8781410 8655945 8449907 8111717 8070600 8315101 8414695
2758 8414695 8254319 8151874 8113941 7837013 7741869 7788961 7581268 7601465 7434939 7505125
2748 7505125 7418839 6979167 6707119 6519418 6704973 6573579 6259241 5937179 6141495 5852727
2738 5852727 5754392 5649188 5787441 6003974 6080002 5990865 5904709 5693030 5533347 5607320
2728 5607320 5503930 5913399 5847648 5971086 5926997 6021633 6056924 5964139 5917267 5740949 5744744
2717E744744k34291j26904Q4070L8130n0711R5200N0840j24251l98523R8044j6242
2706E160106l55933j38291K36789n670o0320L13001L00247j71117q6105k88628
2696D904079m1153j61041j70725R2516l43302J19867j33310N6138j17106J98706
2686D404669l6785j11838k44875k98710q3482J35007K38203k21851p3054K01425
2676C908709k38165j66058N5661J6091k23015K5978O4087J38880J26167J62714
2666C871049R7842p8749n8649j96314j80801k9254J56249q9086J86068l36285
2656C342070L1628n7312K91330L15702l19991n9097K15326k94912J49157K64854
2646C878755J59016Q7737j18880N8051k88255p1520l44703k61639j53761l1996
$$ plain form
2717 5744744 5510453 5383549 5467619 5505749 5455038 5550238 5601078 5476827 5078304 5176348 5160106
2706 5160106 4804173 4665882 4902671 4897001 4836681 5149682 5449929 5278812 5192707 4904079
2696 4904079 4862926 4701885 4531160 4623676 4280374 4400241 4266931 4323069 4205963 4404669
2686 4404669 4367884 4256046 4011171 3712461 3628979 3763986 4002189 3780338 3707284 3908709
2676 3908709 3670544 3504486 3560147 3576238 3353223 3379201 3443288 3582168 3708335 3871049
2666 3871049 3968891 3890142 3831493 3635179 3454378 3425124 3581373 3492287 3678355 3342070
2656 3342070 3373698 3316386 3607716 3923418 3603427 3544330 3759656 3464744 3613901 3878755
2646 3878755 4037771 4125508 4006628 4064679 3776424 3704904 3360201 3098562 2944801 2912805
2636B912805p3459K037j46465L63430q4p910j17856j4268n9293K20993j15299
2625B964631n12026j12468k67706L20384j06556n57J54527k18440l33362K97836
2615B186263J03810j84153P7525j29720K81373r1753l27076j02518K3197J75445
2605B012393o7559j47370l57643J36037o6202o0387r618K02275J12065m3456K07828
2594A918363j38266k39346J24676l29485K8923J46562k22359k4230j45578K68174
2584A387434J70525j91947j18742L80129J19970j43125l02853J04958K84234m74320
2574A216263M55889M9433l47120J96531j66419M34155k59950l6218L19464j80513
2564A681515r0787J168k37281L8201J93277L1301Q3664j31391K23399r5356k12837
$$ plain form
2636 2912805 2839346 2841383 2694918 3058348 3058264 3050354 2932498 2918230 2858937 3079930 2964631
2625 2964631 2452605 2340137 2072431 2392815 2286259 2285702 2440229 2221789 1888427 2186263
2615 2186263 2290073 2105920 2183445 2053725 2335098 2243345 1916269 1813751 1836948 2012393
2605 2012393 1944834 1797464 1439821 1575858 1509656 1449269 1439651 1641926 1753991 1710535 1918363
2594 1918363 1780097 1540751 1665427 1335942 1364865 1511427 1289068 1264838 1119260 1387434
2584 1387434 1557959 1366012 1247270 1627399 1747369 1604244 1301391 1406349 1690583 1216263
2574 1216263 1672152 1721585 1374465 1570996 1404577 1838732 1578782 1542564 1862028 1681515
2564 1681515 1590728 1591896 1354615 1392816 1586093 1617394 1701058 1569667 1793066 1697710 1484873
2553A484873J02631K1786k06230o3958J019K15385o2154j4538J30663J280R6722
2542A707479M1699j65071k49596N31424j44725o15943l2687J11591J60189j24554
2532A219806J40059O0986k16863J26607P2539j21709o7270k05253m8523K47044
2522A207423j47714j44731q1089k8318K28025O3399k68929J52636J79653P1176
2512A231531j39154m9572l8884j86481K11603K77997n1001R4006k16275n1486
2502A082284j297j7942J49077l51328l5685J99843J2254j20635J99468J36080
2492A252119J41948l87212j45803k0551j16348K51269J4792o1460J14893q3139
2482I60508k03044j06066j00697j3987J93519J02146O0079p1520M450P0699j00078
$$ plain form
2553 1484873 1587504 1609290 1403060 1339102 1340121 1555506 1493352 1478814 1609477 1610757 1707479
2542 1707479 1749178 1584107 1334511 1865935 1721210 1105267 1072580 1184171 1344360 1219806
2532 1219806 1359865 1420851 1203988 1330595 1403134 1281425 1214155 1008902 960379 1207423
2522 1207423 1059709 914978 833889 805571 1033596 1096995 828066 980702 1160355 1231531
2512 1231531 1092377 1042805 1003921 817440 1029043 1307040 1256039 1350045 1133770 1082284
2502 1082284 1080987 1063045 1212122 860794 825109 1024952 1037206 916571 1116039 1252119
2492 1252119 1394067 1006855 861052 840501 724153 975422 990214 928754 1043647 960508
2482 960508 757464 651398 550701 536714 730233 832379 892458 820938 825388 896087 796009
2471G96009N7726j28254J89609O9232j97895K28155m15508j25787K60498L6887
2461G70672N4600k84776j03272J57594j04571J18159j03439q3587J45209K7353
2451E93942p4412m6687j25956j61030K47615J7783R3269j38919j32201L06110
2441E79514l5874j28511K9180p4589L42190L97821j7925k82491m13188J91047
2431E87174J478m7711k6487l4104p568j50443j7823j47148n2232K7909J28699
2420B61744q7883J1563J06688K478L56318J424j49678r744k29704M43145O878
2409G13229k67481r2153j73733J32117L11360J30026j85126l66368j33232M4554
2399A13193q1185j62363L96819j31574M3225L6681k33808K19041J63731K25635
$$ plain form
2471 796009 853735 725481 915090 984322 786427 1014582 599074 473287 733785 770672
2461 770672 825272 540496 437224 594818 490247 608406 504967 421380 566589 593942
2451 593942 519530 472843 346887 185857 433472 451255 544524 405605 273404 579514
2441 579514 543640 415129 444309 369720 711910 1109731 1091806 809315 396127 587174
2431 587174 588652 540941 514454 480350 472782 322339 304516 157368 105136 133045 261744
2420 261744 173861 185424 292112 294590 650908 652332 502654 492910 263206 706351 713229
2409 713229 445748 353595 179862 311979 623339 753365 568239 201871 68639 113193
2399 113193 32008 -130355 266464 134890 178115 214796 -19012 200029 363760 589395
2389E89395n9657k08430j52481O442l0399N4179J34453q7509P8803p4347L74347
2378F24796K3805m20903R6269M1624N12970j56456j97845K41072j78711l07097
2368B79524J26732k41748J46487k9406J34418J98640l95174K60736q7821J52639
2358E45027J38549j41457O3759J30179j78364K35528r6522j53084j1520k38722
2348B93373L84123n1433p6431J3513J64841j64937k27251j30086L01874m0598
2338D66988j69204L84466k84871j31218p6457L65066j15136r9749j35419J75249
2328C79715L5868j66771j54255n158M54297j52875K20160P5608M133L0887N9659
2317G81268j6604L27020j25730J12234q9275j62919k42737M2754J56773m0421
$$ plain form
2389 589395 529738 321308 168827 175269 144870 199049 333502 245993 324796 250449 624796
2378 624796 648601 227698 323967 365591 878561 722105 524260 765332 586621 279524
2368 279524 406256 164508 310995 281589 416007 614647 219473 480209 392388 545027
2358 545027 683576 542119 605878 736057 557693 793221 696699 543615 532095 293373
2348 293373 677496 626063 549632 563145 727986 563049 335798 205712 507586 466988
2338 466988 297784 682250 397379 266161 189704 554770 439634 339885 204466 379715
2328 379715 415583 248812 94557 89399 543696 390821 610981 686589 690722 721609 781268
2317 781268 764664 1091684 965954 1078188 988913 825994 583257 626011 782784 742363
2307G42363L41112o8841m71068r9446M13588P7349J04323j79543L47431L1814
2297A239082M617l7682M5780K057L0703N8256k38383J57459N6049K67628j58867
2286A426699J29802J3002M117K1686J09218L16415m98335m79178p0454L48001
2276A320973R8453l58268j49945N21003K9907J16527j10975K48038L40457k52165
2266A804005R4865k08376J46322k77071k1484M19371j83332r7177q6682K10072
2256A800513L68026k73840p7258j95439J97880J20358J34584m3l41643L8565Q6991
2245A858694k049j21394L41699K07258j25788L5178R8792j89323l8501k9216J58537
2234B193887m65494j53487j13835J48181N63127J9962N8201m37732K50553K35023
$$ plain form
2307 742363 1083475 1014634 543566 444120 857708 935057 1039380 859837 1207268 1239082
2297 1239082 1243699 1206017 1251797 1253854 1284557 1342813 1104430 1261889 1317938 1585566 1426699
2286 1426699 1556501 1569503 1573620 1595306 1704524 2020939 1522604 1043426 972972 1320973
2276 1320973 1419426 1061158 911213 1432216 1462123 1578650 1467675 1715713 2056170 1804005
2266 1804005 1898870 1690494 1836816 1559745 1538261 1957632 1774300 1677123 1590441 1800513
2256 1800513 2168539 1894699 1817441 1622002 1819882 1940240 2074824 2074781 1733138 1771703 1858694
2245 1858694 1856645 1735251 2076950 2284208 2158420 2193598 2292390 2103067 2064566 2035350 2193887
2234 2193887 1728393 1574906 1461071 1609252 2172379 2192341 2250542 1812810 2063363 2298386
2224B298386q7981l04311k96047m2009J00022J639R6010j48509k37163P4661K62107
2213A716805k7755k13058Q699l11433L36270K13338l63384K8465N52813j0104
2203A930656k43271P6210r4152J59653P1537J78495k0957k81853j05341P0077
2193A741054J90814J60077J52884j29319k49371K62944L480j39261K42123k48961
2183A986464J54647n7974M5704K286j08441K08694N174j87128O1990k32927q883
2172A869606r12M2914p2758j6141J97353J18641K91026j028k15371M1826L69177
2161B624333r2208J79623j78235p9254K62026J962K58689Q2220J42988K24892
2151C427036j34794J34804j17035J66942J27787p84m6166J28300L369J07481L45691
$$ plain form
2224 2298386 2210405 1906094 1610047 1568038 1668060 1669699 1765709 1617200 1380037 1454698 1716805
2213 1716805 1689050 1475992 1484691 1173258 1509528 1722866 1359482 1387947 1940760 1930656
2203 1930656 1687385 1763595 1669443 1829096 1900633 2079128 2058171 1776318 1670977 1741054
2193 1741054 1931868 2091945 2244829 2115510 1866139 2129083 2132563 1993302 2235425 1986464
2183 1986464 2141111 2083137 2128841 2131127 2022686 2231380 2236554 2049426 2111416 1878489 1869606
2172 1869606 1868694 1911608 1838850 1822709 2020062 2138703 2429729 2428701 2213330 2255156 2624333
2161 2624333 2532125 2711748 2533513 2454259 2716285 2718247 2976936 3059156 3202144 3427036
2151 3427036 3292242 3427046 3310011 3476953 3604740 3603956 3557790 3686090 3689459 3796940 4142631
2140D142631L60295q3041K3260K61257M5649L86289n7654J07729K57598L1540
2130E475553K58263P13507r143L61524M08777J52246M80363M54407J82196K82908
2120H760601N92545K14354L15302M65058L77753N28873N79923Q76154O61566R56389
2110A4328518J200356J804604K204312K753763L282759K652235Q17492k498518
2102B6545521l537662l061448k354837j853667r57054j009367r11980q82124m63962
2093A1513420m85425l85401j86952L22181Q1396J20012J96474L9869M07468K82877
2083A1905919O81686N53471J323375J262897J444098J620709K067724K067041
2075B2926920K925345M067950N130031O386779O353383L393527l420231o816363
$$ plain form
2140 4142631 4502926 4419885 4443145 4704402 4750051 5136340 5078686 5186415 5444013 5475553
2130 5475553 5733816 6447323 6438180 6799704 7208481 7360727 7841090 8295497 8477693 8760601
2120 8760601 9353146 9567500 9882802 10347860 10725613 11254486 11834409 12710563 13372129 14328518
2110 14328518 15528874 17333478 19537790 22291553 25574312 28226547 29044039 26545521
2102 26545521 23007859 19946411 17591574 15737907 14780853 13771486 12859506 11977382 11513420
2093 11513420 11027995 10642594 10455642 10777823 10859219 10979231 11175705 11215574 11623042 11905919
2083 11905919 12587605 13141076 14464451 15727348 17171446 18792155 20859879 22926920
2075 22926920 25852265 29920215 35050246 41437025 47790408 51183935 47763704 40947341
2067D0947341o606165n692848l993098k371523k253451k039809j277997j061227
2059A5651223o27996p96543j33825o17297J78332l9773L18317Q46317N82922J067986
2049A6429663O43704O12691M59431j74666q92133l08378J17968N42343M90751
2040A7921374J293980J895097K216034K783741K175302j175292l237498l782706
2032B0090032l032519k399759j696870j237752j482907p94725j085577n99138
2024G760785l55538n96220o9995m17818m40588P9954n65454k78684m7701j90897
2014D877844l42733l59270k9241k57403j83913J1990j2316J56893l54398L6588
2004C544041q3056k59668j29091R6679k82962K55499j04753l00969R0872J0377
$$ plain form
2067 40947341 34341176 28648328 24655230 22283707 20030256 17990447 16712450 15651223
2059 15651223 15023227 14226684 14092859 13475562 13653894 13614121 13932438 14778755 15361677 16429663
2049 16429663 17073367 17686058 18145489 17970823 17078690 16770312 16888280 17430623 17921374
2040 17921374 19215354 21110451 23326485 26110226 28285528 27110236 23872738 20090032
2032 20090032 17057513 14657754 12960884 11723132 10240225 9445500 8359923 7760785
2024 7760785 7405247 6809027 6739032 6321214 5880626 5960580 5395126 5116442 5068741 4877844
2014 4877844 4535111 4175841 4146600 3889197 3705284 3717274 3704958 3861851 3507453 3544041
2004 3544041 3460985 3201317 3072226 3168905 2885943 3141442 3036689 2735720 2826592 2836969
1994B836969k11960k71402p4854P7304N209p13995K71893j57623O4103K9064J54528
1983B009236o7770J61340l5989K91K6903k30413j34802L2852J32702l04284j85376
1972A404690p0160K10502L9482k28830M79766Q8108k9115R0082k7044p0699l50996
1961A535786n595k6411J10390q3016k0966j91573o197N6482r2485k85953p2095
1950I18367J24176J15256J7455j9381k40334K75946K8658n7436J05703k00065
1940A068345P0652k94666J13176K22776j87789J1623J22384M4151j64343j07809
1930H98500K83987q6907l5196K16159l46699J2204N8493L07168k32457k4208M7515
1919A098559J77689j72375j2574j01432k41480K14543l44651L57868j16962J19341
$$ plain form
1994 2836969 2625009 2353607 2278753 2356057 2361266 1647271 1919164 1761541 1825644 1854708 2009236
1983 2009236 1941466 2102806 2066817 2067108 2094011 1863598 1728796 1761648 1894350 1590066 1404690
1972 1404690 1334530 1545032 1584514 1355684 1835450 1923558 1894443 1984525 1957481 1886782 1535786
1961 1535786 1530191 1503780 1614170 1531154 1510188 1318615 1312418 1368900 1276415 990462 918367
1950 918367 1042543 1157799 1175254 1155873 915539 1191485 1220143 1162707 1268410 1068345
1940 1068345 1138997 844331 957507 1180283 992494 1004117 1126501 1170652 1006309 898500
1930 898500 1182487 1095580 1060384 1276543 929844 942048 1000541 1307709 1075252 1051044 1098559
1919 1098559 1276248 1103873 1091299 989867 748387 962930 618279 976147 859185 978526
1909I78526j66864q0641j05127R3847p9192k88365P2634J13177m02808k38275
1899a03088K08367J885M7047j47796k24548J71176J05046J23438N2136M6167K53017
1888E32847j52933o7013r2488R0886J6173j77395k03466M83871j06416q1696L32057
1877E74427L07247j18483m94015K18500r5350k30141L9209J6071j10245j80141
1867g2921J79924N81617n04459j43827M50862m05335J51746m07262J76591J1207
1857A8143j01376J36835j29130n069p7318K14793J08827q1468N6778M1745j57855
1846B4905K90924j32371P1378M2949j66133k14157J49650r3001O0702l0606k0987
1835a6747N16711m15639P9423M85106N0234L820j16876J30369p6967k97403J089
$$ plain form
1909 978526 811662 731021 625894 719741 640549 352184 424818 537995 135187 -103088
1899 -103088 105279 107164 154211 6415 -218133 -46957 58089 181527 233663 279830 532847
1888 532847 379914 312901 220413 311299 327472 150077 -53389 430482 324066 242370 574427
1877 574427 881674 763191 269176 487676 392326 162185 201394 217465 107220 -72921
1867 -72921 107003 688620 184161 40334 491196 85861 237607 -169655 6936 18143
1857 18143 -83233 53602 -75528 -80597 -157915 56878 165705 84237 141015 182760 24905
1846 24905 315829 183458 254836 297785 131652 -82505 67145 -25856 34846 4240 -16747
1835 -16747 499964 84325 163748 648854 699088 702908 586032 716401 639434 342031 343120
1824C43120J28044K69235j13014j00143O3809q7987R5204j36893k27143j78868
1814E5364L80941j53939l094j09218O6734Q2651o8391K18940k7936K8407j67063
1803C03396J72057P6212J43386j36729J76610l42973K41269j07869j06387m8390
1793C70582o6996K14499p3780j30379N5926K09718J06468n9922n60130n9980o150
1782a44L13374n594l8905L51289k40136r1512K26495J85183J09913m15086r8710
1771B96167J34873j74894J40924R6025m8048L02292K37560k885n70493K24748
1761F36269R6553j50598m06276K28064J0700q9556J26577J15695m5622m40810
1751H0996p4518J57456J2389K63838J66220p2597J16873j77819j34208j74990
$$ plain form
1824 343120 471164 740399 627385 527242 591051 503064 598268 461375 234232 55364
1814 55364 436305 282366 279272 170054 236788 319439 251048 469988 442052 470459 303396
1803 303396 475453 551665 695051 558322 734932 391959 633228 525359 418972 370582
1793 370582 303586 518085 444305 313926 369852 579570 686038 626116 65986 6006 -144
1782 -144 313230 307636 268731 620020 379884 288372 514867 700050 809963 394877 296167
1771 296167 431040 256146 397070 493095 445047 747339 984899 982014 411521 636269
1761 636269 732822 582224 175948 404012 414712 325156 451733 567428 521806 80996
1751 80996 6478 163934 176323 440161 606381 533784 650657 472838 338630 163640
1741A63640J59762J07865N6191Q7476O6777J8021j61105P5342O7859j34195m9214
1730D58419m8587l03033j18941j09518k50740J74588j21790P2235m4931K53413
1720c8885k26324j76490P9995K51584P6718k4890J4258j35293j88066k055N07391
1709A37943J42581j60778l8407K06999o2964k5565j29791R6061k29428K38696
1699A75347J4213O0128J84182l65308R4935q0637k15860n7173J5395M2082J75219
1688D2523j16345j43707L9651k15059J3493J99606O881l2989J22323K47059k51193
1677h7757j91369j75270K70977o4071j8546k629k84660J3706K03887n8445L72200
1666b1977l6132k05974K2127j12820j73374p7597r533J35688K55734j50984j59253
$$ plain form
1741 163640 323402 431267 487458 574934 641711 659732 498627 573969 641828 507633 458419
1730 458419 409832 106799 -12142 -121660 -372400 -197812 -319602 -247367 -292298 -38885
1720 -38885 -265209 -441699 -361704 -110120 -33402 -58292 -44034 -179327 -367393 -369448 137943
1709 137943 280524 119746 81339 288338 225374 199809 70018 166079 -63349 175347
1699 175347 189560 249688 433870 68562 163497 82860 -133000 -190173 -174778 -132696 42523
1688 42523 -73822 -217529 -177878 -392937 -379444 -179838 -172957 -205946 -83623 163436 -87757
1677 -87757 -279126 -454396 -183419 -247490 -266036 -268665 -553325 -539619 -335732 -394177 -21977
1666 -21977 -58109 -264083 -241956 -354776 -528150 -605747 -615280 -479592 -223858 -374842 -534095
1655e34095q0493M0944k8541J23483J75199l69346N0680K38727J75266N1913k81131
1644d37394j21980M900J88241r4856M8440K3934j93056l08450K81427j65346m557
1633g78697P6967P6502J92213r3224k91334J76251L12951q8630m3880k00231k24932
1622h86044j68912j95678M48527J38247j33687J48880o1861K13150j28313P3991
1612e51700j17974J12771k52097k1372K60940m38193m0849O0903R6731N0546P011
1601h33283j63458M5428J04761k14942l52615K95461N4603R3052M8132K68541
1591f54320K9415j66769q1016J11665k4197k67911J77150j20174K11233p7486
1581h62410k77878J82898K42847O54o9581j45495M6369j39973K71420M7075k83947
$$ plain form
1655 -534095 -614588 -573644 -602185 -478702 -303503 -672849 -622169 -383442 -208176 -156263 -437394
1644 -437394 -559374 -554474 -366233 -461089 -412649 -388715 -581771 -890221 -608794 -774140 -778697
1633 -778697 -701730 -625228 -433015 -526239 -817573 -641322 -328371 -417001 -460881 -661112 -886044
1622 -886044 -1054956 -1250634 -802107 -663860 -797547 -648667 -710528 -497378 -625691 -551700
1612 -551700 -669674 -556903 -809000 -830372 -569432 -1007625 -1048474 -987571 -890840 -840294 -833283
1601 -833283 -996741 -951313 -846552 -1061494 -1414109 -1118648 -1064045 -970993 -922861 -654320
1591 -654320 -624905 -791674 -872690 -761025 -785222 -1053133 -875983 -996157 -784924 -862410
1581 -862410 -1140288 -957390 -714543 -713889 -783470 -928965 -882596 -1022569 -751149 -704074 -988021
1570i88021K04490J25909K21048l2054j34510k18060q911m4194p4792J97796p5883
1559h27182J02275j62117n9331o4788M2942k8361K41576K44615m3923k30064j10011
1548h94369P6634k41017J02496k61310J67557n3212L02866j06932j67534k66790
1538a341611J58101K23484j17959K52066k06099j04739j05509n2829J47874K459
1528a144762q195L39332q1373J20572n71180J40687K2601L3387J8579j61788j3525
1517a305665p9342K49313L00056N5891L6148J71119j78614j28244j25841J13725
1507h91454k94184O3986R1732N5290L8483j8403j3439L47115l2351l05186K1432
1496i36979R8705K26184q7437j52850k55936n0081k9712L4521n3878J81445J64982
$$ plain form
1570 -988021 -783531 -657622 -436574 -468628 -603138 -821198 -830109 -874303 -949095 -751299 -827182
1559 -827182 -724907 -887024 -946355 -1011143 -968201 -996562 -754986 -510371 -554294 -784358 -894369
1548 -894369 -817735 -1058752 -956256 -1217566 -1050009 -1103221 -800355 -907287 -1074821 -1341611
1538 -1341611 -1183510 -960026 -1077985 -825919 -1032018 -1136757 -1242266 -1295095 -1147221 -1144762
1528 -1144762 -1152957 -813625 -894998 -774426 -1345606 -1204919 -1182318 -1148931 -1130352 -1292140 -1305665
1517 -1305665 -1385007 -1135694 -835638 -779747 -743599 -572480 -751094 -879338 -1005179 -891454
1507 -891454 -1185638 -1121652 -1029920 -974630 -936147 -954550 -967989 -620874 -653225 -958411 -936979
1496 -936979 -838274 -612090 -699527 -852377 -1108313 -1158394 -1188106 -1153585 -1207463 -1026018 -861036
1485h61036j67450o902r6162P3713j51283M5794J76444N3073J97884l18347J63347
1474h90925K18415n5661j32513j16915K82586J46382l20028q576M9231L31085
1464d96919k44443r3230P9105r383Q4211k10324Q4112l1827L32748j63931J81415
$$ plain form
1485 -861036 -1028486 -1035388 -1131550 -1057837 -1209120 -1163326 -986882 -933809 -735925 -1054272 -890925
1474 -890925 -672510 -728171 -860684 -977599 -695013 -548631 -868659 -877235 -828004 -496919
1464 -496919 -741362 -834592 -755487 -764870 -680659 -890983 -806871 -838698 -505950 -669881 -488466
$$ [...]
##END NTUPLES=NMR SPECTRUM
##END=
