##TITLE=1H_TG-2309-6
 DMSO, 8 sc, 
 15.12.2020
##JCAMPDX= 6.0         $$ Bruker NMR JCAMP-DX V2.0
##DATA TYPE= NMR SPECTRUM
##DATA CLASS= NTUPLES
##ORIGIN= UXNMR, Bruker Analytische Messtechnik GmbH
##OWNER= root
$$ XWIN-NMR		Version 3.5
$$ Tue Dec 15 11:42:38 2020 Russian Standard Time (UT+4h)  she@DPX200
##.OBSERVE FREQUENCY= 200.1315066352
##.OBSERVE NUCLEUS= ^1H
##.ACQUISITION MODE= SIMULTANEOUS
##.ACQUISITION SCHEME= undefined
##.AVERAGES= 8
##.DIGITISER RES= 18
##SPECTROMETER/DATA SYSTEM= spect
##.PULSE SEQUENCE= zg30
##.SOLVENT NAME= DMSO
##.SHIFT REFERENCE= (INTERNAL, DMSO, 0, 15.9833)
##AUDIT TRAIL= $$ (NUMBER, WHEN, WHO, WHERE, WHAT)
$$ ##TITLE= Audit trail, XWIN-NMR		Version 3.5
$$ ##JCAMPDX= 5.01
$$ ##ORIGIN= Bruker BioSpin GmbH
$$ ##OWNER= she
$$ F:/spectra/data/she/nmr/H-F/1/pdata/1/auditp.txt
$$ ##AUDIT TRAIL=  $$ (NUMBER, WHEN, WHO, WHERE, WHAT)
(   1,<2020-12-15 11:40:33.75 +0400>,<she>,<DPX200>,
      <created by zg, POWCHK disabled, PULCHK disabled
       configuration hash MD5:
       00 E9 B6 7A A2 85 ED C7 34 08 36 98 17 FE 4E 26
       data hash MD5: 16K
       B9 F5 E7 9F 07 5F 9F 28 78 76 E6 D2 D6 1E DA 9D>)
(   2,<2020-12-15 11:40:36.39 +0400>,<she>,<DPX200>,
      <Start of raw data processing
       efp BC_mod = 2 LB = 0.24 FT_mod = 6 PKNL = 1 PHC0 = -10752.67 PHC1 = 6.20089 SI = 16K 
       data hash MD5: 16K
       CE 4F F4 1A 96 92 82 15 D5 36 A6 50 B5 F3 31 55>)
(   3,<2020-12-15 11:40:59.85 +0400>,<she>,<DPX200>,
      <pk PHC0 = -16.4591 PHC1 = 15.8 
       data hash MD5: 16K
       EA D7 18 9A 55 74 C7 95 75 56 89 B4 71 E0 1E 73>)
(   4,<2020-12-15 11:41:03.20 +0400>,<she>,<DPX200>,
      <abs ABSG = 5 
       data hash MD5: 16K
       66 DC 6E 4B 66 5D E7 DA B0 B1 64 9C A2 85 08 6C>)
$$ ##END=
$$ 
$$ hash MD5
$$ 7F 21 08 00 AA D7 6F E5 41 4D DD 9D F0 58 34 8F
##$RELAX= 
##$RELAX= 
##$RELAX= 
##$RELAX= 
##$RELAX= 
##$RELAX= 
$$ Bruker specific parameters
$$ --------------------------
##$DU= <F:/spectra>
##$EXPNO= 1
##$NAME= <H-F>
##$PROCNO= 1
##$TYPE= <nmr>
##$USER= <she>
##$AMP= (0..31)
100 100 100 100 100 100 100 100 100 100 100 100 100 100 100 100 100 100 
100 100 100 100 100 100 100 100 100 100 100 100 100 100 
##$AQSEQ= 0
##$AQ_mod= 1
##$AUNM= <au_zg>
##$AUTOPOS= <>
##$BF1= 200.13
##$BF2= 200.13
##$BF3= 200.13
##$BF4= 200.13
##$BF5= 200.13
##$BF6= 200.13
##$BF7= 200.13
##$BF8= 200.13
##$BYTORDA= 1
##$CFDGTYP= 0
##$CFRGTYP= 5
##$CHEMSTR= <none>
##$CNST= (0..31)
1 1 145 1 1 1 1 1 1 1 1 1 1 1 1 1 1 1 1 1 1 1 1 1 1 1 1 1 1 1 1 1 
##$CPDPRG= <>
##$CPDPRG1= <>
##$CPDPRG2= <>
##$CPDPRG3= <>
##$CPDPRG4= <mlev>
##$CPDPRG5= <mlev>
##$CPDPRG6= <mlev>
##$CPDPRG7= <mlev>
##$CPDPRG8= <mlev>
##$CPDPRGB= <>
##$CPDPRGT= <>
##$D= (0..31)
0 1.2 0 0 0 0 0 0 0 0.06 0 0.03 0 0 0 0 0.0002 0 0 0 0 0 0 0 0 0 0 0 0 
0 0 0 
##$DATE= 1608018033
##$DBL= (0..7)
120 120 120 120 120 120 120 120 
##$DBP= (0..7)
150 150 150 150 150 150 150 150 
##$DBP07= 0
##$DBPNAM0= <>
##$DBPNAM1= <>
##$DBPNAM2= <>
##$DBPNAM3= <>
##$DBPNAM4= <>
$$ [...]
##$SUBNAM3= <"">
##$SUBNAM4= <"">
##$SUBNAM5= <"">
##$SUBNAM6= <"">
##$SUBNAM7= <"">
##$SUBNAM8= <"">
##$SUBNAM9= <"">
##$SW= 16.9725356469052
##$SWIBOX= (0..15)
0 0 2 0 0 0 0 0 0 0 0 0 0 0 0 0 
##$SW_h= 3396.73913043478
##$TD= 16384
##$TD0= 1
##$TE= 0
##$TE2= 300
##$TE3= 300
##$TEG= 300
##$TL= (0..7)
0 120 120 120 120 120 120 120 
##$TP= (0..7)
150 150 150 150 150 150 150 150 
##$TP07= 0
##$TPNAME0= <>
##$TPNAME1= <>
##$TPNAME2= <>
##$TPNAME3= <>
##$TPNAME4= <>
##$TPNAME5= <>
##$TPNAME6= <>
##$TPNAME7= <>
##$TPOAL= (0..7)
0.5 0.5 0.5 0.5 0.5 0.5 0.5 0.5 
##$TPOFFS= (0..7)
0 0 0 0 0 0 0 0 
##$TUNHIN= 0
##$TUNHOUT= 0
##$TUNXOUT= 0
##$USERA1= <user>
##$USERA2= <user>
##$USERA3= <user>
##$USERA4= <user>
##$USERA5= <user>
##$V9= 5
##$VALIST= <valist>
##$VCLIST= <CCCCCCCCCCCCCCC>
##$VD= 0
##$VDLIST= <DDDDDDDDDDDDDDD>
##$VPLIST= <PPPPPPPPPPPPPPP>
##$VTLIST= <TTTTTTTTTTTTTTT>
##$WBST= 1024
##$WBSW= 4
##$XGAIN= (0..3)
0 0 0 0 
##$XL= 0
##$YL= 0
##$YMAX_a= 382032
##$YMIN_a= -273480
##$ZGOPTNS= <>
##$ZL1= 120
##$ZL2= 120
##$ZL3= 120
##$ZL4= 120
##$ABSF1= 15.98335
##$ABSF2= -0.9893122
##$ABSG= 5
##$ABSL= 3
##$ALPHA= 0
##$AQORDER= 0
##$ASSFAC= 0
##$ASSFACI= 0
##$ASSFACX= 0
##$ASSWID= 0
##$AUNMP= <proc_1d>
##$AZFE= 0.1
##$AZFW= 0.1
##$BCFW= 0
##$BC_mod= 2
##$BYTORDP= 0
##$COROFFS= 0
##$CY= -3
##$DATMOD= 1
##$DC= 0
##$DFILT= <>
##$DTYPP= 0
##$F1P= 0
##$F2P= 0
##$FCOR= 1
##$FTSIZE= 16384
##$FT_mod= 6
##$GAMMA= 0
##$GB= 0
##$INTBC= 1
##$INTSCL= 2.992141e-10
##$ISEN= 128
##$LB= 0.24
##$LEV0= 0
##$LPBIN= 0
##$MAXI= 10000
##$MC2= 0
##$MEAN= 0
##$ME_mod= 0
##$MI= 1.114404
##$NCOEF= 0
##$NC_proc= -5
##$NLEV= 6
##$NOISF1= 3.799351
##$NOISF2= 2.8
##$NSP= 0
##$NTH_PI= 0
##$NZP= 0
##$OFFSET= 15.98335
##$PC= 1
##$PHC0= -10769.13
##$PHC1= 22.00089
##$PH_mod= 1
##$PKNL= yes
##$PPARMOD= 0
##$PSCAL= 0
##$PSIGN= 0
##$REVERSE= no
##$SF= 200.130006257245
##$SI= 16384
##$SIGF1= 3
##$SIGF2= 2
##$SINO= 5.538805
##$SIOLD= 16384
##$SREGLST= <1H.CDCl3>
##$SSB= 0
##$STSI= 16384
##$STSR= 0
##$SW_p= 3396.73913043478
##$SYMM= 0
##$S_DEV= 0
##$TDeff= 16384
##$TDoff= 0
##$TI= <>
##$TILT= no
##$TM1= 0
##$TM2= 0
##$TOPLEV= 0
##$USERP1= <user>
##$USERP2= <user>
##$USERP3= <user>
##$USERP4= <user>
##$USERP5= <user>
##$WDW= 1
##$XDIM= 16384
##$YMAX_p= 355960479
##$YMIN_p= -448180
$$ End of Bruker specific parameters
$$ ---------------------------------
##NTUPLES= NMR SPECTRUM
##VAR_NAME=  FREQUENCY,     SPECTRUM/REAL,   SPECTRUM/IMAG
##SYMBOL=    X,             R,               I
##VAR_TYPE=  INDEPENDENT,   DEPENDENT,       DEPENDENT
##VAR_FORM=  AFFN,          ASDF,            ASDF
##VAR_DIM=   16384,         16384,           16384
##UNITS=     HZ,            ARBITRARY UNITS, ARBITRARY UNITS
##FACTOR=    0.207333158178281, 1,           1
##FIRST=     3198.74789550772, 0,            0
##LAST=      -197.991234927058, 0,           0
##MIN=       -197.991234927058, -448180,     0
##MAX=       3198.74789550772, 355960479,    0
$$ Real data points
##PAGE= N=1
##DATA TABLE= (X++(R..R)), XYDATA
$$ [...]
7460B160194n4117q5179j82566k5062K39865p5841K2673P6578n1650j25109J02190
7449B001976o820m6517J3779n4907k5861n0764r5449k7950R300j31618J7899j978
7437A601090j74966N6622m5357l6555J1203J13079K2581m8270l3344o3842O6646
7426A468887j75576l8579M8064j3332k3408J0469j4950l3376L201K2814l664L6333
7414A286883r5908n8506n1580m5361p3720P4374m6676Q7826j41179J05331L4990
7403A076474j37246J3029M5107o1175L108P1906j52467J10276J5332j04607R3844
7392I73581k14096k45104O5464k4967M8198J09433p2166j22819N3595J5317p551
7381E78885J0474o76l9838k9994l1302K7127K7277k5279n0107J12100q851m9097
$$ plain form
7460 2160194 2106077 2020898 1838332 1813270 2053135 1977294 1999967 2076545 2024895 1899786 2001976
7449 2001976 1995156 1948639 1962418 1907511 1881650 1830886 1735437 1707487 1716787 1585169 1603068 1601090
7437 1601090 1426124 1482746 1437389 1400834 1412037 1525116 1547697 1499427 1466083 1402241 1468887
7426 1468887 1293311 1254732 1302796 1289464 1266056 1276525 1261575 1228199 1231400 1254214 1250550 1286883
7414 1286883 1190975 1132469 1080889 1035528 961808 1036182 989506 1077332 936153 1041484 1076474
7403 1076474 939228 952257 997364 936189 939297 1011203 858736 969012 984344 879737 973581
7392 973581 759485 514381 579845 554878 603076 712509 640343 517524 571119 586436 578885
7381 578885 589359 588683 548845 518851 487549 514676 541953 516674 466567 578667 569816 520719
7369E20719m9834n8300k2230N3803j35403k0108P7358l751o3722J7341n9499P3819
7357C30193o5739J7363J38626p2590j12439Q1030m0959m6483P2198R8673M2949
7346D42822O834n6401n3535j16328r2371K4537L0585N365n7297L1279p9476J04293
7334A90307Q8194P6435j0991j25367m216N5231K9814p1171o3904l7664l3263N1561
7322A44966k9939J44407j19567j24044M3420J90329R70l1061j19449n9641P6976
7311A17367o2366n0111J54964R0153j15135n0428K8792J29462P3012j35815n4755
7300A25140N4211O5296R2307j45641j36011m2564J01958p5512j1689N350M7623
7289H0468k4144q4168L0074J4154n4349M886J81501N097r7785M9713l8158P312
$$ plain form
7369 520719 470885 412585 390355 444158 308755 288647 366005 362254 298532 315873 256374 330193
7357 330193 264454 281817 420443 347853 235414 316444 275485 229002 301200 399873 442822
7346 442822 449656 393255 339720 223392 131021 155558 186143 191508 134211 165490 86014 190307
7334 190307 278501 354936 343945 218578 214362 269593 299407 228236 164332 126668 93405 144966
7322 144966 115027 259434 139867 15823 59243 249572 250542 219481 100032 40391 117367
7311 117367 55001 4890 159854 250007 134872 84444 113236 242698 315710 179895 125140
7300 125140 179351 244647 336954 191313 55302 12738 114696 39184 27495 32845 80468
7289 80468 56324 -27844 2230 16384 -37965 -33079 148422 153519 55734 105447 67289 74601
7277G4601j960P346K8254Q4044m5607j57729q1482j9023P957l2360N5067Q0915
7265B3N1164j8365P8001L6383K6673j02270l9838j1701K3931M7156j8998j54496
7253h2337J9241L3805N4541o0501L2024N8430o9614q511J49507j8010r7439M8895
7241F0031p7473P574K6542R305K34l3838Q0153P2753j21665Q5483K2808j13281
7229A8626j5559J18931P2322j04942j44434j183R0256M0390p0953j72184j8116
7218a86846Q8922l3369Q3270J45693L2954q2261j33192O8672J49673q237m2627
7207H2652r637j04460n3442J29219l1689M570o9495P0417o6011K5509j3947p738
7195d4052N5829q7461M8554K0792J34302O326L3482j69231l2229J03439l88J12213
$$ plain form
7277 74601 72641 79987 108241 192285 146678 -11051 -92533 -111556 -103599 -135959 -80892 23
7265 23 51187 32822 110823 147206 173879 71609 31771 20070 44001 91157 72159 -82337
7253 -82337 -63096 -29291 25250 -35251 -3227 55203 -14411 -22922 126585 108575 11136 60031
7241 60031 -17442 -9868 16674 25979 26213 -7625 72528 145281 23616 109099 131907 18626
7229 18626 3067 121998 194320 89378 -55056 -56239 34017 74407 3454 -168730 -186846
7218 -186846 -97924 -131293 -48023 97670 130624 48363 -84829 -16157 133516 125279 82652
7207 82652 73015 -31445 -84887 44332 12643 17213 -52282 18135 -47876 -22367 -36314 -44052
7195 -44052 11777 -75684 -27130 -6338 127964 134290 167772 -1459 -33688 69751 69363 181576
7183A81576l353j64776j6334J03945j58924j38298O0978Q4930J11601o3578L6990
7172C4757M3703j10383L8053Q5128j05554Q5716J63630k23106j65300J20706m0853
7161g3503q5705o8023J25054N6407M7689j8138J27337j59544j03446J73343m8327
7150b6856P3841K2818o9000o0207J13176m4891m4582l4000j9640m2185r2906L3070
7138a91362J78925q0690m9462J19378n6980q2493K81694j87916p0273P9482J47554
7127H7857n9363j13000L9852O3274j05736j01090J21806r6492j62973K01718K1674
7116a02473p6808K7995J15366P2431p5094l8870p4053M3093K1223J08814r9360
7105g7736p6428J79429N4571r3509o1114J3012N8182n8049n4241R1874m2357j2874
$$ plain form
7183 181576 178223 13447 -2887 101058 -57866 -196164 -135186 -50256 61345 -2233 34757
7172 34757 78460 -31923 6130 91258 -14296 71420 235050 11944 -153356 -32650 -73503
7161 -73503 -159208 -227231 -102177 -45770 1919 -16219 111118 -48426 -151872 21471 -26856
7150 -26856 46985 69803 803 -59404 53772 8881 -35701 -69701 -89341 -131526 -224432 -191362
7138 -191362 -12437 -93127 -142589 -23211 -80191 -162684 119010 -68906 -139179 -59697 87857
7127 87857 28494 -84506 -44654 18620 -87116 -188206 -66400 -162892 -325865 -124147 -102473
7116 -102473 -179281 -151286 -35920 36511 -38583 -77453 -151506 -108413 -87190 21624 -77736
7105 -77736 -154164 25265 79836 -13673 -74787 -61775 -3593 -61642 -115883 -24009 -66366 -79240
7093g9240P2765q8410J37973r5520l1390l8049k8317K9805J2624P0774j18533
7082a55518p752O9349j2162N1589j4027Q2423n8274p1007K7641J00227j31388
7071a18899j68315L8186K08861P184o6045p2225m7067M7637k3901O144P2974J1137
7059a04329J4458j60886L4267N4242r502l1916j06493J61330P5517k9309M816
7048i7805J28850j16120l6707J14698r3349P4356l7487j41441R7664J5162K0705
7037g1474L623q6733l316J37117j35378j09225N7126J23056k6182l3063J09699
7026c4750q1653J4528M4295M1269j54521M0701L0966k5036j9869j34201L9725
7015b38546j7401j3712K44113K7718j46089K9615P7821j53426p1795J6409m966
$$ plain form
7093 -79240 -6475 -94885 43088 -52432 -83822 -121871 -150188 -120383 -107759 -36985 -155518
7082 -155518 -163270 -93921 -106083 -54494 -68521 13902 -44372 -115379 -87738 12489 -118899
7071 -118899 -287214 -249028 -40167 -32983 -99028 -171253 -218320 -170683 -194584 -188440 -115466 -104329
7059 -104329 -89871 -250757 -216490 -162248 -171750 -203666 -310159 -148829 -73312 -102621 -97805
7048 -97805 31045 -85075 -121782 -7084 -100433 -26077 -63564 -205005 -107341 -92179 -71474
7037 -71474 -67851 -154584 -157900 -20783 -156161 -265386 -208260 -85204 -111386 -144449 -34750
7026 -34750 -116403 -101875 -57580 -16311 -170832 -130131 -99165 -124201 -144070 -278271 -238546
7015 -238546 -255947 -269659 -25546 2172 -143917 -114302 -36481 -189907 -261702 -245293 -250259
7004b50259K14104n1740p9370O18M0492j9919R7085j51030m1421R1995M0460o4529
6992a73514O4438N3345q7921O2794q8453j16382J76265p6550j4924L912O358J7273
6980a73359R3387M9384j85995r1937K6436N6383j3484K0980O9787m3497N2309
6969a39606Q4108q6832Q8104n3562k3649L9871j31825l4127J18328j17997M123
6958b53064R566o2509j42173P4797N0270J28922Q6814M3494l479j17301q6903
6947b71566j3740Q0338J01747l4777p4810q678J09727J10016n8960O1125n7359
6936e6937o1890L998q999j9565L3431j56406o2916P6499K0198p218L5258O2667
6924a41880j09307R0746P571k0521L60q3134K0771N522N5362r34O8750q6170n0570
$$ plain form
7004 -250259 -36155 -87895 -167265 -166647 -126155 -146074 -48989 -200019 -241440 -149445 -108985 -173514
6992 -173514 -109076 -55731 -143652 -80858 -169311 -285693 -109428 -185978 -200902 -196990 -190632 -173359
6980 -173359 -79972 -30588 -216583 -308520 -282084 -225701 -239185 -218205 -148418 -191915 -139606
6969 -139606 -55498 -142330 -54226 -107788 -131437 -91566 -223391 -257518 -139190 -257187 -253064
6958 -253064 -243498 -306007 -448180 -373383 -323113 -194191 -107377 -63883 -67362 -184663 -271566
6947 -271566 -285306 -204968 -103221 -137998 -212808 -221486 -111759 -1743 -60703 422 -56937
6936 -56937 -118827 -114829 -123828 -143393 -109962 -266368 -329284 -252785 -232587 -239805 -204547 -141880
6924 -141880 -251187 -160441 -152870 -173391 -173031 -256165 -235394 -229872 -174510 -175444 -106694 -192864 -243434
6911b43434R0290j3811l309k6090j0954M5512m2110M6659m9603r5440j6246N3360
6899b65176L6413R6234k1828p3044k950M9875l512m8658O8507J22205O2964r5618
6887g4588k6680J02959r7010p3840j611n1924L801R2042J15412o7457m978j51242
6875b35116n4681R7766l6322p4508q592K48480J01475q1445j5938K4530j11208
6864a45559o0884J6735j9467L8406R1895m2251o2801r6552Q82J8029j756P2020
6852a91303O8148j23084l3129J73867l626j27151J2922J1884L6467M4487n8027
6841a88545k7069K6598j3275R2807j8789l7705J58181r5162p4581R083L3764r8780
6829b33473L9082p817o6844N5852k39l2073N9740O2061k8768p5449Q6491l1180
$$ plain form
6911 -243434 -153144 -166955 -170264 -196354 -207308 -161796 -203906 -157247 -206850 -302290 -318536 -265176
6899 -265176 -228763 -132529 -154357 -227401 -230351 -180476 -183988 -232646 -164139 -41934 21030 -74588
6887 -74588 -101268 1691 -95319 -169159 -170770 -222694 -218893 -126851 -11439 -78896 -83874 -235116
6875 -235116 -289797 -192031 -228353 -302861 -311453 -62973 38502 -42943 -58881 -34351 -145559
6864 -145559 -206443 -189708 -209175 -170769 -78874 -121125 -183926 -280478 -279596 -261567 -263323 -191303
6852 -191303 -123155 -246239 -279368 -105501 -109127 -236278 -223356 -211472 -175005 -130518 -188545
6841 -188545 -215614 -189016 -202291 -109484 -128273 -165978 -7797 -102959 -177540 -168457 -134693 -233473
6829 -233473 -194391 -202208 -269052 -213200 -213439 -245512 -185772 -123711 -152479 -227928 -141437 -172617
6817a72617k9429r040J3923L2299Q0146j00800R686k2534J06344J4490K0498n7799
6805a14833K5605K3203j41150m0736J50709o4632M2579J1904k0824r3401R6315
6794a25261J2048r8422J74093k8595q6169L1900J54766q2939j69370m5377J78575
6783h4751J187n0528L1764J50458j91864R262J20588j6282j46490Q0038k4729
6772a21347L724l0496M8160L1047j1062K6L1129L5813j02741R869j28218p1913
6760c06009J7705J2609K4231M7797K7805N1141J66617P168k05758N6299M1478
6749e8917l3122n8405M8722N8573q4083l2934J05880o5637o5067p047o8553p2831
6737c33421K11733J70068j05892J7730O8888M4448j27564j25545P319k4444l6138
$$ plain form
6817 -172617 -202046 -211086 -197163 -164864 -84718 -185518 -175832 -198366 -92022 -77532 -57034 -114833
6805 -114833 -89228 -66025 -207175 -247911 -97202 -161834 -119255 -107351 -128175 -221576 -125261
6794 -125261 -113213 -211635 -37542 -66137 -152306 -120406 34360 -48579 -217949 -263326 -84751
6783 -84751 -83564 -134092 -102328 48130 -143734 -134472 -13884 -30166 -176656 -96618 -121347
6772 -121347 -117623 -148119 -99959 -68912 -79974 -79948 -48819 -13006 -115747 -105878 -234096 -306009
6760 -306009 -288304 -275695 -251464 -203667 -175862 -124721 41896 49064 -156694 -100395 -58917
6749 -58917 -92039 -150444 -101722 -43149 -127232 -160166 -54286 -119923 -184990 -192037 -260590 -333421
6737 -333421 -121688 48380 -57512 -39782 29106 73554 -54010 -179555 -172236 -196680 -232818
6726b32818J73060j09127p799L7259l6497J20098j3557r4264J31053P8051o7052
6715b1593q2024j5291O0214J2996j21500J9780J4248o6772M5236L9899k6218L0268
6703a10757J77214K4673j89616l1492O2614J8327m4001q1123P7135P4679j25032
6692a47379P1505j2623j10047O5399J3259M7871K3044J6846l0900O4441l4666
6681c3250J40792m246k29889Q2343m3932n0925O8342m4464L0937P676n6885J26984
6669f517L0281j22201J15673O6852j16598K6796L3765j7984o5337l9298k0740
6658a15308R0646j11388L9933L5820r1708M2786L2876Q5861O4353K35O4356j8170
6646A20292L1986j06334p8058J8595J11199j02621j44953q128m3884N5232Q9962
$$ plain form
6726 -232818 -59758 -168885 -176684 -139425 -175922 -55824 -69381 -163645 -32592 45459 -21593
6715 -21593 -103617 -118908 -58694 -45698 -167198 -147418 -133170 -199942 -154706 -114807 -141025 -110757
6703 -110757 66457 91130 -98486 -129978 -67364 -49037 -93038 -174161 -97026 -22347 -147379
6692 -147379 -75874 -88497 -198544 -133145 -119886 -72015 -48971 -32125 -63025 1416 -33250
6681 -33250 107542 103296 -126593 -44250 -88182 -139107 -70765 -115229 -84292 -76616 -133501 -6517
6669 -6517 23764 -98437 17236 84088 -32510 -5714 28051 10067 -55270 -94568 -115308
6658 -115308 -24662 -136050 -96117 -60297 -152005 -109219 -76343 9518 73871 74106 138462 120292
6646 120292 152278 45944 -32114 -13519 97680 -4941 -149894 -158022 -201906 -146674 -56712
6635e6712O6948p9872K1646J95487m351j9147j3189N5251j8219j07703m0584J2508
6623A2063q7255o7128J08739n1716O0460P02n6071l9584K70458N0980N0845j5082
6611B37411Q714j7108p7233j47788N2381n4243j2949J0727J8643M3923J03662
6600A66140k3763R055o968J849M7663O6799n0633o5253Q6565k5911K9389j6346
6588B18586p1119k2615m7638K7583M1609k9153L5249Q2762R1154k7415j43783
6577A55220N9817Q8981j49388j18771K9992J9759K921r1445K961J04342J10604
6566B14993N2652r4063j2470J85621j22757r7803O20L3416O8009m4569O951j999
6554A88601q7394K987j0341K6012j00356q386K8798J5066N5891J293P9922m3949
$$ plain form
6635 -56712 10236 -69636 -47990 147497 143146 123999 110810 166061 147842 40139 -445 12063
6623 12063 -75192 -142320 -33581 -85297 -24837 -24135 -80206 -119790 150668 201648 252493 237411
6611 237411 246125 229017 151784 3996 56377 2134 -10815 -88 18555 62478 166140
6600 166140 142377 151432 144464 146313 193976 260775 210142 144889 231454 205543 234932 218586
6588 218586 147467 124852 77214 104797 146406 117253 152502 235264 326418 299003 155220
6577 155220 215037 304018 154630 35859 65851 85610 88531 -2914 47 104389 214993
6566 214993 267645 173582 161112 346733 223976 126173 126793 160209 228218 183649 190600 188601
6554 188601 101207 104194 93853 119865 19509 11123 39921 54987 110878 112171 192093 148144
6542A48144J16422N3790o5899n9611L3204L2747K0150j07932o4357R7820J5311
6531B19789j06749L5302J45622J9762j31300O1269O1282J5652m0754J04747j1874
6520C72748J47944l4991j06411M1097p930K1462J613j55664J14691P3005o7251
6509D00313j58885j2104K2351L8054L372j3286M4157j4544l9258O0393K7179Q8856
6497D46598K7949L1919k4862k5774l231p1185l9075J26932j0972M5031k0105k2612
6485D60613J4974j19406j19565J68697J88418j45894P249L2988m8300r344n1711
6474C78719L9083J18459k4236O530l4952K1950Q8860q1895Q086J7751o8876q3089
6462C86390o5461Q6324J15716P3147k4846J9512j1773N271K1075k1727l009Q6410
$$ plain form
6542 148144 264566 318356 252457 192846 226050 258797 278947 171015 106658 204478 219789
6531 219789 113040 148342 293964 313726 182426 243695 304977 320629 279875 384622 372748
6520 372748 520692 485701 379290 420387 412457 433919 435532 279868 394559 467564 400313
6509 400313 241428 229324 251675 289729 293101 279815 323972 309428 270170 330563 357742 446598
6497 446598 474547 506466 481604 455830 452599 381414 342339 469271 458299 503330 483225 460613
6485 460613 475587 356181 236616 405313 593731 447837 455086 488074 439774 430430 378719
6474 378719 417802 536261 512025 518555 483603 505553 594413 512518 520604 538355 469479 386390
6462 386390 320929 407253 522969 596116 571270 590782 579009 584280 605355 583628 580619 667029
6450F67029j7031o7489K9397M6882O9051R807j21734L322L0175L1424k2018j36452
6438E22363p4241R7748N0945J6387P2763n0469k0637J05301m6989J4701J9978
6427G07850P2j57117K9522r7365o8874J12662n7733p6041M2734J428M6706J1497
6415D95341J32348P9656M985o82K9212N226o8316j25077n9430M3103j66735k6048
6403C43583J09040j23020m9136J02437J06816J8140M1905O040R8071P6182J2250
6392G42308N2863R7141p8067N262j32107k0867N9792Q4243N4827J33492k812J04528
6380A100603J84889M6382O9789J19780l5726J25Q1746m9877q1653p7703r8483
6369A259872O369L0992m6645j19911q4933o1505q648n3138j55262k481J0063m2928
$$ plain form
6450 667029 649998 582509 611906 658788 727839 737646 615912 619234 649409 680833 658815 522363
6438 522363 448122 545870 596815 613202 685965 635496 614859 720160 673171 687872 707850
6427 707850 707922 550805 580327 482962 414088 526750 469017 392976 435710 437138 483844 495341
6415 495341 627689 707345 712330 711648 740860 746086 677770 552693 493263 536366 369631 343583
6403 343583 452623 329603 280467 382904 489720 507860 549765 555805 653876 730058 742308
6392 742308 795171 892312 814245 819507 687400 666533 726325 810568 865395 998887 996075 1100603
6380 1100603 1285492 1331874 1401663 1521443 1485717 1485842 1567588 1517711 1436058 1358355 1259872
6369 1259872 1266241 1297233 1250588 1130677 1045744 984239 975591 922453 767191 764710 774773 731845
6357G31845o8146p2516q2105p1307k01285K7213Q8597J0134p428l8869J822K16163
6345E34118N0943O5149l2416j8619l3770J1261j19112l2080O5456M6255p7791
6334D59394k3509o2319m5675J03516N7415M4433O9255l0357j8290K4789J0665
6323E89317n5077O417p3384k6750N1132M8447j4791o0002q5922j3228J9612O8707
6311D54478L872Q1233J37820O3875j22587R0834R1222j07054j70433n6963m5873
6300D20424K8430L0511m4101L1445K8044m190M9389L484J32375O1098q620L032
6288G31321J2751N0002j9008n9379J1553M1078k7423j3253K5551J42290K8559
6277I24042R300J14011J24708J42027j03547k421L4694q1683k2154j14065L7924
$$ plain form
6357 731845 663699 591183 509078 437771 236486 263699 352296 362430 355002 316133 317955 534118
6345 534118 585061 650210 617794 599175 565405 576666 457554 425474 490930 537185 459394
6334 459394 435885 373566 327891 431407 488822 533255 602510 572153 553863 578652 589317
6323 589317 534240 540657 467273 440523 491655 540102 525311 465309 379387 366159 385771 454478
6311 454478 458350 539583 677403 741278 618691 709525 800747 693693 523260 466297 420424
6300 420424 448854 479365 435264 466709 494753 490563 539952 543436 675811 736909 728289 731321
6288 731321 744072 794074 775066 715687 727240 768318 740895 727642 753193 895483 924042
6277 924042 933342 1047353 1172061 1314088 1210541 1208120 1242814 1161131 1138977 1024912 1062836
6266A062836P0457R312j14816p1445P8979Q4808M3482m2079l0731J08027J32271
6255A331101M2310K8676M443j09108k414j52l5351j24239P5698k480K1961k9500
6243A200945O4571j4306o735l1007M5893R5484r6274k3544Q0594m5123J0126P0371
6231A350995j3441J6630o4588j11764L0974Q4817M7602Q4948j0156K7860P9802
6220A523679r9886r2737J02590m7993j64099q028n7740J31460k2268K2651n8543
6209A229086N6859j21502n8944P8362k3648O9116M9651j12588o3564N3408L0111
6198A186347r2426j5982J28174P9167m5610j05444j2853J5694l9996n8834o7566
6187I70671m8078j354L8441J10353l7468M8700P9370n7968o9868J4914O5889N708
$$ plain form
6266 1062836 1133293 1142605 1027789 956344 1035323 1120131 1163613 1121534 1090803 1198830 1331101
6255 1331101 1373411 1402087 1406530 1297422 1295008 1294856 1259505 1135266 1210964 1208484 1230445 1200945
6243 1200945 1265516 1251210 1244475 1213468 1259361 1354845 1258571 1235027 1315621 1270498 1280624 1350995
6231 1350995 1337554 1354184 1289596 1177832 1208806 1293623 1341225 1426173 1416017 1443877 1523679
6220 1523679 1423793 1331056 1433646 1385653 1221554 1213526 1155786 1287246 1264978 1287629 1229086
6209 1229086 1285945 1164443 1105499 1183861 1160213 1229329 1278980 1166392 1102828 1156236 1186347
6198 1186347 1093921 1077939 1206113 1285280 1239670 1134226 1121373 1137067 1097071 1038237 970671
6187 970671 922593 921239 959680 1070033 1032565 1081265 1160635 1102667 1032799 1047713 1113602 1119310
6175A119310L093K9152o2594L3030j86271J58702N788j68910k4266J99292O7215
6164A173541p6686n2428j669J9907p2057M6728O2393p8892k7487K9067n4773n1225
6152I16419J38357L6888k07117k7712o7531M7367l5825m2324N4959J24770k01707
6141G36544o5597J65501L6208p439j01657p5578L7602O5745m6068R138K6992K0625
6129H02016K6819p883j36201O378K3865K4187r7350j11105J47786M3505q6292
6118F35725J42336M0436q6363J2277l0602m498m5602K2308j5353q9555j31932
6107D49177J0601N2018p3797l5837m3349p688N9825O5415L4072J04027O0522P7073
6095G52059R3157o7009q6536j37354o1558K8946P996o3890n5890J75346j49590
$$ plain form
6175 1119310 1122403 1151555 1088961 1121991 935720 1094422 1100210 931300 907034 1106326 1173541
6164 1173541 1096855 1044427 1042758 1062665 990608 1037336 1099729 1020837 993350 1022417 967644 916419
6152 916419 1054776 1091664 884547 856835 789304 836671 800846 758522 813481 938251 736544
6141 736544 670947 836448 872656 865217 763560 687982 725584 791329 745261 754399 781391 802016
6129 802016 828835 820952 684751 691129 714994 739181 641831 530726 678512 722017 635725
6118 635725 778061 818497 732134 744411 713809 709311 663709 686017 670664 581109 449177
6107 449177 459778 511796 437999 402162 358813 351125 410950 476365 510437 614464 674986 752059
6095 752059 845216 778207 691671 554317 492759 521705 529701 465811 409921 585267 435677
6084D35677m649j1553J2205J03685L0010l7979k5611M6333K0365o1421M8823r1285
6072D64600M7792J48677Q5879j75514p2556P3926l0484R51p7324n1403K7624J4989
6060D57157n5300J1328Q1451n8854n2850N5305j4743N5466k9557J06652r2709
6049D63346r397O3946J5155n4771Q2115j07170L3616J22810M2479K4458j08356
6038E68231l0820j8414K3824L5849k3077k2366j2786k5819K2321P1164Q8934J24930
6026H01971K0610l8232Q7899l9178j10696m7503J47180j0688L9387k9064j76730
6015F44956Q2757J42654k3253j01759J04657O4666p8325q0292k1735N2000l9949
6004G46377q6434L0783k8400K8842L3220o2620r9663J62637J01931p106k09533
$$ plain form
6084 435677 431028 419475 431680 535365 565375 527396 501785 548118 568483 507062 555885 464600
6072 464600 512392 661069 746948 571434 498878 572804 542320 543271 465947 414544 442168 457157
6060 457157 401857 413185 494636 435782 382932 438237 423494 478960 449403 556055 463346
6049 463346 453949 517895 533050 478279 560394 453224 486840 609650 652129 676587 568231
6038 568231 537411 518997 542821 578670 555593 533227 520441 494622 516943 588107 677041 801971
6026 801971 822581 784349 872248 833070 722374 674871 822051 811363 850750 821686 644956
6015 644956 727713 870367 847114 745355 850012 914678 836353 756061 734326 786326 746377
6004 746377 659943 690726 662326 691168 724388 661768 562105 724742 826673 819567 610034
5993F10034j0802P8595n4825q9936l8948L0164j0489L5712j10812l7534J22691
5982E23850K0288O4207k0683N959Q8382j1089J22224N0555p7199p1801J99788
5971H94481j30744j20084m8063n6692Q6119O1151j1372O1544J43531K7579j9120
5960H88330j23107P3670L436j11907L4330Q292o0846j15718j2695p1374j34017
5949C78394M8985q2331M8507n5169M0176k903Q4322J08330L005N731L7353N7601
5937F72001j79942m1478Q0024o9711k4320L8745o0525R5390J00083j2009n80P504
5925F05182M1786J00890j49777m4157P6544J3692j06681L379K0420Q830L8069
5914F08177J231r9492K0416O3620m3512j23072K7412J23528L9931O4706R2318
$$ plain form
5993 610034 599232 677827 623002 533066 494118 524282 513793 549505 438693 401159 523850
5982 523850 544138 608345 587662 593621 682003 670914 793138 843693 766494 694693 894481
5971 894481 763737 643653 595590 538898 625017 686168 674796 736340 879871 907450 888330
5960 888330 765223 838893 842329 730422 764752 773044 712198 596480 583785 512411 378394
5949 378394 427379 345048 393555 338386 378562 375659 459981 568311 571316 577047 614400 672001
5937 672001 492059 450581 530605 460894 436574 475319 414794 510184 610267 598258 597678 605182
5925 605182 646968 747858 598081 553924 630468 644160 537479 540858 561278 570108 608177
5914 608177 609408 509916 530332 593952 550440 427368 454780 578308 618239 682945 775263
5903G75263N0582j57804j24710P5156k1112j00055Q9199J14583k1822n8821q3699
5892E36760K1230R1477m5746m6912L5765Q7835J49893M2952j47627P0462J41521
5881I37610o7600q5234o2128n8017R790N276k21861R4947J77420M2388n6830l4066
5869F81695L4917j2567Q4758p1793O3164K2789k3612q6218L923J01354j67776
5858F30634j13172J42248m6292j4792k6146J3649R0632q2794j20143J51128M3494
5847F68446q5734N5954j03310q0811M7566J8782l8673K1491J00875n5028m6877
5836E02681J4083J9156K3915p8686J965j9490J62098J5698j24993n3542J15927
5825E78812J5451k12976p4761J98374J22138j15542k05771J25187N7830j24949
$$ plain form
5903 775263 825845 668041 543331 618487 597375 497320 586519 701102 679280 620459 536760
5892 536760 557990 649467 603721 556809 592574 680409 830302 873254 725627 796089 937610
5881 937610 870010 784776 722648 664631 674421 679697 457836 552783 730203 772591 715761 681695
5869 681695 716612 704045 788803 717010 780174 802963 779351 693133 697056 798410 630634
5858 630634 517462 659710 613418 598626 572480 586129 676761 593967 473824 624952 668446
5847 668446 582712 638666 535356 454545 502111 520893 482220 503711 604586 549558 502681
5836 502681 516764 535920 559835 481149 483114 463624 625722 641420 516427 462885 578812
5825 578812 594263 381287 306526 504900 627038 511496 305725 430912 488742 363793
5815C63793O1414N3643J4908L845k837j8700j1521L8636m2979l9752m2368k462
5803C75620p0326j16508J43780n842j62272R5921N9412K1213M9802n6378j25600
5792B08822J46735J63760l4096l9414k0193O7543j61188j13438L6721J87573M650
5781D47475j13381p5196l6330M4798O1214j43347P8465O8403l9890J4288l6676
5770B69823l1228l3849p3423R1484J04301j05183q5463J10402j9906p1428N2042
5759B07572o6928J00693K17415j26884j88355K6769N9889l6801j79093J00338
5749A14615J36650j19791k7616J31949j3503k3131N6026n2569j06773J30010R6681
5738C22548n3918j52796N1776R1787j31141j00078J45029N3204q0427R6080K7664
$$ plain form
5815 363793 425207 478850 493758 497603 494766 476066 464545 503181 460202 420450 378082 375620
5803 375620 305294 188786 332566 326724 164452 260373 319785 340998 390800 334422 208822
5792 208822 355557 519317 485221 445807 425614 493157 331969 218531 255252 442825 447475
5781 447475 334094 258898 222568 267366 328580 185233 263698 332101 292211 306499 269823
5770 269823 238595 204746 131323 222807 327108 221925 136462 246864 226958 155530 207572
5759 207572 140644 241337 458752 331868 143513 170282 230171 193370 14277 114615
5749 114615 251265 131474 103858 235807 222304 199173 255199 202630 95857 225867 322548
5738 322548 268630 115834 167610 259397 128256 28178 173207 226411 145984 242064 269728
5727B69728L9567L5144j08427j04812P3548n497q1392p46J52468N2999j49469
5716A73111L7933J35076j41110p9028J01731J3089o5927R0975q0842p1210J22857
5705B36655n8014j52576L3615L5286l1465K7458j28437L1578J23226j2491L3117
5694A37952p893r6406M4199J65395q2448m8489L4664j9438q2353L918N7348n2532
5682E3917M3572M4340K560n5647R7480Q9400o1146N9688M0679P5487r5099k8658
5670B66573p7926p6205J2310n7767J373K8581J15422l0967j56828m4512J15304
5659I5358Q0835l3694j4023O9608J8660p1615q2201M3917K4176J6930r6458N3612
5647A05105J0000L5013k1200l4335K3506L3728k9663R4757j0718j24307J9771
$$ plain form
5727 269728 309295 344439 236012 131200 204748 199251 117859 117113 269581 322580 173111
5716 173111 211044 346120 205010 125982 227713 240802 174875 265850 185008 113798 236655
5705 236655 178641 26065 59680 94966 63501 90959 -37478 -5900 117326 104835 137952
5694 137952 130059 33653 77852 243247 160799 112310 146974 127536 45183 49101 106449 53917
5682 53917 97489 141829 144389 88742 186222 275622 214476 274164 314843 390330 295231 266573
5670 266573 188647 112442 124752 66985 68358 96939 212361 181394 24566 -19946 95358
5659 95358 176193 142499 128476 198084 216744 145129 62928 106845 131021 147951 51493 105105
5647 105105 115105 150118 128918 94583 118089 151817 122154 216911 206193 81886 101657
5636A01657P8642p5254N4430q5210r2371O4147J9760J27576N163l6626O2606J07392
5624C31912k2217r2052n147K5887m3527L7489l0945k7453N3899j23400j14078
5613i632L3258O0340R2529q6088P1695K9222L6876O8383m9072m5999k7135k1202
5601A53175n194L9791j33515o2061P3971q025m1188Q807N9092M7797K9899J1030
5589A73579l6458j8147k6768O4245K9595l374L5387j40167j13747M0525Q7492
5578I2162K5696K9836n7149O4762J54286p344j06302J84L0420M8625N5122j26603
5566B03695m925J6338r7389r4875P0074K6876m2580N1921k148m9565q1516J6299
5554A2205J12544Q1469N5681O7991K8324q4689J9603j20813q6455O4389r1432
$$ plain form
5636 101657 180299 105045 159475 74265 -18106 46041 65801 193377 198540 161914 224520 331912
5624 331912 309695 217643 212496 238383 194856 232345 201400 173947 227846 104446 -9632
5613 -9632 23626 83966 176495 90407 162102 191324 228200 296583 247511 201512 174377 153175
5601 153175 147981 187772 54257 -7804 66167 58142 16954 25761 84853 132650 162549 173579
5589 173579 137121 118974 92206 156451 186046 182672 218059 77892 -35855 4670 92162
5578 92162 117858 147694 90545 155307 309593 302249 195947 196131 226551 275176 330298 203695
5566 203695 198770 215108 117719 22844 92918 119794 77214 129135 126987 77422 -4094 12205
5554 12205 124749 206218 261899 329890 358214 273525 293128 172315 85860 150249 58817
5543E8817L3790j10339r5992K3557J40476o8945J8161K00808O5526q5520n0472
5532A29867N0170M6846k8802Q7171j3369j34349o857j1067q2990J17138n7917
5521I5841j25076J0003Q0408Q6440J6250l8822k6650J23140n4400L4546M5415
5510B47095n4710P2980j4127j63144N6357K0820m8376j9706L1981q1383N4061
5499A01848R0970J48160o6339j63898M7315Q0135j11593m7927k8984O6641L7342
5488A53670M987j6321j00624J81848J21328q8929j70112K1829J72073Q9694j67745
5477B01698Q9517O7486k9132k353L9624n0526K2101j30158j81919Q7787J26052
5466B40177Q3359j17505p6512M1705J95809N1719O8792l2083n9555j4448q2890
$$ plain form
5543 58817 92607 -17732 -113724 -90167 50309 -18636 -475 200333 265859 180339 129867
5532 129867 180037 226883 198081 285252 271883 137534 130677 119610 36620 153758 95841
5521 95841 -29235 -19232 61176 147616 163866 125044 98394 221534 167134 201680 247095
5510 247095 192385 265365 251238 88094 144451 165271 116895 97189 129170 47787 101848
5499 101848 192818 340978 274639 110741 158056 238191 126598 78671 49687 116328 153670
5488 153670 158657 142336 41712 223560 344888 255959 85847 107676 279749 369443 201698
5477 201698 291215 358701 329569 327216 366840 316314 338415 208257 26338 114125 240177
5466 240177 323536 206031 129519 171224 367033 418752 487544 455461 395906 381458 298568
5455B98568P8520O5911l7487j20796n9447O2560P5392J3642q2878p9774p0133
5444A44078P0089J48720j2703l3407R0317J41574L3791m5534R0842p9905j19481
5433D28381r827L9610p8501p7071P5773K14508p7095n8696N6958j8614Q458O856
5421E10740o9238q0372N0566l8488R4432m4972n3831O8404l2407o0379n0532K6576
5409C20499P7535n8353q0489J03437o468O207l3529r7058Q2659m106m0156m4133
5397B26045O218o1285M2240K3047L186J00164L2273o0490N991j3710P5984K9232
5385D08895m7259k31710k0056J95261m8J0346K2799r9310J00526J45555j35957
5374C49042n4744m2627o3414K7044j0714N8554J91357m3774j1126k2134q1485
$$ plain form
5455 298568 377088 442999 405512 284716 225269 287829 363221 376863 293985 214211 144078
5444 144078 214167 362887 350184 316777 407094 548668 582459 536925 627767 547862 428381
5433 428381 418554 458164 379663 302592 378365 592873 515778 457082 514040 495426 503884 510740
5421 510740 441502 361130 411696 373208 467640 422668 368837 437241 404834 344455 293923 320499
5409 320499 398034 339681 259192 362629 356161 362368 328839 231781 314440 310334 270178 226045
5397 226045 232263 170978 213218 236265 239451 339615 371888 311398 317389 303679 379663 408895
5385 408895 361636 129926 109870 305131 305083 315429 338228 238918 339444 484999 349042
5374 349042 294298 251671 188257 215301 204587 263141 454498 410724 399598 377464 295979
5363B95979K3439n458r8430R8742j1839j5725Q2341j58326m8144M7287M1635q5453
5351A66048n2411J35598O8271m2896o2342j3003k6537J6560L9409k71j5771j8225
5339A94430N9687R0244o4925J5764K4146k1405q2598L992K5642O1898m6894p6690
5327A83291q0429J0847J33066j6619o98O0965L3490K2497K5979J8295Q2121j18929
5315C53876k18820J09148O2119j0115k8036N7100o1816j42418P1162J15976o7296
5304B40880k7579N9484j45190l8926P1282Q7785k5339q7627k6987Q2170Q5471
5293B75424k3915P8144Q5351k19556j13102O3823J30105n4607P916p1391j80425
5282b2233J02346J29813M828P22N2383j41773J30671J12421p8759N8329j56453
$$ plain form
5363 295979 319418 313960 215530 314272 302433 286708 369049 210723 162579 209866 251501 166048
5351 166048 113637 249235 317506 274610 212268 199265 172728 189288 228697 228426 212655 194430
5339 194430 254117 344361 279436 295200 319346 297941 215343 219335 244977 306875 259981 183291
5327 183291 102862 113709 246775 230156 229458 290423 323913 346410 372389 390684 472805 353876
5315 353876 135056 244204 306323 296208 268172 325272 263456 121038 192200 308176 240880
5304 240880 213301 272785 127595 88669 159951 247736 222397 134770 107783 189953 275424
5293 275424 251509 329653 415004 195448 82346 146169 276274 221667 229583 158192 -22233
5282 -22233 80113 209926 214754 215476 267859 126086 256757 369178 290419 348748 192295
5271A92295o8256J02667J34027j11069r331k2312j9407K250K3019m4100L6281
5260B16064l679N925P179M143k8058L3960q1037l2913P2105J38246o7150j41376
5248A23409N2047M3091j3143q2858J46805q168o7489k2653J0425J2726J7813J10099
5236C22104l9136j01521N5545m821j40093M280J35372n2589n7127N1678L5214
5225B08906J68601O7276j42784m9896l4630J17204J32149m7346j19205P5751P5055
5214D51081r8143j82377J5144q5202j10375j716O6089J22335K07733r7964j5922
5203B70683l6646N2154J46976q0850k54859n013J05797K7139J7968P7438q496
5192C12291l2741Q631k9407m036n1288j8541K215J6311J1346K1155N6303N9951
$$ plain form
5271 192295 124039 226706 360733 249664 240333 218021 198614 200864 223883 179783 216064
5260 216064 212385 218310 225489 229632 201574 235534 154497 121584 193689 331935 264785 123409
5248 123409 175456 218547 205404 122546 269351 261183 193694 171041 181466 194192 212005 322104
5236 322104 282968 181447 236992 232171 92078 96358 231730 179141 122014 173692 208906
5225 208906 377507 444783 301999 252103 217473 334677 466826 419480 300275 376026 451081
5214 451081 352938 170561 185705 100503 -9872 -11588 54501 176836 384569 286605 270683
5203 270683 234037 286191 433167 352317 97458 92445 198242 225381 243349 320787 312291
5192 312291 279550 288181 258774 254738 203450 184909 187124 203435 214781 235936 292239 352190
5180C52190j501n2775P073J01019K3988m9660j53321p3746K5869J17999o0750
5169B36385L1699J54764J4278p3264o4077n6185J94457l2832j00743J4717j29328
5158A89871M4267N0321k6862p547K0669P3705n8192m2615J14118j08746j1655
5147B37334J12960P6596l2936J00730q4798q8097n16k8860p4489M8577L2118m9210
5135B49409M2353R6623N4932o6837k2716L2394l738L8317j00261r442J28709j3932
5123D25811n1406m0241O4389j43130k9043N4798J99713n73p8603L9188k0920J05787
5111E25770O6193j78724m8560m7197J14647N5123m2146q3060J21861k9791j86197
5100B67919r4413Q441q508J37647J31413J0647N0804L7174J2804Q2447n2035j3801
$$ plain form
5180 352190 350689 297914 304987 406006 429994 380334 227013 153267 179136 297135 236385
5169 236385 268084 422848 437126 363862 299785 243600 438057 405225 304482 319199 189871
5158 189871 234138 284459 257597 250050 270719 344424 286232 243617 357735 248989 237334
5147 237334 350294 426890 393954 494684 409886 321789 321273 292413 217924 266501 298619 249409
5135 249409 291762 388385 443317 376480 353764 386158 382420 420737 320476 311034 439743 425811
5123 425811 374405 334164 398553 255423 226380 281178 480891 480318 401715 440903 419983 525770
5111 525770 591963 413239 364679 317482 432129 487252 445106 362046 483907 454116 267919
5100 267919 173506 181947 173439 311086 442499 453146 503950 541124 553928 636375 584340 570539
5088E70539m6682Q9354j06349r6160N0147k7948l939Q0129N7194m7645P9212j1313
5076E86539n0822j67675P0051J18965J06722J8831o3301P1440r3683j43551n5599
5065C97917O9551J06618L9738l3424j68238J21774q0840M0045p8938k6017J78082
5054E66268Q231o5475J9232o2032K7621J57076m17j73066J04004n789O4535N7765
5042F97953m3039N1221p0566o8172R4108M5754p7279R1415p7849L1339N4565j51966
5030E77484K1300k4027o6308J88095J44007o9482N8526J08144q060R6806j90153
5019H36332o8349J57646Q1029r7646k8744J0826o9049J72448j5722j61526R5215
5008I12460J11971n5541k9247j510J18850M4361j47297j3751J9290K3559J08022
$$ plain form
5088 570539 523857 613211 506862 410702 460849 432901 428962 509091 566285 518640 597852 586539
5076 586539 535717 368042 438093 557058 663780 682611 619310 690750 597067 453516 397917
5065 397917 467468 574086 613824 580400 412162 533936 453096 493141 414203 388186 566268
5054 566268 574499 509024 528256 466224 493845 650921 650504 477438 581442 575653 640188 697953
5042 697953 654914 706135 635569 567397 661505 707259 629980 721395 643546 674885 729450 577484
5030 577484 598784 574757 508449 696544 840551 771069 829595 937739 929679 1026485 836332
5019 836332 767983 925629 1006658 909012 880268 891094 822045 994493 978771 817245 912460
5008 912460 1024431 968890 939643 938133 1056983 1101344 954047 940296 959586 983145 1091167
4997A091167k4785j77778j30682J20676K09604O3319n0356L0270P008K3407k5548
4986A136302J9007O788J4444J35845m3159M0020K7625Q752L047j3135J5088Q1085
4974A431709R8972k4330R5160K0296l3938M4090k6699j34093M4629R7423k0828
4963A592391l8807j19345P384J92833m7891J18338Q7024Q4386M1741q612j9861
4952A889581Q2405j83p0561j3907m444J34742O7228q5960j11239l0055p1656P7596
4940A863547O8496j9290R8843R7057m4626J04081J57951M9254m2872K15379j61699
4929B386121r6458J4749Q1137o320k6544r4860P5561j9711l6520j07555l7105
4918B132495J28055P2059j18935m7122J42188P8159J14344j14365k375J26358
$$ plain form
4997 1091167 1066382 888604 757922 878598 1088202 1151521 1101165 1131435 1138443 1161850 1136302
4986 1136302 1155309 1162097 1176541 1312386 1269227 1309247 1336872 1345624 1348671 1335536 1350624 1431709
4974 1431709 1530681 1506351 1601511 1621807 1587869 1631959 1605260 1471167 1515796 1613219 1592391
4963 1592391 1553584 1434239 1441623 1634456 1586565 1704903 1791927 1876313 1918054 1909442 1889581
4952 1889581 1971986 1971803 1901242 1887335 1882891 2017633 2084861 1998901 1887662 1857607 1785951 1863547
4940 1863547 1932043 1912753 2011596 2108653 2064027 2168108 2326059 2375313 2332441 2547820 2386121
4929 2386121 2289663 2304412 2385549 2379229 2352685 2257825 2333386 2313675 2277155 2169600 2132495
4918 2132495 2260550 2332609 2213674 2166552 2308740 2386899 2501243 2386878 2384503 2510861
4908B510861r7859n4994J40470l7986J848J68850M9564n9721J32376L5176o870
4897B781715j8676j16471N318P2649J05393P9312m3523m0763K2185j2793N9041
4886B893387K9325K0870J49274N222Q4133K09588L1217q0004M7356j78323k26740
4875B985305J25390M3040L5049p7697Q0518J22386o1568K1163R4710M1812j33440
4864C276668k513Q486l2682k9819o417N0564P8844r1393P1564J28221q515J00164
4852C543172K34785K9313j677J63562K48731J68145J66960j37522j35440j95535
4842D084494k21083j25628m9814n5975r8150l0096N7427L5461K1355N7756Q8892
4831C764639j11077n9988K8717L3628M0387O678m1621m355L3771K2447P2199m0865
$$ plain form
4908 2510861 2413002 2358008 2498478 2460492 2462340 2631190 2680754 2621033 2753409 2788585 2781715
4897 2781715 2763039 2646568 2651886 2724535 2829928 2909240 2865717 2824954 2847139 2834346 2893387
4886 2893387 2922712 2943582 3092856 3098078 3182211 3391799 3423016 3343012 3390368 3212045 2985305
4875 2985305 3110695 3153735 3188784 3111087 3191605 3313991 3252423 3273586 3368296 3410108 3276668
4864 3276668 3274155 3282641 3249959 3220140 3213723 3264287 3343131 3251738 3323302 3451523 3443008 3543172
4852 3543172 3777957 3807270 3805593 3969155 4217886 4386031 4552991 4415469 4280029 4084494
4842 4084494 3863411 3737783 3687969 3631994 3533844 3503748 3561175 3596636 3617991 3675747 3764639
4831 3764639 3653562 3593574 3622291 3655919 3696306 3702984 3661363 3657008 3690779 3713226 3785425 3744560
4819C744560J5126K00682J21231L3488K90360K55873J81110K44597R086j62400
4809D933713o9153j67572k31241j76563j27785k22699M2118m1676K6837J00285
4799D066264n3936n1994Q2418R748P9620K39349Q234j3227r9460L6174L9871J7875
4787D360936O2833o3626K2530K0972m8720J2531J14987K09415J6098m575J59235
4776D862616L1585k9294j2797q3195j00910k9193M645N1407M0019L9664m3540
4765D731007j06615j9079P9182l876j3273J57433p9882j12221M776l657J00884
4754D734679K7106j44312j08843J05149n4898K28667r7174j94486K5963J0048
4744D531899k4206j5978R8442L4339p0124n8684L4009K6788n7817j8803r0075
$$ plain form
4819 3744560 3759686 3960368 4081599 4115087 4405447 4661320 4842430 5087027 5096113 4933713
4809 4933713 4864560 4696988 4465747 4289184 4161399 3938700 3980818 3939142 3965979 4066264
4799 4066264 4012328 3960334 4042752 4052500 4132120 4371469 4379703 4366476 4267016 4303190 4343061 4360936
4787 4360936 4423769 4360143 4382673 4403645 4354925 4367456 4482443 4691858 4707956 4703381 4862616
4776 4862616 4894201 4864907 4852110 4768915 4668005 4638812 4643457 4694864 4734883 4774547 4731007
4765 4731007 4624392 4605313 4684495 4680619 4667346 4824779 4744897 4632676 4637452 4633795 4734679
4754 4734679 4761785 4617473 4508630 4613779 4558881 4787548 4690374 4495888 4521851 4531899
4744 4531899 4507693 4491715 4590157 4624496 4554372 4495688 4529697 4556485 4498668 4479865 4389790
4733D389790j01537m0275p0317Q1042l1642n2102j00348j27520J8785O7852m0809
4722C992919M1698O543o3488o072n4643M3275m8263j3351p5280p0204m2332n8318
4710C652484M8384L9939q4372j50316j21772Q5532j8911r6659l2459M8804p6005
4699C294649L7997K4762l1943J34932J39888P7426j52658o7368q798l3894j50371
4688C264622M8244m7055n4779Q686j09921J20557J50260q0566j00562M0941r1860
4677C148567M3082Q9108j53673Q7898j21714o3525P6548J95617R446q7539j75544
4666C048271k8136R0090J735m5082K3177P6890j2773q7377L5354P3285R9262m1078
4654C233618j27934j8486R2480p0250n881P727j91473k1815n575q2325R0725P9389
$$ plain form
4733 4389790 4288253 4247978 4177661 4258703 4227061 4174959 4074611 3947091 3965876 4033728 3992919
4722 3992919 4034617 4041160 3977672 3971600 3916957 3960232 3911969 3898618 3823338 3753134 3710802 3652484
4710 3652484 3700868 3740807 3656435 3506119 3384347 3469879 3450968 3354309 3321850 3370654 3294649
4699 3294649 3332646 3357408 3325465 3460397 3600285 3677711 3525053 3457685 3448887 3414993 3264622
4688 3264622 3312866 3265811 3211032 3219718 3109797 3230354 3380614 3300048 3199486 3240427 3148567
4677 3148567 3191649 3280757 3127084 3214982 3093268 3029743 3106291 3301908 3311354 3223815 3048271
4666 3048271 3020135 3110225 3111960 3066878 3090055 3166945 3154172 3066795 3102149 3175434 3274696 3233618
4654 3233618 3105684 3087198 3179678 3109428 3103547 3111274 2919801 2897986 2892411 2810086 2900811 2980200
4642B980200o2414k9291K3297J35128M6720m9792M4507M2659j17737q7552m4557
4631B881168o5431Q59k4471k39171J5748O9391q6044o3816P8712P8847m7037K9063
4619B627818M9002M2999m7775j6725R0911j072k8768R0490l8339m9823P846j16437
4607B610127l5711J1732O685J9398r4834k9607J42669J6250l2910J42854J2463
4596B769116R656J02369o9568j3457K3188j216q7038J7474k8377P4262K10m2273
4584B754346P4956n388r7158J35425j5061o8021Q4510M1286p5167J0382n2453
4573B787657o3543K3869o77k3556O7422r7056m1976L6338j04814J27322J59382
4562B870368k21431r0636K39605N6351r2283Q6841L0132m5658K6374r8271J30343
$$ plain form
4642 2980200 2917786 2888495 2911792 3046920 3093640 3043848 3088355 3131014 3013277 2925725 2881168
4631 2881168 2815737 2816596 2792125 2552954 2568702 2638093 2552049 2488233 2566945 2645792 2598755 2627818
4619 2627818 2676820 2719819 2672044 2655319 2746230 2745158 2716390 2806880 2768541 2718718 2726564 2610127
4607 2610127 2574416 2586148 2592833 2612231 2517397 2487790 2630459 2646709 2613799 2756653 2769116
4596 2769116 2778772 2881141 2811573 2798116 2821304 2820088 2733050 2750524 2722147 2796409 2796619 2754346
4584 2754346 2829302 2823914 2726756 2862181 2847120 2779099 2863609 2904895 2829728 2840110 2787657
4573 2787657 2724114 2747983 2747306 2723750 2791172 2694116 2652140 2688478 2583664 2710986 2870368
4562 2870368 2648937 2558301 2797906 2854257 2761974 2848815 2878947 2833289 2859663 2761392 2891735
4551B891735N7308j24729J1107P066m3518O7290L3580p9099m7494J27680J46662
4540C047588K7019j310j2576P1560m456j4163J2157j45515l8096j2538M9268J29339
4528C108277m8551j5903o275O1567M3591n1396j37295J06447J31154j74821l2247
4517B984548J8249O2210Q8252p8977j28182R1101J18321J3025L6859K9334j7426
4506C217314N5420K995p9378L6561O7819j37984k8476l2574n2204Q5156J8240
4495C152889j36720M9432J76364o0138J46483J79870j20579q3336M3162Q7944
4485C435371l0518M3805q6243l8935R9054K28455j20423j77816L0510J19369M381
4474C507010j7810M6468Q2651k9000O8692l9504k11258L2413K43137m3136m3694
$$ plain form
4551 2891735 2949043 2824314 2835421 2842487 2798969 2866259 2899839 2820740 2773246 2900926 3047588
4540 3047588 3074607 3073297 3060721 3132281 3127825 3113662 3125819 2980304 2942208 2929670 2978938 3108277
4528 3108277 3059726 3043823 3037548 3099115 3142706 3091310 2954015 3060462 3191616 3016795 2984548
4517 2984548 3002797 3065007 3153259 3074282 2946100 3037201 3155522 3168547 3205406 3234740 3217314
4506 3217314 3272734 3275729 3196351 3232912 3300731 3162747 3134271 3101697 3049493 3134649 3152889
4495 3152889 3016169 3065601 3241965 3181827 3328310 3508180 3387601 3304265 3347427 3435371
4485 3435371 3404853 3448658 3362415 3323480 3422534 3650989 3530566 3352750 3383260 3502629 3507010
4474 3507010 3489200 3535668 3618319 3589319 3658011 3618507 3407249 3439662 3682799 3639663 3595969
4463C595969R8404K02953M9666k3549M8843m3000l1347K2240l9952j2754J50785
4452D018258P5689l4120J06975N2513j33492J1195J59346J37138j57143O4734
4442D301093K58914M8652N9358J71175q4643L6086K57773P3701j18814J95461
4432E198756J45891J53602l204O3641K2857o2300J8443J05256q0673p2750J46983
4421E636502r193l3261L1641P702J03811k0091j32495Q7750J38169P3527J53753
4410F037815J3022q7287J99210J12602J15166P7859K8989L3299J80885J70301
4400F881861l5053J95994N4504p8243R645K23482l7267n0679J25048J42805Q902
4389G440999Q3550J95846J00834K873P2152J12158J46295Q6138J55152P7723K2197
$$ plain form
4463 3595969 3694373 3897326 3946992 3923443 3972286 3929286 3897939 3920179 3880227 3867473 4018258
4452 4018258 4093947 4059827 4166802 4219315 4085823 4097018 4256364 4393502 4236359 4301093
4442 4301093 4560007 4608659 4668017 4839192 4754549 4790635 5048408 5122109 5003295 5198756
4432 5198756 5344647 5498249 5495045 5558686 5581543 5519243 5537686 5642942 5562269 5489519 5636502
4421 5636502 5627309 5594048 5625689 5633391 5737202 5717111 5584616 5672366 5810535 5884062 6037815
4410 6037815 6050837 5963550 6162760 6275362 6390528 6468387 6497376 6530675 6711560 6881861
4400 6881861 6846808 7042802 7097306 7019063 7028708 7252190 7214923 7164244 7289292 7432097 7440999
4389 7440999 7524549 7720395 7821229 7824102 7896254 8008412 8154707 8240845 8395997 8473720 8495917
4378H495917J9779J89347P6030P3233K71627Q3693l3809J68172J47697J34666
4368I626352J33114N0255J38830J12135P0838J78395J54759O6790K22491K02382
4358A0956341K01192J95445L07366K23593K49320J88112K44844L46818J79250
4349A3092281Q2320K80496L44027K09159K50962M63270K19144K53479L69410N10498
4339A6075046L28940L21848K96013M07020L92487L63835L80445O31274M09552
4330A9606460M03114N79911N13136N68272O82719N12063O12702O88622N36710
4321B4703709O24023O45298N48781O13090P89891O21075O50912P02846R33248
4312C0832873P68158Q09743R87277R87790R21471R92409J138266J111156J093342
$$ plain form
4378 8495917 8515696 8705043 8781073 8854306 9125933 9209626 9175817 9343989 9491686 9626352
4368 9626352 9759466 9809721 9948551 10060686 10131524 10309919 10464678 10531468 10753959 10956341
4358 10956341 11157533 11352978 11660344 11883937 12133257 12321369 12566213 12913031 13092281
4349 13092281 13174601 13455097 13799124 14008283 14259245 14722515 14941659 15195138 15564548 16075046
4339 16075046 16403986 16725834 17021847 17428867 17821354 18185189 18565634 19196908 19606460
4330 19606460 20009574 20589485 21102621 21670893 22353612 22865675 23478377 24166999 24703709
4321 24703709 25327732 25973030 26521811 27134901 27924792 28545867 29196779 29899625 30832873
4312 30832873 31601031 32410774 33398051 34385841 35307312 36299721 37437987 38549143 39642485
4303C9642485J143850J333203J345021J423251J489164J414682J503740J789766
4295E1085162J889099J814106J978415K176665K275133K413839K511384K834550
4287F8978353K932670L015398L266810L412592L595945L852989M213979M446326
4279I7715062M776542N224779N884292O335558O742943P373978Q187644Q986938
4271A51227736R787678J0809280J1680964J2592254J3648342J4685354J5595927
4264B40027535J6315451J6785316J6816300J6483939J5240886J3502522J0756905
4257C45928854P220600K811025j810955o360452j0355737j3376430j5695497j6905564
4249B91455844j7402607j7219268j6543487j5699768j5041425j4166552j3113750
$$ plain form
4303 39642485 40786335 42119538 43464559 44887810 46376974 47791656 49295396 51085162
4295 51085162 52974261 54788367 56766782 58943447 61218580 63632419 66143803 68978353
4287 68978353 71911023 74926421 78193231 81605823 85201768 89054757 93268736 97715062
4279 97715062 102491604 107716383 113600675 119936233 126679176 134053154 142240798 151227736
4271 151227736 161015414 171824694 183505658 196097912 209746254 224431608 240027535
4264 240027535 256342986 273128302 289944602 306428541 321669427 335171949 345928854
4257 345928854 353149454 355960479 354149524 347789072 337433335 324056905 308361408 291455844
4249 291455844 274053237 256833969 240290482 224590714 209549289 195382737 182268987
4242A82268987j2311727j1337133j0436840r722183q802431q048199p424834o880036
4234A07305604o179336n655693n080883m756367m481939m042768l705446l507138
4226F9896034l293486l037619k879141k645101k581829k323795k226207k157464
4218D8751392j945650j706067j704236j728109j522184j341951j401696j269026
4210C6132473j255186j316685j100824r57165j074438j106113q79530p84771q31058
4201B6826703p83272q06744p97311o24753o07127o94772n95494o00803n30308
4192B0786119n85957o10332m45508l40741n33511l27232l42236n06408l87571
4183A6706623l21360l91419l88416k80059l75950j89831m11034k43214k96053
$$ plain form
4242 182268987 169957260 158620127 148183287 138461104 129658673 121610474 114185640 107305604
4234 107305604 101126268 95470575 90389692 85633325 81151386 77108618 73403172 69896034
4226 69896034 66602548 63564929 60685788 58040687 55458858 53135063 50908856 48751392
4218 48751392 46805742 45099675 43395439 41667330 40145146 38803195 37401499 36132473
4210 36132473 34877287 33560602 32459778 31502613 30428175 29322062 28442532 27657761 26826703
4201 26826703 26043431 25236687 24439376 23814623 23207496 22512724 21917230 21316427 20786119
4192 20786119 20200162 19589830 19144322 18803581 18270070 17942838 17600602 17094194 16706623
4183 16706623 16385263 15993844 15605428 15325369 14949419 14759588 14348554 14105340 13809287
4174A3809287l73520j86753l21436l87987k58309j00006l30685k80317k50754
4165A1319520k47681k46297k45467l23614k31492k60945j74712j58807j98867
4156I231638j31106j71658j20008r6968j34806k18059k09504j62576o3670p6234
4146G847049k67645k59981L1991j67930j19017k64828o7285L2195j21183k57463
4136F385903l3204j60877o6333k2688j59430j54698j15055o8314k2856j78501
4126E403947j27736P7287o1610k10409l11o0363k10803q9871j36133j13433j16810
4115D353755l700r4607q9344q8608n8389K8261K7012n2050J5045j23340m4579
4104C869456l5080p4324j33733l1196j33778N4267L4981n4997l8363p976l1770
$$ plain form
4174 13809287 13435767 13249014 12927578 12539591 12281282 12181276 11850591 11570274 11319520
4165 11319520 11071839 10825542 10580075 10256461 10024969 9764024 9589312 9430505 9231638
4156 9231638 9100532 8928874 8808866 8711898 8577092 8359033 8149529 7986953 7923283 7847049
4146 7847049 7579404 7319423 7351414 7183484 7064467 6799639 6732354 6764549 6643366 6385903
4136 6385903 6352699 6191822 6125489 6102801 5943371 5788673 5673618 5605304 5582448 5403947
4126 5403947 5276211 5353498 5291888 5081479 5081168 5020805 4810002 4720131 4583998 4470565 4353755
4115 4353755 4350055 4255448 4166104 4077496 4019107 4047368 4074380 4022330 4037375 3914035 3869456
4104 3869456 3834376 3760052 3626319 3595123 3461345 3515612 3550593 3495596 3457233 3449257 3417487
4093C417487K55k6912j30232O0388p6883J4535l0055o6733k0829L9778j12448
4082C068351n6015j66722N9006j1610n3679J4997P6445j16836n1636l5714j3198
4071B713389P7769M267r5418L6739o0463o7220J33391n2700j31584r8490K9473
4060B489153l732m3698Q781q3008l0498R2784l4567J43566j1690q280l0978J1904
4048B499737j44453K4601p4436n9136o4985m1718k9333J02274q862O340l7347
4037B172682M0828J8423K1280K3289M751j00830M08J2947j25165j43327O5950
4026A991236Q331j28283o7256m467M3147L1435o7354r1924M9325R688j4695m1998
4014A717185O2004j53893o5190L059j3748j4174j0492L2455j9725M6551M3891
$$ plain form
4093 3417487 3417742 3390830 3260598 3320986 3244103 3258638 3228583 3161850 3141021 3180799 3068351
4082 3068351 3012336 2845614 2904620 2893010 2839331 2854328 2930773 2813937 2762301 2726587 2713389
4071 2713389 2791158 2795425 2700007 2736746 2676283 2609063 2742454 2689754 2558170 2459680 2489153
4060 2489153 2485421 2441723 2450504 2367496 2336998 2429782 2395215 2538781 2527091 2518811 2487833 2499737
4048 2499737 2355284 2379885 2305449 2246313 2181328 2139610 2110277 2212551 2203689 2210029 2172682
4037 2172682 2213510 2231933 2253213 2276502 2281253 2180423 2180831 2193778 2068613 1925286 1991236
4026 1991236 1999567 1871284 1804028 1799561 1842708 1874143 1806789 1714865 1764190 1773878 1759183 1717185
4014 1717185 1779189 1625296 1560106 1563165 1549417 1535243 1524751 1557206 1537481 1584032 1627923
4003A627923j3766M4322j14995j15991k7143J03265M4784L064M4421J00129m2952
3992A653061j70530m5892p659j24790Q7823N7120k8317J9390O7685n3454k5770
3981A428667J3518p6898m5853J6064o1252M084M5363j23169Q8398l7629r8619
3970A152674J7662l326L5637P5548L6758j13735Q256J6034j94923j52941j8482
3959H59162p992J32622o590p5475j46R1938R3175K430Q2732Q3207J609M0852j26481
3946A171043n9255L431m4546j48983q7351R0547j2863o2261J191Q2608J08195
3935A041756J9464k9853m9131L6865l2545l6317o8968q009L5029q5481o9934l6373
3923G16503J15334M9793p9478n9329J29819l9430j01470n9307R2537R5612j15284
$$ plain form
4003 1627923 1614157 1658479 1543484 1427493 1400350 1503615 1548399 1551463 1595884 1696013 1653061
3992 1653061 1482531 1436639 1428980 1304190 1392013 1449133 1420816 1440206 1507891 1454437 1428667
3981 1428667 1442185 1365287 1319434 1335498 1274246 1278330 1323693 1200524 1288922 1251293 1152674
3970 1152674 1170336 1167010 1202647 1278195 1314953 1201218 1209474 1225508 1030585 877644 859162
3959 859162 851170 983792 977202 901727 901581 993519 1086694 1089124 1171856 1255063 1256672 1297524 1171043
3946 1171043 1111788 1115219 1070673 921690 834339 924886 912023 849762 850953 933561 1041756
3935 1041756 1061220 1031367 982236 1019101 986556 950239 881271 873262 908291 822810 752876 716503
3923 716503 831837 881630 802152 742823 872642 833212 731742 672435 764972 860584 745300
3912G45300m4245Q04J7608Q7254P5214k381o7727J0537P5260l2307p1494P2565
3900H66388j4107J794R7696N7251j3939k3295q7038p8486m3407j0184Q7935P5415
3888I16023K2700O5452j00509j0765J56186k9695p1879l249k576R3441n7167j23571
3876H54391M2100k6155K2792L7468j00650o3624J68788J8687q2032q2137l9683
3865G49945J73870Q9996q1220J9007q0179k9318L765j40458k6505Q8373o1574
3854G05702M0511P2315l1381O3590J26393J7685l8957o5909N0788L4388m7757
3843I27368L9693O2212l5852q2456Q9505o7608k7149K4936J67498J01994j26451
3832A073690q4913K7260j01576l548J29113M4048q2095K3875k4743j5976j4814
$$ plain form
3912 745300 701055 701859 719467 806721 881935 879554 811827 822364 897624 865317 793823 866388
3900 866388 852281 854075 951771 1009022 995083 971788 884750 806264 762857 752673 840608 916023
3888 916023 938723 1004175 903666 892901 1049087 1019392 947513 944264 941688 1035129 977962 854391
3876 854391 896491 870336 893128 930596 829946 766322 935110 953797 871765 789628 749945
3865 749945 923815 1013811 932591 951598 871419 842101 845866 705408 678903 767276 705702
3854 705702 746213 818528 787147 850737 977130 994815 955858 889949 940737 975125 927368
3843 927368 967061 1029273 993421 910965 1000470 932862 905713 930649 1098147 1200141 1073690
3832 1073690 988777 1016037 914461 910913 1040026 1084074 1001979 1025854 1001111 985135 970321
3821I70321m5305n9963J19958J54130m2643J26462O4845J2189l1403k6764r565
3810A232262O8369o6427P478m8539p0476J24026n6207o9464N2006j5843Q240J926
3798A167351R0728L4765r2996N7262L7749j13143q7297J08551l4169q2086J5599
3787A102314P5758p5729L7334J53057O1015p5015N3475L6567n0028m5808m9459
3776A223481J4318q5798N5452P9670J4495m8871N3924p2673k6111J86841M9704
3765A444432j8357j2772l1180l9091P8525K0984r2882j10392O7731J94048p9520
3754A421526q3472R1076J21836O726o5366M7234J52172Q431j43926M2023K7369
3743A625629O9876R3918r5407J5741l0535l3542N0950N5820R461N1426J13256
$$ plain form
3821 970321 925016 865053 985011 1139141 1096498 1222960 1287805 1299994 1268591 1241827 1232262
3810 1232262 1300631 1234204 1241682 1193143 1122667 1246693 1190486 1121022 1173028 1157185 1165425 1167351
3798 1167351 1258079 1292844 1199848 1257110 1294859 1181716 1094419 1202970 1168801 1086715 1102314
3787 1102314 1178072 1102343 1139677 1292734 1353749 1278734 1332209 1368776 1318748 1272940 1223481
3776 1223481 1237799 1152001 1207453 1287123 1301618 1252747 1306671 1233998 1207887 1394728 1444432
3765 1444432 1426075 1413303 1382123 1343032 1421557 1442541 1349659 1239267 1306998 1501046 1421526
3754 1421526 1338054 1429130 1550966 1557692 1492326 1539560 1691732 1700163 1556237 1598260 1625629
3743 1625629 1695505 1789423 1694016 1709757 1679222 1645680 1696630 1752450 1761911 1813337 1926593
3732A926593N0772p5941J19325J42308m8112P285M9574p7637n0371K2025Q7047
3721B152868q60j74059L6167Q1970j23960K0601Q3052j9427J6423O5769O671j273
3709B143942J16430J21154r7778r427J32745J16451l3520o3255J45638o113l8026
3698B528241J55399O1034o9040m6784J05217o6113q1522J10356R7867O897j38528
3687B663024k4647K0310J02590P8805K3722O1721o0694P9824o5605l9744p7997
3676B761309O401J77733l2061K9148K3257L0795l8307L2910m5359N0229m4178
3665B951877j12804m036Q1242j8823L7194R1607j02572k3171P8638l2075K6391
3654B973468R9595P3993r9418N3402J82923M8791q49m3076K4056m1416j34775
$$ plain form
3732 1926593 1977365 1901424 2020749 2163057 2114945 2122230 2171804 2094167 2043796 2065821 2152868
3721 2152868 2152008 1977949 2014116 2096086 1972126 1992727 2075779 2056352 2072775 2138544 2145215 2143942
3709 2143942 2260372 2381526 2283748 2274321 2407066 2523517 2489997 2426742 2572380 2566267 2528241
3698 2528241 2683640 2744674 2675634 2628850 2734067 2667954 2586432 2696788 2794655 2801552 2663024
3687 2663024 2638377 2658687 2761277 2840082 2863804 2925525 2864831 2944655 2879050 2839306 2761309
3676 2761309 2767710 2945443 2913382 2942530 2965787 2996582 2958275 2991185 2945826 2996055 2951877
3665 2951877 2839073 2835037 2916279 2897456 2934650 3026257 2923685 2900514 2979152 2947077 2973468
3654 2973468 3073063 3147056 3047638 3101040 3283963 3332754 3331905 3288829 3312885 3271469 3136694
3643C136694r186J35591n2821j25067K1907J51878q1301q8491J89016P3885k4068
3632C328037j02979N668R8079Q9552O6413j21569L5946O5345j4639j39277j43186
3621C167390m9507L3908m5150j90550o7385Q7737o7625j55637j1061k0879P5407
3610B756648N6533n9241k5227Q502o638l3580o5446L6122L6243o8534k0616J84850
3598B799616N5173j18305n4839O3241L3782q5322j15809J00466M2769j79326q957
3587B532489N2424p381k9177J36498o8547M741J14944K6720M9355r2565Q3455
3576B802956n7153j91758r7162J1223L3501j07438L168J96050L5023k4682j221
3565B602507n9111n8052O0861o2161j76870L9719R9971O6121q5483j1651O9509
$$ plain form
3643 3136694 3127508 3263099 3210278 3085211 3107118 3258996 3177695 3089204 3278220 3352105 3328037
3632 3328037 3225058 3230726 3328805 3418357 3484770 3363201 3399147 3464492 3449853 3310576 3167390
3621 3167390 3117883 3151791 3106641 2916091 2848706 2936443 2868818 2713181 2702120 2681241 2756648
3610 2756648 2813181 2753940 2728713 2737215 2730577 2696997 2631551 2667673 2703916 2635382 2614766 2799616
3598 2799616 2854789 2736484 2681645 2744886 2778668 2693346 2577537 2678003 2720772 2541446 2532489
3587 2532489 2584913 2577532 2548355 2684853 2616306 2621047 2735991 2762711 2812066 2719501 2802956
3576 2802956 2745803 2554045 2456883 2468106 2501607 2394169 2397337 2593387 2628410 2603728 2602507
3565 2602507 2543396 2485344 2546205 2484044 2307174 2346893 2446864 2512985 2427502 2415851 2485360
3554B485360j7438l7268P9717k3872p989Q0106L938k9008M6337k9835o076O6519
3542B610491Q032m8314k2636p992L2830m0846L2582J93847l5053l0519n3665L3360
3530B672117l0475M9294O2968l588q5226k5890J13209O2192j32570K4536N5690
3519B762257P359Q168l4588O7349O2139j08595p9973J32231q2118p271J44286
3508B871244J57618j71674L3395L2111j6108r1953j5637L4119P516n9150Q3843
3497B865324K13486m2798o8488Q3685J55958j63816j61499j8322N6997M4042m7822
3486B916747o9758J9591J43534M2270j15065o1241l6261J85566R4072j7441J283
3475C103297N5665N7706k0905o2553q9554j1134J24230J06572N8126j01518M2867
$$ plain form
3554 2485360 2467922 2430654 2510371 2486499 2478510 2558616 2562554 2533546 2579883 2550048 2543972 2610491
3542 2610491 2618523 2570209 2547573 2539581 2572411 2531565 2564147 2757994 2722941 2692422 2638757 2672117
3530 2672117 2641642 2690936 2753904 2750316 2665090 2639200 2752409 2814601 2682031 2706567 2762257
3519 2762257 2769616 2777784 2743196 2810545 2872684 2764089 2684116 2816347 2734229 2726958 2871244
3508 2871244 3028862 2857188 2890583 2922694 2906586 2814633 2798996 2833115 2840631 2781481 2865324
3497 2865324 3078810 3036012 2967524 3051209 3207167 3043351 2881852 2863530 2920527 2964569 2916747
3486 2916747 2846989 2866580 3010114 3052384 2937319 2876078 2839817 3025383 3119455 3102014 3103297
3475 3103297 3158962 3216668 3195763 3133210 3043656 3032522 3156752 3263324 3321450 3219932 3262799
3464C262799J39223j212j43282J21457N1606K321L0298K4075P2755p0192O3317
3453C553165Q9453k2538l7701J82795K01523n5523J6383J63428J2738N7628j15794
3442D045557L1093L2364j0576J1714J11947o509R9648J2223N4333O7472K2493
3431D471759L837J33089Q8355K5324M9952O7366N6011J07009P6709l631M1714
3420E117494K2683J99346J1739j58215Q0185Q3258m9755K03018J52971J10643
3410E773367J24914K73011R8593J23115J42749J36658J53954K3148J23433K22016
3400G194958J97561K76018J82172J65660K46612L03950K81569L15278L85594L42243
3390I891615M72481N54857N82093P69693Q43106Q27547R13689J170660J301006
$$ plain form
3464 3262799 3402022 3400810 3257528 3378985 3430591 3432912 3463210 3487285 3560040 3489848 3553165
3453 3553165 3642618 3620080 3582379 3765174 3966697 3911174 3927557 4090985 4103723 4161351 4045557
3442 4045557 4076650 4109014 4098438 4110152 4222099 4215590 4315238 4327461 4381794 4449266 4471759
3431 4471759 4475596 4608685 4697040 4722364 4772316 4839682 4895693 5002702 5079411 5075780 5117494
3420 5117494 5140177 5339523 5351262 5193047 5273232 5356490 5306735 5509753 5662724 5773367
3410 5773367 5898281 6171292 6269885 6393000 6535749 6672407 6826361 6849509 6972942 7194958
3400 7194958 7392519 7668537 7850709 8016369 8262981 8566931 8848500 9163778 9549372 9891615
3390 9891615 10364096 10918953 11501046 12270739 13113845 13941392 14855081 16025741 17326747
3381A7326747J398888J392516J478942J242354P75336P27523R51561J407687J554105
3372B8255659J833065K035735J872416J157536M02396J25697M1724O42435J100297
3363C7466960J534166J637694J101681Q2299r84184j605410j807313j121071o80731
3354C5624091k79954O455l76084j038322j869029k206164j831962j609235j492754
3345B4927042j000290q80433q95742j289578j528487j457709j398980j331497
3337A5144326j141560q88415p91840o06308o14383p05576m66259m41246l33776
3328I154963m19000l54559k57416l12189j91864j08500k39901k35223j41847k56646
3318F637818q0044j45242j34292j00358o4331j02761j2656l2488j58121j12924
$$ plain form
3381 17326747 18725635 20118151 21597093 22839447 23614783 24342306 25293867 26701554 28255659
3372 28255659 30088724 32124459 33996875 35154411 35556807 35682504 35724228 36366663 37466960
3363 37466960 39001126 40638820 41740501 41822800 40838616 39233206 37425893 36304822 35624091
3354 35624091 35344137 35350592 34974508 33936186 32067157 29860993 28029031 26419796 24927042
3345 24927042 23926752 23046319 22150577 20860999 19332512 17874803 16475823 15144326
3337 15144326 14002766 13114351 12322511 11716203 11101820 10396244 9929985 9488739 9154963
3328 9154963 8735963 8381404 8123988 7811799 7619935 7511435 7271534 7036311 6894464 6637818
3318 6637818 6557774 6412532 6278240 6177882 6113551 6010790 5998134 5965646 5807525 5694601
3308E694601r5202p7865M3233m462k06973j16011L373j87969Q5507j9235j81236
3297D937761Q1525m408j58931K0113l0735p9386N5401j29442K750J20151k1286
3286D793513J01410j50850j58977R557q628j08268n0716k0154j4164K51098j22763
3275D521058r6784J0735l4060K8413j33052l70N9922M3979q6724o3077j49400
3264D100640L4501J05517l5876L1509l1140p4182N7608j1577m7219P2245l8553
3253D163473Q1051N9985q0800q4854l2342n30q3168j08771K779J8553M4678j31193
3241C848861q2600N2782p3570P225O2492Q6791N568o7672k12056m6620k3277P138
3229C565062L0915p5896j6250O3047j3450k8387L4093O1337P6289j87684q2715
$$ plain form
3308 5694601 5599399 5521534 5564767 5560305 5353332 5237321 5240694 5052725 5138232 5118997 4937761
3297 4937761 5019286 5014878 4855947 4876060 4845325 4765939 4821340 4691898 4694648 4814799 4793513
3286 4793513 4894923 4744073 4585096 4594653 4586025 4477757 4427041 4406887 4392723 4643821 4521058
3275 4521058 4424274 4435009 4400949 4429362 4296310 4295940 4355862 4399841 4313117 4250040 4100640
3264 4100640 4135141 4240658 4204782 4236291 4205151 4130969 4188577 4177000 4129781 4202026 4163473
3253 4163473 4244524 4304509 4223709 4138855 4106513 4105983 4022815 3914044 3916823 3935376 3980054 3848861
3241 3848861 3766261 3819043 3745473 3752698 3815190 3901981 3907549 3839877 3627821 3581201 3557924 3565062
3229 3565062 3595977 3520081 3503831 3566878 3553428 3525041 3559134 3620471 3696760 3509076 3426361
3218C426361J9674J03219J5013O987J2845L0147o4426K6792K4456j51748j04090
3207C345230K36204K6471j02932J00709N1991O1766O7580M5220l3811L4981R9317
3196C932726j7212j39435j20813L882N4204j23181m0729Q3659j4268j6643J16458
3185C718648o1074N4063J07419J9893n2514N1927j21981m8487O8962J1127J1953
3174C759936K0105o4363j38475O2128K8296O9545k9515K9659j141M5989l1584
3163C750580J77897O4076l9451R1152K7935q5897k928R9232P2803O5266N054Q1323
3151D307042J18688j39480J7061J0899l6583O0285J40873P6216J06027j2774m8627
3140D599627J82203O67J02959J66660P0453n4097p6779p6840J39407n2766k06535
$$ plain form
3218 3426361 3446035 3549254 3564267 3571254 3584099 3614246 3549820 3576612 3601068 3449320 3345230
3207 3345230 3581434 3607905 3504973 3605682 3657673 3719439 3787019 3832239 3798428 3833409 3932726
3196 3932726 3915514 3776079 3655266 3659148 3713352 3590171 3549442 3633101 3618833 3602190 3718648
3185 3718648 3657574 3711637 3819056 3838949 3786435 3838362 3716381 3667894 3736856 3747983 3759936
3174 3759936 3780041 3715678 3577203 3639331 3667627 3737172 3707657 3737316 3736175 3782164 3750580
3163 3750580 3928477 3992553 3953102 4044254 4072189 3986292 3983364 4082596 4155399 4220665 4225719 4307042
3151 4307042 4425730 4286250 4303311 4314210 4277627 4337912 4478785 4555001 4661028 4648254 4599627
3140 4599627 4781830 4782497 4885456 5052116 5122569 5068472 4991693 4914853 5054260 5001494 4794959
3129D794959o1153j27647j34023J33736J698L7021k5908l7286j81813k1304j71548
3118D206732l5638P8866k4242j5106J1558O296N0645K9530k02078j12499J5962
3107D010026J7837j0524r521l0590M6354R925K6776J2645J42432r8991J85191
3096D301560j08899n4137p1853J7343K457M5097Q2046p0833L266r5610r161J34523
3084D175799M755O7158J29705l949q6910M8841J00895M0770N9353k3603L1416
3073D544230O8979L5060j05008R9525j12856P1481J63454O9596J10443Q755R7930
3062E051589J16578R3974J4193Q7965m9009j2286J82035q2054K05397J80219K26852
3051F015453Q7500r3905O7583J89393L354K5137K59052J06287P8551O4335Q8369
$$ plain form
3129 4794959 4733806 4606159 4472136 4605872 4607570 4644591 4618683 4581397 4399584 4378280 4206732
3118 4206732 4171094 4249960 4225718 4210612 4222170 4228466 4279111 4308641 4106563 3994064 4010026
3107 4010026 4027863 4017339 4007818 3977228 4023582 4033507 4060283 4072928 4215360 4116369 4301560
3096 4301560 4192661 4138524 4066671 4084014 4086471 4131568 4213614 4142781 4146047 4050437 4041276 4175799
3084 4175799 4180554 4247712 4377417 4373468 4286558 4335399 4436294 4477064 4536417 4512814 4544230
3073 4544230 4613209 4648269 4543261 4642786 4529930 4601411 4764865 4834461 4944904 4953659 5051589
3062 5051589 5168167 5262141 5276334 5364299 5315290 5303004 5485039 5402985 5608382 5788601 6015453
3051 6015453 6102953 6009048 6076631 6266024 6269378 6294515 6553567 6659854 6738405 6802740 6891109
3040F891109J90359J25187j5241J67824J16565o0883J28488K57314O9414R2568
3030G962704K83804K33684K46267K14263J30491J91195J16015L4504K17916R5966
3020I726809N3988J32405J52379R177J60952L64800L80283K95923L39098L98513
3010A2014327K70756M8721K88958L51555R1965J43570J03052N6883k2031K1669
3000A3369425j4077q8303j17378o4912j43182k88151q7526p6990j71663j01371
2990A2215872m6564K0048j19931n0959k6811p4723j7213J55003L6434R9462J24450
2979A2315068j6057J17869J15896p7421l00062k52522j38172k67176l02155j79755
2969A1015513N84j31023m3632K5967k27789Q5070L05299L0114o2586O0867r3517
$$ plain form
3040 6891109 7081468 7206655 7191414 7359238 7475803 7414920 7543408 7800722 7870136 7962704
3030 7962704 8246508 8480192 8726459 8940722 9071213 9262408 9378423 9412927 9630843 9726809
3020 9726809 9780797 9913202 10065581 10074758 10235710 10600510 10980793 11276716 11615814 12014327
3010 12014327 12285083 12333804 12622762 12974317 13066282 13209852 13312904 13369787 13347756 13369425
3000 13369425 13355348 13267045 13149667 13084755 12941573 12653422 12565896 12488906 12317243 12215872
2990 12215872 12169308 12189356 12069425 12018466 11991655 11916932 11899719 12054722 12091156 12190618 12315068
2979 12315068 12299011 12416880 12532776 12455355 12155293 11902771 11764599 11497423 11195268 11015513
2969 11015513 11016097 10885074 10841442 10867409 10639620 10724690 11029989 11060103 10997517 11058384 10964867
2958A0964867m55452n85594m33972k81116l61371k06091k31362k90717k09990
2949G909202j60511l16148l85515q4862k2453k85006k31048j36719q5788j66773
2939F034379j22529r8528q4917j28499j30305j99613j28111K068k22981j28858
2929D792106k126j21579j39142j02097j60648p2454n0365j24240j2014Q8331j03928
2918C991844j05172r3266j47084J25708J4171k21992J9173j2565j17599j19825
2908C333393O5653N4987r8712q2766k1246R7800l0324m0612Q218r9544q7531K5720
2896C125036j3531p3270J30952P504j54950k8441K8764q0028R269j12682p8408
2885B760215J16867N3260J04800J22349J05819L1178l5792Q334l9691j0207q0252
$$ plain form
2958 10964867 10509415 9923821 9489849 9208733 8847362 8641271 8409909 8119192 7909202
2949 7909202 7748691 7432543 7047028 6962166 6939713 6654707 6423659 6286940 6201152 6034379
2939 6034379 5911850 5813322 5728405 5599906 5469601 5269988 5141877 5143945 4920964 4792106
2929 4792106 4789980 4668401 4529259 4427162 4266514 4194060 4143695 4019455 4007441 4095772 3991844
2918 3991844 3886672 3793406 3646322 3772030 3786201 3564209 3583382 3570817 3453218 3333393
2908 3333393 3399046 3454033 3355321 3272555 3251309 3349109 3318785 3278173 3286391 3186847 3099316 3125036
2896 3125036 3111505 3038235 3169187 3176691 3021741 2993300 3022064 2942036 2951305 2838623 2760215
2885 2760215 2877082 2930342 3035142 3157491 3263310 3294488 3258696 3267030 3227339 3217132 3136880
2874C136880J60525J07413o2121O058K08004K46566K85262L90713K12834L82224
2864E074358Q51668Q83803P63245K11518m59968p26496p48951o53306m55106k64894
2854D475871m55549l96221j26576j01109k87290p9607n8054j18059r0641m4868
2844B717897n1823o0506j31894Q9482P809j63593j03247J08129j90100j23043
2834B099111L4463Q7546q90o7327L1826m1294k7007N2092j5266j06744N6101o7717
2822B034894q9187J1715j23411n9619J24581j01898L82k8645n4633O0100j04419
2811A669860j29165K08633l7813n8739J19650k4815j18708M0702R1352q6206j11192
2800A563559M8555O4782M8059q4325M5104J31l2418M0501K7636p3244j73828L7156
$$ plain form
2874 3136880 3297405 3404818 3342697 3348755 3556759 3803325 4088587 4479300 4692134 5074358
2864 5074358 5926026 6809829 7573074 7784592 7324624 6598128 5849177 5195871 4740765 4475871
2854 4475871 4020322 3624101 3497525 3396416 3109126 3029519 2971465 2853406 2762765 2717897
2844 2717897 2666074 2605568 2473674 2563156 2570965 2407372 2304125 2412254 2222154 2099111
2834 2099111 2133574 2221120 2220230 2152903 2184729 2143435 2116428 2168520 2153254 2046510 2102611 2034894
2822 2034894 1945707 1957422 1834011 1774392 1898973 1797075 1797457 1768812 1714179 1774279 1669860
2811 1669860 1540695 1749328 1711515 1652776 1772426 1747611 1628903 1669605 1760957 1674751 1563559
2800 1563559 1612114 1676896 1724955 1640630 1685734 1685865 1653447 1693948 1721584 1648340 1474512 1511668
2788A511668K3954q5768k8199n8862P7432J33253q076l2030O1205K7040j7115
2777A604502p0511M3050o132J9250k8665j77862m0243J62487J03854l3247o5652
2766A510831n8541j9053P7204q2653J9503J6617r6298O0218M7838p8156q9527
2755A307983p7537j02243O8577p8093P9857l4438J4752J01867O4906k10888J1586
2744A146329O6186K52j12389j42779n3484J35489q6003o666q9825P455N1137K102
2732I17804L2808P6513l065j46989K0068l1487K0170L8667j12933k3137O4243
2721H52662j16269M4893J0751m6034M7585N0710j31330J5398n3436k322J7667
2710F90275M1618j6259J18001j4763o0424L623m1961J44443j4339j14436l4604
$$ plain form
2788 1511668 1535622 1449854 1421655 1362793 1440225 1573478 1565402 1533372 1594577 1621617 1604502
2777 1604502 1533991 1577041 1570909 1590159 1561494 1383632 1343389 1505876 1609730 1576483 1510831
2766 1510831 1452290 1433237 1510441 1427788 1447291 1463908 1367610 1427828 1475666 1397510 1307983
2755 1307983 1230446 1128203 1196780 1118687 1198544 1164106 1178858 1280725 1345631 1134743 1146329
2744 1146329 1212515 1212767 1100378 957599 904115 1039604 953601 946935 857110 864565 915702 917804
2732 917804 950612 1027125 1024060 877071 897139 865652 885822 924489 811556 788419 852662
2721 852662 736393 781286 792037 746003 793588 844298 712968 728366 674930 672608 690275
2710 690275 731893 715634 833635 818872 758448 762071 720110 864553 850214 735778 701174
2699G01174J191J19006M2962p2176q1636O4999k3181J848Q5612j71821m2155j2722
2687F13101r530M2115N8415L6676n6514j21436p1205J14867K2900m6365n9943
2676E23081J0221M9294M4620o6368m1307K1051k3532Q8776M0446j02301j7802
2665E26179o4888R095P2147l2367r1133J57816j3081j64045M6077K112k1590k2741
2653D03581q8687J02797N8272n1616M9577J0773J74903N2082o4198l7430m7979
2642E62075l2141n8967l1205n9003J6248O1375j17771M8652N5222N4686q1432
2631D17739j00278M3315M1620j07755j5983M0565O7200j14040M5083o0661J3951
2620B70756p0986p006P0218k9735l9352K8699J0024O9046J65698j01923o5754
$$ plain form
2699 701174 702365 821371 864333 792157 710521 775520 752339 754187 839799 667978 625823 613101
2687 613101 603571 645686 704101 740777 684263 562827 491622 606489 629389 583024 523081
2676 523081 533302 582596 627216 560848 519541 540592 517060 605836 646282 543981 526179
2665 526179 461291 470386 542533 510166 419033 576849 563768 399723 445800 447912 426322 403581
2653 403581 314894 417691 475963 424347 473924 484697 659600 711682 647484 610054 562075
2642 562075 529934 470967 439762 380759 397007 458382 340611 389263 444485 499171 417739
2631 417739 317461 360776 402396 294641 278658 319223 386423 272383 317466 256805 270756
2620 270756 199770 192764 262982 233247 193895 222594 232618 301664 467362 365439 299685
2609B99685k8012N5153l772r0425j73566J07078Q3720j52101M8599J40731m9692
2598B37398J09110k1086R136P6035N8922r6739m8452q3945k9859N4617j20514
2587A44623q6061L6392k7960L7756r0857L7246R3307K7743P9686J70207n1050
2576C71032j26628k588l4414l8407n8466R341m5344k4359q9229J09036J4144j02389
2564a8271R0458Q0985J0931J87704p721j4645M171l9023j33387K3766K5059j1821
2552A98206q1611j44011J42394K5787R906J02438J40497j46347N5130m611j43213
2541A54565L6187J6178n1159L608o3448k2357N6304J1202L0769P3009j07259q6483
2529E1116K2405N5629n8722K438L208l7940R1966P673N9529p8215J1778L5030
$$ plain form
2609 299685 271673 326826 323054 232629 59063 166141 249861 97760 146359 287090 237398
2598 237398 346508 325422 334558 410593 469515 372776 324324 240379 210520 265137 144623
2587 144623 58562 94954 66994 104750 13893 51139 144446 172189 251875 422082 371032
2576 371032 244404 241816 207402 168995 110529 119870 74526 50167 -39062 69974 84118 -18271
2564 -18271 72187 153172 164103 351807 344086 329441 333612 294589 161202 184968 210027 198206
2552 198206 116595 -27416 114978 140765 150671 253109 393606 247259 302389 297778 154565
2541 154565 190752 206930 155771 159379 95931 73574 129878 141080 171849 244858 137599 51116
2529 51116 73521 129150 70428 72866 76074 38134 130100 137773 197302 119087 130865 165895
2517A65895j33066q4681J57869P5751j39066Q140J50532K6177p663n3649n3904
2506A12335M0452O4546j6326M4689j21639k0767m0041J10067j1515q1987K1234
2495A01048o164J02129J5869P7885j26312o2138K4236k0839J7938j10114n70R2780
2483A05748J5866j16005J45798k6671j52246O9948m2526k5710J13567L8780K410
2472A28959J07295P825j24775J999j5916R7833j73315o0008J65289R245k2945
2461A21486n3497J41813J3032q4212j20926N9614L9151K5151j99623j07625J40855
2450b4781L909k6083J27686N7L994j0485j1967k7330J27999p5938n1924o2733
2438b7596J5838J50632r2209j12544P2196R4621q7241L364J5662R1132o3494n4955
$$ plain form
2517 165895 32829 -51852 106017 181768 42702 50842 201374 227551 219888 166239 112335
2506 112335 152787 217333 201007 245696 124057 103290 63249 173316 161801 79814 101048
2495 101048 94884 197013 212882 290767 164455 102317 126553 105714 123652 13538 12968 105748
2483 105748 121614 5609 151407 124736 -27510 42438 -88 -25798 87769 126549 128959
2472 128959 236254 244079 119304 121303 105387 203220 29905 -30103 135186 144431 121486
2461 121486 67989 209802 222834 138622 17696 77310 116461 141612 -58011 -165636 -24781
2450 -24781 -20872 -46955 80731 80788 84782 74297 62330 35000 162999 87061 35137 -27596
2438 -27596 -11758 138874 46665 -65879 6317 100938 13697 17061 32723 123855 60361 5406
2426E406L3932Q9243J0896p9742n3914k346P059j09658j46120O9797O034J55917
2414a3496L6099m2775J82160R1878j00591o5791J25886j42077o8537J8412N6065
2403G7233K4313j55164p4842J98612L6081n4071q403l2438k1628J05706O7773
2392A63172j24280Q3399J65646n6623l6018j38298k4797J509j26820O2324n286
2381c6072P5137O6637o8441j17280P4371J20331J48957r000j18592r2138J4995
2370E8905n4869P8685o9593m1542L2065j9943k9949R3473L022j9776M242j08462
2358g3742J05275J51051n3234l8998o9084p7847P2307N2616J8553J3498k8642
2347G1753k7600J01280n1136n689Q2734J1891m6192P448j62059O1558J70003j56242
$$ plain form
2426 5406 39338 128581 139477 59735 5821 3475 10534 -99124 -245244 -175447 -169413 -13496
2414 -13496 22603 -20172 161988 253866 153275 87484 213370 71293 2756 21168 77233
2403 77233 101546 -53618 -128460 70152 106233 52162 43759 11321 -10307 95399 163172
2392 163172 38892 122291 287937 231314 195296 56998 32201 33710 -93110 -30786 -36072
2381 -36072 39065 105702 37261 -80019 -5648 114683 263640 254640 136048 43910 58905
2370 58905 4036 82721 13128 -28414 3651 -16292 -46241 47232 50254 30478 34720 -73742
2358 -73742 31533 182584 129350 90352 21268 -56579 15728 68344 86897 100395 71753
2347 71753 44153 145433 94297 88608 171342 183233 137041 144489 -17570 43988 213991 57749
2335E7749j43724J6164K8929P0915n3015R4671J3530k3438J12131n6315N2305
2324A69902J27704r3091j19561l8741L0484j2946L3880n1851j6025m4013r1699
2313a05957k5990J72486O2551o9476n3147P7296J70715j6366r0498m7489R7456
2302A71581L1719m964J4320n3473J18652n6490r8217M2899P205r011N6737l2373
2290A88585J01249P3129j71195n0441J91901M812n3175o7375K5815K05430R216
2279D57951j06277m733N8101K0198J6342j15825O4198J05362O9855j33968M104
2268D35308O6659K5601p9610p6223j00829Q605J26433J53039j08397Q6203J43592
2257F80381L0273p9206k1491R844n4637M1326M9275j07095l9130k022L6298L7971
$$ plain form
2335 57749 -85975 -69811 -40882 30033 -22982 71689 85219 61781 173912 117597 169902
2324 169902 297606 204515 84954 46213 76697 63751 97631 45780 29755 -14258 -105957
2313 -105957 -131947 40539 103090 33614 -19533 57763 228478 212112 121614 74125 171581
2302 171581 203300 198336 212656 159183 277835 221345 123128 166027 173232 164221 220958 188585
2290 188585 289834 362963 191768 141327 333228 338040 284865 217490 243305 448735 457951
2279 457951 351674 346941 405042 425240 441582 325757 389955 495317 565172 431204 435308
2268 435308 501967 527568 447958 371735 270906 279511 405944 558983 450586 536789 680381
2257 680381 710654 631448 609957 619801 565164 606490 655765 548670 509540 507518 543816 581787
2245E81787k7028J49101J7057q0918l9802j39670m3749J86656k2848j03378Q6511
2234E63719m7837m6660j07767M539m7104o1943J21473R2080k37N2812J35163k43579
2222D14659L2K7967m3511j38217r2721Q4242M1717q8120R299M7265p6681O5710
2210B51641O1697q1860J23491k3862J4991P0083p3910l9521L7786J0753L1240
2199C82529n3795m0310J55442k1713m9130M1207l6226j9169N7387l0669O904j9601
2187C72856J7498R1014j32671n6748Q7298r4390N628M6746J19249l5582n4549
2176C66349J78297m6218k19559m0430J57908R2358j23408L6806N3633M2130p4172
2165D23694q6717r2889M9099O4741R704j016J01449J96111r1712o2338l025N6624
$$ plain form
2245 581787 554759 703860 720917 639999 600197 460527 416778 603434 580586 477208 563719
2234 563719 515882 469222 361455 365994 318890 256947 378420 470500 470263 523075 658238 414659
2222 414659 414691 442658 399147 260930 168209 252451 294168 206048 215347 262612 185931 251641
2210 251641 313338 231478 354969 331107 346098 416181 342271 302750 340536 351289 382529
2199 382529 328734 288424 443866 422153 373023 414230 378004 358835 416222 385553 392457 372856
2187 372856 390354 481368 348697 291949 379247 284857 290485 337231 456480 420898 366349
2176 366349 544646 498428 278869 238439 396347 488705 365297 402103 455736 497866 423694
2165 423694 336977 244088 293187 357928 367632 366616 468065 664176 572464 510126 507101 563725
2153E63725l8814R1536j04931o6856J89168o6840o3621J43227P9019m1510n4519
2142F29584M4275J04366P4844k0836J46489P6097P4752R0480m6710p7352K61975
2131A357964K14425j39623m3787J37941N8933q3539N8220m5670j14684L8257P3467
2120A511904j13685m9356L8071J9401j01186R0391J28767K7461O0767K57713J47270
2109B017518J21080J46946m23j71022j57949j17499j40376k06561O6001j06466
2099A451249k54568N8143K5903j36395m5743R3845p6407L8479o2475J5898L4210
2088A142139N764l0616P8346K162l5715R1101J29551J71204J61213K0751J55027
2077A890927K79133L46191R1145M69225L27083j35961l46601m19469l76382k71487
$$ plain form
2153 563725 524911 616447 511516 444660 633828 566988 503367 646594 725613 684103 629584
2142 629584 673859 778225 853069 832233 978722 1054819 1129571 1220051 1173341 1095989 1357964
2131 1357964 1572389 1432766 1388979 1526920 1585853 1502314 1560534 1514864 1400180 1438437 1511904
2120 1511904 1398219 1348863 1386934 1406335 1305149 1395540 1524307 1551768 1612535 1870248 2017518
2109 2017518 2138598 2285544 2285121 2114099 1956150 1838651 1698275 1491714 1557715 1451249
2099 1451249 1196681 1254824 1280727 1144332 1098589 1192434 1116027 1154506 1092031 1107929 1142139
2088 1142139 1147903 1117287 1195633 1197795 1162080 1253181 1382732 1553936 1715149 1735900 1890927
2077 1890927 2170060 2516251 2607396 3076621 3403704 3267743 2921142 2501673 2125291 1853804
2067A853804k39183j18201m4478p4394o4932o4849j12317m1045J07455O8173r0814
2056A179219q9507O6286n4551L1960L7761K3667m4565j5246j05648J09843R4133
2045A233352l3521L6812J02178J27745K62019J75954L6531L0808j91751k46216
2035A533911j95781j20434j28806j20436j62647j18865J39339l1748j47695K7894
2025F74732m3584k5274M1410r5578m9423J5935j24122n9023J43095j18588o5833
2014B93747M3914P2499Q4486J66029q5659j04578m3640J4896M4469j82328J2929
2003C16764N4227q6673j30441m5927J45056k299m9518k8261K2907m0704N9479
1992B14610L7100N4169n844l7771Q758O7175o408j34294j17108J32447N7981k5009
$$ plain form
2067 1853804 1614621 1496420 1451942 1377548 1312616 1247767 1135450 1094405 1201860 1270033 1179219
2056 1179219 1089712 1155998 1101447 1133407 1171168 1194835 1150270 1135024 1029376 1139219 1233352
2045 1233352 1199831 1236643 1338821 1466566 1728585 1904539 1941070 1971878 1780127 1533911
2035 1533911 1338130 1217696 1088890 968454 805807 686942 826281 794533 646838 674732
2025 674732 631148 605874 647284 551706 502283 518218 394096 335073 478168 359580 293747
2014 293747 337661 410160 494646 660675 575016 470438 426798 441694 486163 303835 316764
2003 316764 370991 284318 153877 107950 253006 250707 201189 172928 195835 155131 214610
1992 214610 251710 305879 300035 262264 271022 338197 331789 197495 80387 212834 270815 245806
1980B45806o3187k368k6625O9504p968m6497J29233J2358N8447r3924p5305L5792
1968B35266L745k07989P9777L0258r1292O8281M0279j01563Q2545Q3400l3296
1957A89411j06933j8985J68847r1358j9026J19926n8555j22857N0080J16299j05632
1946A21217j08560J3274j8845J9886Q5870P5814J34105j12923o1762l646M1553
1935A85983m5135N1863j16965j06458R9396P188K196K2560m1503j7762R4078r4169
1923D1272K9530M2880R712L2644q385n926N819p6159m2033K6103m6985M8289O7350
1910A24111l9663l7230n7656N9326R7756n6291J05560P074n4568R4514R0911j24226
1898B09618k06528r9414r9319J2996O4141K2714Q821M1761L2383J48441O4703
$$ plain form
1980 245806 182619 180251 153626 223130 215162 168665 297898 310256 368703 274779 199474 235266
1968 235266 239011 31022 110799 141057 49765 118046 158325 56762 139307 222707 189411
1957 189411 82478 63493 232340 140982 121956 241882 183327 60470 110550 226849 121217
1946 121217 12657 25931 7086 26972 112842 188656 322761 209838 148076 144430 185983
1935 185983 140848 192711 75746 -30712 68684 75872 78068 100628 59125 41363 135441 41272
1923 41272 70802 113682 123394 156038 147653 141727 147546 71387 29354 55457 8472 56761 124111
1910 124111 84448 47218 -10438 48888 146644 90353 195913 202987 148419 242933 333844 209618
1898 209618 3090 -96324 -195643 -182647 -118506 -95792 -86971 -45210 -12827 135614 200317
1887B00317j28934n6351J627J00065l8187O0349j15812Q9526j2341j10138J45274
1876A35395N1525n0214J8745j67570r0272J21032J15043l9657j10789j01791O6118
1865e2435J64528j19973n9051N5218k0900K7531N3903m0279m2965M9125n2181
1854c7479m9330J13935p929j9146N2444J5324j03664j14057J10549J12397k0057
1843E2987j5577K7219K06737j05250j09821p3516q6945P8687J1965j80446J26522
1832f7438M7042k9198L304P1986O3725K2150N858k1258l6272m1579M3266p6098
1820a4512J7795R7301K663p3710j968n6967o5269o8912K1883J24938R11K1184
1808E337j8437N636M6594K0688p3337K9394J71040P2073k28325M6667j3201p4244
$$ plain form
1887 200317 71383 15032 16659 116724 78537 138886 23074 112600 100259 -9879 135395
1876 135395 186920 136706 155451 -12119 -102391 18641 133684 94027 -16762 -118553 -52435
1865 -52435 112093 -7880 -66931 -11713 -32613 -5082 48821 8542 -34423 14702 -37479
1854 -37479 -86809 27126 19197 51 52495 67819 -35845 -149902 -39353 73044 52987
1843 52987 37410 64629 271366 166116 56295 -17221 -104166 -25479 -13514 -193960 -67438
1832 -67438 -20396 -49594 -46290 25696 89421 111571 117429 96171 59899 18320 61586 -14512
1820 -14512 3283 100584 103247 29537 27569 -29398 -94667 -163579 -141696 -16758 -15847 5337
1808 5337 -13100 -7464 39130 59818 -13519 15875 186915 258988 30663 77330 64129 -10115
1796a0115m1254L0069L0411K9402o6032j7276n8811Q1685J14535n6688Q2644P348
1784A25918O6881k0476J599q5074k3641j6539L509J3531l828J188j39116o7568
1772a43616Q2239K4608J60131J4521k0710L1291l568J13170K2441m3041p9259
1761A58207O289k2770j1661o3597K1372n7784J9902p1358k9278R6836P4495R4166
1749B14819j31659M3973J13118n6440q0831K9984o211j42053J13523N0160n4695
1738I3688r9402o226o8179n944J40561l4827N1509N9689r850O6830k0110o8196
1726I9543O6030j08778j73780N3424N6690j05426K3626l2289O5934K8587P8818
1715E2379n4932J16136l5731q0136R8678O9869J2592j75243n8420J5811l411J69170
$$ plain form
1796 -10115 -51369 -21300 9111 38513 -27519 -44795 -103606 -21921 92614 35926 118570 125918
1784 125918 192799 172323 173922 88848 65207 48668 52177 65708 61880 63068 -76048 -143616
1772 -143616 -61377 -36769 123362 137883 117173 148464 144896 258066 280507 237466 158207
1761 158207 164496 141726 130065 66468 87840 30056 49958 -21400 -50678 46158 120653 214819
1749 214819 83160 127133 240251 183811 102980 132964 126753 -15300 98223 148383 93688
1738 93688 -5714 -11940 -80119 -86063 54498 19671 71180 130869 121019 187849 167739 99543
1726 99543 165573 56795 -116985 -63561 -6871 -112297 -88671 -120960 -55026 -26439 52379
1715 52379 -2553 113583 77852 -2284 96394 166263 178855 3612 -54808 -38997 -42408 126762
1703A26762j3620j60241j48968P154R3100P6476n3901K1401j04651M6166J96898
1692H6576L3323k41476P9916N8961p2835O3670R6264j8501m8140j76266M3449
1681i5059O7964p5640P2641j2920j63860l817J22915q604m6034n0143P3214J18295
1669a048n1319j8038N8867j14513J11469k0045J21766K2214j71252P5438Q5563
1658I9102j43154o6131J6678L6684j08700l6266P0015O0447j15678o9910O2178
1647a94735J02271L5686R8329o7889p614O7958k3326j23720K0631J14912j37499
1636a14996j27556k513J78754J22885j37712P1888R1226j43081l7750M2530p121
1625f3446m1092q2984j5066Q4212M5622j22353n7891J6917J40769K2221p2753
$$ plain form
1703 126762 113142 -47099 -196067 -188913 -95813 -19337 -73238 -51837 -156488 -110322 86576
1692 86576 119899 -121577 -41661 17300 -55535 8135 104399 85898 37758 -138508 -95059
1681 -95059 -27095 -102735 -30094 -43014 -206874 -210691 -87776 -96380 -142414 -192557 -119343 -1048
1669 -1048 -52367 -70405 -11538 -126051 -14582 -34627 87139 109353 -61899 13539 99102
1658 99102 -44052 -110183 -93505 -56821 -165521 -201787 -131772 -71325 -187003 -256913 -194735
1647 -194735 -92464 -56778 41551 -26338 -33952 34006 10680 -113040 -92409 22503 -114996
1636 -114996 -242552 -245065 -66311 56574 -81138 -9250 81976 -61105 -98855 -56325 -63446
1625 -63446 -104538 -187522 -202588 -118376 -72754 -195107 -252998 -236081 -95312 -73091 -145844
1614a45844J8524P5691n0178n609o1232R8914J01702j02240j5534j9326N4009
1603e1123l378n2759j60372N5975J18251q1298J1732l1071J7130K9309n0613J234
1591a96983m0659L1420j02140M4436J67526M5901j09603N1881J06850m2622J0365
1580c3628J5872J492l5665j16580o4952n3856Q3577J7771o1093j44930J08107
1569b83885l8929R1213J91246j90578K6418P4444P6625R7709N5924o5424q010
1558B6753p2562R5582L136j26067j39341P9144j4917j04785p9575Q2229m9977
1547c00380J2174R0296m3596k5971J25931N3559N9027R3498j05299k6049l9345
1536a06155k7198j9318k3054Q7942J34534j35617j72314R6187K26880n6439k18157
$$ plain form
1614 -145844 -127320 -51629 -101807 -107416 -168648 -69734 31968 -70272 -85806 -105132 -51123
1603 -51123 -54501 -107260 -267632 -211657 -93406 -174704 -162972 -194043 -176913 -147604 -198217 -196983
1591 -196983 -237642 -206222 -308362 -263926 -96400 -50499 -160102 -108221 -1371 -43993 -33628
1580 -33628 -17756 -16264 -51929 -168509 -233461 -287317 -203740 -185969 -247062 -391992 -283885
1569 -283885 -322814 -231601 -40355 -230933 -204515 -130071 -53446 44263 100187 34763 26753
1558 26753 -45809 49773 52909 -73158 -212499 -133355 -148272 -253057 -332632 -250403 -300380
1547 -300380 -288206 -197910 -241506 -267477 -141546 -87987 -28960 64538 -40761 -66810 -106155
1536 -106155 -133353 -152671 -175725 -87783 46751 -88866 -261180 -164993 61887 5448 -212709
1525b12709K6915R8224r814j6663l1473J5341l5138J7087j3868p541m0292P8490
1513a31441o3797k2157J16941R5678n9175n1713N7668n9099j28313q199M6073
1502b07534J74689m963j0160j3458k179j12262n0880K4815o2378J38991j32699
1491b58018q1802J39719J41846l0302o0398m1022L6001J4179j20427N5135J31953
1480g3136j260j13024n349J61494J638j27208m2348j258Q8215J10590m1973j90
1468d3809J13941j10737j47615q1808O2890O5811l5011r9683J07182M0293o7180
1457a95726M5095O954K1124k3688m5959K1486J45449P2055r8585n2982n9129l1645
1445a95551m398Q606l1628J25660J16076k13134q377R223k6904M9687N0623N1001
$$ plain form
1525 -212709 -185794 -87570 -97384 -114047 -145520 -130179 -165317 -148230 -162098 -169639 -209931 -131441
1513 -131441 -195238 -217395 -100454 -4776 -63951 -115664 -57996 -117095 -245408 -253607 -207534
1502 -207534 -32845 -37808 -47968 -61426 -63605 -175867 -226747 -201932 -264310 -125319 -258018
1491 -258018 -339820 -200101 -58255 -88557 -148955 -189977 -153976 -139797 -260224 -205089 -73136
1480 -73136 -74396 -187420 -192769 -31275 -29637 -156845 -199193 -200451 -112236 -1646 -43619 -43809
1468 -43809 70132 -40605 -188220 -270028 -207138 -141327 -176338 -276021 -168839 -128546 -195726
1457 -195726 -150631 -143677 -122553 -146241 -192200 -170714 -25265 46790 -51795 -104777 -163906 -195551
1445 -195551 -199949 -191343 -222971 -97311 18765 -194369 -202746 -193523 -220427 -170740 -120117 -69116
1433f9116L7820p9175n4260R4587k0440q8024L3135O2424k6995J9019m708r1136
1421a86869k557R1992n8110O605J14728K8776q0834j7369j32833J64897J46258
1410G4684o4770N713o4411p1244p9538P4275j1032k5885N3944n5370r3355J10418
1398a46571J14549R4406m7742p1980j7153L3634j64085k3246P0064j20096k4837
1387c03057K53699L0033j54807P1544N735k529m4674l9769J46648J1611j6087
1376d1653o5660m1585n4338J20479j5000j5071N2088m2879N8817K0754o2478k251
1364h8777r5008J6690j8708K922J60304j2022j08258O8525l5207p8044l7589K8062
1352a97110j0163K1506K3400O1818M6310o4754R4304J4186K4509L9101l8478j06713
$$ plain form
1433 -69116 -31296 -110471 -164731 -70144 -90584 -178608 -145473 -83049 -110044 -91025 -95733 -186869
1421 -186869 -189426 -97434 -155544 -148939 -34211 -5435 -86269 -103638 -236471 -71574 74684
1410 74684 9914 15627 -48784 -120028 -199566 -125291 -136323 -162208 -108264 -163634 -256989 -146571
1398 -146571 -32022 62384 14642 -57338 -74491 -40857 -204942 -228188 -158124 -278220 -303057
1387 -303057 -49358 -19325 -174132 -102588 -96853 -99382 -144056 -183825 -37177 -25566 -41653
1376 -41653 -107313 -148898 -203236 -82757 -97757 -112828 -60740 -103619 -44802 -24048 -86526 -88777
1364 -88777 -183785 -167095 -185803 -182881 -22577 -34599 -142857 -74332 -109539 -187583 -225172 -197110
1352 -197110 -207273 -185767 -162367 -100549 -54239 -118993 -24689 -10503 14006 53107 14629 -92084
1340i2084q0770P6313p6969n1297Q3148l8338r1270j2582l9857M8945R7870k073
1328a78964Q5758K5151m8157Q2587L7817j25753O3170N0584j11427M9026q7136
1317a57344r9688J11506j66533O8541N6614J04142k6495L1778p4915O3977J12414
1306B3997j24058r1607P6046Q3729l3466o7358K9270l8058N4944j4993j7345n050
1294a23949j26446Q2919J74910r6980j33215P0022L3031k0163M5762N634k3375
1283a11850l8478R93M5796j04019R4885J43551K4487j64688n4073N5104J23327
1272A5035J7019l0229m268j49636R0864k4474j74375P9950J25252q4643q3504
1261b23009K4515K6178R6188Q60j23219m503J47305K1680R1368L8948o5554k6018
$$ plain form
1340 -92084 -172854 -96541 -173510 -224807 -141659 -179997 -271267 -283849 -323706 -274761 -176891 -178964
1328 -178964 -93206 -68055 -116212 -33625 4192 -121561 -58391 -7807 -119234 -70208 -157344
1317 -157344 -257032 -145526 -312059 -243518 -186904 -82762 -109257 -77479 -152394 -88417 23997
1306 23997 -100061 -191668 -115622 -31893 -65359 -132717 -103447 -141505 -86561 -101554 -118899 -123949
1294 -123949 -250395 -167476 7434 -89546 -222761 -152739 -119708 -139871 -94109 -88475 -111850
1283 -111850 -150328 -149335 -103539 -207558 -112673 30878 55365 -109323 -163396 -108292 15035
1272 15035 32054 1825 -2443 -152079 -61215 -85689 -260064 -180114 -54862 -139505 -223009
1261 -223009 -198494 -172316 -76128 -75268 -198487 -202990 -55685 -34005 57363 96311 30757 4739
1249D739p5054N3035Q471m0867k03953J9149n4976o8617J87913L4312j059O4911
1237g1996p0195j23202J55339J24834p1868l8387O6893P3999k5943j3230P0926
1226G7170o5189n3704r9114j36608O5878Q1586m9373P698j6063P3539N2747j20052
1214a81485J46446M0158j5045j05160r930r1998L6715J40933r1906j738K8541
1203a04469l6301J13216P1342j718n9312o4854J28332j7881j28279n7392J5959
1192a41357m9591k8991n1396M8378R4709J66578j28809j14379K9406K03357q0563
1181e2658M582o1810N9941J08898M7665o5953m0613r1697l9368j0359o2174N0511
1169a53035M6850r2232O7886J31744l4932m5182P3053j0368j12581j15012K1730
$$ plain form
1249 4739 -70315 -17280 -8809 -49676 -253629 -234480 -289456 -358073 -170160 -135848 -136907 -71996
1237 -71996 -142191 -265393 -110054 14780 -57088 -95475 -28582 45417 19474 6244 77170
1226 77170 11981 -41723 -140837 -277445 -211567 -129981 -179354 -171656 -187719 -114180 -61433 -181485
1214 -181485 -35039 5119 -9926 -115086 -125016 -217014 -180299 -39366 -131272 -133010 -104469
1203 -104469 -140770 -27554 43788 42070 -17242 -82096 46236 28355 -99924 -157316 -141357
1192 -141357 -190948 -219939 -271335 -222957 -128248 38330 -90479 -204858 -175452 27905 -52658
1181 -52658 -48076 -109886 -49945 58953 106618 40665 52 -91645 -131013 -141372 -203546 -153035
1169 -153035 -106185 -198417 -130531 1213 -33719 -78901 -5848 -16216 -128797 -243809 -222079
1158b22079J96467q3015j7719L8525J31147m7339j09965Q35L0930K9385J21080
1147F8252Q868j05559n2571J2571k7863n9970Q6816R2587p5876p5791r4784J92404
1135c0916j9017j38144k1134j554R5591N3996j2342m890K04633j45860j31649
1124a51286J39728n808L4187N1452j88696l9163N8369k0029j2883O5103r7627
1113a66653l1822L3570M5848m359n0359J6452Q8707O9219K9011l059p1233N0654
$$ plain form
1158 -222079 -25612 -108627 -126346 -87821 43326 -4013 -113978 -113143 -82213 -52828 68252
1147 68252 77120 -28439 -81010 -68439 -96302 -156272 -69456 23131 -52745 -128536 -223320 -30916
1135 -30916 -49933 -188077 -209211 -210765 -115174 -61178 -73520 -78410 126223 -19637 -151286
1124 -151286 -11558 -17366 16821 68273 -120423 -159586 -101217 -121246 -134129 -69026 -166653
1113 -166653 -198475 -164905 -119057 -123416 -173775 -157323 -68616 603 29614 26555 -44678 5976
$$ [...]
##END NTUPLES=NMR SPECTRUM
##END=
