##TITLE=1H_TG-2308-IVa
 CDCl3
 8 sc, 
 6.10.2023
##JCAMPDX= 6.0         $$ Bruker NMR JCAMP-DX V2.0
##DATA TYPE= NMR SPECTRUM
##DATA CLASS= NTUPLES
##ORIGIN= UXNMR, Bruker Analytische Messtechnik GmbH
##OWNER= root
$$ XWIN-NMR		Version 3.5
$$ Fri Oct  6 14:15:10 2023 Russian Standard Time (UT+4h)  she@DPX200
##.OBSERVE FREQUENCY= 200.13135
##.OBSERVE NUCLEUS= ^1H
##.ACQUISITION MODE= SIMULTANEOUS
##.ACQUISITION SCHEME= undefined
##.AVERAGES= 8
##.DIGITISER RES= 18
##SPECTROMETER/DATA SYSTEM= spect
##.PULSE SEQUENCE= zg30
##.SOLVENT NAME= DMF
##.SHIFT REFERENCE= (INTERNAL, DMF, 0, 15.7524)
##AUDIT TRAIL= $$ (NUMBER, WHEN, WHO, WHERE, WHAT)
$$ ##TITLE= Audit trail, XWIN-NMR		Version 3.5
$$ ##JCAMPDX= 5.01
$$ ##ORIGIN= Bruker BioSpin GmbH
$$ ##OWNER= she
$$ F:/spectra/data/she/nmr/H-F/1/pdata/1/auditp.txt
$$ ##AUDIT TRAIL=  $$ (NUMBER, WHEN, WHO, WHERE, WHAT)
(   1,<2023-10-06 14:13:59.81 +0400>,<she>,<DPX200>,
      <created by zg, POWCHK disabled, PULCHK disabled
       configuration hash MD5:
       00 E9 B6 7A A2 85 ED C7 34 08 36 98 17 FE 4E 26
       data hash MD5: 16K
       5F DA 48 3C 4B 52 BB 3B 4C E4 9E C8 95 CC EC 2F>)
(   2,<2023-10-06 14:14:04.10 +0400>,<she>,<DPX200>,
      <Start of raw data processing
       efp BC_mod = 2 LB = 0.24 FT_mod = 6 PKNL = 1 PHC0 = -22426.25 PHC1 = 6.252712 SI = 16K 
       data hash MD5: 16K
       AB C3 22 DF 64 26 FE 41 63 38 A1 F7 7C 10 B7 55>)
(   3,<2023-10-06 14:14:22.26 +0400>,<she>,<DPX200>,
      <pk PHC0 = -4.161928 PHC1 = 6 
       data hash MD5: 16K
       14 02 85 86 45 45 D2 8B CE D2 5C 25 2A DF 3B ED>)
(   4,<2023-10-06 14:14:26.25 +0400>,<she>,<DPX200>,
      <abs ABSG = 5 
       data hash MD5: 16K
       CF B4 C0 27 F9 0D 30 F9 B7 A1 85 25 0E ED 2C A1>)
$$ ##END=
$$ 
$$ hash MD5
$$ 8F E1 0B 8B 88 27 CF FA C5 E7 31 4F EB 6A 9A BA
##$RELAX= 
##$RELAX= 
##$RELAX= 
##$RELAX= 
##$RELAX= 
##$RELAX= 
$$ Bruker specific parameters
$$ --------------------------
##$DU= <F:/spectra>
##$EXPNO= 1
##$NAME= <H-F>
##$PROCNO= 1
##$TYPE= <nmr>
##$USER= <she>
##$AMP= (0..31)
100 100 100 100 100 100 100 100 100 100 100 100 100 100 100 100 100 100 
100 100 100 100 100 100 100 100 100 100 100 100 100 100 
##$AQSEQ= 0
##$AQ_mod= 1
##$AUNM= <au_zg>
##$AUTOPOS= <>
##$BF1= 200.13
##$BF2= 200.13
##$BF3= 200.13
##$BF4= 200.13
##$BF5= 200.13
##$BF6= 200.13
##$BF7= 200.13
##$BF8= 200.13
##$BYTORDA= 1
##$CFDGTYP= 0
##$CFRGTYP= 5
##$CHEMSTR= <none>
##$CNST= (0..31)
1 1 145 1 1 1 1 1 1 1 1 1 1 1 1 1 1 1 1 1 1 1 1 1 1 1 1 1 1 1 1 1 
##$CPDPRG= <>
##$CPDPRG1= <>
##$CPDPRG2= <>
##$CPDPRG3= <>
##$CPDPRG4= <mlev>
##$CPDPRG5= <mlev>
##$CPDPRG6= <mlev>
##$CPDPRG7= <mlev>
##$CPDPRG8= <mlev>
##$CPDPRGB= <>
##$CPDPRGT= <>
##$D= (0..31)
0 1.2 0 0 0 0 0 0 0 0.06 0 0.03 0 0 0 0 0.0002 0 0 0 0 0 0 0 0 0 0 0 0 
0 0 0 
##$DATE= 1696587239
##$DBL= (0..7)
120 120 120 120 120 120 120 120 
##$DBP= (0..7)
150 150 150 150 150 150 150 150 
##$DBP07= 0
##$DBPNAM0= <>
##$DBPNAM1= <>
##$DBPNAM2= <>
##$DBPNAM3= <>
##$DBPNAM4= <>
##$DBPNAM5= <>
$$ [...]
##$SUBNAM3= <"">
##$SUBNAM4= <"">
##$SUBNAM5= <"">
##$SUBNAM6= <"">
##$SUBNAM7= <"">
##$SUBNAM8= <"">
##$SUBNAM9= <"">
##$SW= 18.05172834244
##$SWIBOX= (0..15)
0 0 2 0 0 0 0 0 0 0 0 0 0 0 0 0 
##$SW_h= 3612.71676300578
##$TD= 16384
##$TD0= 1
##$TE= 0
##$TE2= 300
##$TE3= 300
##$TEG= 300
##$TL= (0..7)
0 120 120 120 120 120 120 120 
##$TP= (0..7)
150 150 150 150 150 150 150 150 
##$TP07= 0
##$TPNAME0= <>
##$TPNAME1= <>
##$TPNAME2= <>
##$TPNAME3= <>
##$TPNAME4= <>
##$TPNAME5= <>
##$TPNAME6= <>
##$TPNAME7= <>
##$TPOAL= (0..7)
0.5 0.5 0.5 0.5 0.5 0.5 0.5 0.5 
##$TPOFFS= (0..7)
0 0 0 0 0 0 0 0 
##$TUNHIN= 0
##$TUNHOUT= 0
##$TUNXOUT= 0
##$USERA1= <user>
##$USERA2= <user>
##$USERA3= <user>
##$USERA4= <user>
##$USERA5= <user>
##$V9= 5
##$VALIST= <valist>
##$VCLIST= <CCCCCCCCCCCCCCC>
##$VD= 0
##$VDLIST= <DDDDDDDDDDDDDDD>
##$VPLIST= <PPPPPPPPPPPPPPP>
##$VTLIST= <TTTTTTTTTTTTTTT>
##$WBST= 1024
##$WBSW= 4
##$XGAIN= (0..3)
0 0 0 0 
##$XL= 0
##$YL= 0
##$YMAX_a= 380349
##$YMIN_a= -553398
##$ZGOPTNS= <>
##$ZL1= 120
##$ZL2= 120
##$ZL3= 120
##$ZL4= 120
##$ABSF1= 15.85597
##$ABSF2= -2.195881
##$ABSG= 5
##$ABSL= 3
##$ALPHA= 0
##$AQORDER= 0
##$ASSFAC= 0
##$ASSFACI= 0
##$ASSFACX= 0
##$ASSWID= 0
##$AUNMP= <proc_1d>
##$AZFE= 0.1
##$AZFW= 0.1
##$BCFW= 0
##$BC_mod= 2
##$BYTORDP= 0
##$COROFFS= 0
##$CY= -3
##$DATMOD= 1
##$DC= 0
##$DFILT= <>
##$DTYPP= 0
##$F1P= 0
##$F2P= 0
##$FCOR= 1
##$FTSIZE= 16384
##$FT_mod= 6
##$GAMMA= 0
##$GB= 0
##$INTBC= 1
##$INTSCL= 3.70164e-10
##$ISEN= 128
##$LB= 0.24
##$LEV0= 0
##$LPBIN= 0
##$MAXI= 10000
##$MC2= 0
##$MEAN= 0
##$ME_mod= 0
##$MI= 1.114404
##$NCOEF= 0
##$NC_proc= -6
##$NLEV= 6
##$NOISF1= 3.799351
##$NOISF2= 2.8
##$NSP= 0
##$NTH_PI= 0
##$NZP= 0
##$OFFSET= 15.7524
##$PC= 1
##$PHC0= -22430.41
##$PHC1= 12.25271
##$PH_mod= 1
##$PKNL= yes
##$PPARMOD= 0
##$PSCAL= 0
##$PSIGN= 0
##$REVERSE= no
##$SF= 200.130003831828
##$SI= 16384
##$SIGF1= 3
##$SIGF2= 2
##$SINO= 5.538805
##$SIOLD= 16384
##$SREGLST= <1H.CDCl3>
##$SSB= 0
##$STSI= 16384
##$STSR= 0
##$SW_p= 3612.71676300578
##$SYMM= 0
##$S_DEV= 0
##$TDeff= 16384
##$TDoff= 0
##$TI= <>
##$TILT= no
##$TM1= 0
##$TM2= 0
##$TOPLEV= 0
##$USERP1= <user>
##$USERP2= <user>
##$USERP3= <user>
##$USERP4= <user>
##$USERP5= <user>
##$WDW= 1
##$XDIM= 16384
##$YMAX_p= 269017204
##$YMIN_p= -264321
$$ End of Bruker specific parameters
$$ ---------------------------------
##NTUPLES= NMR SPECTRUM
##VAR_NAME=  FREQUENCY,     SPECTRUM/REAL,   SPECTRUM/IMAG
##SYMBOL=    X,             R,               I
##VAR_TYPE=  INDEPENDENT,   DEPENDENT,       DEPENDENT
##VAR_FORM=  AFFN,          ASDF,            ASDF
##VAR_DIM=   16384,         16384,           16384
##UNITS=     HZ,            ARBITRARY UNITS, ARBITRARY UNITS
##FACTOR=    0.220516191357247, 1,           1
##FIRST=     3152.52795206314, 0,            0
##LAST=      -460.18881094264, 0,            0
##MIN=       -460.18881094264, -264321,      0
##MAX=       3152.52795206314, 269017204,    0
$$ Real data points
##PAGE= N=1
##DATA TABLE= (X++(R..R)), XYDATA
$$ [...]
7097H2400439K452039l005947p821386j0420322j0725133r354903p257384n400387
7089C0867016m110413k990820k288792j934285j378444j090095q38879q69920
7081A5365368o55312p56931o86726n49564n26117m58093m24826l53062k20596
7072A0734141o5665j07537l0323R5165K58909N22254N28786M08943L30699P8342
7062A2753714l27787n39709r22740j122387j076685o77636o76513n78151m86007
7053F346099k99253k28388k92936j83879k80328k11412k09813k48987k89029o3904
7043D038170j43922K8924j1971k22265j00803J893k06497n5498P3445j51661L4636
7032C284451q3048j91269o4635q1723p6657r5286l1851N9041l8844q9485N0916
$$ plain form
7097 82400439 84852478 81846531 74025145 63604823 52879690 43524787 36267403 30867016
7089 30867016 26756603 23765783 21476991 19542706 18164262 17074167 16235288 15365368
7081 15365368 14710056 13953125 13266399 12716835 12190718 11732625 11307799 10954737 10734141
7072 10734141 10668476 10560939 10530616 10625781 10884690 11406944 11935730 12344673 12675372 12753714
7062 12753714 12425927 11886218 10963478 9841091 8764406 8086770 7410257 6832106 6346099
7053 6346099 6046846 5818458 5525522 5341643 5061315 4849903 4640090 4391103 4102074 4038170
7043 4038170 3894248 3923172 3911201 3688936 3588133 3590026 3383529 3328031 3401476 3249815 3284451
7032 3284451 3201403 3010134 2945499 2863776 2787119 2691833 2659982 2719023 2680179 2590694 2641610
7021B641610p5508j8294L6750J516j1833q9349j358M8828M8713l9094l1993M0407
7009B550395l7265l2135m5777q0918J67486N5893k5656m8393o9429j63536r1485
6998B179180O3567P3012N1652k0468n023P5090J7749j51828j5782N9317K641K9457
6986B358564p0621m4255J23750M2580m6493l0801L3587J3152K9485J7028r4133
6975B331843O5396N3811l7559m5768J14213L5412l4331K7944k482J9504L3247
6964B561230J48M6621N0534o1574O403R7922L20j1752O7758o6052N8536J23259
6952B873353J6954M3927K30819k7840P6995J40771K4887J54388J82256K48975
6942C965485K38696K39307K64071P4251m2059N35j06267k89526l01762l05434
$$ plain form
7021 2641610 2566102 2547808 2584558 2586074 2574241 2484892 2483534 2532362 2581075 2541981 2509988 2550395
7009 2550395 2513130 2480995 2435218 2354300 2521786 2577679 2552023 2503630 2434201 2270665 2179180
6998 2179180 2242747 2315759 2367411 2346943 2341920 2417010 2434759 2282931 2267149 2326466 2329107 2358564
6986 2358564 2287943 2243688 2367438 2410018 2363525 2332724 2366311 2379463 2408948 2425976 2331843
6975 2331843 2397239 2451050 2413491 2367723 2481936 2517348 2483017 2510961 2508479 2527983 2561230
6964 2561230 2561378 2607999 2658533 2596959 2603362 2701284 2701604 2689852 2757610 2691558 2750094 2873353
6952 2873353 2890307 2934234 3165053 3137213 3214208 3354979 3379866 3534254 3716510 3965485
6942 3965485 4204181 4443488 4707559 4781810 4739751 4740286 4634019 4344493 4042731 3737297
6932C737297j88801p5630j46064M3854o604j46134M4712J9579j14776q6106o88
6921C080639R5258N8411j701K9207J131k3035L445q0826N0020M2082J8576m1278
6909C231929o1071L8732J04953Q380J6984P1794k3687K1882J1017O1888L5509
6898C518310o0717L1323N7325O2544J13431J03916L8858O9072J22404J52835J06289
6887D315590l425J45283K34313K48720J42419J77011J73029J47516Q8670p341
6877E661785j34972j56549r9119p3244j25694j54216j10551o7519n5780r3291
6867D590850o8087R4415J0648m7518L2781P3939Q8773j13557K7217J20149P7174
6856D886784M7191j12743L6096p135M9964J06802K1403L9281K08592n5534j0947
$$ plain form
6932 3737297 3548496 3472866 3326802 3370656 3364052 3217918 3262630 3282209 3167433 3081327 3080639
6921 3080639 3175897 3234308 3232607 3261814 3262945 3239910 3243355 3162529 3212549 3254631 3273207 3231929
6909 3231929 3170858 3209590 3314543 3322923 3339907 3411701 3388014 3409896 3420913 3482801 3518310
6898 3518310 3457593 3488916 3546241 3608785 3722216 3826132 3864990 3934062 4056466 4209301 4315590
6887 4315590 4312165 4457448 4691761 4940481 5082900 5259911 5432940 5580456 5669126 5661785
6877 5661785 5526813 5370264 5271145 5197901 5072207 4917991 4807440 4739921 4684141 4590850
6867 4590850 4522763 4617178 4627826 4580308 4613089 4687028 4775801 4662244 4689461 4809610 4886784
6856 4886784 4933975 4821232 4857328 4850193 4900157 5006959 5028362 5067643 5276235 5220701 5209754
6845E209754N2139O2208Q6297K1966J22603R7659J05545L4283R9554K4460J06102
6834F022570J20765J4777J21789Q8874L2321J16456O9365N6620O2660J92413N1839
6823F950449O4144J59317N6445Q4671K17166K07879P5111M9345Q0931M0803J45061
6812H131322K09828Q3668K6784R2456J12703J93535J32633N4870Q4491K76040
6802I398330J77781J25917J77943J80729Q9543K33049J70926J69372J37074J18467
6792A0979131K27594Q0541J27185J99834J84380K24396J54641J75625L10998K57802
6782A2922127J79406K07655J72696L39560K52307K57097J59826J98632K38021
6773A4927327L02381K62977L41519L37035L38662L67615L10264K16490K40982
$$ plain form
6845 5209754 5261893 5324101 5410398 5432364 5554967 5652626 5758171 5792454 5892008 5916468 6022570
6834 6022570 6143335 6158112 6279901 6368775 6401096 6517552 6586917 6643537 6706197 6898610 6950449
6823 6950449 7014593 7173910 7230355 7315026 7532192 7740071 7815182 7864527 7945458 7986261 8131322
6812 8131322 8341150 8424818 8451602 8544058 8656761 8850296 8982929 9037799 9122290 9398330
6802 9398330 9576111 9702028 9879971 10060700 10150243 10383292 10554218 10723590 10860664 10979131
6792 10979131 11206725 11287266 11414451 11614285 11798665 12023061 12177702 12353327 12664325 12922127
6782 12922127 13101533 13309188 13481884 13821444 14073751 14330848 14490674 14689306 14927327
6773 14927327 15229708 15492685 15834204 16171239 16509901 16877516 17187780 17404270 17645252
6764A7645252L38809K52699M57431K70951M68060L81024M17562L98566L70674
6755B1001028L62317M84443M65679N65921M91295N50045M90924N93022N21380
6746B5526054N16857O43075O17951N99333O72025O90392P03297P36624O57428
6737C1363036P54322Q44671R20258Q96124P87589R34797R37303R75065J000744
6728C9413909R93963J139875R81137J113587J061325J238750J163978J195276
6720D8301800J100955J221463J248501J201385J167612J234547J209413J022297
6712E7707973J176713J060906J038463R50163Q98642P52095P69881P59233O72763
6703F5786832N45236L50776K55409K87730Q5776J1723q4946j57580j79128m93252
$$ plain form
6764 17645252 17984061 18236760 18694191 18965142 19433202 19814226 20231788 20630354 21001028
6755 21001028 21363345 21847788 22313467 22879388 23370683 23920728 24411652 25004674 25526054
6746 25526054 26042911 26685986 27303937 27903270 28575295 29265687 29968984 30705608 31363036
6737 31363036 32117358 32962029 33882287 34778411 35566000 36500797 37438100 38413165 39413909
6728 39413909 40407872 41547747 42528884 43642471 44703796 45942546 47106524 48301800
6720 48301800 49402755 50624218 51872719 53074104 54241716 55476263 56685676 57707973
6712 57707973 58884686 59945592 60984055 61934218 62832860 63584955 64354836 65114069 65786832
6703 65786832 66332068 66682844 66938253 67225983 67311759 67323482 67238536 67080956 66901828 66408576
6693F6408576n56558o88169o32360p50462q10930q54424j064718j042669j050815
6684E8957471j092035j033645j275224j332833j248676j311049j195696j230148
6676D9238165j308678j299893j256914j252703j155293j293690j222614j075595
6668C9372785j209690j106044j035840r61712j043363j115492r40854r51422r28662
6659C0079706r36161q15741p34928p57324p38984p32999p24731o94715o26702
6650B3317421o71128n92001n37298o62934n00572m56278n47343n93628m09268
6641A8346971m40081m09613m10636m36876l57124m28847l30639k94676m11749
6632A4826730l42022k79335l19386l65093l37275l20514l00717k97266k10264
$$ plain form
6693 66408576 65852018 65163849 64531489 63781027 62970097 62115673 61050955 60008286 58957471
6684 58957471 57865436 56831791 55556567 54223734 52975058 51664009 50468313 49238165
6676 49238165 47929487 46629594 45372680 44119977 42964684 41670994 40448380 39372785
6668 39372785 38163095 37057051 36021211 35059499 34016136 32900644 31959790 31008368 30079706
6659 30079706 29143545 28327804 27592876 26835552 26096568 25363569 24638838 23944123 23317421
6650 23317421 22646293 22054292 21516994 20854060 20353488 19897210 19349867 18756239 18346971
6641 18346971 17906890 17497277 17086641 16649765 16292641 15863794 15533155 15238479 14826730
6632 14826730 14484708 14205373 13885987 13520894 13183619 12863105 12562388 12265122 12054858
6623A2054858j39327l31741k20716k56872k78747k54983j14013j66330l45421
6614I946708j32760j56114j53731j84492k73786j27304k85675j04876j34531j33550
6604H259889j62197j79875j31811j60006r7022p3555j50837j99866j77332j08755
6594F818633q0939j76226j00468p7422j94495j53661m4969l7706j17087p0490
6584E765170r1322j98178j8815j19435j21218k7498k5733j63302j03503N726r2103
6573D809789j07077o1130O685k08144j11491L2383l4597o0242j03015o1154p5785
6562D026222j6408j2770j34143j11437n5442k9262m7647o0619o4795L0234n4317
6551C469616m1653l7725p5322r5151L9815j3144o5165k5271N0358j20539k6685
$$ plain form
6623 12054858 11915531 11583790 11363074 11106202 10827455 10572472 10458459 10292129 9946708
6614 9946708 9813948 9657834 9504103 9319611 9045825 8918521 8632846 8527970 8393439 8259889
6604 8259889 8097692 7917817 7786006 7626000 7528978 7455423 7304586 7104720 6927388 6818633
6594 6818633 6737694 6561468 6461000 6383578 6189083 6035422 5990453 5952747 5835660 5765170
6584 5765170 5673848 5475670 5456855 5337420 5216202 5188704 5162971 4999669 4896166 4901892 4809789
6573 4809789 4702712 4641582 4648267 4440123 4328632 4361015 4326418 4266176 4163161 4102007 4026222
6562 4026222 4009814 3997044 3862901 3751464 3696022 3666760 3619113 3558494 3493699 3523933 3469616
6551 3469616 3427963 3390238 3314916 3219765 3259580 3246436 3181271 3156000 3206358 3085819 3059134
6540C059134N6625j52960j11700k6694k7638j32087n4116R1251J4769m1178l3454
6529B641952j33730R7147l0606n4080Q711j8371p9165j13866J074O3237n0101
6518B332202J001j7212o9611R6421n1957j03451K1129r4840o7817l4226M4426
6507B056065j05234k5197n0982J2893j2781r0166J31447O7268j04106j0033p732
6496A861442p3271j20657j334j8796P3264M0533n6869r7369N9140N7529m5446
6485A678166K7670n7183j39885n489Q4333l6446j3331l6607N1201m8079l4943
6474A469407J3782R803N5415r8999j05874J23008M896q4536N584r0987O5539L3083
6462A400121n7278J03471p9771o8852l9389P8318O364j3947n2274L3053q1639
$$ plain form
6540 3059134 3115759 2962799 2851099 2824405 2796767 2664680 2610564 2701815 2716584 2675406 2641952
6529 2641952 2508222 2605369 2574763 2520683 2529394 2511023 2431858 2317992 2319066 2382303 2332202
6518 2332202 2333203 2315991 2246380 2342801 2290844 2187393 2208522 2113682 2045865 2011639 2056065
6507 2056065 1950831 1925634 1874652 1887545 1874764 1784598 1916045 1983313 1879207 1869174 1861442
6496 1861442 1788171 1667514 1666180 1647384 1720648 1761181 1704312 1606943 1666083 1723612 1678166
6485 1678166 1705836 1648653 1508768 1503279 1587612 1551166 1537835 1501228 1552429 1504350 1469407
6474 1469407 1483189 1492992 1548407 1449408 1343534 1466542 1471438 1386902 1392486 1301499 1367038 1400121
6462 1400121 1342843 1446314 1366543 1297691 1258302 1336620 1342984 1329037 1276763 1309816 1228177
6451A228177q6683J2631N2520o7499j3562K1729k5246M3231m3945K1177L4361
6440A176891m601r0486M824j2326J05647M6026j51592k9881m8117J1690O8040
6429A076115M6574K2614j20739l3611O3566k2621n5242o4701j1569k8780r510
6418H62096P2539j3737Q4464O9349r9671J3972k758M536J7879Q2357m0938N6785
6406A106873l7895j31523o4263r460R6134n1091m6276k4485k7534L1002J2731
6395H54213M5590m5111K4816J76895q9311o0829p2780m0683N9661N4474N8280
6384I65215J4980p0948k0846M7334p1251m1693N3042p4291j4395P9215n6769j6244
6372G93349N0596n099j9374L8524P7655r3877K2104N0163K9846j808k58p0114
$$ plain form
6451 1228177 1141494 1154125 1206645 1139146 1125584 1147313 1122067 1165298 1121353 1142530 1176891
6440 1176891 1172290 1081804 1086628 1074302 1179949 1225975 1074383 1044502 996385 1008075 1076115
6429 1076115 1122689 1145303 1024564 990953 1054519 1031898 976656 911955 900386 871606 862096
6418 862096 934635 920898 1005362 1074711 975040 989012 986254 990790 1008669 1091026 1050088 1106873
6406 1106873 1068978 937455 873192 863732 959866 908775 862499 838014 810480 841482 854213
6395 854213 899803 854692 879508 1056403 967092 906263 833483 792800 852461 906935 965215
6384 965215 980195 909247 888401 935735 864484 822791 875833 801542 787147 866362 809593 793349
6372 793349 843945 838846 819472 857996 935651 841774 863878 914041 943887 942079 941821 871707
6360H71707M2316j7571R811n3519n5192L4154j2765O8715Q1521l5025n2000K1929
6348I04081l3515N0210O1981n7035k3170J933k4867p299M421n3136M0861k1171
6336H43294J8251J46974K0670o4968k4951k6522j32138M9669j1208K6061n2071
6325G93061R309K9506P3312N0203m7779q109P5860m6355p3251q4433N070L2135
6313H08529k1140N7553j8809j02j2714M4293r355o4151L018N9252m9007M308O1989
6300H63664j2830P7567n4125M6050o2754J2430J1764j7607P646m0181J9192M8421
6288H99237q6518p4466N2799j2378P4328q5603p9982O2913J52603J1790n9480
6277H55243k9299l9869l3336o59K9629O1183l401l4973P3197N5657k582L680P1667
$$ plain form
6360 871707 914023 896452 906263 852744 797552 831706 818941 887656 969177 934152 882152 904081
6348 904081 870566 920776 982757 925722 902552 904485 879618 872319 876740 823604 864465 843294
6336 843294 861545 1008519 1029189 964221 939270 912748 780610 830279 819071 845132 793061
6325 793061 802370 831876 905188 955391 907612 899503 975363 929008 855757 771324 776394 808529
6313 808529 787389 844942 826133 826031 813317 857610 848255 784104 787122 846374 797367 801675 863664
6300 863664 850834 928401 874276 920326 857572 870002 881766 864159 871805 831624 850816 899237
6288 899237 812719 738253 791052 778674 853002 767399 687417 750330 902933 914723 855243
6277 855243 825944 786075 752739 752080 781709 842892 839491 804518 877715 933372 930790 934470 1006137
6264A006137l6028l2880P254J5016P7863N4957O5080n8901l2931K8829O1428J6575
6252A172399q9347j01472j05789k032l1417O8611J41202K9538j2885K5072p6908
6241A016972N173J29719p1124N3301j09044n441L0330L1933n9666K0190M6359
6230A088702N3058l7199p9632P0829m0575j9032M3180o7952J8990Q8221j61245
6219I57345j0391J46611r252J043J3900m84O0940k3209J1270r5156k6796K7325
6207A053146J0068J6179M4381K3145K1769N288Q9269j05131J4695N271j62286
6196A015794M7775O3222O4683K6488l660N2755o028p1161J6798q133J02478j6956
6184A284055k1040q8796l5202P0363N6569M7583o2122J6844N9597l7487n0477
$$ plain form
6264 1006137 970109 937229 944483 959499 1037362 1092319 1157399 1098498 1065567 1094396 1155824 1172399
6252 1172399 1083052 981580 875791 873759 842342 910953 1052155 1081693 1068808 1093880 1016972
6241 1016972 1022145 1151864 1080740 1134041 1024997 1019556 1049886 1081819 1022153 1042343 1088702
6230 1088702 1141760 1104561 1024929 1095758 1055183 1036151 1079331 1011379 1030369 1118590 957345
6219 957345 946954 1093565 1084313 1085356 1099256 1098772 1159712 1136503 1147773 1052617 1025821 1053146
6207 1053146 1063214 1079393 1123774 1146919 1168688 1173976 1263245 1158114 1172809 1178080 1015794
6196 1015794 1063569 1126791 1191474 1217962 1214302 1267057 1261029 1189868 1206666 1198533 1301011 1284055
6184 1284055 1263015 1174219 1139017 1209380 1265949 1313532 1251410 1268254 1327851 1290364 1239887
6173A239887J43310O0700q5862Q6499Q454n315O5817n0929l7116o0717n013K1095
6161A380810R3369O0774L8659K8491j03273N8018J16769n7581n1816j5465Q6840
6150A635595J4397J6587J28173J797L0797J8675j45585j2883O2950Q5013l2050
6139A803466P4458q0699q1674N7481J07430l806J8212M1673k0464J1972o8733
6128A859316J55936M7554N2587J1208p1567L2748N2491o5842l3471J6699M3889
6117B101548J8838l9673l8495J8082J52643p702L7379J65816K0864K0495o3565
6106B386230M0913K4491o8963J36141P7744l6875J27729J11821p8274n7293J41255
6095B804919M234J3668J14804L2391J30952K3420r1234O0604P7220J38642J46376
$$ plain form
6173 1239887 1383197 1443897 1358035 1444534 1452988 1447673 1513490 1462561 1425445 1364728 1359715 1380810
6161 1380810 1474179 1534953 1573612 1602103 1498830 1556848 1673617 1616036 1564220 1548755 1635595
6150 1635595 1649992 1666579 1794752 1796549 1827346 1846021 1700436 1687553 1750503 1835516 1803466
6139 1803466 1877924 1797225 1715551 1773032 1880462 1876656 1894868 1936541 1916077 1928049 1859316
6128 1859316 2015252 2062806 2115393 2126601 2055034 2087782 2140273 2074431 2040960 2057659 2101548
6117 2101548 2120386 2080713 2042218 2060300 2212943 2205241 2242620 2408436 2429300 2449795 2386230
6106 2386230 2427143 2451634 2382671 2518812 2596556 2559681 2687410 2799231 2720957 2663664 2804919
6095 2804919 2809153 2822821 2937625 2970016 3100968 3124388 3033154 3093758 3170978 3309620 3455996
6084C455996M4665J02415M9857R3795J7106J8168P4809J36125J38320J9398J30122
6073D280776J05442J6950L7819J98133J26414J46793N4271K06351K72614J03883
6063E549446J69505K33725J96332J71949J87178K19473K67252K66080K22813L07899
6053G791652L24125K75303L78254K31297K46902K92277K14070L15694K16731J82777
6043A0469082L09341J56763L09089L09727L54509L28685K75787M46050M85218
6034A3444251L30674M80378N63239K95471M29563N95434L90182K93442L48046
6025A7170680K17075Q4804Q8335P7870m5991o9068J75405J99998K05486L55869
6015A8460463L53440L49400N35521N32635M65344L94793K72311R1694j43588m2386
$$ plain form
6084 3455996 3500661 3603076 3652933 3746728 3763834 3782002 3856811 3992936 4131256 4150654 4280776
6073 4280776 4386218 4403168 4440987 4639120 4765534 4912327 4966598 5172949 5445563 5549446
6063 5549446 5718951 5952676 6149008 6320957 6508135 6727608 6994860 7260940 7483753 7791652
6053 7791652 8115777 8391080 8769334 9000631 9247533 9539810 9753880 10069574 10286305 10469082
6043 10469082 10778423 10935186 11244275 11554002 11908511 12237196 12512983 12959033 13444251
6034 13444251 13774925 14255303 14818542 15114013 15543576 16139010 16529192 16822634 17170680
6025 17170680 17387755 17472559 17560894 17638764 17592773 17523705 17699110 17899108 18104594 18460463
6015 18460463 18813903 19163303 19698824 20231459 20696803 21091596 21363907 21455601 21312013 21269627
6005B1269627k08711k69539l58473l27943k53257k55244k43243o3231K290J0940
5995A9303216J55467L14845M51926L17602L49268L34870L63484K24589Q9642n4265
5985B1850644j55260l11216n60692o20527n95481o00562m81276l92894j91830
5976A7940906j87652o5164R5792k6327R6277J16720P927o7741K3522j89786k81815
5965A7462659l93983k71342l40912n25032n19306n34748n08586m59594k88609
5956A3620547l39454m00445k85937j36536n6732r0433j7980j13687l33478j71245
5946A1674620k85016j86419l26593n12585m22278m34850m39715k86136l57507
5937H423521k31662k44468k33015j81259j26841o0718j82811r2289p6595p1197
$$ plain form
6005 21269627 21060916 20791377 20432904 20104961 19851704 19596460 19353217 19289986 19292276 19303216
5995 19303216 19458683 19773528 20225454 20543056 20892324 21227194 21590678 21815267 21904909 21850644
5985 21850644 21695384 21384168 20823476 20202949 19607468 19006906 18525630 18132736 17940906
5976 17940906 17753254 17688090 17783882 17757555 17853832 17970552 17978479 17910738 17934260 17744474 17462659
5965 17462659 17068676 16797334 16456422 15931390 15412084 14877336 14368750 13909156 13620547
5956 13620547 13281093 12880648 12594711 12458175 12401443 12311010 12293030 12179343 11845865 11674620
5946 11674620 11389604 11203185 10876592 10364007 9941729 9506879 9067164 8781028 8423521
5937 8423521 8191859 7947391 7714376 7533117 7406276 7345558 7162747 7070458 6993863 6922666
5927F922666l5915l049p0040Q5007M9835Q8433m8610O2006q2225J4291J00711
5916G083110j17154p230P0866R1341Q5205l004l0514R130m8524k1751L5205M1170
5904G187850o1111l2486o4052K4653J17152J20207J23460O3056R0010K16520J40290
5893G925549j2667J01848K00100J87268K4464Q5449K38089J72453K09766J29778
5883I262097Q6997j0284Q7652K11092K29824J21527N183J75049L17022K15325
5873A0701484K95260M13358M63974L81791M80943L92039K84751K91473J02339
5864A3807412j20059m9160l7191j37677j1531O2922J30905Q0905K22400J80644
5854A4129570L05790K82560L33071L93235M99580M79357N40554M77139L59621
$$ plain form
5927 6922666 6886751 6883702 6813662 6898669 6948504 7036937 6988327 7050333 6968108 6982399 7083110
5916 7083110 6965956 6958726 7029592 7120933 7206138 7203134 7172620 7181750 7133226 7111475 7146680 7187850
5904 7187850 7126739 7094253 7030201 7054854 7172006 7292213 7415673 7478729 7568739 7785259 7925549
5893 7925549 7912882 8014730 8214830 8402098 8426562 8512011 8750100 8922553 9132319 9262097
5883 9262097 9349094 9338810 9426462 9637554 9867378 9988905 9994088 10169137 10486159 10701484
5873 10701484 10996744 11410102 11874076 12255867 12736810 13128849 13413600 13705073 13807412
5864 13807412 13687353 13638193 13601002 13463325 13451794 13514716 13645621 13726526 13948926 14129570
5854 14129570 14435360 14717920 15050991 15444226 15943806 16423163 16963717 17440856 17800477
5845A7800477M30427L45135L14970K20435L06495N22051N96858O99230P78650
5836B2014728J005082J026569J161748J349014J526083J864143K096622K230415
5828C4274404K546902K939149L197368L557110L543559L457072L037464K340544
5820E8893572J479278J028129N29990L63913J50353l77084p07584j236010j630769
5811E8493788j881703j921247j599921j213726p95904k73775K3218L45742L27582
5802E1504054L33918L9331m28371q65973j129117j024710q88183n67428k26250
5793D6747271j86134k05291m59879r47547j480038j887228k142500k388807k539005
5784C4510842k721289k531669k195486j776935j490604j161699q88247p68905
$$ plain form
5845 17800477 18230904 18576039 18891009 19111444 19417939 19939990 20536848 21236078 22014728
5836 22014728 23019810 24046379 25208127 26557141 28083224 29947367 32043989 34274404
5828 34274404 36821306 39760455 42957823 46514933 50058492 53515564 56553028 58893572
5820 58893572 60372850 61400979 61930969 62294882 62445235 62068151 61360567 60124557 58493788
5811 58493788 56612085 54690838 53090917 51877191 51081287 50807512 50830730 51176472 51504054
5802 51504054 51837972 51877303 51448932 50582959 49453842 48429132 47540949 46973521 46747271
5793 46747271 46561137 46355846 45895967 44948420 43468382 41581154 39438654 37049847 34510842
5784 34510842 31789553 29257884 27062398 25285463 23794859 22633160 21744913 20976008
5776B0976008n86037m84411l67164j71717j14563q9845j16002k26504m00436m06253
5766A8013076m81933m75466n16627k63163j14421k27311k26436k43017l26449
5757A5138253l62920k50312j40344n7234j4428K5703N5882J7161J27481R7655
5747A4636897P2554n0313k88675j90772k61486m67170m09291m85873m06569l50158
5737A1799144k99127l54416k51775k10793k18478k14571j74269j77546j49170
5728I748999j27010j57893M9669j22243J7966l1292r7834K3956j224N0172k898
5717I350368o1479M564m9945O6467j2238n4790M5136j00278j50369j39658j91930
5706H705848r8574j33639Q3980p4911j20620O4759Q8027O17Q1613J22226Q0208
$$ plain form
5776 20976008 20389971 19905560 19538396 19366679 19252116 19162271 19046269 18819765 18419329 18013076
5766 18013076 17531143 17055677 16539050 16275887 16161466 15934155 15707719 15464702 15138253
5757 15138253 14775333 14525021 14384677 14327443 14313015 14338718 14394600 14411761 14539242 14636897
5747 14636897 14709451 14659138 14370463 14179691 13918205 13451035 13041744 12555871 12149302 11799144
5737 11799144 11500017 11145601 10893826 10683033 10464555 10249984 10075715 9898169 9748999
5728 9748999 9621989 9464096 9513765 9391522 9409488 9378196 9280362 9304318 9303094 9353266 9350368
5717 9350368 9288889 9293453 9243508 9309975 9297737 9242947 9288083 9187805 9037436 8897778 8705848
5706 8705848 8607274 8473635 8557615 8482704 8362084 8426843 8514870 8515487 8597100 8719326 8799534
5695H799534J02801Q1038K0415n41j73389j34673k26715j93040k56580j36583
5685G882267k33188j30844j22524k01244j39587j51681j01710k18432j31098q0711
5675F371248n0608o5043r921j40312r5298q7225m1421n3314j7158j51208K6831
5664E686571l2199j39202j12493j15827k8515m1004R903l6316m4808q8648r0896
5653D966566r498J216m2955j2622n6394j02788o8749q9901r8685K2703o369j6133
5641D486391l6933o3879p7574l9917R5065R274l5070n1632k2648l7242j38274
5630D087561m2130n8413L4693K2787j6045r8019J7776J17299q7976n7176q7663
5619C832694o388j5033k3316j10162k880p2873O8708N0242l6756q6131l4685o4099
$$ plain form
5695 8799534 8902335 8983373 9003788 9003247 8829858 8695185 8468470 8275430 8018850 7882267
5685 7882267 7649079 7518235 7395711 7194467 7054880 6903199 6801489 6583057 6451959 6371248
5675 6371248 6320640 6255597 6245676 6105364 6010066 5922841 5881420 5828106 5810948 5659740 5686571
5664 5686571 5654372 5515170 5402677 5286850 5258335 5217331 5227234 5190918 5146110 5057462 4966566
5653 4966566 4957068 4958284 4915329 4902707 4846313 4743525 4674776 4584875 4486190 4508893 4502524 4486391
5641 4486391 4449458 4385579 4308005 4268088 4363153 4372427 4337357 4285725 4263077 4225835 4087561
5630 4087561 4045431 3987018 4021711 4044498 4028453 3930434 3948210 4065509 3977533 3920357 3832694
5619 3832694 3826306 3811273 3787957 3677795 3674915 3602042 3670750 3720992 3684236 3598105 3563420 3499321
5607C499321m8185J03368O273n1822p0169j2488j5419j3843J20208k9729k6448
5596C461067r6120n4291J19815l4496j3967J2177n1035K6532P111k8423J9378
5585C367748J42309P1998J09203l3456M4413m3508M8668R543O3326J41491R3099
5574D014834J06980K7509J08951J05804R6651J73139J99256J02012J75082j8042
5564E092176q3265J29631k4156j37227j6161j24609o5664q0740j1745O697k8670
5553D656267r202j4832p624J25928P8883J45229M6679o200J21676J01696j587
5542E236913J28840N5278J49181J01720K59984N06047N17340N52408O98279O33921
5532H839911J84652l14713p05719r08820p43223p16700m63860k95355j53440j93481
$$ plain form
5607 3499321 3451136 3554504 3560777 3508955 3438786 3426298 3410879 3397036 3517244 3487515 3461067
5596 3461067 3364947 3310656 3430471 3395975 3382008 3394185 3343150 3369682 3376793 3348370 3367748
5585 3367748 3510057 3582055 3691258 3657802 3702215 3658707 3707375 3716918 3780244 3921735 4014834
5574 4014834 4121814 4149323 4258274 4364078 4460729 4633868 4833124 4935136 5110218 5092176
5564 5092176 5008911 5138542 5114386 4977159 4960998 4836389 4770725 4689985 4678240 4684937 4656267
5553 4656267 4647065 4632233 4624609 4750537 4829420 4974649 5021328 5015128 5136804 5238500 5236913
5542 5236913 5365753 5421031 5570212 5671932 5931916 6437963 6955303 7507711 8205990 8839911
5532 8839911 9024563 8709850 8004131 7095311 6352088 5635388 5171528 4876173 4722733 4529252
5522D529252j42406j49916p0937P047K1797p1567j31446J5570J5570J666Q0133
5511D104763P4546N7798J82589M8816K82356K23303K80005K03001K0778r6912
5501E381043p1767j81087j45352R6334k5109N635J26566J82344J45876J93946
5491E708429L59337N52322N93127L50408O37780L60365l46618n33195p30591p09005
5481F242359n15232l49113p9763J5910M753J27619O8475O7626K01656J36601k0704
5470E900187j34244j72303o6029j52663p3883n8224l2203j51085n4088j0076N2227
5459E047616P4053L569j3456O3950O5092R0185K34963J87861K50354J92376K70930
5448F467493K75089L65112M60327P23000R16005J153711J026140Q53276O73589
$$ plain form
5522 4529252 4386846 4236930 4165993 4173040 4194837 4123270 3991824 4007394 4022964 4024630 4104763
5511 4104763 4179309 4237107 4419696 4468512 4750868 4974171 5254176 5457177 5477955 5381043
5501 5381043 5309276 5128189 4982837 5079171 5054062 5059697 5186263 5368607 5514483 5708429
5491 5708429 6067766 6620088 7213215 7563623 8201403 8561768 8215150 7681955 6951364 6242359
5481 6242359 5727127 5378014 5298251 5314161 5318914 5446533 5515008 5582634 5784290 5920891 5900187
5470 5900187 5765943 5593640 5527611 5374948 5301065 5242841 5210638 5059553 5005465 4995389 5047616
5459 5047616 5121669 5125238 5111782 5175732 5240824 5331009 5565972 5753833 6004187 6196563 6467493
5448 6467493 6742582 7107694 7568021 8291021 9207026 10360737 11386877 12240153 12913742
5439A2913742l03989j093242j113457j031951r09364q73430p88426o25981l99417
5430E774485k45965k98259j39384j00611j65156k5019R5560q1607j32548M7841
5420D729337r260O3970J49713K54520K83103K62620K21650M14317P31911N12393
5410G614274N95182N98360K86544n5617o20860o97379o21772o53319o68864m92203
5400E284346m25467l81484k86253j41291j66826k4810j24268n3148j48614M885
5390C537070L955o2114J16814j5528L5388R7866M3714N1719Q9503K40089J97990
5379D336466J68426J50952K01036J66356q9812k97008k20447j90103j81781j6543
5369D027542k32295j31227l1806j15171j33445j290r1238L6857j48077q4039k4210
$$ plain form
5439 12913742 12609753 11516511 10403054 9371103 8461739 7588309 6799883 6173902 5774485
5430 5774485 5528520 5230261 5090877 4990266 4825110 4800091 4895651 4814044 4681496 4729337
5420 4729337 4720077 4784047 4933760 5188280 5471383 5734003 5955653 6369970 7101881 7614274
5410 7614274 8209456 8807816 9094360 9038743 8417883 7720504 7098732 6445413 5776549 5284346
5400 5284346 4858879 4477395 4191142 4049851 3883025 3858215 3733947 3680799 3532185 3537070
5390 3537070 3541025 3478911 3595725 3580197 3615585 3713451 3757165 3808884 3898387 4138476 4336466
5379 4336466 4504892 4655844 4856880 5023236 4933424 4636416 4415969 4225866 4044085 4027542
5369 4027542 3795247 3664020 3632214 3517043 3383598 3382308 3291070 3327927 3179850 3095811 3071601
5358C071601q3198M3622j236j27085M9677o9171q9299j4454p0995j41737l7903
5347B529822l1134j47428L7925M4725j45233O587L4269l8018j09625j9627l6512
5336B125751n7588K364J002j06071L9595P8127P037m4406q8228k9988o3127J06476
5324A970944j5541M9099P6812p8035l2828p773R0683j16781j19127m3201K6851
5313A801103Q1214L1592P1625l8461Q5241o1398j52699R8466J62814P8791M586
5302B162874q9084K5547J5819L8626R1510o289J10546N5002p1906r72M6093l8581
5290B339185Q4631L1091k5224j06090j4763O142m4446K7091j01626O056N0038
5279B252085j10007p7976L4914o4843l2648n4252N4022r1903M1632J10097n4239
$$ plain form
5358 3071601 2988403 3032025 3030789 2903704 2953381 2884210 2794911 2780457 2709462 2567725 2529822
5347 2529822 2498688 2351260 2389185 2433910 2288677 2295264 2329533 2291515 2181890 2162263 2125751
5336 2125751 2068163 2070527 2071529 1965458 2005053 2083180 2090217 2045811 1957583 1927595 1864468 1970944
5324 1970944 1955403 2004502 2081314 2003279 1970451 1962678 2053361 1936580 1817453 1774252 1801103
5313 1801103 1882317 1913909 1985534 1947073 2032314 1970916 1818217 1916683 2079497 2158288 2162874
5302 2162874 2073790 2099337 2115156 2153782 2245292 2239003 2349549 2404551 2332645 2331673 2377766 2339185
5290 2339185 2423816 2454907 2429683 2323593 2308830 2314972 2270526 2297617 2195991 2202047 2252085
5279 2252085 2142078 2064102 2099016 2034173 2001525 1947273 2001295 1909392 1951024 2061121 2006882
5268B006882m8006N8397K0037l7663m6718M0215J4039L8449M1109L9751K0600
5257B147092M4225r5481j23810L1782p81j77836j20143L5825k1701K7215r2342
5246A654045k9720O3579q0371o0592r0421N5484K2748N16j9545N9843J29015j31890
5234A572691p1918J34929M1308j1378N396k2178J08921M1618L3814N1638P4392
5223A959233O7123L8241J40873K23268J80347J57458K24189J60553j67911k23230
5213B760144j83556k12171k64472k07771k0804q5412o7933J9265j33118j9471
5203A584701k1445M8295l7194r3465j7764R4008L1511L8711O1354r134j4230Q4500
5191A749848P6177L8484J12354J05327Q4288J63214J80279R4961L9910l9441j64005
$$ plain form
5268 2006882 1958876 2017273 2037310 1999647 1952929 1993144 2007183 2045632 2086741 2126492 2147092
5257 2147092 2191317 2095836 1972026 2003808 2003027 1825191 1705048 1740873 1719172 1746387 1654045
5246 1654045 1624325 1687904 1607533 1546941 1456520 1512004 1534752 1535268 1515723 1575566 1704581 1572691
5234 1572691 1500773 1635702 1677010 1665632 1671028 1648850 1757771 1799389 1833203 1884841 1959233
5223 1959233 2026356 2064597 2205470 2428738 2609085 2766543 2990732 3151285 2983374 2760144
5213 2760144 2576588 2364417 2099945 1892174 1871370 1785958 1718025 1737290 1604172 1584701
5203 1584701 1563256 1611551 1574357 1480892 1463128 1557136 1588647 1627358 1688712 1679578 1665348 1749848
5191 1749848 1826025 1864509 1976863 2082190 2166478 2329692 2509971 2604932 2644842 2605401 2441396
5180B441396j36705p8846j79722r1299j60974j24940k6754p9796o857r7789n7533
5169A400181K7143L0071p7007O557O6994j08339n0112k8O8017P881l6258R588
5157A344688m6551q1092N5900M8625k6205j40700k8722K1072M9293Q6126N9545
5146A341979m8862l1301J9059M9128N6491j9171l6043L4271k8264J0685O1744
5135A409716J1369J6709n9808j9581j3702K522K1529m8517N4937j2773l0705K9781
5123A361477m4278k7351J08198M547p2061j9728J31999J5592j37875L6228P3246
5112A429994O3894Q9745o3698j35696L5014O5455Q3480r3937p3544K4018L8166
5101A462891n6586n2048J01311N0515n810J3573R9274O1851Q2125N3119q9284
$$ plain form
5180 2441396 2304691 2225845 2046123 1954824 1793850 1668910 1642156 1562360 1555503 1457714 1400181
5169 1400181 1427324 1457395 1380388 1386945 1453939 1345600 1295488 1295460 1363477 1371358 1335100 1344688
5157 1344688 1298137 1217045 1272945 1321570 1295365 1154665 1125943 1147015 1196308 1282434 1341979
5146 1341979 1293117 1261816 1280875 1330003 1386494 1367323 1331280 1365551 1337287 1347972 1409716
5135 1409716 1421085 1437794 1377986 1358405 1344703 1347225 1368754 1320237 1375174 1362401 1331696 1361477
5123 1361477 1317199 1289848 1398046 1402593 1330532 1310804 1442803 1458395 1320520 1356748 1429994
5112 1429994 1493888 1583633 1519935 1384239 1419253 1484708 1568188 1474251 1400707 1424725 1462891
5101 1462891 1406305 1354257 1455568 1506083 1500273 1513846 1613120 1674971 1757096 1810215 1720931
5090A720931n0940r9042q7699O9611M3069l0700k654p0653j9272R6133n069P2150
5078A635865l2813j28274P6957N3607J12429j17569j32803k5985P0722O7824N961
5067A585921M982K5079j20522m077p455L2252R3289P672p3092N481R6272q7386
5055A558416k0078K0000l0459Q367p024p489m3603n3593N7415j4971J7728l6854
5043A447855p6294k3353J75081j05858l8494J2456M9484k1897R5127M1232O7895
5032A623234M0590j18332R8476m3760L5814K6299Q7764k4768n0316l9251n9873
5021A575877J44300K97k615L7313l3307R0100j5178j9416j4245M1895J2241N1664
5009A868926M1419L4604O1112n7595M3062J03952L8832o3409L1931l4392Q205
$$ plain form
5090 1720931 1669991 1570949 1483250 1552861 1595930 1565230 1562576 1491923 1472651 1568784 1563715 1635865
5078 1635865 1603052 1474778 1551735 1605342 1717771 1600202 1467399 1441414 1512136 1579960 1585921
5067 1585921 1590903 1615982 1495460 1491383 1483928 1516180 1609469 1617141 1544049 1549530 1645802 1558416
5055 1558416 1538338 1558338 1527879 1536246 1529222 1521733 1478130 1424537 1481952 1466981 1484709 1447855
5043 1447855 1371561 1348208 1523289 1417431 1378937 1391393 1440877 1418980 1514107 1555339 1623234
5032 1623234 1663824 1545492 1643968 1600208 1636022 1662321 1750085 1725317 1675001 1635750 1575877
5021 1575877 1720177 1720474 1717859 1755172 1721865 1811965 1796787 1777371 1763126 1805021 1817262 1868926
5009 1868926 1910345 1944949 2006061 1948466 1991528 2095480 2134312 2070903 2102834 2068442 2076647
4998B076647J89664k5995o9570m8701K3184k7499O0193J17340K3181k7864N0640
4987B341220K6016P5837N1651q0257R0900o6573K8188M6010K4950M5903L0682
4976B614527m225K6219J22558J7618R7702N9165J5167j5436J1930O0201J70449
4965C175875j8339j4918J88023n93N9856O9686j4414J13472Q7573R7809J66792
4954C910822J10505Q6695K15507J11173R2749J65071O7811K29908K11409O9024
4944E270674J05734j01742N2814K45513Q6567J4975l6997J3974j38304J84272
4934E697480N2106K9033P3493Q8726J7094r526L8451J27269R1727Q0402J17378
4923F403633j10124K4308K6731j31794o929n6410k4298Q1558j8152N5677j15247
$$ plain form
4998 2076647 2266311 2240316 2170746 2122045 2145229 2117730 2177923 2295263 2318444 2290580 2341220
4987 2341220 2367236 2443073 2494724 2414467 2505367 2438794 2466982 2512992 2537942 2583845 2614527
4976 2614527 2610302 2636521 2759079 2776697 2874399 2933564 2948731 2933295 2945225 3005426 3175875
4965 3175875 3157536 3142618 3330641 3330048 3389904 3459590 3445176 3558648 3646221 3744030 3910822
4954 3910822 4021327 4108022 4323529 4434702 4527451 4692522 4760333 4990241 5201650 5270674
4944 5270674 5376408 5274666 5327480 5572993 5659560 5674535 5637538 5651512 5513208 5697480
4934 5697480 5749586 5778619 5852112 5940838 5957932 5948406 5986857 6114126 6205853 6286255 6403633
4923 6403633 6293509 6317817 6344548 6212754 6205825 6149415 6125117 6206675 6188523 6244200 6128953
4912F128953k0958K5494Q3441J05320N2750M1308J10251m4029J06054J41269J24641
4901F854494J46622K17038K57273J01744K32749J39675N2779J66712J17384J81400
4891H467870J53328J03403R1669J76247J32660l7344K6478P478J3249J09101l7710
4880I206429l3203Q9826J05549R9240R2655J65393J69704J97683K28858K53228
4870A0575362J83304K10849K01032K50143J67031J62995J30562K00669J66344
4861A2248291K53315K60867L02036M32777N68765O24703O62958P46691Q55162
4852A6955565N26022N68350K72655O8709l7528k76549j29531l84432k46694k1924
4842A7294643J26716K42595J35897K16900M85348L03380K12620R057l51101n11527
$$ plain form
4912 6128953 6107995 6133489 6216930 6322250 6375000 6416308 6526559 6482530 6588584 6729853 6854494
4901 6854494 7001116 7218154 7475427 7577171 7809920 7949595 8002374 8169086 8286470 8467870
4891 8467870 8621198 8724601 8816270 8992517 9125177 9087833 9114311 9121789 9135038 9244139 9206429
4880 9206429 9173226 9263052 9368601 9467841 9560496 9725889 9895593 10093276 10322134 10575362
4870 10575362 10758666 10969515 11170547 11420690 11587721 11750716 11881278 12081947 12248291
4861 12248291 12501606 12762473 13064509 13497286 14066051 14690754 15353712 16100403 16955565
4852 16955565 17481587 18049937 18322592 18391301 18353773 18077224 17947693 17563261 17316567 17294643
4842 17294643 17421359 17663954 17799851 18016751 18502099 18805479 19018099 19027156 18676055 18164528
4832A8164528o29645q27075q99487p33506n98195n90739n76715n22190j96139
4823A2590837k54420k32934j91373o1724J2359M1328R4219N2973J25550K05254
4813A2382069L46139K89483L50230L79526M71185N81911N95730O00526P93028
4804A6789827R06961R82715J263924J257864J435659J451816J366986J255318
4796B6711070J026860O99525K54166j38294m08831m45137n26907m86767l33090
4787B6352595j53950J05121J86095K57822L99061K13663J50324j52422m61748
4778B6896561q31851j207622j135283j304278j282316j162677j023455q77717
4770A8071362r20412p17645m94992m22078l61743l05054l69167l37747l20777
$$ plain form
4832 18164528 17534883 16707808 15808321 15074815 14476620 13885881 13309166 12786976 12590837
4823 12590837 12336417 12103483 11912110 11850386 11862745 11904073 11998292 12051265 12176815 12382069
4813 12382069 12728208 13017691 13367921 13747447 14218632 14800543 15396273 15996799 16789827
4804 16789827 17696788 18679503 19943427 21201291 22636950 24088766 25455752 26711070
4796 26711070 27737930 28437455 28691621 28553327 28144496 27699359 27172452 26685685 26352595
4787 26352595 26198645 26303766 26489861 26747683 27146744 27360407 27510731 27358309 26896561
4778 26896561 26064710 24857088 23721805 22417527 21135211 19972534 18949079 18071362
4770 18071362 17150950 16433305 15938313 15516235 15154492 14849438 14480271 14142524 13821747
4761A3821747l23817k24681k31810k38224m20326l70720l15342j82991k67902
4752A1245934o4425k37489j71149n9212l0144M6591J8907L6043n4025k882J4504
4741A0742653Q4060N344K291o1952k3308r7427j41159j99309r5756j25366r5604
4730I994467J1404q0973j7856j7969k4852J31918J43360l393L8530Q7970Q5757
4719A0348363Q8208K64814R8162J74867L20022K73983K62872K00501L51935M46314
4709A2830041L49449M24478N15874M12617M07433O62075O48461O42031Q51422
4700A7743881Q85272J018891J106614J280942J150162J027039N76841K77419m3134
4691B5023927m94420q07379r77842j105183j173891j057724p78605q44392q23054
$$ plain form
4761 13821747 13497930 13273249 13041439 12803215 12382889 12012169 11696827 11513836 11245934
4752 11245934 11181509 10944020 10772871 10713659 10683515 10730106 10749013 10785056 10731031 10728149 10742653
4741 10742653 10826713 10832057 10834348 10772396 10749088 10651661 10510502 10311193 10215437 10090071 9994467
4730 9994467 10005871 9924898 9907042 9889073 9864221 9996139 10139499 10136106 10174636 10262606 10348363
4719 10348363 10436571 10701385 10799547 10974414 11294436 11568419 11831291 12031792 12383727 12830041
4709 12830041 13179490 13603968 14119842 14532459 14939892 15601967 16250428 16892459 17743881
4700 17743881 18629153 19648044 20754658 22035600 23185762 24212801 24789642 25067061 25023927
4691 25023927 24529507 23722128 22744286 21639103 20465212 19407488 18628883 17784491 16961437
4682A6961437p91319n54938m56683m08418m96502l33654k79883j37028J977L4534
4672A3539523M0582N3237J29839J04980K34161K88299L55038N03020M72287M74858
4662A6195824O36445Q24483P73251J062749J132814R69001R95488R79226O29286
4653B4198567K63903N2199m67002p30026q65436r86811p23756o73839n45635k71231
4643A9250933j42475K9443n1851o702J3858q8895n25296n46529o86346q06491
4633A6439649j035058q84003p79618p01213n87828o05885l98660l39190l10656
4624A0797538k92316j94988k79800k43594l1729o7328r8515m7895q2964p0297
4614I388112K8609O0083J39964J01694J31574K80315K71631K53517M03491M98750
$$ plain form
4682 16961437 16170118 15615180 15158497 14750079 14253577 13919923 13640040 13503012 13504989 13539523
4672 13539523 13580105 13633342 13763181 13868161 14102322 14390621 14745659 15248679 15720966 16195824
4662 16195824 16832269 17656752 18430003 19492752 20625566 21594567 22590055 23569281 24198567
4653 24198567 24462470 24514669 24047667 23317641 22452205 21465394 20741638 20067799 19522164 19250933
4643 19250933 19108458 19137901 19086050 19079348 19093206 19004311 18479015 17932486 17246140 16439649
4633 16439649 15404591 14520588 13740970 13039757 12451929 11846044 11447384 11108194 10797538
4624 10797538 10505222 10310234 10030434 9786840 9755111 9687783 9589268 9541373 9458409 9388112
4614 9388112 9416721 9476804 9616768 9718462 9850036 10130351 10401982 10655499 11058990 11557740
4604A1557740N11586N50654O18426N56305N65567L50088J27415k03705m32080
4595A4201996o78881p56698o60497o80989p59459o16364m85217m37691m17336
4586H708864l84596l66165k58447k20343j72227j28252k47273j77048J7409k58124
4576F513798k38336q8204j99216n5602n1835j15839l7819q6230q2909j04567L251
4565E456492p0520n0123n5066j19734j04796l067P6213Q1773q2535n5191J12003
4554E185449m0189r878K6810m8680J5748k6991q7867p1632R7594r6343r9733j6354
4542D827934r3746L5337L6586n4586p1851Q9758R6880K2575j29789Q8856k2461
4531D825493K5158m9469N438K6456m4321R7966k1686M4996k5716l3517j7813M637
$$ plain form
4604 11557740 12069326 12619980 13238406 13794711 14360278 14710366 14837781 14634076 14201996
4595 14201996 13523115 12766417 12105920 11424931 10665472 10049108 9563891 9126200 8708864
4586 8708864 8324268 7958103 7699656 7479313 7307086 7178834 6931561 6754513 6771922 6513798
4576 6513798 6275462 6187258 5988042 5932440 5880605 5764766 5726947 5640717 5557808 5453241 5456492
4565 5456492 5385972 5335849 5280783 5161049 5056253 5053186 5129399 5211172 5128637 5073446 5185449
4554 5185449 5145260 5135382 5162192 5113512 5129260 5102269 5014402 4942770 5040364 4944021 4844288 4827934
4542 4827934 4734188 4769525 4806111 4751525 4679674 4769432 4866312 4888887 4759098 4847954 4825493
4531 4825493 4850651 4801182 4806620 4833076 4788755 4886721 4865035 4910031 4884315 4850798 4832985 4837622
4519D837622N080J7170J46004j07785o9704m121n2265N5315J0062r6746K0204
4508D760836j55318p8136J26898o4206k66517J5249p8225r9353N4919R36k7868
4497D189215R911j17569O6200p8021p191j12486l4220L6141M1964J4145J78298
4486D186387J0393j16258L7590n2707N9941O9593p5711K8415M5075j22814M1012
4475D110916Q6405k0322J05470J63268P381J13072N8020R0550j8416p5635q3949
4464D536760j15762P5991o113P0812K3226k6513P450M613J9006n3423K5655K6571
4452D588273m1548p0321L5184j5295k9049n5712J37009J64600r8743j0516R1679
4441D695561j29050L7437L1728O9318O3806M9366P7514P1543j8127R6375J38316
$$ plain form
4519 4837622 4842702 4859872 5005876 4898091 4828387 4824266 4772001 4827316 4837378 4740632 4760836
4508 4760836 4605518 4527382 4654280 4590074 4323557 4338806 4260581 4161228 4216147 4217083 4189215
4497 4189215 4199126 4081557 4147757 4069736 4062545 3950059 3915839 3951980 3993944 4008089 4186387
4486 4186387 4196780 4080522 4118112 4065405 4125346 4194939 4119228 4147643 4192718 4069904 4110916
4475 4110916 4197321 4176999 4282469 4445737 4453118 4566190 4624210 4714760 4696344 4620709 4536760
4464 4536760 4420998 4496989 4490876 4561688 4584914 4558401 4565851 4570464 4589470 4536047 4561702 4588273
4452 4588273 4546725 4476404 4511588 4496293 4467244 4411532 4548541 4713141 4614398 4603882 4695561
4441 4695561 4566511 4603948 4635676 4704994 4768800 4818166 4895680 4967223 4949096 5045471 5183787
4430E183787J59145J38756J10888J17963k7658j33401o5402r1974j46437Q549
4420E254216J0897o1844j7774M8112m9778j47083q3047O8899M5659J8208N465
4409E091930p4245k0047J15172M7125Q0351M2548j3554K0180J0040j6224m1432
4398E241844p2700r9356Q824J6836N0681m6247k2951j7162Q6974N993Q0536m7666
4386E185606j9601r7185m5101L8665M4352n45m0005n6783o198j25228m0299m7865
4374D789813n4768l3048r100L2154r9668k9085P6740J3934L9535k1834K7724J3559
4362D745956n2817m514N6989n36k240N7237k0143j3677J2399P5848J8115J9232
4350D891849N0676j2253r0036J3699J5235j1171P9852m2715k5254J05625M6567
$$ plain form
4430 5183787 5342932 5481688 5592576 5710539 5682881 5549480 5484078 5392104 5245667 5254216
4420 5254216 5265113 5203269 5185495 5233607 5183829 5036746 4953699 5022598 5068257 5086465 5091930
4409 5091930 5017685 4997638 5112810 5159935 5240286 5282834 5269280 5289460 5299500 5283276 5241844
4398 5241844 5169144 5069788 5078612 5095448 5146129 5099882 5076931 5059769 5146743 5152736 5233272 5185606
4386 5185606 5166005 5068820 5023719 5062384 5106736 5106191 5066186 5009403 5003205 4877977 4837678 4789813
4374 4789813 4735045 4701997 4692897 4725051 4625383 4596298 4673038 4686972 4726507 4704673 4732397 4745956
4362 4745956 4693139 4688625 4745614 4745078 4742838 4800075 4779932 4766255 4778654 4854502 4872617 4891849
4350 4891849 4942525 4930272 4840236 4853935 4869170 4857999 4937851 4895136 4869882 4975507 5022074
4339E022074l1145j04475J36171K9365O2420N3151o00R421J8863n6703L3307l8616
4327E133233l8834l5265p3454k0589N8291P6569P0783n7077j6173j4165M2689
4316E126008j9237K8843p778J02486J03360J7365M0468J245m0935J34263Q7975
4305E574063n5198m3O6988K4627L7848R5016q4429j0097R1767J07697K0818M865
4293E873922K6079l769J4582O460Q6153R4100J03164j6366K4481q250n502L2136
4281F227190k6575M8420Q6865J7192n2002l0875P8031Q0123Q7732o2492L6891
4270F490500k2145K7753K7372j8409N7987M2887P3021K3771O5478K7653R7275
4259F893143J33037M995j2671O6428R167O7154J90615R3244P9871J04644M4712
$$ plain form
4339 5022074 4990929 4886454 5022625 5051990 5114410 5167561 5166961 5176382 5195245 5138542 5171849 5133233
4327 5133233 5094399 5059134 4985680 4965091 5023382 5099951 5170734 5113657 5097484 5083319 5126008
4316 5126008 5106771 5135614 5127836 5230322 5333682 5351047 5391515 5392760 5351825 5486088 5574063
4305 5574063 5518865 5518822 5585810 5610437 5648285 5743301 5658872 5648775 5740542 5848239 5869057 5873922
4293 5873922 5900001 5896232 5910814 5917274 6003427 6097527 6200691 6184325 6208806 6200556 6195054 6227190
4281 6227190 6200615 6249035 6335900 6353092 6301090 6270215 6348246 6428369 6516101 6453609 6490500
4270 6490500 6468355 6496108 6523480 6505071 6563058 6605945 6678966 6702737 6768215 6795868 6893143
4259 6893143 7026180 7031175 7018504 7084932 7094099 7161253 7351868 7445112 7524983 7629627 7674339
4248G674339J7254R5124J33855O9448j1223J7751J37782J06971N1110M8089J58232
4237H498732J9670J34479L4347J99740J98788M714O4985J11205K12348K07099
4227I686107J97573K20710J20855J54526K28173K49331J50897K40000J50976J53009
4217A1552157J20566K34728K10849J88973R2970J02685J80710M5462J48639L17193
4207A3194932K79124J41688K16436K93557K09717J63575J57879L11637J60787
4198A5129332J84670K22722L15887K32466K44483M17667L47399K99988K63771
4189A7658385M85836M41876L63133M31478M01034N14806N51372N45747N51219
4180B1944886O84958O09847O44046Q56156Q93175R18160P86068R38428Q73523
$$ plain form
4248 7674339 7691593 7786717 7920572 7990020 7978797 7996548 8134330 8241301 8292411 8340500 8498732
4237 8498732 8518402 8652881 8687228 8886968 9085756 9090470 9155455 9266660 9479008 9686107
4227 9686107 9883680 10104390 10225245 10379771 10607944 10857275 11008172 11248172 11399148 11552157
4217 11552157 11672723 11907451 12118300 12307273 12400243 12502928 12683638 12729100 12877739 13194932
4207 13194932 13474056 13615744 13832180 14125737 14335454 14499029 14656908 14968545 15129332
4198 15129332 15314002 15536724 15852611 16085077 16329560 16747227 17094626 17394614 17658385
4189 17658385 18144221 18586097 18949230 19380708 19781742 20296548 20847920 21393667 21944886
4180 21944886 22629844 23239691 23883737 24739893 25633068 26551228 27337296 28275724 29149247
4171B9149247Q16576J024381R33914R44097Q46158R91353J222912J197500J445530
4162C8571668J555085J786022K234641K471985K642117L044946L505779L853726
4154E9665969M284817M813655N494330O377027P327679Q621039J0420100J2587356
4146A19591972J5612616J9225149K3578222K6883061K7378190K3887206J2860788
4139B69017204k642655j8208061k7424854k9483028k7003719k1932434j6432141
4132A25890312j2394905r703924p930100o877654n957066n289976m693169m318009
4124F8725509m131518l880401l767245l415171k905057k590535k058689j841587
4116D4135306j532675j400984j150390j040226o26090k99345l72566k52125k82582
$$ plain form
4171 29149247 29965823 30990204 31924118 32868215 33714373 34705726 35928638 37126138 38571668
4162 38571668 40126753 41912775 44147416 46619401 49261518 52306464 55812243 59665969
4154 59665969 63950786 68764441 74258771 80635798 87963477 96584516 107004616 119591972
4146 119591972 135204588 154429737 178007959 204891020 232269210 256156416 269017204
4139 269017204 266374549 248166488 220741634 191258606 164254887 142322453 125890312
4132 125890312 113495407 103791483 95861383 88983729 83026663 77736687 73043518 68725509
4124 68725509 64593991 60713590 56946345 53531174 50626117 48035582 45976893 44135306
4116 44135306 42602631 41201647 40051257 39011031 38384941 38085596 37713030 37460905 37178323
4107C7178323n42000r51109j238134j085224j217277j171809j022171q46484o10158
4098B8493957o91806p08601n63402m92435m15203m67814k14670k38767m35977
4089B4265282k72365l27617k32434o5483q0259p5638j01526m2423l6076Q6179
4079B3117640K35J28672Q6386K5836J29924Q1727K14811K07348K69290J14904
4069B4376773L90797M81294O11700O17829P22522R56640P80200P97785O82748
4060C0418288J81290q8382k09094k44462j80075r3480o1646K52906K30224N6482
4050C0262051M46330M32073K51919M43121M95490K66394M37523N77614N01728
4041C4114243M82786O85240O63449O84455P24819P10691P50539P70911P08490
$$ plain form
4107 37178323 36636323 35685214 34447080 33361856 32144579 30972770 29950599 29104115 28493957
4098 28493957 27802151 27093550 26530148 26037713 25622510 25154696 24940026 24701259 24265282
4089 24265282 23992917 23665300 23432866 23367383 23287124 23211486 23109960 23067537 23031461 23117640
4079 23117640 23117875 23246547 23332933 23358769 23488693 23570420 23785231 23992579 24261869 24376773
4069 24376773 24767570 25248864 25860564 26478393 27200915 28157555 28937755 29735540 30418288
4060 30418288 30599578 30511196 30302102 30057640 29877565 29784085 29722439 29975345 30205569 30262051
4050 30262051 30708381 31140454 31392373 31835494 32330984 32597378 33034901 33612515 34114243
4041 34114243 34597029 35282269 35945718 36630173 37354992 38065683 38816222 39587133 40295623
4032D0295623P94475Q68756Q17035J026903R40907R06032Q70636J072943J145594
4023D8738904J034250J107048J180879J151044J280326J328254J243712J392551
4015E8456968J542041J354304J393864J458367J523914J524821J589208J567992
4007G0411479J581487J566285J545472J727696J610352J700117J780235J733732
3999H3656855J721209J654126J604280J637278J445513J330064J487904J390357
3991I5927586J052839J059059J041710R12302P65089P96190P31724N52164M37176
3982A03275839J80867j28939j53824l68269n91408o63423q41267r68482j010075
3973I8731019j207444j170336j323020j390367j481763j589029j705023j719616
$$ plain form
4032 40295623 41090098 41958854 42775889 43802792 44743699 45649731 46520367 47593310 48738904
4023 48738904 49773154 50880202 52061081 53212125 54492451 55820705 57064417 58456968
4015 58456968 59999009 61353313 62747177 64205544 65729458 67254279 68843487 70411479
4007 70411479 71992966 73559251 75104723 76832419 78442771 80142888 81923123 83656855
3999 83656855 85378064 87032190 88636470 90273748 91719261 93049325 94537229 95927586
3991 95927586 96980425 98039484 99081194 99993496 100758585 101554775 102286499 102838663 103275839
3982 103275839 103456706 103327767 103173943 102805674 102214266 101550843 100709576 99741094 98731019
3973 98731019 97523575 96353239 95030219 93639852 92158089 90569060 88864037 87144421
3965H7144421j821323k068207k062229k043474k039486k075643j969854k024404
3957G1039801k149673j852019j878103j896271j856792j755174j673481j671286
3949E6307002j664319j575193j528177j367486j351489j308830j204958j134792
3941D5171758j091164j190588r40996j039520r16751r46750q12147p21839p31681
3932C6780322p64257p06605o56952p18416n47156n79688n56962n20169m84038
3923C1246079m11113m39739l90742m91154m43389l90314k65268l45038m70499
3914B7598823m45950m69404l60862l18274k70888l56452m31985l12546j85556
3905B4446906j61192k93362k59930l02484l02279j32978k54863j92899k12224
$$ plain form
3965 87144421 85323098 83254891 81192662 79149188 77109702 75034059 73064205 71039801
3957 71039801 68890128 67038109 65160006 63263735 61406943 59651769 57978288 56307002
3949 56307002 54642683 53067490 51539313 50171827 48820338 47511508 46306550 45171758
3941 45171758 44080594 42890006 41949010 40909490 39992739 39045989 38233842 37512003 36780322
3932 36780322 36016065 35309460 34652508 33934092 33386936 32807248 32250286 31730117 31246079
3923 31246079 30834966 30395227 30004485 29513331 29069942 28679628 28414360 28069322 27598823
3914 27598823 27152873 26683469 26322607 26004333 25733445 25376993 24945008 24632462 24446906
3905 24446906 24285714 23992352 23732422 23429938 23127659 22994681 22739818 22546919 22334695
3896B2334695j60821k36360k88068j82410j48924j99177j81432j35996j97768
3887B0603739j02276j62308p9892o1346j05928j39Q458r5544O6018j4101m229
3876B0052452K1155j28298J2473J92995L517O7522K2715r48Q988Q8120J78719
3865B0519410Q0405R3656M1048k744J98295K42837L4931J3961K09314J60668J73210
3854B1764991K46025J88544J72637K70741J91338K2044J02496j07568j92778K284
3844B2660754o6254o9547j37104j84345j29170j55388r435n7564p1722j33820
3834B1646405k57976j22821j49360k51746o5018j46195j60583k71179k24428j68383
3824A9828716j43673j46989j99426r0188k29253k60650j34263r5546q6257j33222
$$ plain form
3896 22334695 22173874 21937514 21649446 21467036 21318112 21118935 20937503 20801507 20603739
3887 20603739 20501463 20339155 20259263 20197917 20091989 20091850 20100308 20004764 20070782 20056681 20052452
3876 20052452 20073607 19945309 19957782 20150777 20154294 20221816 20244531 20243583 20252571 20340691 20519410
3865 20519410 20599815 20693471 20734519 20731775 20930070 21172907 21207838 21221799 21431113 21591781 21764991
3854 21764991 22011016 22199560 22372197 22642938 22834276 22856320 22958816 22851248 22658470 22660754
3844 22660754 22594500 22524953 22387849 22203504 22074334 21918946 21909511 21851947 21780225 21646405
3834 21646405 21388429 21265608 21116248 20864502 20799484 20653289 20492706 20221527 19997099 19828716
3824 19828716 19685043 19538054 19338628 19248440 19019187 18758537 18624274 18528728 18442471 18309249
3814A8309249o8307o7286M2796j91522J1168j06239k89N3027L0975M0410Q6733
3803A8140715J04761J68357N8596L3399J45746R1448J45253J06674J96371J36787
3793A9328107K06779K02234K03218J96388J35431K44957K01746J88755M03206
3784B1310821K32434K66211J79029L26715K78131K81275L66052L31717L93620
3775B3966005M21997M53651M66789M10211O20464M77676M83437N31527O12403
3766B8444160N44204O10943P65068Q14168P06288Q09778R03470Q57974R59901
3757C5415954J002953R95807J139598J130682J200431J175093J145565J173772
3749D4379855J274835J454584J482786J312027J463266J714268J663244J777047
$$ plain form
3814 18309249 18240942 18173656 18216452 18024930 18036098 17929859 17929570 17982597 18013572 18053982 18140715
3803 18140715 18245476 18413833 18472429 18505828 18651574 18743022 18888275 18994949 19191320 19328107
3793 19328107 19534886 19737120 19940338 20136726 20272157 20517114 20718860 20907615 21310821
3784 21310821 21543255 21809466 21988495 22315210 22593341 22874616 23240668 23572385 23966005
3775 23966005 24388002 24841653 25308442 25718653 26339117 26816793 27300230 27831757 28444160
3766 28444160 28988364 29599307 30364375 31178543 31884831 32694609 33598079 34456053 35415954
3757 35415954 36418907 37414714 38554312 39684994 40885425 42060518 43206083 44379855
3749 44379855 45654690 47109274 48592060 49904087 51367353 53081621 54744865 56521912
3741E6521912J810294J989381J887248J888991J894039J919872J738628J535420
3733G1185785J433347J320939J037167J005012P30558N84734N33589N45561M22056
3724G8798748L39592N34109L16806K43549K69570K63980L09427K83600J54559
3715H1513940K92206M16548N48675O93714R31360J156094J380330J777151K004345
3706I0714363K501126K756283K975578L313009L773782L851337M083827M295026
3698A18264331M602088M655181M687979M753625M963525M787290M666513M578675
3690A55959207M467056M353755L979445L888531L357646L013737K558156J938578
3682A83516111J374341O72768R9744n46485j251753j592900k176924k722425l111150
$$ plain form
3741 56521912 58332206 60321587 62208835 64097826 65991865 67911737 69650365 71185785
3733 71185785 72619132 73940071 74977238 75982250 76712808 77297542 77831131 78376692 78798748
3724 78798748 79138340 79672449 79989255 80232804 80502374 80766354 81075781 81359381 81513940
3715 81513940 81806146 82222694 82771369 83465083 84396443 85552537 86932867 88710018 90714363
3706 90714363 93215489 95971772 98947350 102260359 106034141 109885478 113969305 118264331
3698 118264331 122866419 127521600 132209579 136963204 141926729 146714019 151380532 155959207
3690 155959207 160426263 164780018 168759463 172647994 176005640 179019377 181577533 183516111
3682 183516111 184890452 185563220 185662964 185116479 183864726 182271826 180094902 177372477 174261327
3673A74261327l498382l597784l815033m038630l913447m064996m266259m255090
3665A42811706m238397m325492m171863m157246l963191l907840l798094l535289
3657A10714294l332613l170662l033109k735780k411927k209305j962019j658259
3649I0200620j569682j257604j020453q63781q23374n23482m43810l86789j21949
3640H3189696o1166L8381J57827J20341L27630L04948K17341L96720K61449J40877
3630H5094044J16045J43783Q9437Q6036O8644J21389P7728J77107J24572J87688
3620H6286473K00763K68790M31773L41614L58638M67808N63572O52668P06603
3611I0278702P90086P75891R76754J078745J236800J206780J332323J459691J620493
$$ plain form
3673 174261327 170762945 167165161 163350128 159311498 155398051 151333055 147066796 142811706
3665 142811706 138573309 134247817 130075954 125918708 121955517 118047677 114249583 110714294
3657 110714294 107381681 104211019 101177910 98442130 96030203 93820898 91858879 90200620
3649 90200620 88630938 87373334 86352881 85489100 84665726 84142244 83698434 83311645 83189696
3640 83189696 83128530 83166911 83324738 83445079 83772709 84077657 84294998 84691718 84953167 85094044
3630 85094044 85210089 85353872 85443309 85529345 85597989 85719378 85797106 85974213 86098785 86286473
3620 86286473 86487236 86756026 87187799 87529413 87888051 88355859 88919431 89572099 90278702
3611 90278702 91068788 91844679 92821433 93900178 95136978 96343758 97676081 99135772 100756265
3602A00756265J705990J745359J835546K124708K210401K338183K430980K563965
3594A17711397K641995K553048K524427K699822K600022K386473K368356K245424
3586A37730964K100098K052897J974172J851772J758404J600418J593686J188332
3578A51850743Q80894P60419O34862L00380Q6165k69206n12937o25770p83644
3569A52321906r47889j122259j167603j021090r68634r95503j018250q01928q64054
3560A43414696p86639p76674n73377o92013o41205n07277m15600l59580l48430
3551A38313901l60034j84763k78989k71464l3784k08309k01982j31538m9367j96199
3541A36397472l38053l66296m67109q54064j099147j212509j560803j851382j946206
$$ plain form
3602 100756265 102462255 104207614 106043160 108167868 110378269 112716452 115147432 117711397
3594 117711397 120353392 122906440 125430867 128130689 130730711 133117184 135485540 137730964
3586 137730964 139831062 141883959 143858131 145709903 147468307 149068725 150662411 151850743
3578 151850743 152731637 153492056 154126918 154427298 154513463 154244257 153731320 153105550 152321906
3569 152321906 151374017 150251758 149084155 148063065 147094431 146098928 145080678 144278750 143414696
3560 143414696 142628057 141851383 141278006 140585993 139944788 139437511 139021911 138662331 138313901
3551 138313901 137953867 137769104 137490115 137218651 137184867 136976558 136774576 136643038 136593671 136397472
3541 136397472 136059419 135693123 135226014 134371950 133272803 132060294 130499491 128648109 126701903
3532A26701903k170260k407544k418354k539871k746215k742434k729176k880766
3524A06067283k693404k710438k885344k779323k873386k826503k810584k778637
3516H3709664k760853k612706k532498k437512k285848k054858j845996j765267
3508F5414126j528126j352834j405357j199777q65359p66055o69684o71498n00597
3499E6454839l73823m86411k91040l15401l50711l17316m74647l61777l17764
3490E3165949l41135l58967l43448l70190l36428k68481m16519m30383m70795
3481D9829603n03949o41934o64210o68825q80965r70819r93773r79117j009050
3472D2516961j096513j118518r34995r07201j072664j010200r35874j021945r49721
$$ plain form
3532 126701903 124531643 122124099 119705745 117165874 114419659 111677225 108948049 106067283
3524 106067283 103373879 100663441 97778097 94998774 92125388 89298885 86488301 83709664
3516 83709664 80948811 78336105 75803607 73366095 71080247 69025389 67179393 65414126
3508 65414126 63886000 62533166 61127809 59928032 59062673 58296618 57626934 56955436 56454839
3499 56454839 56081016 55594605 55303565 54988164 54637453 54320137 53845490 53483713 53165949
3490 53165949 52824814 52465847 52122399 51752209 51415781 51147300 50730781 50300398 49829603
3481 49829603 49325654 48683720 48019510 47350685 46469720 45498901 44505128 43526011 42516961
3472 42516961 41420448 40301930 39366935 38459734 37387070 36376870 35440996 34419051 33469330
3463C3469330j063831j074626r20788j115349r37299q85536q90465q68495q32237
3454B4880704o70769p27104n77427o38882o91284n08937m11006m23792m68989
3445A9762514n38271m25609m07471l49531m09207l84636l04141l64312l56618
3436A6222718l15873k50161k98332l44124k86129k68315j63966j63441l35556
3427A3796821k93003k03730k68943l07416j94067k12302j17837j91727k57646
3418A1750150j13444r2340j44738j88094k17185j60308j44297k28359j36886j1580
3408A0312919j90105j14178r6633j53099j84190j36834j31017j70954l2977k3380
3398I079552r6197j53715q2183q7011j91238L438j64010j54811j22114j12207
$$ plain form
3463 33469330 32405499 31330873 30410085 29294736 28357437 27471901 26581436 25712941 24880704
3454 24880704 24209935 23482831 22905404 22266522 21575238 21066301 20655295 20231503 19762514
3445 19762514 19224243 18798634 18391163 18041632 17632425 17247789 16943648 16579336 16222718
3436 16222718 15906845 15656684 15358352 15014228 14728099 14459784 14295818 14132377 13796821
3427 13796821 13503818 13300088 13031145 12723729 12529662 12317360 12199523 12007796 11750150
3418 11750150 11636706 11544366 11399628 11211534 10994349 10834041 10689744 10461385 10324499 10312919
3408 10312919 10122814 10008636 9912003 9758904 9574714 9437880 9306863 9135909 9102932 9079552
3398 9079552 8983355 8829640 8747457 8660446 8469208 8472646 8308636 8153825 8031711 7919504
3388G919504j18315j23607K537j16448r6206o0194j48732j45529j71186j03350
3378F838474r9396l1244n768J7640j86753m9124p0466r0218k6049j37078l6718
3367F123300m9917p621p2500j33706j06025p6674N5907M0777n9486n7945j26271
3356E529839n9621l1295r909m5892o6522J2730K7678j09717n8995k2119o8621
3345E097556r4971M236K8115n4290p5684K648o8354j15106n5443K3244n9949Q730
3333D640732r2850Q0717n8270j0980N4510L9952K8678r7883R694L290N4082N2207
3321D703879M2316P4428j6119J11346L3242O2206p8184j45044j11722K1059k5725
3310D671682L9140l354n933K9427n6550j07603L205J22670n0114M2287o4158m8723
$$ plain form
3388 7919504 7801189 7677582 7680119 7563671 7467465 7407271 7258539 7113010 6941824 6838474
3378 6838474 6739078 6707834 6702066 6719706 6532953 6483829 6413363 6323145 6297096 6160018 6123300
3367 6123300 6073383 6065762 5993262 5859556 5753531 5676857 5732764 5773541 5714055 5656110 5529839
3356 5529839 5470218 5438923 5429014 5383122 5316600 5329330 5357008 5247291 5188296 5166177 5097556
3345 5097556 5002585 5006821 5034936 4980646 4904962 4907610 4839256 4724150 4668707 4691951 4632002 4640732
3333 4640732 4547882 4628599 4570329 4559349 4613859 4653811 4682489 4584606 4594300 4597590 4651672 4703879
3321 4703879 4746195 4820623 4804504 4915850 4949092 5011298 4933114 4788070 4676348 4697407 4671682
3310 4671682 4710822 4707468 4701535 4730962 4674412 4566809 4570014 4692684 4642570 4684857 4620699 4571976
3298D571976J48182J32506k0688L4755m2774l9309J4281J73155J8017Q372l091
3287D995382J8776K8012J9818J56040l0792l6068o9664O611J14835r6584k4517
3276E081849n4122n8020J02131Q6532M9405q6052n6627L3108o3532K9273J0031
3265E073976k2950L3118R195k1085J07657Q9302J34325r828k6177O1387k1427
3254E407493O599J17773P7685R0014J29103K7469N1380J28328Q6903k3862J7016
3243F115901J26239J13152L7585J85541J84666J61664K34836J47089J69990J58061
3233G634724J58553K14596K18936K24883J41444K51893P6071L2780L2272J1970
3223H998122J84061J85K26995N10572O41204M55083O02403O66883O5407p96825
$$ plain form
3298 4571976 4720158 4852664 4831976 4866731 4823957 4784648 4798929 4972084 4990101 4998473 4995382
3287 4995382 5014158 5042170 5061988 5218028 5187236 5151168 5081504 5088115 5202950 5106366 5081849
3276 5081849 5027727 4969707 5071838 5158370 5207775 5121723 5065096 5098204 5034672 5063945 5073976
3265 5073976 5051026 5084144 5093339 5072254 5179911 5269213 5403538 5393710 5367533 5428920 5407493
3254 5407493 5414092 5531865 5609550 5699564 5828667 5856136 5907516 6035844 6122747 6098885 6115901
3243 6115901 6242140 6355292 6392877 6578418 6763084 6924748 7159584 7306673 7476663 7634724
3233 7634724 7793277 8007873 8226809 8451692 8593136 8845029 8921100 8953880 8986152 8998122
3223 8998122 9182183 9182368 9409363 9919935 10561139 11016222 11618625 12285508 12350915 11554090
3213A1554090q13645o71738q96664q79987o46449l81403l02033k12728k14905
3204F534538j60775j61451k5328J02945o3984K3425P7105K09382L26684K45395
3194G107936K10021K15163L28796L77311O11220R06954J334495J345018J161890
3185A3598804J454027J419739j07780j429747j402596j469399j400926j484926
3177I177196j094957q40258n24846m00532l24661k58831k76291j09227q7054n7082
3167E203457O927Q9974r7895J01488J74107K17737o4237L2771M5198J88116K34849
3156F132492N92707P11976N94969N04045M08200j84896o09266o50617q37125p33617
3146E928868p32504o01212m07487l51488k71567p1646j82158k02241k4397j30740
$$ plain form
3213 11554090 10740445 10068707 9172043 8292056 7645607 7264204 6962171 6749443 6534538
3204 6534538 6373763 6212312 6186984 6289929 6225945 6249370 6326475 6535857 6862541 7107936
3194 7107936 7317957 7533120 7861916 8239227 8850447 9757401 11091896 12436914 13598804
3185 13598804 15052831 16472570 16364790 14935043 13532447 12063048 10662122 9177196
3177 9177196 8082239 7241981 6717135 6316603 5991942 5733111 5456820 5347593 5260539 5203457
3167 5203457 5210384 5300358 5202463 5303951 5478058 5695795 5631558 5664329 5709527 5897643 6132492
3156 6132492 6725199 7437175 8032144 8536189 8944389 8759493 8150227 7499610 6662485 5928868
3146 5928868 5196364 4595152 4187665 3836177 3564610 3492964 3310806 3108565 3084168 2953428
3136B953428n2237k706j28931o8116k5464J07850l9081j43764p3291r4897p3106
3125B359685j64636q9223p1219q6657J1215N9022m1687p817j714j49400j57744
3114A659825o9759J26105R8647K0616j8300p8124j10608k0916j53514j2414R4808
3103A536366P661n477n1253J10472m2855j1310o9139p6431l829o1401P8262K6960
3091A438026j62188q21P0194l1964k2246o1025k0885L0246L497J9851q3114p096
3079A172475M677K292L822p162k5577o5564M3453l9672l679J7345k9201o8872
3067A004337J0278R1110J1896m5931r9665p6731M2369R6772n756n1906J39179
3056A115952q4057j9194K6549q339n3608J8381P2106p4408m1358n0602K7816P408
$$ plain form
3136 2953428 2901191 2898485 2769554 2701438 2675974 2783824 2744743 2600979 2527688 2432791 2359685
3125 2359685 2195049 2105826 2034607 1947950 1959165 2018187 1976500 1968683 1966969 1817569 1659825
3114 1659825 1590066 1716171 1814818 1835434 1817134 1739010 1628402 1607486 1453972 1441558 1536366
3103 1536366 1544027 1538550 1487297 1597769 1554914 1543604 1474465 1398034 1394205 1332804 1411066 1438026
3091 1438026 1275838 1275017 1345211 1313247 1291001 1229976 1209091 1239337 1242834 1262685 1179571 1172475
3079 1172475 1177152 1179444 1183266 1176104 1150527 1084963 1128416 1088744 1085065 1102410 1073209 1004337
3067 1004337 1014615 1105725 1117621 1071690 972025 895294 937663 1034435 1028679 976773 1115952
3056 1115952 1031895 1012701 1039250 1030911 977303 995684 1067790 993382 952024 901422 929238 936646
3044I36646q1314k9755J0356O0390J0119N9819p0391J9295o862N3724j0440l6388
3032I15199N431j7921R1630k4753L2002M9986j5565l0490q9738N6367O5512P678
3020A045338m9962n9803M5820k947q0722m681j5303m7793M6841j0047J17314r3804
3008H90251q5787k8050N9603L8109j67250L6746J09891j8262n3390M6509R5259
2997I23629j2408o4485J4334j351P585Q6602M8172p7183L3278q9502j1934l4724
2985H22013m5922N7971p5508K8493k415n3235M5715O5554N5934p9210j1207j393
2973H06790L0829J7076n508n3934J572N0457J7734k7116j65158L8680n101L5550
2961G41871j1575L3544P0753m806j7356l7270o7038P3626N8630k5049o070L9295
$$ plain form
3044 936646 855332 825577 835933 896323 906442 966261 895870 915165 908303 962027 951587 915199
3032 915199 920630 902709 994339 969586 1001588 1051574 1036009 1005519 915781 972148 1037660 1045338
3020 1045338 995376 935573 981393 978446 897724 893043 877740 829947 876788 866741 984055 890251
3008 890251 804464 776414 836017 874126 706876 743622 853513 835251 781861 828370 923629
2997 923629 911221 846736 861070 859719 867304 953906 1002078 924895 958173 868671 856737 822013
2985 822013 776091 834062 758554 787047 784632 731397 777112 842666 898600 819390 808183 806790
2973 806790 837619 854695 849187 795253 796825 847282 865016 837900 672742 711422 706321 741871
2961 741871 730296 763840 834593 829787 812431 775161 708123 781749 840379 815330 809260 848555
2949H48555n1502o7977Q5735q5523k8165N1083K0297j80J7247m6493P1585j8273
2937G96389J2711K9639j5033J3254k9657J66567l9721J8974K0086R7253o3606
2926A006856m8473K4441m9541j7522J15369m3004N8627l9306R1549l5462o7766
2915I95768k4609R4003J44805m4879O934L5919n0788q717O9414O252J5624O0093
2903A299819l1468j00034O6595R1076M850m8895J52730Q0345j2895k3005l1161
2892A447957M1653J39306q611m4747Q4194k8325N6400J0926j06254p4618j22727
2881A395154l0414p2774o8159P7866J27571j10742q9037O018N5278k8536p6135
2870A186090M5036J75129R18Q0973L1364l8805l3176l1949J5342l2500j3421J01055
$$ plain form
2949 848555 797053 729076 814811 729288 701123 752206 772503 772323 789570 743077 814662 796389
2937 796389 809100 838739 823706 836960 807303 973870 934149 953123 973209 1070462 1006856
2926 1006856 958383 982824 933283 915761 1031130 988126 1046753 1007447 1098996 1063534 995768
2915 995768 971159 1065162 1209967 1165088 1172022 1207941 1157153 1148436 1217850 1224102 1239726 1299819
2903 1299819 1268351 1168317 1234912 1325988 1330838 1281943 1434673 1515018 1502123 1479118 1447957
2892 1447957 1489610 1628916 1620305 1575558 1659752 1631427 1687827 1698753 1592499 1517881 1395154
2881 1395154 1364740 1291966 1223807 1301673 1429244 1318502 1229465 1235483 1290761 1262225 1186090
2870 1186090 1231126 1406255 1407173 1488146 1519510 1480705 1447529 1415580 1430922 1398422 1385001 1486056
2858A486056m858J1725J3713j441p501j05302j61402O3119J21932o2682K8370
2847A381729j52289l6940Q8473m2425n7348N3754P3774p7571q1480o917r1981
2836A050779p5629M3019k5070Q0054o9518m8394p5092k5946M5875q3092m6539
2825G70447m6285r4360J7282j02889Q0305K1045p14j3021J662p4804M930j518
2813E62080l0714N5397L421Q5070n4513o9719m3869M1108N085k4332l2759K1861
2801E18116l9458j50513J33846M0380N437J5562r8137j7571k7653j4692J5107
2790C80424J3400n7857K3791O2338k2567L162j1124j54398O1012m1788l4262n9596
2778A62535J15126O7405m437l2819l1357K95L5356r4779P59M0032P4426M0542
$$ plain form
2858 1486056 1481198 1492923 1506636 1505195 1497694 1392392 1230990 1294109 1416041 1353359 1381729
2847 1381729 1229440 1192500 1280973 1238548 1181200 1234954 1308728 1231157 1149677 1142760 1050779
2836 1050779 975150 1018169 993099 1073153 1003635 955241 880149 854203 900078 816986 770447
2825 770447 724162 629802 647084 544195 624500 645545 644831 631810 633472 558668 563598 562080
2813 562080 531366 586763 590184 675254 620741 551022 507153 548261 553346 529014 496255 518116
2801 518116 478658 328145 461991 502371 507808 523370 425233 407662 380009 365317 380424
2790 380424 393824 335967 359758 422096 399529 402691 391567 237169 298181 256393 222131 162535
2778 162535 277661 345066 340629 307810 276453 276748 312104 217325 218084 258116 332542 373084
2766C73084r2954k1332k1704J6027m9408J7726O0317j17467K769Q9799K89M4531
2754C01677K6585n4409O0512K7662r5874L9846l6585k5924Q5956r9616l5802Q2579
2742B76607k6531r1043p1585K0916J4693J6834L3140O6351j06050L1076J04343
2731B68751q8533J9585m9715j9383j4183O0080P3167q5915o8856j0443r6447J17100
2719A05208K1981j47J6255l9635O9496j3138o3293m7638R3950L0259k3752n7252
2707I2294K5066P9567l8044o590L3621j0299m4591m0865l517j7754M5504l9643
2695G4749J01375L5650o9931j906j11865Q6915j8774k9415Q1061Q823J5197J8892
2683A90771R86p1671r6017J08676J5543n084L3306k1729M6568o8471k0265J7685
$$ plain form
2766 373084 280130 258798 237094 253121 203713 221439 281756 164289 167058 256857 257146 301677
2754 301677 328262 273853 334365 362027 266153 305999 269414 243490 329446 229830 194028 276607
2742 276607 250076 159033 87448 108364 123057 139891 173031 239382 133332 164408 268751
2731 268751 180218 199803 150088 130705 116522 176602 249769 163854 94998 84555 -11892 105208
2719 105208 127189 127042 143297 103662 173158 160020 96727 49089 143039 173298 149546 92294
2707 92294 117360 196927 158883 152293 185914 175615 131024 90159 86642 68888 114392 74749
2695 74749 176124 211774 141843 139937 28072 114987 96213 66798 147859 156682 171879 190771
2683 190771 191757 120086 24069 132745 148288 143204 176510 154781 201349 132878 112613 130298
2671A30298L1949p1050l8675O5458O9640o4946M2212n0717m8981k0762m7229K5654
2659B2851M9249J04923N3283N099l4830l1333j33624R3864M5975j8402N305j8962
2647A43398N8648j22978J4418p9934j2297K5346N0574j3652m0320q1503M6750
2636a1550O8920M6684J17166o3529p4077q0161M3168o3217q810K2302K0446q669
2624H673R039Q9860N654L3219o687K3216j7590o8038m5697k7117l2845N7362o139
2611B2910J17710n2666l9162M1853l5431m8389P4743p8876n610J06249M3376k8223
2599A18484m0028R1556N305k9463J1416k7322j6075O2585j45330O2769M6250q029
2587A32118l0172j1016l4799j6833P2068M9066j00144M1458L512O3007O782p0006
$$ plain form
2671 130298 162247 91197 52522 117980 187620 122674 164886 114169 65188 44426 -2803 22851
2659 22851 72100 177023 230306 235405 200575 169242 35618 129482 175457 157055 162360 143398
2647 143398 202046 79068 93486 13552 1255 26601 77175 63523 23203 -58300 -11550
2636 -11550 57370 104054 221220 157691 83614 3453 46621 -16596 -25406 -3104 17342 8673
2624 8673 17712 107572 113226 146445 139758 162974 145384 77346 31649 4532 -28313 29049 22910
2611 22910 140620 87954 48792 90645 55214 6825 81568 2692 -2918 103331 146707 118484
2599 118484 78456 170012 175317 145854 157270 129948 113873 176458 31128 93897 140147 132118
2587 132118 101946 90930 56131 39298 111366 160432 60288 101746 105258 168265 175047 105041
2575A05041J8861l8539L0280K3508m2237n3407M259K2761L573j17431L6482K4389
2563A7540J06330j5771r2735J18576O19j1382k2841r2465K3257K5908k6882J36389
2551A66543m9485N9170q0462m5273M394O4508N892m6688J38923M5402j07811j01210
2539E3903l5781K7383m792J8083n0605m1671J09034J07687j16292q1490N4848
2528D0307O7836n5184m822o1118o1755O4160M3264J55503k9854k3764p3719M7667
2516A08521o37l1316m6896m8625q2197J28130K7733j2589o4156J4785j1031l315
2504b1593L4697j17960k9800J21333J42079m4591k0603l7119m8502l5187N314
2493e1932j1693J23700M7411m4341j06779N5545Q2010o0954n2210p0550R5973
$$ plain form
2575 105041 123902 85363 115643 139151 96914 43507 47766 70527 74100 -43331 -6849 17540
2563 17540 123870 108099 15364 133940 134559 123177 100336 7871 31128 57036 30154 166543
2551 166543 117058 176228 95766 50493 54887 119395 125287 78599 217522 262924 155113 53903
2539 53903 18122 45505 40713 58796 8191 -33480 75554 183241 66949 -14541 40307
2528 40307 108143 52959 48137 -12981 -74736 -10576 32688 188191 158337 134573 60854 108521
2516 108521 107884 76568 29672 -18953 -101150 26980 54713 42124 -22032 -7247 -18278 -21593
2504 -21593 13104 -104856 -134656 -13323 128756 84165 63562 26443 -22059 -57246 -51932
2493 -51932 -63625 60075 107486 63145 -43634 11911 93921 32967 -19243 -89793 6180
2482F180J6327L9818o4580j7209J24280m7924l8277l317j3462K4618Q1077n8095
2470D9436l9825J0826j4788J4365J3150l8095J44607k1492l9014O8740k0733L556
2458A30733o8567K4877l5801M5228p1737N195m7569k9027J32699k2130L1308p8882
2446A6327r3009j7790J20062R8875K4277j06835m8547K4261l3126r6340n35J07394
2434d986j8779l2113P1485Q4057m7164n4387J01767j2011l4180M5782o5241J2370
2422D6600o9170J60026j52963q2813M7141J15403j9387j52645K01856Q0261N4928
2411B29237j02172k4782n6141m2025l4257J0539Q9632j7049P583N7909N3103o9298
2399A02279l8616o2718k6590J26013j13227j4887m2313J62389Q5683p8827r1417
$$ plain form
2482 6180 22507 62325 -2255 -19464 104816 56892 18615 15298 1836 26454 107531 49436
2470 49436 9611 20437 5649 20014 33164 -4931 139676 118184 79170 147910 127177 130733
2458 130733 62166 87043 51242 96470 24733 29928 -17641 -46668 86031 63901 95209 16327
2446 16327 -76682 -94472 25590 124465 148742 41907 -6640 17621 -15505 -111845 -112380 -4986
2434 -4986 -23765 -55878 15607 99664 52500 -1887 99880 87869 53689 99471 34230 46600
2422 46600 -22570 137456 -15507 -98320 -51179 64224 44837 -107808 94048 174309 229237
2411 229237 127065 102283 46142 4117 -30140 -19601 70031 52982 60565 118474 171577 102279
2399 102279 63663 945 -25645 100368 -12859 -27746 -70059 92330 178013 99186 7769
2388G769n4271j2412n5909J11421N8569J8350O4233Q2855k1780j15289j39292
2377e5756J30102k5905K8643J19707l2613k8808j7027K6168n3755m0122N4706
2366A05340o5663j09403R3068J39604l4203r1237j6626M2148n499P7074P3359
2355B07962M5867P047j4700P581q33l002k511j83024K7278P6091L0574j00131
2343I8199K9975M7283p6343J4550K4914l055N322K2522j1696J9899j20991o6401
2331a5822q0508J07463j3792j7484M3430R9349M9923m7830j29411J5791m473l9197
2319c2561O4856k6080R6988k0977j3278q176R0490O0159j35344k53o8752O3658
2307G0730J35180j13874l4973M1080Q8822l8899o7488j261M6594N6218k7806o9702
$$ plain form
2388 7769 -46502 -58914 -114823 -3402 55167 73517 137750 220605 198825 83536 -55756
2377 -55756 74346 48441 77084 196791 164178 135370 118343 144511 90756 50634 105340
2366 105340 39677 -69726 23342 162946 128743 37506 20880 63028 57529 134603 207962
2355 207962 253829 260876 246176 253757 252924 249922 247411 64387 91665 167756 198330 98199
2343 98199 128174 175457 99114 113664 138578 135523 140845 163367 151671 171570 50579 -15822
2331 -15822 -96330 11133 -2659 -20143 23287 122636 172559 124729 -4682 11109 6636 -32561
2319 -32561 32295 6215 103203 82226 68948 60772 151262 211421 76077 75824 7072 70730
2307 70730 205910 92036 57063 98143 186965 148066 80578 79317 125911 182129 154323 84621
2295H4621n2722k1176J01149o1780J9050P0926p0320j5611P4834K9917k2761k0038
2283A16089n4540K4846L9597o9795K5758L7903p9923K8177K2003N5820N315j2320
2271A38930L5865n5597n2546J00760o7104Q8814L9523L1296p6033o1145M6547
2260A69310m3239R4675L0179R428r2635J2394N1765r8693O167K1096l858k1242
2248A35347J6153m1369j0377J3311M9029p425L8577K8837m6924r4544L5908m0599
2236G5924O7195Q4486L6318k4042l2466m1410R1014K2256r5161O5374n2594L2384
2224B29278L3375J0308n5901o4450k276P0857k8497L4328P5412q1861n2665P4103
2212B42011j1002J1363L2495j25640J10987J16611j2549l2238J17628n7926l8285
$$ plain form
2295 84621 31899 10723 111872 50092 69142 140068 69748 54137 128971 158888 136127 116089
2283 116089 61549 86395 125992 56197 81955 119858 39935 68112 90115 145935 151250 138930
2271 138930 174795 119198 66652 167412 100308 189122 228645 259941 183908 122763 169310
2260 169310 126071 220746 250925 260353 167718 180112 231877 133184 139351 160447 156589 135347
2248 135347 151500 110131 99754 113065 162094 154669 193246 222083 175159 80615 116523 75924
2236 75924 143119 227605 263923 239881 207415 166005 257019 279275 184114 249488 196894 229278
2224 229278 262653 272961 217060 152610 150334 221191 192694 227022 302434 220573 167908 242011
2212 242011 231009 242372 274867 149227 260214 376825 364276 332038 449666 391740 353455
2201C53455j5608k6936R9706M8158k3529N8873q2690q9018L932q6663M1551Q2822
2189C64053O4454J4359k2198m0475Q2387p3532Q4570k3890q3183k223j4112N3985
2177D04195m7845M6979J44250k045Q1176r3921R5852M5438r9567J02117p830l9711
2165F29088K3586l0175M4296P9899M0039j8891M8208M9113J052m1052J8026P6751
2153I19940J0853l5049j5995K4335Q0622P1030J4346N4498k7011j10960K4393
2142A011002r603R7668L906O0271q138J69166N3413L6727N4704K3101m6035M8681
2130A494863J00120R1600J60625P0021k0918J03427J66400K05692R1662J11070
2120B574562l1616j318J35767M6538R8369O1461O6139J52840P8040J28372K37941
$$ plain form
2201 353455 337847 310911 410617 458775 435246 494119 411429 322411 326343 239680 281231 364053
2189 364053 428507 442866 420668 380193 462580 389048 473618 449728 366545 364322 350210 404195
2177 404195 356350 403329 547579 545534 626710 532789 628641 674079 574512 676629 668799 629088
2165 629088 652674 622499 666795 746694 786733 767842 816050 865163 866215 825163 843189 919940
2153 919940 930793 895744 879749 904084 984706 1055736 1070082 1124580 1097569 986609 1011002
2142 1011002 1001399 1099067 1102973 1163244 1155106 1324272 1377685 1414412 1469116 1492217 1446182 1494863
2130 1494863 1594983 1686583 1847208 1917229 1896311 1999738 2166138 2371830 2463492 2574562
2120 2574562 2542946 2541628 2677395 2723933 2822302 2883763 2949902 3102742 3180782 3309154 3547095
2109C547095K77561J42822K40806L90831M42348M49800N10010L34969M83478M53497
2099G273217N22181O60968R15159J159512J407782K036778K595300L451806M957129
2090B4979832O356892O353457N737275j896638o987909p607981o695006m552410
2082A5687512l078843k054055j402616j085411j043294o78767o14538l77536k12798
2073E139654j41914k91700l12061l29714l18661l34435k50739j60496k46421p0140
2063B683373j98201j73195j02927k23941m8623j8989n2271j21367j0526n5192
2053A678141n3353k2746j35629j26590j20312J4090k4482m8881o1262J6580o0776
2042A054780j05946j6812m7445r0774p6177J17276k8369j05715K5036O90p4534
$$ plain form
2109 3547095 3824656 3967478 4208284 4599115 5041463 5491263 6001273 6336242 6819720 7273217
2099 7273217 7795398 8456366 9371525 10531037 11938819 13975597 16570897 20022703 24979832
2090 24979832 31336724 37690181 43427456 41530818 34542909 26934928 20239922 15687512
2082 15687512 12608669 10554614 9151998 8066587 7023293 6344526 5729988 5352452 5139654
2073 5139654 4997740 4706040 4393979 4064265 3745604 3411169 3160430 2999934 2753513 2683373
2063 2683373 2485172 2311977 2209050 1985109 1936486 1917497 1865226 1743859 1733333 1678141
2053 1678141 1624788 1602042 1466413 1339823 1219511 1233601 1209119 1160238 1098976 1115556 1054780
2042 1054780 948834 932022 884577 793803 717626 834902 806533 700818 725854 726544 652010
2031F52010P6736K975k3732n3452p3594P4438J2476o0755m4145J6671o3628j9317
2019D96683n0786k2678L8285r5954n8325J36916j592r7510n482m27K0869k5359
2007C34640J07955J9250j65576n7330P1244j9307L6556n0938Q4299M2205o7151
1996C35847j53386L4434P7224O0909r5869p6566K4897N3445o8314K3638j44922
1985G1337K6175R6378M527M2173L262o7605l6885m613j32046N0201K8702Q019
1973H9625O8279O6790q6398k4551N602p280Q1077n3228P1043o8874j10027L3259
1961F5317J02124O34r980l2668j9781J6989J46009n122n2741j14696o4389O3685
1949I5381Q8524o5946l7419j6167O2337n7391o8012j1785n3943J2808k047K5486
$$ plain form
2031 652010 728746 731721 707989 654537 580943 655381 667857 607102 562957 579628 516000 496683
2019 496683 445897 423219 461504 365550 307225 444141 442549 345039 339557 339130 359999 334640
2007 334640 442595 461845 296269 238939 310183 290876 327432 276494 360793 402998 335847
1996 335847 182461 216895 294119 355028 259159 182593 207490 260935 192621 216259 71337
1985 71337 97512 193890 198417 240590 243852 176247 139362 134749 2703 52904 81606 89625
1973 89625 157904 224694 138296 113745 119347 112067 193144 139916 210959 142085 32058 65317
1961 65317 167441 168075 158095 125427 105646 122635 268644 263522 210781 96085 31696 95381
1949 95381 183905 117959 80540 64373 126710 69319 1307 -10478 -64421 -51613 -53660 -28174
1937b8174R3819j0025j7778N9311q331l6888R5648k0449n1243J14157l7183q2766
1925G0098O3490j0096J6757k9798j42756Q4343j9162N0194j25383J95911j5695
1914A37903R3070J125q2446k0118j8210l5162j2135N655m8203k2456M2848n6328
1902a4457k0522R0407L5497k8983R403n150L6050n3166p2159P6291J0027o5557
1890b319m9675P706M7065m007K4296O8500j5394r5353l7627J31571m4649K8337
1878E8451K8117o8336K3972o3114J14175J2822r0632k6438M4365PM6634m0190
1866C9833o2625J3700L7200N9021o0737J2108l7502m4415M6015j4826J06883n1352
1854D3303n7820O164p396j2863N3455K0998N6239n8371l7369R4898q2234r4496
$$ plain form
1937 -28174 65645 55620 37842 97153 88822 51934 147582 127133 75890 190047 152864 70098
1925 70098 133588 123492 140249 110451 -32305 52038 32876 83070 -42313 153598 137903
1914 137903 230973 232098 149652 129534 111324 76162 64027 69682 21479 -977 41871 -14457
1902 -14457 -34979 55428 90925 61942 71345 66195 102245 49079 -23080 53211 63238 -2319
1890 -2319 -51994 -44288 2777 -1230 23066 91566 76172 -19181 -56808 74763 30114 58451
1878 58451 86568 18232 42204 -20910 93265 106087 15455 -10983 33382 33389 80023 39833
1866 39833 -22792 -9092 28108 87129 26392 38500 998 -43417 2598 -12228 94655 43303
1854 43303 -14517 -8353 -15749 -28612 24843 45841 102080 43709 6340 101238 19004 -75492
1842g5492k2216p7594J21267J11940o47m3897L4055O679j00701o8785R9330M5191
1830B9130k2055P8028o4575L2065k3555j0223Q4025N8038m2761L3951j5738K7696
1818A64026j2456J8275K3528p6740j01969K7571P193J0006n2417j05565l177J68773
1806F7048q3983M0214J4103o5425p4082O9249J22305k3771l9915K6752J9594O07
1794G2696o4033M6990j5608N8809j28213m6123J03525M9805o2806m2793J233O2795
1782C6277O3367j08154p0045L1995O2139J16636K2490L9059q1220j67771O7669
1771A2442m9356Q8505k2774J07720j4223R3485r5488j04081q303l2829N4675l6415
1759f642l1747j42063J1497J08734J2561K3750l7553m6917K8588J18950l9268
$$ plain form
1842 -75492 -97708 -175302 -54035 57905 57258 13361 47416 54095 -46606 -115391 -16061 29130
1830 29130 7075 85103 20528 52593 29038 18815 102840 160878 118117 152068 136330 164026
1818 164026 151570 169845 193373 116633 14664 42235 49428 59434 7017 -98548 -101725 67048
1806 67048 -16935 23279 37382 -28043 -102125 -32876 89429 65658 25743 52495 72089 72696
1794 72696 8663 55653 40045 98854 -29359 -75482 28043 77848 15042 -27751 -26518 36277
1782 36277 99644 -8510 -78555 -46560 15579 132215 154705 193764 112544 -55227 12442
1771 12442 -36914 51591 28817 136537 122314 215799 120311 16230 7927 -24902 29773 -6642
1759 -6642 -38389 -180452 -168955 -60221 -47660 -23910 -61463 -108380 -79792 39158 -110
1748a10o3698J0751l0093M6085J03231l8336P244o6185K3893K2495j28152m5913
1736a58788O6377P2370k4824M1799P770m4409P7728L1982j10252k5241l5616N648
1724i5456K8260l6528p8523K9989m3258O9667K5914q02L5114m4828M1345J00646
1712C1540J8224q3701Q3844K1574j39336K691J20470j31229k1690l065N9279J16298
1700G4899q0647K7991j17317l6806m322L9231K8926P4762j255L5697j4342N489
1688C2306r536m5674P6023q4976o8111K1359P1851K307L137J02285J6838M3253
1676A61062l1328r0199p8522P2768p1917p3836Q6692L9634r5237o9779N3965K3147
1664g3550J638o1304R3647p9219J02458n7149r712K2850M9399l7451N3691K171
$$ plain form
1748 -110 -63808 -53057 -83150 -37065 66166 27830 35074 -31111 -7218 15277 -112875 -158788
1736 -158788 -92411 -20041 -44865 -3066 4704 -39705 38023 70005 -40247 -65488 -101104 -95456
1724 -95456 -67196 -103724 -182247 -152258 -195516 -125849 -99935 -100737 -65623 -110451 -69106 31540
1712 31540 49764 -33937 49907 71481 -67855 -65164 55306 -75923 -97613 -100678 -41399 74899
1700 74899 -5748 22243 -95074 -131880 -136202 -96971 -68045 6717 5462 41159 26817 32306
1688 32306 22770 -22904 53119 -31857 -99968 -78609 -6758 -4451 -1314 100971 117809 161062
1676 161062 129734 39535 -38987 33781 -38136 -111972 -25280 14354 -80883 -150662 -96697 -73550
1664 -73550 -71912 -133216 -39569 -118788 -16330 -73479 -83191 -60341 -10942 -48393 5298 7469
1652G469m2049m8660J1806P9897m3279K8483m7595j32345R8242J23131n1970j51008
1640a67878L8131O4114Q4188R4170p5015q2495j645L7463O7382N8503m8511n8863
1628I544j16411R7669J0353J0909l9538j0878K9096k798l125N3241p9897p195
1616d9030J1079m7513J85055n3519r7206Q7939N2762K2811m3360j20835l90l5182
1604h7389o788Q409R5838l6082o2894L6982N0914N8217k698K1918m6512m0774
1592a0859N743K7326K3821J5549m5337j22655K5398P1181L5002j7413j6701N6739
1580D7794j27513P3022R0197p8493q0223J08541j11319n485m0362j02931J33505
1569i3267L4305o2240J04551N6154o0340L265J7242k8730N2589l3641R965l9772
$$ plain form
1652 7469 -34580 -83240 -71434 8463 -34816 -6333 -53928 -186273 -88031 35100 -16870 -167878
1640 -167878 -129747 -65633 18555 112725 37710 -44785 -46430 -8967 58415 116918 68407 9544
1628 9544 -106867 -9198 1155 12064 -27474 -38352 -9256 -12054 -15179 38062 -41835 -49030
1616 -49030 -37951 -85464 99591 46072 -51134 36805 89567 112378 69018 -51817 -52207 -87389
1604 -87389 -94177 -85768 10070 -26012 -88906 -51924 -1010 57207 54509 76427 29915 -10859
1592 -10859 -5116 22210 46031 61580 16243 -106412 -81014 -9833 25169 7756 -8945 47794
1580 47794 -79719 -6697 83500 5007 -75216 33325 -77994 -83479 -123841 -226772 -93267
1569 -93267 -58962 -121202 -16651 39503 -20837 -17572 -330 -29060 23529 -10112 -147 -39919
1557c9919q175Q4522o6332K6455L9487j0337r802J0430o7320J1225Q278O5616
1545D4128J4836r3162o5046L5741r558K927m8472L0669O8754P613Q2139l60r0756
1532b0547p239P7772O3814n4236l7277j657r491o1154l4855O3025j1214L1972
1520a087J0490m5065N4369n0542N5848J0081k8596P3026j22795k9680o421o4897
1508a45269J24393N548j42355J18752R5643m7681j32691k8536P7836O65m1950
1497a15645R1873k5049m4132N7092j3990p349J5505O6897n6328l3141L5395l7708
1485f6580J4226J16201O8643j73494L4124K5612q3969l0947L9086n0497M7901
1474e9694P1109K901o9041N653N0154k4842m2853K0072J28911n1453j0340m4425
$$ plain form
1557 -39919 -48094 36428 -29904 -3449 36038 25701 15899 26329 -40991 -29766 -21488 44128
1545 44128 58964 -34198 -99244 -63503 -73061 -70134 -118606 -87937 -19183 -11570 70569 70209 -20547
1532 -20547 -27786 49986 113800 59564 22287 20630 11139 -50015 -84870 -21845 -33059 -1087
1520 -1087 9403 -35662 18707 -31835 24013 34094 5498 78524 -44271 -73951 -80372 -145269
1508 -145269 -20876 -15328 -157683 -38931 56712 9031 -123660 -152196 -74360 -73695 -115645
1497 -115645 -23772 -48821 -92953 -35861 -49851 -57200 -41695 25202 -31126 -64267 -28872 -66580
1485 -66580 -52354 63847 132490 -41004 -6880 18732 -65237 -96184 -57098 -107595 -59694
1474 -59694 11415 14316 -54725 -49072 1082 -23760 -66613 -46541 82370 30917 20577 -23848
1462b3848q0233K4103J74457K8858n084j79223r8418N7507J21972j5593k7259
1451b2761J3859j8628p0140M9844O3484O9828n3612n5086L6682j4373K187J8655
1439A9939j8938J8755J0644k1331k9312l6237Q9931k5175M2814j3108P2748k0127
1427I0603j83105k8160J18137Q0765j7201m2296L9741o8278j0461O1953n0297
1416h599R595n9301J5618q207N5773R1593j59815q501P1271J1000l3339N663m5222
1403f2471P3116k006K9273l3550r2476Q7499O0459K8598j09501p5564M9749o3054
1391a09928N1237J7884O2926M4030K4900R1882k09978k4848l1449m5336o445N86
1379a34539J16467m4956P876J51920l1447l2120o110O7115O0663k3973n0642p7096
$$ plain form
1462 -23848 -104081 -79978 94479 123337 118253 -60970 -159388 -101881 20091 4498 -22761
1451 -22761 -8902 -27530 -97670 -47826 15658 85486 31874 -23212 13470 -903 1284 19939
1439 19939 1001 19756 30400 9069 -20243 -56480 33451 8276 51090 37982 110730 90603
1427 90603 -92502 -120662 -2525 78240 61039 18743 58484 -9794 -20255 41698 -8599
1416 -8599 996 -58305 -42687 -50894 4879 96472 -63343 -71844 -573 10427 -22912 -17249 -62471
1403 -62471 10645 8639 37912 4362 -88114 -615 59844 88442 -21059 -96623 -46874 -109928
1391 -109928 -58691 -40807 22119 66149 91049 182931 -27047 -51895 -83344 -128680 -135125 -134539
1379 -134539 -18072 -63028 -55152 96768 65321 33201 27091 94206 154869 130896 80254 3158
1367C158O8962J071l1441K1948K2353l1833n8344r426j139j22432r269J65188
1355A8796n4489k6472k4767l350J9096J83566o9055n5568M4975r6112j07772L4002
1343a37150J71230J5414m8862k2992j00009M4163L6771P4923M3097j7084n5016
1332D485j9704N1100o1123k7741o8290L9846O4210j9346N7666r0899O7107O3387
1320F0698n9862R790j5280R1737n5015k5176K5109p4433M2849l5079O5102K0612
1308E1052J1209K3341l2237J6911j10803M3188L4594m9178J9339R8087j5361n4526
1296C5616q1952M0029l6027p1577O781m5793Q9223R9081o7107Q5171j04929J6472
1284c5012Q2122j12527N3852o144m4515N5917J4545o3377j13424J6545L7306N2488
$$ plain form
1367 3158 72120 73191 41750 63698 86051 54218 -4126 -13552 -14691 -137123 -146392 18796
1355 18796 -35693 -62165 -86932 -90282 -71186 112380 43325 -12243 32732 -63380 -171152 -137150
1343 -137150 34080 49494 632 -22360 -122369 -78206 -41435 33488 76585 59501 4485
1332 4485 -15219 35881 -25242 -52983 -121273 -81427 -17217 -36563 21103 -69796 -2689 60698
1320 60698 836 10626 -4654 87083 32068 6892 32001 -42432 417 -34662 30440 51052
1308 51052 62261 85602 53365 70276 -40527 2661 37255 -11923 7416 105503 90142 35616
1296 35616 -46336 -6307 -42334 -113911 -107130 -152923 -63700 35381 -31726 53445 -51484 -35012
1284 -35012 47110 -65417 -11565 -17709 -62224 -6307 8238 -55139 -168563 -152018 -114712 -62224
1272f2224M5061m0002m8085L7458K9726K7628q256N190J335L5077l3439m7557
1260e8088M7928O5296o3755P7021j25048N5478L9258r1696m6152J02154O5912
1249F8308m2243q7830J2376J25152p9494l2421j2687m0238R4326o4634j9720N5976
1237b3129L635O8066r8190P8678m7308m2533L8042q1523r9025J39795r90L2189
1225c2293N3389N1254K9365k1125m1897J3062n5816J0393q733j4547j8464K8608
1213f804L2377r0500P4284R7106j04940j09756L4765O5446O6252j1439r2267N7215
1201A1739K3287q7790M8282K6033M9323j251j02981K955k5852j9958N571l829
1189g4471j4954k9443P5853L2440o8174L4299O0716l0098m6221p2122J6335J17829
$$ plain form
1272 -62224 -17163 -57165 -105250 -67792 -38066 -10438 -18694 -13504 -12169 22908 -10531 -58088
1260 -58088 -10160 55136 -8619 68402 -56646 -1168 38090 -53606 -99758 2396 68308
1249 68308 26065 -61765 -49389 75763 -3731 -36152 -48839 -89077 5249 -59385 -79105 -23129
1237 -23129 -19494 48572 -49618 29060 -18248 -60781 -22739 -104262 -203287 -63492 -64482 -32293
1225 -32293 21096 72350 101715 80590 38693 51755 -4061 6332 -2401 -16948 -35412 -6804
1213 -6804 25573 -64927 9357 106463 1523 -108233 -73468 -8022 58230 46791 -45476 11739
1201 11739 35026 -52764 -4482 21551 70874 69623 -33358 -30403 -56255 -76213 -70642 -74471
1189 -74471 -89425 -118868 -43015 -10575 -78749 -44450 16266 -13832 -60053 -132175 -115840 1989
1177A989q767P332n9348J9828P4930k6147r5311L5924K2415o63O0002N0147j08472
1164b6141n3711k895j01405L0528K51121K0755j31546M1554k1956r8747k682R3120
1152b005Q2610p1568k8139m4793m9240Q8354j48710j6186J09668J10311J5057
1141D5359k6750j2227l8681j3792k8744Q26P1231O5153M724K4263k6824n5089
1129I449j3837J010n507K7911j1821q6977k6365N8183r43k7824J2031J00800n0506
1116a4396j5058O4970j17239O688m5298l6396R3730Q719p80L2430M0822m4573
1104b6381K1898r0184L525P0525j48828r4876J12553J4525m86P1055J4765K3229
1092b8680j07653P2950J09694p9884J5371q9747o5788L5847J15423R5366p8220
$$ plain form
1177 1989 -6778 554 -58794 -38966 35964 9817 -85494 -49570 -27155 -27818 32184 82331 -26141
1164 -26141 -79852 -82747 -184152 -153624 97497 118252 -13294 28260 6304 -92443 -95125 -2005
1152 -2005 80605 9037 -19102 -63895 -113135 -24781 -173491 -189677 -80009 30302 45359
1141 45359 18609 6382 -32299 -46091 -74835 -74009 -2778 62375 67099 91362 64538 9449
1129 9449 -4388 -3378 -8885 19026 7205 -79772 -106137 -47954 -48897 -76721 -64690 36110 -14396
1116 -14396 -29454 35516 -81723 -75035 -120333 -156729 -62999 -54280 -55060 -22630 18192 -26381
1104 -26381 -4483 -94667 -91142 -20617 -169445 -264321 -151768 -137243 -137729 -66674 -51909 -28680
1092 -28680 -136333 -63383 46311 -33573 -18202 -107949 -173737 -137890 -22467 72899 -5321
1081e321N2014l3885j2546l7823k8437R441L0866n409J8801O7274r6585j5372
$$ plain form
1081 -5321 46693 12808 262 -37561 -65998 -56557 -25691 -31100 -12299 54975 -41610 -56982
$$ [...]
##END NTUPLES=NMR SPECTRUM
##END=
