##TITLE=1H_TG-2307
 CDCl3, 8 sc, 
 17.11.2020
##JCAMPDX= 6.0         $$ Bruker NMR JCAMP-DX V2.0
##DATA TYPE= NMR FID
##DATA CLASS= NTUPLES
##ORIGIN= UXNMR, Bruker Analytische Messtechnik GmbH
##OWNER= root
$$ XWIN-NMR		Version 3.5
$$ Tue Nov 17 10:07:02 2020 Russian Standard Time (UT+4h)  she@DPX200
##.OBSERVE FREQUENCY= 200.1315066352
##.OBSERVE NUCLEUS= ^1H
##.DELAY= (6, 6)
##.ACQUISITION MODE= SIMULTANEOUS
##.ACQUISITION SCHEME= undefined
##.AVERAGES= 8
##.DIGITISER RES= 18
##SPECTROMETER/DATA SYSTEM= spect
##.PULSE SEQUENCE= zg30
##.SOLVENT NAME= CDCl3
##.SHIFT REFERENCE= (INTERNAL, CDCl3, 0, 15.7039)
##AUDIT TRAIL= $$ (NUMBER, WHEN, WHO, WHERE, WHAT)
$$ ##TITLE= Audit trail, XWIN-NMR		Version 3.5
$$ ##JCAMPDX= 5.01
$$ ##ORIGIN= Bruker BioSpin GmbH
$$ ##OWNER= she
$$ F:/spectra/data/she/nmr/H-F/1/audita.txt
$$ ##AUDIT TRAIL=  $$ (NUMBER, WHEN, WHO, WHERE, WHAT)
(   1,<2020-11-17 10:05:41.45 +0400>,<she>,<DPX200>,
      <created by zg, POWCHK disabled, PULCHK disabled
       configuration hash MD5:
       00 E9 B6 7A A2 85 ED C7 34 08 36 98 17 FE 4E 26
       data hash MD5: 16K
       C4 10 7B D6 17 45 5E EC CB 59 D6 1E A5 F0 5A FA>)
$$ ##END=
$$ 
$$ hash MD5
$$ E8 DD 31 E1 73 B6 A4 99 0C AC 74 7E 91 6D 31 11
##$RELAX= 
##$RELAX= 
##$RELAX= 
##$RELAX= 
##$RELAX= 
##$RELAX= 
$$ Bruker specific parameters
$$ --------------------------
##$DU= <F:/spectra>
##$EXPNO= 1
##$NAME= <H-F>
##$PROCNO= 1
##$TYPE= <nmr>
##$USER= <she>
##$AMP= (0..31)
100 100 100 100 100 100 100 100 100 100 100 100 100 100 100 100 100 100 
100 100 100 100 100 100 100 100 100 100 100 100 100 100 
##$AQSEQ= 0
##$AQ_mod= 1
##$AUNM= <au_zg>
##$AUTOPOS= <>
##$BF1= 200.13
##$BF2= 200.13
##$BF3= 200.13
##$BF4= 200.13
##$BF5= 200.13
##$BF6= 200.13
##$BF7= 200.13
##$BF8= 200.13
##$BYTORDA= 1
##$CFDGTYP= 0
##$CFRGTYP= 5
##$CHEMSTR= <none>
##$CNST= (0..31)
1 1 145 1 1 1 1 1 1 1 1 1 1 1 1 1 1 1 1 1 1 1 1 1 1 1 1 1 1 1 1 1 
##$CPDPRG= <>
##$CPDPRG1= <>
##$CPDPRG2= <>
##$CPDPRG3= <>
##$CPDPRG4= <mlev>
##$CPDPRG5= <mlev>
##$CPDPRG6= <mlev>
##$CPDPRG7= <mlev>
##$CPDPRG8= <mlev>
##$CPDPRGB= <>
##$CPDPRGT= <>
##$D= (0..31)
0 1.2 0 0 0 0 0 0 0 0.06 0 0.03 0 0 0 0 0.0002 0 0 0 0 0 0 0 0 0 0 0 0 
0 0 0 
##$DATE= 1605593140
##$DBL= (0..7)
120 120 120 120 120 120 120 120 
##$DBP= (0..7)
150 150 150 150 150 150 150 150 
##$DBP07= 0
##$DBPNAM0= <>
##$DBPNAM1= <>
##$DBPNAM2= <>
##$DBPNAM3= <>
##$DBPNAM4= <>
##$DBPNAM5= <>
##$DBPNAM6= <>
##$DBPNAM7= <>
##$DBPOAL= (0..7)
0.5 0.5 0.5 0.5 0.5 0.5 0.5 0.5 
##$DBPOFFS= (0..7)
0 0 0 0 0 0 0 0 
##$DE= 6
##$DECBNUC= <off>
##$DECIM= 32
##$DECNUC= <off>
##$DECSTAT= 4
##$DIGMOD= 1
##$DIGTYP= 9
##$DL= (0..7)
0 120 120 120 120 120 120 120 
##$DP= (0..7)
150 150 150 150 150 150 150 150 
##$DP07= 0
##$DPNAME0= <>
##$DPNAME1= <>
##$DPNAME2= <>
##$DPNAME3= <>
##$DPNAME4= <>
##$DPNAME5= <>
##$DPNAME6= <>
##$DPNAME7= <>
##$DPOAL= (0..7)
0.5 0.5 0.5 0.5 0.5 0.5 0.5 0.5 
##$DPOFFS= (0..7)
0 0 0 0 0 0 0 0 
##$DQDMODE= 0
##$DR= 18
##$DS= 0
##$DSLIST= <SSSSSSSSSSSSSSS>
$$ [...]
##$SUBNAM2= <"">
##$SUBNAM3= <"">
##$SUBNAM4= <"">
##$SUBNAM5= <"">
##$SUBNAM6= <"">
##$SUBNAM7= <"">
##$SUBNAM8= <"">
##$SUBNAM9= <"">
##$SW= 16.9725356469052
##$SWIBOX= (0..15)
0 0 2 0 0 0 0 0 0 0 0 0 0 0 0 0 
##$SW_h= 3396.73913043478
##$TD= 16384
##$TD0= 1
##$TE= 0
##$TE2= 300
##$TE3= 300
##$TEG= 300
##$TL= (0..7)
0 120 120 120 120 120 120 120 
##$TP= (0..7)
150 150 150 150 150 150 150 150 
##$TP07= 0
##$TPNAME0= <>
##$TPNAME1= <>
##$TPNAME2= <>
##$TPNAME3= <>
##$TPNAME4= <>
##$TPNAME5= <>
##$TPNAME6= <>
##$TPNAME7= <>
##$TPOAL= (0..7)
0.5 0.5 0.5 0.5 0.5 0.5 0.5 0.5 
##$TPOFFS= (0..7)
0 0 0 0 0 0 0 0 
##$TUNHIN= 0
##$TUNHOUT= 0
##$TUNXOUT= 0
##$USERA1= <user>
##$USERA2= <user>
##$USERA3= <user>
##$USERA4= <user>
##$USERA5= <user>
##$V9= 5
##$VALIST= <valist>
##$VCLIST= <CCCCCCCCCCCCCCC>
##$VD= 0
##$VDLIST= <DDDDDDDDDDDDDDD>
##$VPLIST= <PPPPPPPPPPPPPPP>
##$VTLIST= <TTTTTTTTTTTTTTT>
##$WBST= 1024
##$WBSW= 4
##$XGAIN= (0..3)
0 0 0 0 
##$XL= 0
##$YL= 0
##$YMAX_a= 271312
##$YMIN_a= -160854
##$ZGOPTNS= <>
##$ZL1= 120
##$ZL2= 120
##$ZL3= 120
##$ZL4= 120
##$ABSF1= 10
##$ABSF2= 0
##$ABSG= 5
##$ABSL= 3
##$ALPHA= 0
##$AQORDER= 0
##$ASSFAC= 0
##$ASSFACI= 0
##$ASSFACX= 0
##$ASSWID= 0
##$AUNMP= <proc_1d>
##$AZFE= 0.1
##$AZFW= 0.1
##$BCFW= 1
##$BC_mod= 2
##$BYTORDP= 1
##$COROFFS= 0
##$CY= 11.3945322036743
##$DATMOD= 1
##$DC= 2
##$DFILT= <>
##$DTYPP= 0
##$F1P= 15.9154993809931
##$F2P= -4.1035820241983
##$FCOR= 0.5
##$FTSIZE= 0
##$FT_mod= 4
##$GAMMA= 1
##$GB= 0.15
##$INTBC= 1
##$INTSCL= 1
##$ISEN= 128
##$LB= 0.24
##$LEV0= 0
##$LPBIN= 0
##$MAXI= 10000
##$MC2= 0
##$MEAN= 0
##$ME_mod= 0
##$MI= 1.114404
##$NCOEF= 0
##$NC_proc= 0
##$NLEV= 6
##$NOISF1= 3.799351
##$NOISF2= 2.8
##$NSP= 1
##$NTH_PI= 0
##$NZP= 0
##$OFFSET= 15.70392
##$PC= 1
##$PHC0= -11047.26
##$PHC1= 11.60089
##$PH_mod= 1
##$PKNL= yes
##$PPARMOD= 0
##$PSCAL= 0
##$PSIGN= 0
##$REVERSE= no
##$SF= 200.130013532006
##$SI= 16384
##$SIGF1= 3
##$SIGF2= 2
##$SINO= 400
##$SIOLD= 16384
##$SREGLST= <1H.CDCl3>
##$SSB= 0
##$STSI= 0
##$STSR= 0
##$SW_p= 3612.71676300578
##$SYMM= 0
##$S_DEV= 0
##$TDeff= 0
##$TDoff= 0
##$TI= <>
##$TILT= no
##$TM1= 0
##$TM2= 0
##$TOPLEV= 0
##$USERP1= <user>
##$USERP2= <user>
##$USERP3= <user>
##$USERP4= <user>
##$USERP5= <user>
##$WDW= 1
##$XDIM= 8192
##$YMAX_p= 0
##$YMIN_p= 0
$$ End of Bruker specific parameters
$$ ---------------------------------
##NTUPLES= NMR FID
##VAR_NAME=  TIME,          FID/REAL,        FID/IMAG
##SYMBOL=    X,             R,               I
##VAR_TYPE=  INDEPENDENT,   DEPENDENT,       DEPENDENT
##VAR_FORM=  AFFN,          ASDF,            ASDF
##VAR_DIM=   8192,          8192,            8192
##UNITS=     SECONDS,       ARBITRARY UNITS, ARBITRARY UNITS
##FACTOR=    0.0002944,     1,               1
##FIRST=     0,             0,               0
##LAST=      2.4114304,     0,               0
##MIN=       0,             -160854,         0
##MAX=       2.4114304,     271312,          0
$$ Real data points
##PAGE= N=1
##DATA TABLE= (X++(R..R)), XYDATA
0@%%%%%%%%%%%%Qj6J6j6J8k6L2m0N0n8P2q8J04j20J39j63J89k17K49k88L29l73
34a99M26m82N43o12O86p68Q59r58J066j182J310j451J603j770J953k154K373k613
52a370K880l172L496l862M269m727N253n860O568p407Q424r685J1298j3451J6503
67I157k1249L0118q0562K22354j39967j80705J06180j3054M9663l872n3098m6650
79a21685J00949P0651n7554o9711J15869j33271m714J98736q7610j16219R0479
90a4080J14692j15659j2926R715m6536R2515K7386m1451n9011R4454k7170q7022
102f5093R6949J0547j40537R7931J47231j66754j9374K7351N677J8503p076P90
114F145o3464J28296p643j40976O0628O1515j07924L6326J32639j03609m6789
$$ plain form
0 0 0 0 0 0 0 0 0 0 0 0 0 0 8 -8 8 -8 10 -16 16 -24 26 -32 40 -48 56 -64 75 -88 101 -116 133 -155 174 -199
34 -199 227 -255 288 -324 362 -406 453 -505 561 -621 689 -762 841 -929 1024 -1130 1243 -1370
52 -1370 1510 -1662 1834 -2028 2241 -2486 2767 -3093 3475 -3932 4492 -5193 6105 -7346 9157
67 9157 -12092 18026 -62536 159818 19851 -160854 -54674 -67728 -18065 -21937 -75035 -121685
79 -121685 -20736 49915 -7639 -77350 38519 -94752 -99466 99270 11660 -104559 -14080
90 -14080 100612 -15047 -27973 -18258 -64794 27721 55107 13656 -45355 49099 21929 -65093
102 -65093 31856 42403 -98134 -203 147028 -19726 -39100 -11749 -6072 12431 5355 6145
114 6145 -57319 70977 63334 -77642 -17014 44501 -63423 -27097 105542 1933 -44856
125d4856M8198L5248n1797Q460o360l9810J40877r120j17877k1948J16188k2694
137C4509p2414Q8283l8755j9176Q4384o59j19129K8548N6518j6327K7469j818
149E1433l3678l0570J27952o3627j18966J11680K4346l7294K1749K7615q5172
160d532J7753N5533m2558j7639M0742J882m5580R5443n0628j04638O5291P2866
172H3935n4368l7928P8794n7889P999L5944o1602k9690O4384L1330p5084M8329
184C4154R980p1705N178P6300o2593m0066J00627m0939j1620K0311k2412n2006
196e4791M6299N3267p8787K3256L8689l5039k4157N9945n5913m8939J06555M30
208C0815n0255k94L3215m7432K5429K5163p2228L1007O5142j4758p7712N7351
$$ plain form
125 -44856 3342 38590 -13207 -4747 -11107 -50917 89960 80840 -37037 -58985 57203 34509
137 34509 -37905 50378 11623 -7553 76831 76172 -42957 -14409 42109 25782 53251 51433
149 51433 17755 -12815 115137 51510 -67456 44224 68570 31276 53025 80640 -4532
160 -4532 13221 68754 26196 8557 49299 51181 5601 101044 50416 -54222 11069 83935
172 83935 29567 -8361 70433 12544 20543 56487 -5115 -34805 29579 60909 -14175 34154
184 34154 44134 -27571 -22393 53907 -8686 -48752 51875 10936 -684 19627 -2785 -54791
196 -54791 -8492 44775 -34012 -10756 27933 -7106 -31263 28682 -27231 -76170 30385 30815
208 30815 -19440 -19734 13481 -33951 -8522 16641 -55587 -24580 40562 25804 -51908 5443
220E443k527n7224N9324J6462m6668P911O2345o2290m357L0733m0916J465O0691
233C0392J0542r0560N5111K4931n9939J2051L0224l1314J284P5834o0999k7584
245c0027L6509l533l2907L0663L0536o6617M5539L0492n7109k4502N5738j6538
257a756l4788P2600k6545k9460K3834J1091n1555J9553M3750n7182K3992M4681
269C8215l1591n9158N8999J495n2020N3172R8k6011J7188L0207o9553L044N7248
282B1333l6722r715M0113Q516o5591M7958N161n8353L5150K7282k4752p592N3182
295C5970n2896j9384M5432j3580k9245L5886L0832o4880L7399J5638n2421K07
307c1042M6169j2418l0840O1644l1072k6172L0961j862m2519K6782M8578n6771
$$ plain form
220 5443 2916 -54308 5016 21478 -25190 -17279 45066 -17224 -21581 9152 -31764 -30299 30392
233 30392 40934 -49626 5485 30416 -29523 -17472 12752 -18562 -17278 58556 -2443 -30027
245 -30027 6482 2949 -29958 705 31241 -35376 10163 40655 -16454 -40956 14782 -1756
257 -1756 -36544 36056 9511 -19949 3885 14976 -36579 -17026 26724 -30458 -6466 38215
269 38215 6624 -52534 6465 7960 -44060 9112 9210 -16801 387 30594 -38959 -35915 21333
282 21333 -15389 -25104 15009 23525 -42066 5892 11053 -47300 -12150 15132 -9620 -17212 35970
295 35970 -16926 -36310 9122 -4458 -33703 2183 33015 -31865 5534 21172 -31249 -31042
307 -31042 15127 2709 -28131 33513 2441 -23731 7230 5368 -37151 -10369 38209 -18562
319a8562J3995L1111k9547l4310M7363m476l8654N9808j3628k9284J6986K3111
331B3913n4368l3O0620l5365m643K9781q174m5240M2887O96m9685M2320K1508
344B4217k7977q857M3154m9613j4124N1438k1432j4245K7148J8099n5530L0167
356B445J6789n2724J5580L9900j6510k2947M8377l5974k0843L5929k470l4286
368b6734K0648M8323n5442J2486K0430l7074m149M0359q940l6363N4866r312l4177
381a5079J4916J6609m0649J0931N3486m3567m07K3246j2100l1387L5876K202m7336
394c3259N2807J2677l5800o388L0305l2410n528M5450k8941j1687L2788J0500
406C0514n5346K4248J3413l7012L1763J9141k4149k0437M7347k6109k8730L6119
$$ plain form
319 -18562 -4567 26544 -3003 -37313 10050 5574 -33080 26728 13100 -16184 802 23913
331 23913 -30455 -30488 30132 -5233 -9876 19905 11731 -33509 9378 10074 -39611 2709 24217
344 24217 -3760 -12617 30537 -19076 -33200 18238 -3194 -17439 9709 27808 -27722 2445
356 2445 19234 -33490 -17910 21990 5480 -17467 30910 -5064 -25907 10022 7552 -26734
368 -26734 -6086 42237 -13205 -719 19711 -17363 -21512 18847 9907 -26456 28410 19098 -15079
381 -15079 -163 16446 -24203 -13272 40214 -3353 -3760 19486 7386 -24001 11875 14077 -33259
394 -33259 19548 32225 -3575 -9963 20342 -12068 -17596 27854 -1087 -12774 20014 30514
406 30514 -24832 -584 12829 -24183 7580 26721 2572 -17865 29482 3373 -25357 10762
418A0762p835j6189K6056K5217n7444J2009K4721k8598J345K7716j2300k6093
430b0633N6215k2081l9262K0837J5725k0092N332L7827m7222N258L2632k5585
442a049k6915L3038N925k9586M3151q958l5624O963L3183l1243j4158M8166k7032
455d139k005K3310j0440m1186K9316K1399l7885K5529J1293k3446n556L7341l4934
468a1403k4392M7529k484j5836Q738J5535m2960K1902K2525m2913J3460K8724
480A8425q103k3738L5131k2468k8660L7281J0905k8627L228L7517l6369O255J4941
493A5718l0088j745L7233K621m1925L6838k321l0257J5684J5586k7644k264M8551
506C5987k7663j2895J4902q268k0025L0433P109m3888L7247J2302k7418j1471
$$ plain form
418 10762 2927 -13262 12794 38011 -19433 -7424 17297 -11301 -9956 17760 5460 -20633
430 -20633 35582 13501 -25761 -4924 10801 -9291 -3959 33868 -13354 -8096 24536 -1049
442 -1049 -27964 5074 10999 -18587 24564 15606 -20018 -13055 20128 -11115 -25273 22893 -4139
455 -4139 -6144 17166 6726 -34460 -5144 16255 -21630 3899 15192 -8254 -13810 23531 -11403
468 -11403 -35795 11734 9250 -6586 2152 17687 -25273 -3371 19154 -23759 -10299 18425
480 18425 10322 -13416 21715 -753 -29413 7868 18773 -9854 -6626 30891 -5478 777 15718
493 15718 -14370 -16115 21118 23739 -18186 18652 16331 -13926 1758 17344 -10300 -12564 35987
506 35987 8324 -4571 10331 2063 -17962 12471 19580 -24308 12939 25241 -2177 -13648
518a3648K5287j7985j3865M6001j8442j9244J6004J0335l3338J4786J4115l4068
530b4062K5167K3456k2403k8817L8147j0143k6663L2338k914j4851J0930K4088
542B4273m1473K766K5023k5130N999K6709r682l3432M1399k745l5248J2876J7926
555I261j0994j166L1878l9548j467K8727j7160j6979K3787J1389l2245L0810K377
568A8670l4171N25L1466j3159j7948L4597j8660n112J6858p922l1061K3738K5077
581B2898l7698J7199J3454j9499j4468L0060j2052k6354L5876j580j2953N872
593G55Q472l4643J6468K7100l6466M931K6683l943l1216K6200l857k6731K6716
606D69P937j5189m99K4523l2679K294K5894k5281p181L0276Q914l9093K1911N840
$$ plain form
518 -13648 11639 -6346 -20211 25790 7348 -11896 4108 14443 -18895 -4109 10006 -24062
530 -24062 1105 24561 2158 -26659 11488 1345 -25318 7020 4106 -10745 185 24273
542 24273 -17200 -14434 10589 -14541 -8542 18167 8485 -24947 16452 13707 -21541 -8665 9261
555 9261 -1733 -2899 28979 -10569 -12036 16691 -469 -17448 6339 17728 -14517 16293 18670
568 18670 -15501 -14976 16490 3331 -14617 19980 1320 -3792 13066 5144 -25917 -2179 22898
581 22898 -14800 2399 15853 -3646 -18114 11946 -106 -26460 9416 7836 -5117 755
593 755 9227 -25416 -8948 18152 -18314 -13383 13300 9357 -21859 4341 484 -26247 469
606 469 8406 -6783 -7282 17241 -15438 -13144 12750 -12531 -19712 10564 19478 -19615 2296 8136
620H136k3102P922J5791j1890q937L6345k4938r929J8505j0284j6172K5670J7805
633B4922m3387J7429J9981j8254j5621J7973l233j0345L4376k0340j6127J7291
645D665Q739l1310J0278K7355l3227J1275K1817j3243k9853K4012O343k0856K1936
658G931o070j0814J2534J6574m1380J429L5898k0040o501J8080M381l1947K2039
671B114O000k6384J2455J1131o728j371K1982l3778m451L3265j1991k2384J9617
684e23K3025l3917J0904P979j7836L99J6476m518j1366K9961k3557j1599K5274
697A0702j918l0810J4069L4252k9060o99J0445p470j1125J9689n356k0079L2820
710A5460p388j4832Q877R331l1307O976L8837k7528j0528J7256P555k1910R882
$$ plain form
620 8136 -14966 -7044 8747 -3143 -12080 24265 -673 -10602 7903 -2381 -18553 7117 24922
633 24922 -18465 -1036 18945 691 -14930 3043 -190 -10535 23841 3501 -12626 4665
645 4665 13404 -17906 -7628 19727 -13500 -2225 19592 6349 -23504 508 6851 -14005 7931
658 7931 1861 -8953 3581 20155 -21225 -19796 16102 -3938 -10439 7641 12022 -19925 2114
671 2114 8114 -18270 -5815 5316 -1412 -2783 19199 -14579 -19030 14235 2244 -20140 -523
684 -523 22502 -11415 -511 7468 -10368 -9969 6507 1989 -9377 20584 -2973 -14572 10702
697 10702 8784 -22026 -7957 26295 -2765 -3464 6981 -489 -11614 8075 2719 -17360 15460
710 15460 8072 -6760 2117 11448 -19859 -12883 25954 -1574 -12102 5154 12709 -9201 681
723F81l236j5400K8523L199k0633l768K7964k6373o592K9038j6481j0557J7926
736D291J6905l2343L682Q718j1353J2989O241j7037m993L8063k3629k1372K0360
749E22M833j4187Q261K1685l1923P315J3482j3077m978J2642l406j1328L3250
762B3091j5321k5121J5315J7905k3451j672K7296k0887L686J0421o796j8217J6514
775B763N606j9232K6715n056k1145P085K4210k5670j3275K9558n625m264N666
788G336O55k3209J9350P403k4790J4635R113q841p470K4393k2664j7131L0239
801I019R68j3892K149J3719k0520J2360N637k3542L893K2955k753k2057K5412
814A3348j2899j4003J8872L678j8480J058K8194j9489j038O568j2207l715K3010
$$ plain form
723 681 -2555 -17955 10568 13767 -6866 -10634 17330 -9043 -15635 13403 -3078 -13635 4291
736 4291 21196 -11147 -7465 1253 -10100 2889 9130 -7907 -12900 25163 1534 -19838 522
749 522 5355 -8832 -571 21114 -10809 -3494 9988 -3089 -8067 4575 1169 -10159 23091
762 23091 7770 -17351 -2036 15869 -7582 -9254 18042 -2845 841 11262 4466 -13751 2763
775 2763 8369 -10863 15852 10796 -10349 -3264 20946 -4724 -17999 11559 5934 1670 7336
788 7336 7991 -15218 4132 11535 -13255 1380 10493 1652 -5818 18575 -4089 -21220 9019
801 9019 9987 -3905 -1756 11963 -8557 3803 9440 -14102 -10209 12746 9993 -12064 13348
814 13348 449 -13554 5318 8996 -9484 -8426 19768 279 -759 5809 -6398 -10113 12897
827A2897k791k6552K7230J585j6023k92J3016j5304k037K9802j9044n351R313
840F449j10j4859J4333M214k4498K1911J1986j6883j2741K0766j1336p437K2356
853A4151j2022p221J0123J1700k6669O355J1885j9047J2035J2947j1692j7653
865a5108K6792p982j7053J3711J637q032N694J7212k9614L660J4819j2298k804
878i366J3259k9k0578K5863l262k2194O151J3109p941k571J8694k1767K271J4199
892E838o685j7439J4895J1588k0989J7611P60j5946n01J7821j1223j0557K3838
905I011j0001l965R194q9k2551J4425J5490k1466R507P038o918j0306K0277j0364
919g18j5961K2517p06q523J965J1849k1679N680J5355j8768J32J5797J292k0727
$$ plain form
827 12897 10106 -16446 10784 12369 -3654 -3946 9070 -6234 -8271 21531 2487 -2864 6449
840 6449 6339 -8520 5813 10027 -14471 7440 19426 2543 -10198 10568 -768 -8205 14151
853 14151 2129 -5092 5031 16731 -9938 -3583 8302 -10745 1290 14237 2545 -15108
865 -15108 11684 3702 -13351 360 1997 -6035 -341 16871 -12743 -9083 5736 -6562 -9366
878 -9366 3893 3864 -16714 9149 5887 -16307 -10156 2953 -4988 -7559 11135 -10632 -8361 5838
892 5838 -847 -18286 -3391 8197 -12792 4819 5579 -10367 -10868 6953 -4270 -14827 9011
905 9011 -990 -4955 4239 4150 -18401 -3976 11514 -9952 -445 6593 -325 -10631 9646 -718
919 -718 -16679 5838 5132 -3391 -1426 10423 -11256 -5576 9779 -8989 -8857 6940 8232 -12495
933a2495J8560o019j3409J3731N160j2239j082K1505k0947j226J2613r491q000
946a3339J5470Q452k4121J4850J789j2821L367J0074r981n552K6191j5251q103
959h975R048J888j4542J1467J1889k2748J3082Q183j0487q863J5883o540r771
972a0486K3366q561r094O480J0057k0286M693J6346j6647M961J0806l958j6927
985i250J8111l862j3261J6653K30q442M76J7767k2087k188J6894r644l236J0193
999H354L380j9496J6905j712j5349Q114R778q269o683K1670j7445n600J2508l132
1013C023j0873R425J1862k1280J1649L656j3553q23J4513p215j0343K2167r740
1026B468q058N771N322j5851N741J7404j9647O198P206o416r981J4812l620j3445
$$ plain form
933 -12495 6065 46 -13363 368 5528 -6711 -7793 13712 -7235 -8461 4152 -5339 -13339
946 -13339 2131 10583 -13538 1312 3101 -9720 -6353 3721 -6260 -11812 14379 -872 -8975
959 -8975 73 1961 -12581 -1114 10775 -11973 1109 9292 -1195 -10058 5825 -715 -10486
972 -10486 12880 4319 -4775 1705 11762 -8524 -3831 12515 -4132 829 11635 7677 -9250
985 -9250 8861 4999 -8262 8391 8621 179 655 18422 -3665 -5853 11041 1397 -1839 8354
999 8354 11734 -7762 9143 7431 -7918 196 9974 1705 -4978 16692 -753 -6353 6155 3023
1013 3023 -7850 1575 13437 -7843 3806 7462 -6091 -6914 7599 384 -9959 12208 2468
1026 2468 -5590 181 5503 -10348 -4607 12797 -6850 -652 6554 138 -9843 4969 1349 -12096
1040a2096K0129j541j0374J80J4229j7759M53J6107j2642J326Q457J129j8321
1053a0723J4476J056j5138J2953N178q930m235J8903j6231n528J3299m197n693
1066d810Q773P361k1377J2871L732j3464K722J0112m603q760K0403j3076r749
1079i865J1568K989j2150M671J3248j7954Q493M607r497o675J4950j619j3447
1092a0681J9073o474q931M608R627j5890m24J8376j2794J771N413l242j2443J5418
1106C407J17j5164J4206K630p079l841J4272j5629l108J8535q178m832N840N815
1120F991j6374J1330J713j4192R115R426o556r949J8182j2149o070J2898j885
1133B480r069N426J3418j8966O462L686r622J878J1875m963j3680K0225n362j0199
$$ plain form
1040 -12096 8033 6492 -3882 -3702 10527 -7232 -6779 9328 -3314 -1988 6469 7598 -10723
1053 -10723 3753 4809 -10329 2624 7802 -1128 -5363 13540 -2691 -8219 5080 883 -4810
1066 -4810 3963 11324 -10053 2818 6550 -6914 -4192 5920 1317 -7443 12960 -116 -9865
1079 -9865 1703 4692 -7458 -2787 10461 -7493 1000 5607 -3890 -10565 4385 2766 -10681
1092 -10681 8392 1918 -7013 -2405 7222 -8668 -9092 9284 -3510 -1739 3674 432 -12011 3407
1106 3407 3524 -11640 2566 5196 -1883 -5724 8548 -7081 -10189 8346 168 -4664 1176 6991
1120 6991 -9383 1947 3660 -10532 -1417 8009 1453 -8496 9686 -2463 -8533 4365 2480
1133 2480 -6589 -1163 12255 -6711 -249 3437 -6185 -4307 7568 2605 -11075 9150 3788 -6411
1147f411L952O603j0243K393J5768j7331K567O295l425q321J1341k87j4127J8259
1161G033m61j1292k556J3224r677k877J4785j1523k07P162J519j5792J0226M545
1175D109j2777J1401L740q799o594J8251j0304q716J3229k929l158M576O218j8427
1189a0180R390P052j1828K887Q333l034j0871J8310q407j0618Q965N200o482n9
1203a342J1185j6077O758P051r596n366J2516K588j4274J4012l267r009L594R624
1217H397j0096k851J5690j1735J540M412l368j0087J2703N331j6708J0453L493
1230G174o014m221J1551r798n145J6185o201l994K687M513j3533J0008N331j5557
1244g014O865R016l378j2641J3026m557o933J0823k179n851K697J0150j5970M740
$$ plain form
1147 -6411 -2459 4144 -6099 -3706 12062 -5269 -2702 3593 168 -8153 3188 2901 -11226 7033
1161 7033 6572 -4720 -7276 5948 -3729 -6606 8179 -3344 -3551 3611 5130 -10662 -436 4109
1175 4109 -8668 2733 6473 -2326 -8920 9331 -973 -9689 3540 611 -2547 2029 8247 -10180
1189 -10180 -790 6262 -5566 -2679 5654 2620 -8251 10059 1652 -8966 -1 5199 -1283 -1342
1203 -1342 9843 -6234 524 7575 -2021 -7387 5129 7717 -6557 7455 4188 -4821 -1227 8397
1217 8397 -1699 -4550 11140 -595 945 5357 1989 -8098 4605 9936 -6772 3681 7174
1230 7174 1160 -3061 8490 -1308 -6453 9732 3531 -463 2224 6737 -6796 3212 8543 -7014
1244 -7014 -149 8867 5489 -7152 5874 1317 -5616 5207 3028 -2823 -126 10024 -5946 -1206
1258a206O280r360k02R977R16j6441J3989j299q234M037L302n931M11J3896j5345
1273e210k07P316k931p119R470L153j5471J2993J980q298l799R415l905m016J3137
1288F508j1250j107P463N81j3402Q218Q393j3677P420M602n090q701J2709l816
1302a149o723J0728n008j881M338N432j7121N712J2155j0787n88O825O61j1028
1316h434J1743l667q156Q255K488m824o17J0391j5256L506R884p907n488Q861
1330G79O056j4562Q938k19o495K580N942n228l218J3114j1780j91P424k151j0449
1345i460Q820J0224j5327M829K996k664k959O965n188l778J4494p786m498M309
1359I77N423j2704N076J0515j1660J903N880J72r520Q681k609n280J1562l217
$$ plain form
1258 -1206 5074 -4286 -4488 5489 6405 -10036 3953 2654 -5580 -1543 1759 -4172 -3761 10135 -5210
1273 -5210 -5417 1899 -1032 -8151 1319 4472 -10999 1994 3974 -4324 -8123 1292 -2613 -6629 6508
1288 6508 -4742 -5849 1614 2195 -11207 -2989 5404 -8273 -853 3749 -1341 -10042 2667 -1149
1302 -1149 -7872 2856 -2152 -4033 305 5737 -11384 -5672 6483 -4304 -4892 1933 2594 -8434
1316 -8434 3309 -358 -8514 -259 2229 -2595 -3212 7179 -8077 -4571 5313 -2594 -8082 779
1330 779 6835 -7727 1211 992 -5503 -2923 3019 -2209 -5427 7687 -4093 -4284 3140 989 -9460
1345 -9460 -640 9584 -5743 -914 2082 -582 -3541 3424 -1764 -5542 8952 1166 -3332 977
1359 977 6400 -6304 -1228 9287 -2373 -470 5410 5582 -3938 4743 2134 -3146 8416 5199
1373E199o164J952J0566j3576N58R864o718j358O040L095j3529R197O49o222M852
1388D405J381n226k86J3315j3943l203R404j86p339L825O627j2357Q208N83o637
1403a429k40P173m221m683J3079r564m757O440M094j0888K141R762r986M597J069
1418B587l926m974J0234k782q636J1876l418m631J985P189j1879J003J1116p142
1432a398j055L329J134q611R598k106q481R181J971m761l215J0775r932j760J0029
1447D698l925m600L771O073j0861P044p48o801M623O400n387p294J3823o917m071
1462d172N181m3n278L525P936j2570M332K985m333k364P922l344p798J3026m224
1477G81n567J051N903p223J152Q961j0990K273M852j464p729P760j16p446R934
$$ plain form
1373 5199 -965 987 11553 -2023 -1465 8399 1681 323 6363 9458 -4071 5126 5775 -447 4405
1388 4405 5786 560 274 13589 -354 -3557 5847 5661 -1678 2147 8774 -3583 4625 5208 -1429
1403 -1429 -1669 5504 1283 -3400 9679 115 -4642 1798 5892 -4996 -2855 6907 -3079 1518 2587
1418 2587 -1339 -6313 3921 1139 -7497 4379 961 -3670 -1685 5504 -6375 -5372 5744 -1398
1432 -1398 -2453 876 2010 -6601 2997 891 -7590 1591 3562 -1199 -4414 6361 -3571 -5331 4698
1447 4698 773 -3827 -56 6017 -4844 2200 1452 -5349 -726 5674 287 -7007 6816 -101 -4172
1462 -4172 1009 966 -4312 -787 7149 -5421 -1089 1896 -2437 -4801 3121 -223 -8021 5005 781
1477 781 -4786 -3735 2168 -5055 -3903 5058 -5932 -3659 1193 -271 -8000 -240 -356 -7802 2132
1492B132j135o244j360J1023q831j782Q029n378O74L678J352j1130Q427K978q119
1507e686M561L558l583l885J1017q112l407O942j27l350K504N048j1771P353L664
1522D726p033o44O614o36o964J0256n933m179N079L762p528P52Q737r735M024
1537A298K125l768m852Q896R22j0248Q715r10m246N80N616p843m11R858p247l61
1553a876K284P77q143Q505J603r983O812K217j935n021P742o462j085Q984m759
1568c40l504L280M947j0051N389K675o444K833N102j817p789J0529m462l256N266
1583B358k06m042K090P969j1253K573M209k942j831N610l49q157J0286k440m573
1598f98J030M663m712l79R449j0350P32M911k29p048N443K499q041P495o45m309
$$ plain form
1492 2132 997 -5247 -6607 4416 -4415 -6197 1832 -3546 -2872 806 2158 -8972 -545 2433 -5686
1507 -5686 -1125 2433 -1150 -5035 5982 -2130 -5537 1405 1278 -2072 432 5480 -6291 1062 4726
1522 4726 -2307 -2951 3663 3027 -3937 6319 386 -3793 1286 5048 -2480 -1728 7009 -2726 1298
1537 1298 3423 -345 -5197 3699 4621 -5627 3088 2178 -2068 -1488 4128 -3715 -4126 5732 -1515 -1876
1553 -1876 408 1185 -6958 1547 3150 -6833 -21 2196 261 -4760 2982 -3480 -4565 4419 -340
1568 -340 -3844 -564 4383 -5668 -279 2396 -4048 -1215 3887 2070 -5719 4810 348 -2908 2358
1583 2358 2152 -1890 200 8169 -3084 -511 3698 756 -1075 4535 4186 -3971 6315 3875 -698
1598 -698 332 4995 283 -96 9353 -997 -265 4646 4417 -2631 2812 5311 -2730 4765 4120 -189
1614a89j932P995n969k480Q785o039j202L194K812j0232M941M793p138L344J552
1629B235j933m751R494n257m587O815q48k959O49O060j0641L966N213n204r02
1644b650M222O89p166Q341l577m267M806K824n049r70Q950q895J240M023k484
1659C7l507N047K897q923P317j067l821Q16N414n508k283J0006o685j282K289
1674G47J565o547M897M071q854M998J480k238m221P507m434l454Q751l644l433
1689b809P53O084q736K703M602o454K422K877q39p113Q372k446m962O298n5l778
1705c081k69P739q731O90M606k715j770L807J612q783Q689j238m972K308L759
1720A651l101k394Q870p713p82M910n1n468L911M395q188O042k50l269j482O847
$$ plain form
1614 -189 -2121 5874 -95 -2575 6210 171 -1031 2163 4975 -5257 -316 4477 -2661 683 2235
1629 2235 302 -4449 5045 -212 -4799 2016 1168 -1791 -1142 4918 -5723 -1757 3456 -1748 -2650
1644 -2650 1572 2261 -4905 3436 -141 -4408 398 3222 -1827 -2797 6153 -2742 -1502 2521 37
1659 37 -3470 1577 4474 -4449 2868 1801 -2020 -1204 4210 -1298 -3581 6425 -260 -1542 747
1674 747 2312 -4235 662 4733 -4121 877 2357 119 -4102 3405 -1029 -4483 4268 624 -2809
1689 -2809 -2056 4028 -4708 -2005 2597 -3857 -1435 1442 603 -6510 1862 -584 -5546 752 697 -3081
1705 -3081 -3350 4389 -4342 -3652 954 -1761 -3531 276 1888 -6895 1794 556 -4416 -2108 1651
1720 1651 -1450 -3844 5026 -2687 -3469 1441 1390 -4078 -167 4228 -3960 2082 1832 -1437 -2919 3928
1736C928l276m446Q851m854j762K213L307p032K549N617o659K223J530o00m615
1751c026P379k889n276P175q26l163m79O010p662J721N324m914o33K792J929p481
1767d019O736j771m287M534J936l975k590Q965p527m09M640j747k995L101L529
1782D121q557N648R7l361P88M072k974l998R114n596j964K249K618m800J907N100
1798D464q292M555J288k115l297O119j950m725Q069l015l128O89N540o987J018
1813a767N686n904J834J679N15o654P163r47n109N391l44k660j620P545o815q60
1829b867N108k135j317J219K423p476O706m2n368K513L386k081m106P636n544
1844a945j541M131L53l804J439M419p445M624O20l005j305N672j350n887P878
$$ plain form
1736 3928 652 -3794 5057 203 -1559 654 3961 -3071 -522 5095 -1564 659 2189 1589 -3026
1751 -3026 4353 1464 -3812 3363 2537 -626 -1105 4905 -2757 -1036 4288 -626 -1259 1533 3462 -4019
1767 -4019 2717 946 -3341 1193 3129 -846 -3436 5529 -1998 -2407 2233 486 -2509 592 4121
1782 4121 -4436 1212 1309 -2052 -1264 2808 -166 -4164 4950 -646 -2610 -361 2257 -2543 -636 4464
1798 4464 -3828 727 2015 -100 -3397 2722 772 -3953 4116 1101 -2027 -1338 4202 -2785 -1767
1813 -1767 3919 -1985 -151 1528 2043 -4611 2552 1605 -3504 1887 1543 -1117 -2737 4808 -2007 -2867
1829 -2867 2241 106 -1211 8 2431 -5045 1661 1619 -3749 -1236 2150 69 -4037 3599 -1945
1844 -1945 -3486 645 998 -2806 -1367 3052 -4393 231 851 -2154 -3459 2213 863 -5024 2854
1859B854l674j617J341L113n236Q36O189o524K136J095m37l840O331j013o371
1874d817O901k81k280k321O210n469K9O086n013m3J820K130o731N517N55n301
1890c008M259J884k579m060P546m431j073L957j656j950K290L746q851M707J835
1905B616l419M09L193j016n589Q143l437k432J824J991l063P77M832p954L782
1920F57K021j774k967M489O26o246O769j726k694l71M892m012n01N084n804J882
1936C25J946j04n794N455J922o128M229k01j216k599O149m250j610M978k887l08
1952i3R15K468p524N507K103n174J026K658j73m963O347l611j599L750n38k139
1968a040j7M858p513L868J983l227j629M505P44o688O027k241j096J079J918l395
$$ plain form
1859 2854 -820 -2437 -1096 2017 -3219 -2383 3806 -2718 -582 513 76 -3764 2567 1554 -4817
1874 -4817 2084 1803 -477 -2798 3412 -2057 -2028 4058 -955 -998 822 2952 -3779 1738 2293 -3008
1890 -3008 1251 3135 556 -3504 4042 -389 -1462 2495 839 -1111 1179 4925 -3926 781 2616
1905 2616 -803 -394 2799 1783 -3806 4337 900 -1532 292 2283 -780 -3 4829 -3125 657
1920 657 2678 904 -2063 2426 3052 -3194 3575 1849 -845 -1216 3676 -336 -837 4247 -1557 325
1936 325 2271 2167 -3627 1828 3750 -2378 1851 1650 434 -2165 3984 -266 -1876 3102 215 -93
1952 -93 822 3290 -4234 1273 3376 -1798 -772 1886 1713 -3250 3097 -514 -2113 1637 1099 -1040
1968 -1040 -1057 3801 -3712 156 2139 -1088 -2717 1788 2532 -4156 1871 -370 -1466 -387 1531 -1864
1984a864k17N947o826J762K022n20m152M630J762o842M428Qq94k022M239l668
2000b207o57O225n533j35J848K031n993L638K370n333K763J390m02m237N505k728
2016a455j534M664k853j291J145M519p561L089K935l760N65J779P61n626O547
2031A924k558j570K402J69k124o9N749p151J937L012r52l061K779J963n776N289
2047A963j775j492N66L473l124j510N898n652J001J971J188n250L263L056n687
2062b111L513l72o20k135N243l414k505N933l147j077M95L555o016K867K890m336
2078a237J117J211P70m737N918k821k401M541p76k368p41N892o347J649K452k193
2094g1p81K209J375n985N860j766k033J844J659k402j717O202n481M13K152K88
$$ plain form
1984 -1864 -2081 3866 -2960 -1198 824 304 -3848 782 2544 -4298 130 138 -756 -2778 1461 -2207
2000 -2207 -2864 3361 -2172 -2307 -459 1572 -4421 -783 1587 -3746 -983 407 5 -4232 1273 -1455
2016 -1455 -2989 1675 -1178 -2469 -1324 3195 -4366 -1277 1658 -2102 -1537 242 1003 -4623 1924
2031 1924 -634 -2204 198 367 -1757 -1826 3923 -3228 -1291 1721 769 -2292 487 2450 -3326 1963
2047 1963 188 -1304 -738 2735 -389 -1899 3999 -1653 -652 1319 2507 -2743 520 3576 -2111
2062 -2111 1402 1030 410 -1725 3518 104 -2401 3532 385 -692 -197 3358 -2658 209 3099 -1237
2078 -1237 -120 1091 1861 -2876 3042 221 -2180 2361 1585 -783 -1524 4368 -1979 -330 2122 -71
2094 -71 -852 1357 2732 -3253 2607 841 -1192 652 2311 -91 -1808 4394 -1087 -674 1478 1766
2110A766k814K111J948n747M568m86j346j066L715k076k702O207m562j85O91K755
2126B777m498J522L158n410L200P02p56l676N592j924l094M508j927j258o45M453
2142B724n613J843L006l594P00J019L22m602N834j571l106K711R54j588j966N215
2158B288n344J306K574j329j565J428K290n883N143q21k269Q43K642j492l018
2173c207N567l883N03J324Q66l729K451L089n885L234J90l63j977M374k055l400
2189b901N494k277m40n42L137m246J880L010m707J584J038R16m596M936j142k996
2205a852L806r60q24j944M964m445P67K812l014J38J449J746n955M720m25j943
2221i60J295P10p58l158O191m409j00J673K6j750J014K726n951L956O65j600j244
$$ plain form
2110 1766 -1048 1063 3011 -2736 1832 1346 0 -1066 2649 573 -2129 4078 -484 -669 22 2777
2126 2777 -1721 -199 2959 -2451 749 1451 695 -2981 2611 687 -2407 2101 174 -1084 -1729 2724
2142 2724 -2889 -1046 1960 -1634 -934 85 407 -4195 1639 68 -3038 -327 627 -961 -2927 2288
2158 2288 -3056 -1750 824 -505 -2070 -642 1648 -4235 908 87 -2182 -1339 1303 -189 -3207
2173 -3207 2360 -1523 -1020 304 1170 -2559 -108 2981 -2904 330 520 157 -1820 2554 499 -2901
2189 -2901 2593 316 -124 -666 2471 -1775 105 3115 -1592 -8 1030 1946 -2650 2286 1144 -1852
2205 -1852 1954 994 170 -1774 3190 -1255 -488 2324 -690 -552 897 2643 -3312 1408 983 -960
2221 -960 335 1045 287 -2871 3320 -1089 -1189 484 510 -1240 -226 2500 -3451 505 1170 -430 -1674
2238a674K823o16l218N516l658o12R42K548l331M93L435m580K290P85o81l016
2254b554M255k77l734M127j727l71m08L718m247K23L891l268N84J32J524m531
2270b663M439M49l637K308K51l50k254M646m340M29K902j298j770M49L491n199
2286b147L255J48k446Q32J549l2l589M550k972j66J605L13k729O00M400n683K456
2303e6J59m85j473K781m12m026M730j998l06k43K267l091O30L768m656J103R48
2320c60J401l801L303j72l136L857r82r69j550M288k946l44L362k759j20Q15K425
2337B312m693L084P22k505K364j81p73k510N133k930q36K045n70p20n7L084n150
2354b181K757R89j109j161J528L03l109M609k998q67J315J592k001j119L690m438
$$ plain form
2238 -1674 1149 533 -2685 2831 -827 -1439 -497 2051 -1280 -787 2648 -1932 358 1143 462 -2554
2254 -2554 1701 1424 -2310 1817 90 -281 -689 3029 -1218 -995 2896 -372 212 344 1868 -2663
2270 -2663 1776 2225 -1412 896 1147 797 -1457 3189 -1151 -722 2180 882 -888 -439 3052 -2147
2286 -2147 1108 1256 -1190 -358 1191 1159 -2430 2120 -852 -1018 587 900 -1829 -1229 3171 -2512 -56
2303 -56 103 -382 -1855 926 514 -3512 1218 -780 -1086 -1329 938 -2153 -1523 2245 -2411 -1308 -360
2320 -360 1041 -2760 543 371 -2765 1092 110 -859 -2409 1879 -1067 -1411 1951 -808 -928 -113 2312
2337 2312 -2381 703 1425 -1080 1284 1103 330 -2180 2953 23 -813 1232 662 -58 -115 2969 -2181
2354 -2181 576 1565 456 -705 823 1126 -1983 2626 -372 -1239 76 1668 -333 -1452 2238 -2200
2370b200J933Q01j69k763K523R20l851L823j828m40n70L152k872j223M068l053
2386a749O80J39J366l579L073R32l604K344n9K96k159L712k951m21L093j529n94
2403a010k30L057m141K490J190k478P16J038M66k979L981k461j29K050j95j594
2419b29n88M531m566J772P57o79p42J346P28l893M095j348m58l6J633k117n65
2436c59M113m070O51O53R66k664J752J006l441K825l48m27j834L338j907j055
2452h01L152k660j90L54K538l895J677J340k753J850k06J57k517L783j731j200
2468a102J946k71q98m27L313m496J825J336j107o56O05J025l383M600k001j248
2484i39J290J227j263j599L949l412O98J033L8j833J236J593l673L385j455j80
$$ plain form
2370 -2200 -267 534 365 -2398 125 1045 -2806 1017 -811 -1251 -1821 1331 -1541 -2764 1304 -1749
2386 -1749 -1069 -930 436 -3143 -70 862 -2742 -398 -457 -161 -2320 1392 -1559 -1980 1113 -416 -1010
2403 -1010 -1240 1817 -2324 166 1356 -1122 -406 632 1098 -1881 2100 -361 -490 1560 1365 -229
2419 -229 -817 3714 -852 920 1677 998 256 1602 2330 -1563 2532 1184 726 690 2323 206 -359
2436 -359 3754 -316 335 988 1954 -710 1042 2048 -1393 1432 1084 657 -1177 2161 254 -801
2452 -801 2351 -309 -499 -145 2393 -1502 175 1515 -1238 612 406 563 -1954 1829 98 -1102
2468 -1102 844 573 -325 -752 2561 -1935 -110 1226 119 -537 68 1093 -2290 2310 309 -939
2484 -939 351 1578 315 -1284 2665 -747 -49 984 1022 -811 425 2018 -1655 1730 275 95
2500I5p01K724j731j926L915k744K28L34J121k712J630J739l503J812j46k2j768
2517a655L340k130j496L140j669r0j091K951l244J140J256k159O29N50O20l115
2533c023L650j444j588J897K08j098j230L909l691R91J024o93n20N56J426l699
2549c325L588j152p77L15J288q31j772M059l121N03P15J038j717N78J568l109
2565b152K737n20l23j233K728r12k010L522k046L84m09J981k333P27J724k837
2581i72J707l1O35k550L221j043j946K361q67j39j041L051l140R93J455j873K51
2598G2K27J466l466L137l51k051Q45J053p55j909L595k709K87J021l30j217N40
2615e45K016l791K703l93p23l04J529l62k387L364j972L78m3J347j983M04K204
$$ plain form
2500 95 -606 2118 387 -1539 2376 -368 -140 194 1315 -1397 233 1972 -1531 281 135 113 -1655
2517 -1655 1685 -445 -1941 1199 -470 -560 -1651 1300 -1944 -804 452 -1707 -1078 -528 92 -3023
2533 -3023 627 -817 -2405 -508 -300 -1398 -2628 1281 -2410 -1419 -395 -1088 -1608 -1052 374 -3325
2549 -3325 263 -889 -1666 -1351 -63 -894 -2666 1393 -1728 -1225 -510 528 -1189 -611 957 -2152
2565 -2152 585 65 -258 -1491 1237 325 -1685 1837 -209 175 -234 1747 -586 141 1865 -972
2581 -972 735 704 1339 -1211 2010 967 -979 1382 515 376 -665 2386 -754 239 1694 -179 72
2598 72 299 1765 -1701 1436 1085 -966 -121 932 177 -1732 1863 -846 -559 462 132 -1085 -545
2615 -545 1471 -2320 383 -10 -733 -1037 492 130 -2257 1107 -865 -487 -530 817 -1166 -762 1442
2632A442l295K015K07q5j639K580l88k363L215j514n5n31K508k655N63J948k330
2649c77Q22K82Q57k948L072k55j814J560j53r9j907L118k608M74J210j082J6m1
2667A27J639l498K565K13j463K77P12O3k018L113k664O67K70N35j363J68K134
2684A477l623K217r3j97r69J498J51k524K917j627Q9o8J539k084M66K173k726
2701a384R57j0Q77k291K344J85k136J969n05J24j372K793k319L0K406k002K76
2718e8J43J563l161K513j10j459J243L76m72j790L469k435J39J415q18o74MK578
2736B466l541K051L4n97m34Q26K88k605L525j847n1q1J189j464o06K830l257J517
2754B43M7J17j415J378J86k561L224j549n5o42K235k082l95K410k529J118q5J211
$$ plain form
2632 1442 -1853 162 369 284 -1355 1225 837 -1526 1689 175 120 -411 2097 -558 5 1953 -377
2649 -377 445 727 1584 -1364 1708 1453 -361 1199 1046 947 -960 2158 -450 24 1234 152 168 127
2667 127 1766 -1732 833 1046 -417 -140 572 635 -1383 1730 -934 -267 3 538 -825 -657 1477
2684 1477 -2146 71 -22 -219 -1188 310 461 -2063 854 -773 -684 -752 787 -1297 -831 1342 -1384
2701 -1384 -427 -437 440 -1851 493 678 -1458 511 6 130 -1242 1551 -768 -738 1668 -334 -58
2718 -58 85 1648 -1513 1000 890 -569 674 1050 578 -1212 2257 -178 -39 1376 558 -116 -112 2466
2736 2466 -1075 976 1010 413 -21 805 1093 -1512 2013 166 115 34 1223 -241 -847 1983 -1274 243
2754 243 290 407 -1008 370 556 -2005 1219 -330 -385 -1027 1208 -874 -1269 1141 -1388 -270 -355 856
2772H56k756J890O99k142J613n79K50j511K707j903l68J836r81j56n23K316l234
2789a986J991N07j603P67K30L79j955L028j861k14Q21N81p38o83K385k875J743
2806E17J40n72n90R66P76k664K992j714J71p9J465j543o47K988k946J062J82M84
2824I88j789J447M62k610K703j061M11j254K070j480q32K472k100L64l55J732
2840A168k351J615mj845J659k39M87k127K628j505m89J406o27k96l80K217l093
2857a776J589M64o01O0J10Q73k650K912q85l59L40K43n37p24K577k764J213N19
2875F04K58j293Q32J086k560K512r74j47o87J579r59q54K346k402R69m4R91k073
2893h16J037J211k452J761m02K70j451K211j066j398K095j424N74q21K050k750
$$ plain form
2772 856 -1900 -10 689 -1453 160 -419 -169 -1680 1027 -876 -1244 592 -389 -545 -1068 1248 -1986
2789 -1986 5 512 -1091 -324 -94 285 -1670 1358 -503 -717 104 685 -53 -736 1649 -1226 517
2806 517 657 85 -505 461 1237 -1427 1565 -149 22 -57 1408 -135 -782 2206 -740 322 504 988
2824 988 -801 646 1108 -1502 1201 140 551 -703 1367 -113 -945 1527 -573 -209 -564 1168
2840 1168 -1183 432 428 -1417 242 3 490 -1637 991 -514 -1003 403 -224 -520 -900 1317 -1776
2857 -1776 -187 277 -324 -264 -154 719 -1931 981 96 -263 77 320 -217 -941 1636 -1128 85 604
2875 604 862 -431 401 1487 -1073 1439 465 318 -369 1210 251 -603 1743 -659 310 266 1257 -816
2893 -816 221 1432 -1020 741 339 609 -842 1369 303 -1095 1000 -424 150 -671 1379 -1371
2909a371J174R49j712Q29k44R44k523K868j546p29J309k34q1j095K625l005J358
2926d84O63p96m82O06J269k891K635j136o6O2Q69n27j114K473k071J046p6K69
2944B49j042O26J517k788K194p66M53j062J776q93j370K590j997P79o35J573j704
2961e00P02J017k078J303m48J142k252K298r29r94J681p95k50p43K243k391J175
2978A81O03j201M61Q3Q91k654K525p83n71N92l28K47j283K602k572P53O93j87
2996E2o79K54J384k809K545q40j05m22J029j9j328K106j860O23L3Q16j459O49
3014c0J251k430J909o98O47j484K000p21j394K069j209O99q84J686j880L77J181
3031A089j904J070k55J107k230K360q85r01J190l70J13j437K699k459R54Q31j008
$$ plain form
2909 -1371 -197 752 -960 -131 -375 569 -1954 914 -632 -1361 -52 -286 -367 -1462 1163 -1842 -484
2926 -484 179 -617 -1099 -493 776 -2115 520 -616 -682 -620 249 -278 -1392 1081 -990 56 -20 249
2944 249 -793 -167 1350 -1438 756 -10 443 -619 1157 264 -1106 1484 -513 266 -369 1204 -500
2961 -500 202 1219 -859 444 -4 1138 -1114 1184 255 -739 942 147 -103 -846 1397 -994 181
2978 181 784 -417 44 127 1018 -1636 889 106 -465 127 -201 46 -1237 1365 -1207 -454 239 52
2996 52 -627 -373 1011 -1798 747 -93 -198 -620 409 390 -938 1168 -692 -69 -36 780 -679 -30
3014 -30 1221 -1209 700 2 649 -835 1165 444 -950 1119 -90 609 -275 1411 -469 -92 1089
3031 1089 -815 255 0 1107 -1123 1237 352 -549 641 271 384 -1053 1646 -813 141 972 -36
3048c6n1l25J713k556K235o57k96J24K79m2j921K907k190J019M1O5o71J15J533
3067A286k685J829k19J40r49J145J34j806K542k000O00l35J465j782M47J743k556
3084a001J539n22Q79j887J855p6j627K111j212M10j006J980j846O29O26j051M90
3101B91k38J396k557K111l34q93N40j50L66j346K293j791K82N68K7l79n95J726
3119A317k527J876n43p7k80K92L75j632K632k044K20K72O73j118n95K451k697
3136a405J622m03J37j163J314K34j956K363j264L93o38J264j695K28J672j783
3152a080Q96n56J026j714J518j11j472J841r71P41j261K162j727J03J083j241
3168g63N91o36J690k410K010o23m09N46k5L29j709K308j475K17N48k21k99o27
$$ plain form
3048 -36 -87 -412 1301 -1255 980 323 27 151 430 388 -1533 1374 -816 203 244 309 -362 -247 1286
3067 1286 -1399 430 211 351 -598 547 681 -1125 1417 -583 17 -318 1147 -635 -188 1555 -1001
3084 -1001 538 16 895 -992 863 787 -840 1271 59 469 -537 1443 -403 226 852 -199 291
3101 291 53 1449 -1108 1003 669 -224 316 166 532 -814 1479 -312 -30 538 565 186 -409 1317
3119 1317 -1210 666 123 46 -234 58 433 -1199 1433 -611 -391 -119 554 -564 -1159 1292 -1405
3136 -1405 217 -186 -49 -1212 102 336 -1620 743 -521 -128 -766 498 -1197 -969 703 -1080
3152 -1080 -184 -740 286 -1428 90 -21 -1493 348 -623 118 -1143 1019 -708 -605 478 -763
3168 -763 -172 -808 882 -1528 482 -141 -550 -4 -29 300 -1409 899 -576 -359 189 -32 -331 -958
3186i58K164k466J437r5k06k58L53N43j885K101j435N11l37R75q13p01K083k297
3204a284J411n71O90j127O41L18j307J927j419O43j182J886j131j77J292j291
3220f81N45m44J376k098J256M55r10Q55o17O96j518K339j866L38P83n36K62n43
3238c08J579j940J244k51n44J79L92P94j645J783j226J33K17K13m06m72J767j868
3256c59R47l04N71j121R09K46j981K217j149K80n98R97o35m23J677j827Q29k96
3274b0P50j372P69P63j576J326r55P07j197J466q06n77J350j053N84p50J642k112
3292a061J236J47j080J154m38N01j550K077j184o1M89M1j95p86J922j875J110
3309D47R8n37L4M9J027j878J846j117K2nQ26n57r43K149k111J147l08M26p62L46
$$ plain form
3186 -958 1206 -1260 177 82 -124 -382 -29 514 -1371 730 -705 -194 -531 444 -369 -1070 1013 -1284
3204 -1284 127 -444 246 -881 -240 78 -1229 698 -721 -78 -1260 626 -505 -682 610 -681
3220 -681 -136 -580 796 -1302 -46 409 -501 354 -263 433 -1085 1254 -612 -274 509 -27 235 -308
3238 -308 1271 -669 575 324 -220 -41 351 1145 -500 1283 57 190 407 620 214 -258 1509 -359
3256 -359 588 284 855 -266 643 889 -1092 1125 -24 256 -342 655 20 -403 1274 -553 276 -20
3274 -20 730 -642 127 890 -686 640 -315 392 -805 661 -145 -722 628 -425 159 -591 1051 -1061
3292 -1061 175 322 -758 396 -42 459 -1091 986 -198 -259 230 271 76 -710 1212 -663 447
3309 447 545 8 42 91 1118 -760 1086 -31 -9 -14 812 255 -688 1461 -650 497 189 615 -147 199
3329A99Q09k183K151j112N71q76J327o20q63J770j486O27o90J058j400Q81M82
3346F45j597J601j099Q43j309J569n58o57J059j000M67q29J902j971P74O19r07
3363d48M45o34J308k190K289j108k47O15j04Mj040J873j721J004k52K75n43J28
3381c46J247j931J651q37J42j14M30j04o77J326j438R37m19P94j165L98Q73j483
3399g16J449p35L43j042J219k07n14J477r84p6n66J509j854J006K03j460J203
3416B55j80J197k463K000n70p40Q15l21K98r29J681j404K93M54n84L47p53J667
3434A063k132J452n13j08J75Q8L70j538J633j175M86P5J60l99j11J319k067J494
3452B72n05M38n55N47j51q64J540j407Q57o38J257j245J68J067j563J027k98P30
$$ plain form
3329 199 1008 -1175 976 -136 435 -441 886 266 -597 1173 -313 314 -376 682 -718 163 645
3346 645 -952 649 -450 393 -916 653 95 -562 497 -503 -36 -865 1037 -934 -160 459 -448
3363 -448 -3 -637 671 -1519 770 -338 -585 30 -74 -70 -1110 763 -958 46 -206 69 -474 -346
3381 -346 901 -1030 621 -216 -74 -188 242 138 -539 787 -651 286 -133 661 -504 -106 767 -716
3399 -716 733 -2 341 -701 518 311 -203 1274 290 214 -352 1157 -697 309 512 -948 255
3416 255 75 1272 -1191 809 239 -501 314 -7 291 -638 1043 -361 -68 386 -198 149 -604 1063
3434 1063 -1069 383 -130 -238 -63 25 395 -1143 490 -685 -199 -124 36 -363 -474 845 -1222 272
3452 272 -233 205 -350 197 46 -818 722 -685 172 -466 791 -454 -286 781 -782 245 -53 677
3470F77j165R46qp01J189j134N22r84J592j141L99N47q52M23p36J414j627J334
3488F95m68o24Q19n78M95j274J830j492L76J85k37N3l68J389j873J484r48J52
3506c84m6L39J74j179J500j274O81l9K97p72pJ099j675J062m67O52q53N97N1q15
3526a059J340r16L43j67J006j121j3P81r45P63m59Q50j180Q83j2n09P12m16O23
3545E04q98J284j220N60N36q94L86o10J277j368J072o57J9L62r1L15j275J745
3563A047j234J24N09l49L2k56R06j349J101m29p7k94N21J69j207J517j094N37
3581A74m12O53o67m0J370j654J065q31P18p12N36K98j011R84q99N31p87R55n66
3600b95j90J024r62N41m63Q69q78N76O2o53J042q13N38j134J609j036L15K44m82
$$ plain form
3470 677 -488 458 450 -251 938 -196 326 -658 934 -207 192 739 -113 310 -426 988 -639 695
3488 695 227 -397 422 -156 339 -935 895 -597 -221 -36 -273 -220 -588 801 -1072 412 -536 -384
3506 -384 -430 -91 83 -1096 404 -870 -189 -228 69 -703 -710 389 -1286 -224 -691 -39 -892 -295 -244 -1059
3526 -1059 281 -635 -292 -459 547 -574 -587 194 -751 12 -447 403 -777 106 94 -415 297 -119 504
3545 504 -394 890 -330 230 766 -128 258 -352 925 -443 629 -28 -9 353 262 577 -698 1047
3563 1047 -187 -63 446 97 129 -127 779 -570 531 102 25 -269 252 421 -786 731 -363 174
3581 174 -238 415 -252 -292 1078 -576 489 -342 376 -336 200 498 -513 471 -428 103 -684 271 -295
3600 -295 -485 539 -423 118 -345 524 -354 222 284 -369 673 -140 398 -736 873 -163 152 396 -86
3619h6N87m64J149j742J388n01j87R2n7K22q65J671j158M82j29l8n9m26J314j837
3639f44J199m24L51l61K03K96j311J432r38O85q91P76m86m93J380r07M48o09Q42
3658E48j273P48J39p70R13o07N52j101J254o82j68N93o31N87o30J025j364J158
3676B91M9q83P25k63L45r95J309p65J70O7Q5Ro11R84j113R10l29Q6m9j71P78j381
3698g52J471p18K33n20O39o4n37R80j283R16l98M01m25K92J61r65J129n47K58
3717B71m27N98m13n33J082j132P92q79J293j313L58M64r54J157r83P96q10Q40
3735B07p16j35O36k76M80p30J141j388N63J4l31M05l70N57j112J498j046K61l
3754c45K39j03n23J332j117N59k99J72k21O7P00j581J505o78K66l10L76J20o01
$$ plain form
3619 -86 501 37 1186 -556 832 331 144 236 179 401 -464 1207 49 531 402 364 305 -121 1193 -644
3639 -644 555 131 482 121 324 620 -691 741 -197 488 -403 373 -113 -606 774 -133 315 -294 548
3658 548 -725 23 162 -608 305 -302 250 -851 403 -279 -447 146 -485 102 -528 497 -867 291
3676 291 340 -543 182 -81 264 -731 578 -187 -17 50 135 144 -467 517 -596 314 -15 71 22 -149 629 -752
3698 -752 719 1 234 -286 353 289 -248 732 -551 365 -33 368 -57 235 396 -569 560 13 271
3717 271 -156 442 29 -504 578 -554 238 -641 652 -661 -303 161 -793 364 -619 177 -633 207
3735 207 -509 -644 -8 -284 196 -534 607 -781 -218 -204 -535 -130 -500 57 -1055 443 -603 -342 -345
3754 -345 -106 -209 -732 600 -517 42 -257 -85 -306 -239 461 -1120 385 -293 -27 -337 39 159 -442
3773d42J084j033Q86p03M14n71K20Q87j434J036l36L60q46J128p46j87N22n91
3791c52P69q69J037j020M62K33p74Q04n37R17j564J035j99k20O04p31N21p46J244
3810F14j396Q15L39q00N14m82Q05j238J063n26J87q5J80K12p13J392j544P73m12
3829c02O11m82J1O92j230J296p21L26l81K04L64p16Q97p54P29p31Q17q67L09N11
3849E83r21R67o42P13q71Q41n70m67J170j160J034r01J125j061M70L35p71L79
3867B53l97Q57j055J040p32Q5K29j77N39j067R57r32N97qj10r3l76R00j284J014
3887B40m05K56l22J01L38p21J250j146N23l42L27k60k30Q21j237R96l72L64n87
3906d06J24L20n80Q58r33Q41n41N35n33k9R44j013O80n31O17q53Q37m75N6L90
$$ plain form
3773 -442 642 -391 495 -208 206 -365 -145 742 -692 344 8 368 -478 650 -96 -283 239 -352
3791 -352 417 -452 585 -435 27 260 -514 290 -247 670 -894 141 -58 -278 326 -405 116 -630 614
3810 614 -782 33 372 -428 86 -396 409 -829 234 -292 -105 -190 -10 202 -511 881 -663 110 -302
3829 -302 309 -173 -162 530 -700 596 -125 201 -180 24 388 -328 569 -185 544 -187 630 -237 72 583
3849 583 -338 629 -13 700 -171 670 100 -367 803 -357 677 -224 901 -160 310 645 -126 253
3867 253 -144 713 -342 698 -34 51 280 103 642 -425 532 -400 197 189 79 -14 -390 510 -774 240
3887 240 -165 91 -231 -130 208 -513 737 -409 114 -228 99 -161 -391 430 -807 189 -183 181 -406
3906 -406 -282 38 -542 316 -617 224 -317 218 -315 -344 600 -413 267 -264 353 -500 337 -138 -82 308
3926C08m13O75q65Q92q59K22O49q04M10n28Q21r89J050n12O8l5j36N63j229J435
3946G23j075M22m1N3L9n94J154r65P06n03M9o6R7j26m37J091q59L82n45N66r8
3967b7m40R50q80O57o66M79q16P15N4p03J022o32N12p91R20l76p0O16r35N63n94
3988d42P00o78O95k68l24O32m61P87j040J257r06Q2J64j05L71q01J067j230R70
4007D70k01k18J45k79N52q68J127q10J42o5M15Jn82Q62j203Q59l90K23m64M86
4027B02K12r65J063j049P92m22L11j92l49J051j192Q85q20P71o74N25Q9o99P34
4046B73m51L57q34R47m97o1M45o26Q33r27P88q79Q32j20k96K62l08P17j166R71
4066B60m91K25K62l18K92n15O68j028R73l84J05K17m81P69j167J217q60M38n05
$$ plain form
3926 308 -105 570 -295 597 -262 -40 609 -195 215 -313 508 -481 569 57 125 90 -46 517 -712 723
3946 723 -352 70 29 82 121 -473 681 -284 422 -81 -32 -98 -1 -127 -564 527 -332 50 -495 71 -27
3967 -27 -467 483 -397 260 -406 73 -743 -28 26 -677 345 -287 225 -566 354 -22 -92 524 -411 152 -442
3988 -442 258 -420 275 7 -317 315 -146 641 -399 858 -48 34 198 93 464 -337 730 -500 470
4007 470 269 51 196 -83 469 -399 728 -82 60 -5 410 411 -171 691 -512 347 -43 180 -284 202
4027 202 414 -551 512 -537 255 -167 144 -48 -397 654 -538 347 -473 298 -376 149 238 -461 273
4046 273 -178 179 -655 292 -205 -266 179 -447 386 -541 247 -632 200 80 -216 46 -262 455 -711 260
4066 260 -231 -6 256 -62 230 -285 383 -645 328 -56 49 266 -215 554 -613 604 -256 182 -323
4085c23N23L5n89Q85q32O19l28L54l87J43L88j050J065p56O66o96N07l46j00M94
4105B72p53Q52r17P77p01J26N69p17Q60p98P60j076J055n23k16N22o14N37m50
4124d35O55q71N06l4R6Q4o02P48p62J079o55K20l9k12K65o50J002q86P75k93J83
4145A74k60l49R62j019Q95o23L94j68K09R2m94R84j076O04o12N11k14L43L01r25
4165b71P09n35O59n06L59k16k96P70q27N11m45N44q10N44N5n47O76o44O38q67
4185d99P91n18R3J77k64M67p50R41r05Q65m42k03L58n54P92j105J076p89M33o0
4205i6q2J30n25Q92j030J065o11L08l3l70P59p40Q51p56O23n07K98n9m73J067
4225G11q60N11m82O62l48j10L39n90O63m59M08n62O08l42J0M11q23O06q81J197
$$ plain form
4085 -323 200 235 -354 531 -301 318 -10 344 -43 100 488 -562 503 -253 413 -283 224 -122 -222 272
4105 272 -481 371 -546 231 -470 -344 225 -492 368 -430 330 -746 309 -214 -430 92 -522 15 -435
4124 -435 220 -651 -145 -179 -83 1 -601 147 -615 464 -191 29 -10 -222 43 -607 395 -491 284 -9 174
4145 174 -86 -435 527 -492 403 -220 174 6 215 307 -187 797 -279 325 -287 224 10 353 654 -271
4165 -271 438 -97 562 56 415 199 -97 673 -154 357 -88 456 -354 190 245 -302 374 -270 368 -499
4185 -499 292 -226 -133 44 -220 247 -503 438 -467 398 -44 -247 111 -443 349 -756 320 -469 -36 -96
4205 -96 -178 -48 -573 319 -711 354 -257 51 18 -352 407 -333 518 -238 385 -122 176 117 -356 711
4225 711 -149 362 -120 542 194 84 423 -167 496 37 445 -117 491 149 159 570 -253 353 -528 669
4245F69p79K39o4o8L61o13O23o46O80o90L58J76n70N11m42O62r61O55k42j78L99
4266H0l85O48j147J172r11M13k62K66J23o03J040j140Q81n55K44j01r0N59p57
4285e25J000j121Q49p70M23K30m49P74o47N28o55Q52o02M4N24p60P28p55Q25p54
4305b61O41k67k69M47m54O14q62Q31q24O01n7n36O17o27J028j137O81j68l5P4
4325C7k06N06r22R41q04N81j7j41K59o55N21o76P91k65K33o41K98J82m32O36p22
4346d96N96o41O35j50k99L74l95O81n88M28l99L16O8k99J026j228P34q31Q50o09
4366b27K05L48n58O51l57M52o50P19l48k17K24j88P56r12Q13q01K91p4j8L30p74
4387c35Q38o28O58o84J81K65j54K85q15R47n30L16m05J76J2l66M47m83O41n33
$$ plain form
4245 669 -110 129 65 -3 358 -255 368 -278 402 -288 70 246 -324 187 -255 407 -554 101 -141 -319 80
4266 80 -305 343 -804 368 -543 -130 -392 -126 -3 -606 434 -706 175 -380 -136 -237 -327 232 -525
4285 -525 475 -646 203 -567 -144 86 -363 411 -236 292 -363 489 -113 -69 455 -305 423 -332 493 -261
4305 -261 380 113 -156 291 -163 451 -411 420 -404 197 140 -396 221 -406 622 -515 166 -2 -37 37
4325 37 -169 337 -585 356 -448 133 116 -25 234 -421 100 -576 215 -50 183 -458 -160 22 -410 226 -496
4346 -496 100 -541 94 -56 -355 19 -376 305 -283 145 -254 62 130 -169 857 -371 363 -468 382 -227
4366 -227 -22 326 -232 419 62 514 -136 583 235 18 242 54 810 -102 711 -90 201 127 109 439 -335
4387 -335 503 -125 533 -151 30 295 141 426 -389 558 28 344 -61 115 127 -239 208 -275 366 -167
4407a67L73j98R3k2n96Q84p61O74p49L93q2o9K50o34Q45o87Q89q22L91J44m46
4428b97P02o61M68o42N87m08J49j63L5O32p32P09o50L61k53j88N30n91P30o03
4448b85P58q38O02l54n1M83l03P37j003M54l55L03k90J3O05r77P95k79J37m02
4468b50L21Q9p39P57n76Q36o68L80l66J69K54o98R20q64N52n11M03k09l56N84
4488B8n10N74n54O06n63K51J30k35M52p29O80o28N88k58j69L16m07N57n44O98
4508B83m19L19m33J60K55k93N95p21O58o14M73k70j74M02l69M44p27Q07j43m3
4528A90P7j77K14n15P20l89M0j24M3J73n07O50k73M31n83K47l07K70K08m14J87
4549A61m69P04n53L35k04j5K47m56M27m26M42l86Q6L1n2K98n69Q13q98O70l72
$$ plain form
4407 -167 206 8 101 79 -517 367 -394 280 -469 -76 -158 -227 23 -611 234 -453 436 -386 5 149 -297
4428 -297 405 -256 212 -430 157 -251 -102 -265 -230 402 -330 379 -271 90 -163 -351 179 -412 318 -285
4448 -285 473 -365 237 -117 -168 315 12 749 -254 200 -155 148 -142 -129 476 -501 294 15 152 -250
4468 -250 71 160 -579 178 -398 438 -230 150 -216 -47 207 -491 429 -435 117 -394 9 -200 -556 28
4488 28 -482 92 -462 144 -419 -168 -38 -273 179 -550 130 -498 90 -168 -337 -21 -428 129 -415 283
4508 283 -136 183 -250 -90 165 -128 467 -254 404 -210 263 -7 -181 221 -148 296 -431 376 233 190
4528 190 267 90 304 -211 509 120 160 36 79 252 -255 395 122 553 -30 217 -90 180 388 -26 161
4549 161 -308 396 -157 178 -26 -41 206 -250 177 -249 193 -193 -107 -76 -128 170 -399 414 -484 186 -186
4570a86K06j41j06M22p06J072q51M31l05L02j53m82O05m25O22o40M66k15R6N2
4590F4k61N84q28Q84n70M09j16j70L13o94O86o34M78j78J05J54q73R97k37O78
4610G91j205L08K05r6P79r51O12m02K93j086R71j99PM72o69K86l08K27j35R9N7
4631E6l46L71p65R80o37K44j36J95k8n37N56n81R88j038Q34n68K40K81n41O32
4651B00o86O53n47L33k29m1M68o76O07n21O72m23L05p2k9R9l09N55o57N25j56
4672G1j06K84m03J75l27P68p69L90R9k92K09k86N93o07N95p35R83q02j0L11l01
4693a60N44p84N92m08L51j64j50L92n57N51q64R15o79M75n6l49N63o14M61m98
4713d39O90m51PL48k82J36m16P22n61R9K9q6J61k48M14l00N28m99k3J86j48M17
$$ plain form
4570 -186 20 -121 -227 195 -511 561 -290 141 -164 138 -15 -497 108 -317 305 -335 131 -84 12 64
4590 64 -197 387 -441 443 -127 282 166 -4 309 -385 301 -333 145 -33 72 226 -647 350 113 791
4610 791 -414 -106 99 3 782 -169 443 41 334 -752 219 20 27 499 -170 116 -192 35 -100 -1 56
4631 56 -290 81 -684 296 -341 -97 -233 -38 -66 -603 -47 -628 360 -678 156 -412 -172 109 -432 200
4651 200 -486 167 -380 -47 -276 -317 151 -525 82 -439 233 -190 115 43 14 113 -196 359 -298 227 71
4672 71 -35 249 -154 21 -306 462 -307 83 182 -110 99 -187 406 -201 394 -341 642 -160 -170 141 -160
4693 -160 384 -400 192 -216 135 -29 -179 213 -344 207 -657 258 -421 54 -2 -351 212 -402 59 -439
4713 -439 251 -200 -193 155 -127 9 -407 315 -246 -147 -118 -204 -43 -291 123 -177 351 -148 -171 15 -133 284
4735B84l89M94n10M15l77J35J06j11L60o14M72j59J44l33M44k11m1L16l98O61
4755F88r06N26j37k04M69n96N70o37R30n89p5R8j18K19l98M36n51L97j18Q2L5
4776A21r4M18p72O78l41pR3k65J51j12L08l82L47l73L69o70N42p4l37O14l69K43
4798H8j77J57k44Q1L62m56N49o50N65k83j35j3j11O10m99P23q20M58m60o8K92
4819c1j60N37o48M62l77L80J0k75l0Q2M60m93K74k21K36k85j40N06l96N76l92
4840G5L22k73J5j37k37N44l11K12m53O17n64Q6J48l25M63m80Q78r31K95j72j23
4861c51J91j21N17o10O71o29J22J03j01M9k46O15p00O49l11Rj00L0N54p11M47
4882G7m77P97o37K83J65m54M34n81P51n67M95l79n7J2o6L11k48M69l66J81p6O5
$$ plain form
4735 284 -105 389 -121 294 -83 52 158 47 407 -207 265 106 250 -83 361 150 109 425 27 688
4755 688 -218 308 171 -33 436 -160 410 -227 703 114 39 137 19 238 -160 276 -275 122 4 86 121
4776 121 27 445 -327 351 10 3 96 -169 -18 -130 178 -204 143 -230 139 -531 11 -63 -400 214 -155 88
4798 88 -89 68 -176 -95 267 -189 360 -290 275 -8 -143 -156 -267 343 -156 567 -253 205 -255 -323 -31
4819 -31 -191 346 -302 160 -217 163 173 -102 -132 -50 410 -83 191 -30 206 -79 -219 287 -109 467 75
4840 75 397 124 139 2 -235 309 -2 210 -243 374 -190 -104 44 -281 182 -298 580 -351 -56 -228 -351
4861 -351 -160 -281 236 -374 297 -332 -210 -107 -208 -159 -405 210 -490 159 -152 -143 -243 -213 341 -370 77
4882 77 -400 397 -240 43 208 -246 188 -393 358 -209 286 -93 -150 -138 -204 107 -141 328 -38 143 67 132
4904A32K66o14N24l44N30n91R7K40m16N88l72M24n46K66M7j27L3n07N25k87P50
4925F18n48j13J65j48jJ18Ml93N96l90Q1QO5m4j99M70l81K00o17K96L15l27M79
4948B54o58N07n69L83l39M23K19n48O05r33J026m87K30k68Q2J52l78N35l44M20
4968C12m70N50l50r1J65j22L63n54O83q45Q89l89l94O56n82M37l85M79k27o9K3
4989G9j82L48o52Q13n52O46l10j85J49j16M08q04P93o84M23k02l1K29m48O51o52
5010b79L70k39J4K84l40K69n34N66n36O21o68L01J43j62L38o49O50m50J81l34
5030d54L72Q2k89O30q12P00o10M43j28j7L36m96O61o29N38n32M08r0j35K44k40
5051a8M13q30P20m97N14j70k63N03l97N56o97Q02n39j5R7l93O90o14K76l77M92
$$ plain form
4904 132 398 -216 308 -36 494 -97 0 240 -176 412 40 464 -82 184 231 104 137 -370 155 -132 618
4925 618 70 -43 122 -26 -27 91 95 -298 298 -92 -11 -3 62 18 -181 289 -92 108 -509 -213 102 -225 254
4948 254 -404 103 -466 -83 -422 1 220 -328 277 -656 370 -117 113 -155 -73 79 -299 236 -108 312
4968 312 -158 392 42 -49 116 -6 357 -197 486 -359 530 141 -253 403 -179 258 -127 352 125 56 79
4989 79 -103 245 -407 406 -146 500 190 5 154 38 446 -358 435 -249 174 -28 -59 170 -278 373 -279
5010 -279 91 -148 -134 150 -190 79 -455 111 -425 196 -472 -171 -28 -190 148 -501 149 -301 -120 -454
5030 -454 -82 0 -289 341 -471 229 -381 62 -66 -83 253 -243 418 -211 327 -205 203 113 -22 222 -18
5051 -18 395 -435 285 -212 302 132 -131 372 -25 531 -166 636 97 82 179 -214 476 -138 138 -239 253
5072B53j24p3Q3l49K29j19M55l63O1n17L06K62m71N46m65K82k01K48o1k16L53
5093A19m45M45o29N42l64J85J01k42L13l26M56j81J29k76J88j53N5K82p13O53
5113A39m74L38j30n7L21m38O08n80M52n35N95K03n35L91o37Q59o97M14m27M24
5133B34p5l29M72n08N77m24M09n12K42J75m32P37p17N46o42O22l96Q1K95o44N29
5154B40k30J32m42L35j89J91J9o33P07m99M35m21M24k14j6N28n83L25n74N36k97
5175b26K06O0p7K41n03P83p98N53q8k50Q7k74O05p43M32k13J27j19r8N08k41K16
5197A88m19M12l73N09k99j34L44m89O50o75L60j26K09J39p01O75n57O30n98M77
5217B22k03L1K36m26N64o88L84j91J13j00Q3P6l24M11m89N65o72L32M0l79P13
$$ plain form
5072 253 129 56 139 -210 19 -100 355 -8 53 -464 -158 104 -367 179 -286 -4 -205 43 -18 -234 119
5093 119 -326 119 -510 32 -332 -147 -46 -288 25 -301 155 -26 103 -173 15 -138 -83 199 -514 139
5113 139 -335 3 -127 -184 137 -301 307 -273 179 -356 239 442 -93 298 -339 520 -177 237 -190 234
5133 234 159 -170 302 -206 371 -53 356 -156 86 261 -171 566 -151 395 -247 375 -21 60 355 -289 240
5154 240 10 142 -300 35 -154 37 56 -577 130 -369 66 -355 69 -145 -161 367 -216 109 -465 71 -226
5175 -226 -20 40 -37 204 -299 484 -314 239 151 -99 -12 -286 319 -424 8 -205 -78 -197 -295 213 -28 188
5197 188 -231 181 -192 317 18 -116 228 -261 389 -286 74 -52 157 296 -405 270 -287 343 -255 222
5217 222 19 50 286 -140 424 -264 120 -71 42 -58 25 101 -223 188 -301 264 -408 -76 -36 -415 298
5238B98p50M63l36M70k51N2o7r6K49m11O04m58l6J27J42m7k45N35n32J96l25O57
5260B39l37n9L04n94P09o06N58l37J87P9j66K55o38Q26l93K52m22O47j86l99M13
5281C32n49N83n86N47k73o5L62k94K90o24P79o32J99O0l82N18o30N66m61M58l96
5302a98K6K47j68M25l52M36o45M59n48L63N3j46K28o65J043j093N61k47K5M67
5322B71n98O43r07O59l67J83J15j86M13p49O71n57N99m70K99l1j13K40k81J93
5342B7l38M31m05L73K01l25M16n18K92m03L79m34L36Q2m87P46p47O80k68m6j3
5363b1j05M55k84L28n94O58m39m4L50l52L10n68Q82r41O28j85r4j20K51J12n59
5384c32O80n00M40m64j48J96R6J83o07M59j51K30j56j06K96o51P54o62O83n07
$$ plain form
5238 298 -452 11 -325 145 -106 -54 -121 -217 32 -379 225 -233 -269 -142 0 -47 -292 243 -289 -93 -418 239
5260 239 -98 -157 147 -447 262 -344 214 -123 64 143 -23 232 -406 420 27 279 -143 504 318 -81 332
5281 332 -217 366 -220 327 54 -11 351 57 347 -277 502 -130 69 129 -253 265 -365 201 -260 198 -198
5302 -198 -172 75 -93 332 -20 416 -229 230 -318 45 98 -48 180 -485 558 -535 26 -221 -196 271
5322 271 -327 316 -591 68 -299 -116 -1 -187 226 -523 148 -409 190 -280 19 -12 -125 115 -166 27
5342 27 -311 120 -285 88 289 -36 380 -138 154 -249 130 -304 32 114 -373 373 -374 306 38 -8 -21
5363 -21 -126 329 45 373 -221 437 -2 -46 304 -48 262 -306 576 -365 263 78 -16 -136 115 227 -332
5384 -332 348 -152 288 -176 -324 -128 -32 151 -456 3 -148 82 -74 -180 116 -535 219 -443 240 -267
5404b67L74j45j74L15m59M26k80N6rK21Kj77O4j35L31l15L02k44N3K31l01R0l62
5427d03P37n19L24j2k35J22l13M32m38O53l89n2j18L04R5m36M83p32O08k52K02
5448F1j34k39P92o95N95q08M79j40m4J37j24M35o02M76j27J77l83qK83m11N56
5469B76n84N05m62L62k35n3L47n05N67l97J74l60K86K07j73K55l89M15p33N86
5489H9j45M4K7k73L00k21M82m07L25j69J48k36j26L67l78N83l56n4J77O3Q9m43
5511a14L48n10N43k03J45r5O2K46o60N46m59N01k61p6K0nL25m37K20l16K46l68
5533c02M28P5o07M31l37M43m73P38k92k39K27j09N7l97M42j93M47k71j82K53l32
5554a93L54l64L57l31J00R8P1n0k01K24j82K98k06J05K27k44J76n13N69o10M45
$$ plain form
5404 -267 107 -38 -212 103 -356 70 -210 -154 -163 58 60 -117 -53 -188 143 -172 130 -114 -61 170 -131 -41 -403
5427 -403 334 -185 139 127 -108 14 -299 133 -305 348 -41 -93 -211 93 188 -248 235 -497 111 -141 61
5448 61 -73 -312 480 -215 380 -428 51 -89 -133 4 -120 315 -287 189 62 239 -144 -152 131 -280 276
5469 276 -308 197 -265 97 -138 -191 156 -349 218 -179 -5 -365 -79 128 -45 210 -179 236 -497 89
5489 89 -56 -12 15 -258 42 -179 303 -104 221 52 200 -36 -162 205 -173 410 54 0 177 240 329 -114
5511 -114 234 -276 267 64 209 114 176 422 -238 308 -151 350 89 13 33 28 353 -84 136 -180 66 -302
5533 -302 126 201 -406 25 -312 131 -342 396 104 -135 92 -17 40 -357 85 -108 339 68 -114 139 -193
5554 -193 161 -203 154 -177 -77 21 92 42 -159 65 -117 181 -25 80 307 63 239 -274 295 -315 130
5575A30K13j88N1l90N81l71J78k04M4j26J4L75m94K82l82N65l26R0J85k25n9j33
5597a90L34m35L06j52P4L39m97N61m73L25m03M82m26l69M85N0J05j29J58j63L1
5618A3r4J03J06n34M71k61J21j80J49K00k95N14n78K96J11j21k9K1j23k53P57
5639C94p36K86O8O1k15j85L07l42N36k29J06p2K75j40l47M95m76L82q2K77k62
5660A01K70j69k23K32k40M69n24N41n33O6J07k79K96k23K64k01K65j91N5j48j73
5681b38L60l28M03l09J46j14J10j49O1R2k38K60j03j82M33k62K01n38M56l06K21
5702b4Ql2J48J5K11o22O33l78Q3K5Kj20k44O10o12K09JL19l70o8N51n68N70m55
5726a08K76q3r7P2j75M46m26L34j20O8J42j48q4r2K58l06L68m16J14R7m7m3k86
$$ plain form
5575 130 343 155 206 -184 397 26 204 0 44 -82 -68 307 -187 95 -287 278 -48 42 227 2 -57 -190
5597 -190 144 -291 15 -137 -63 276 -221 340 -133 192 -211 271 -155 -524 -39 11 116 -13 145 -18 13
5618 13 -81 22 128 -406 65 -196 -75 -255 -106 94 -201 313 -265 31 142 21 -8 13 -110 -363 394
5639 394 -342 -56 12 73 -142 -327 -20 -362 174 -55 51 -21 254 114 -233 262 -214 168 86 363 101
5660 101 371 202 -21 211 -29 440 -84 457 -76 -10 97 -182 114 -109 155 -46 219 28 83 -65 -238
5681 -238 122 -206 197 -112 34 -80 30 -119 -58 34 -204 56 -47 -229 204 -58 143 -395 61 -245 -24
5702 -24 -16 -48 100 115 326 -296 337 -41 42 67 69 -51 -295 315 -297 -88 -87 232 -138 -206 345 -223 347 -108
5726 -108 168 85 -12 60 -115 331 -95 239 119 187 329 181 97 5 263 -43 325 -91 23 120 73 30 -256
5749b56N01l45L17l05J35r2J56Ok05K79p48P01k55J80o1l06N02m42M96m94L48
5770A12l96K10ok2M81o07M27n87M82l74J73J19j64L65n28K96p9pK7j25L91n40
5792c52M27m01P22o15M57k80j72N12o70O11o09Q49o66K14K32m97L48J9j48l5L55
5813C01m26M4K42l39N30k46J52l69J2K82oj14p8K45n39K45J09j07j81J38K30k40
5835a15Q6l05K47K05J4m94PL43l82M53l75L76j93j10L83k71J81l44K04j59L2J20
5857i7M0J14rL42n67M38m01K41J37m88N34l49K39l65M01m16P9L73j42J32r8K77
5879D15n18L22j89Q6K83n41K84l26N34k03j4o0J32j9m83L87k41Q1L5O6j00J00
5901C1L90m80M64o83L62j36l9j18K65K47n80M94l86L05j66j15L11j62k8j37L67
$$ plain form
5749 -256 245 -100 217 -88 47 -45 111 117 -88 191 -557 144 -111 69 8 -298 204 -238 258 -236 112
5770 112 -284 -74 -80 -102 379 -228 199 -388 94 -280 -107 12 -152 213 -315 -19 -98 -105 -78 -203 188 -352
5792 -352 75 -326 396 -219 238 -42 -214 298 -372 239 -370 479 -187 27 259 -238 110 129 -19 -54 301
5813 301 -125 -81 161 -178 352 106 258 -111 -99 183 177 63 -15 230 -309 -64 45 -62 -243 -105 125 -115
5835 -115 -29 -334 -87 118 132 -362 -355 -12 -394 59 -316 60 -133 -243 140 -131 50 -294 -90 -249 -217 -97
5857 -97 -57 57 48 390 -177 261 -140 101 238 -250 284 -65 174 -191 210 -206 -127 246 104 236 138 415
5879 415 -103 219 30 116 399 -142 142 -184 350 147 133 73 205 186 -297 90 -151 -70 -35 31 -69 31
5901 31 421 -59 405 -278 84 -52 -91 -209 56 303 -277 217 -169 136 -30 -145 166 4 -24 -161 206
5922B06l83L00o8k06J27k85L26k93K45k25J80J53k27L89n49M83p95Q57l43J24
5942A6p8P4J80l84M52m55L03k43L8J20K57j31o04Q31l70K4Q5l0J56k21K20l51
5964a11K72j74q8l8J99M8k63K73k76M90m68J48J93q0K2k69J95p7K30l91J31j44
5986a78l7M07m56K98m66N96J27l14K60n21L16k28K51k14M93m82Q0K29l77N17p17
6007d16L65j4l3L4L5M26q45M16J8K12l84P0M50m55N25o71L74m07L88n2k9L47l70
6030a6K90l73M79j86j8l5j69J37k69L31k1J96m89L67P7l58L57l26K65k79J43j96
6052i3Q2K70l42M19o02M57n01L64j46K23k37o1L57n40M76j61J33M8k62J76o39
6073e79P56n90O94m58j87M73j28J71m77N97p27L68Q6R4R2k94P8rO8o8N1p7n4J87
$$ plain form
5922 206 -177 123 55 -151 -24 -309 17 -276 -31 -256 -76 77 -150 239 -310 173 -622 235 -108 16
5942 16 -62 12 192 -192 260 -195 108 -135 -97 23 280 149 -455 376 6 30 115 85 241 20 240 -111
5964 -111 161 -13 -101 -139 60 108 -155 118 -158 332 -136 12 205 125 147 -122 73 -4 226 -165 -34 -178
5986 -178 -215 192 -264 34 -432 164 291 -23 237 -284 32 -196 55 -159 334 -148 -68 161 -216 301 -416
6007 -416 -51 -65 -98 -64 -29 397 -448 -32 -14 198 -186 -116 334 -121 404 -267 107 -300 88 36 7 354 -16
6030 -16 274 -99 380 194 176 141 -28 109 -160 171 150 346 -143 224 301 -57 300 -26 239 -40 103 -93
6052 -93 -11 259 -83 336 -266 191 -310 54 -92 131 -106 -167 190 -350 126 -35 98 146 -116 60 -579
6073 -579 177 -413 281 -177 -364 109 -19 152 -325 272 -455 -87 -1 93 185 -109 -31 -40 28 -40 11 -66 -120 67
6097F7k12O02n87K91k74K63o2l31M30l99N87j78j59k42M00j92K2J68j88L76k05
6118A77j40j38J12J63l48K39pL20n35J44L4p5j00l6M54m93L03m80L81j76J07J03
6140Ik21K81l23L35k23J05J42m59M50l26L50q0j11N1J04M6m62L47j37j12K34j10
6162a10P2j37J83k22L71rJ10l45K65r4j55L01mM1m03K51l28K78L2k08M58m12L57
6185B92m56L11l21m9N15k17J95k96J30lKj17J44Q4j10P0j88K88m62K25j31K8J97
6208A31l05J48k68M53j09O2k62L62j53l26L64n58K91k5K73j44j98M88n14K44k73
6229c19N46l16L1O3l35N72m18K85l94K23K76k26K25l74M09n17M21k13No1q7M08
6251B04l51L23m45L05k3k07N62j11Kl33L72o53N78j2l62L25k72O72o30n1J41J58
$$ plain form
6097 67 -145 457 -130 161 -113 150 88 -243 187 -212 375 197 38 -204 196 4 26 194 6 382 177
6118 177 37 -101 11 174 -174 65 58 378 -157 -13 21 -54 -154 -190 264 -229 74 -406 -25 -201 -94 9
6140 9 -212 69 -254 81 -142 -37 105 -354 96 -230 120 40 -71 -20 84 130 -332 15 -122 -234 0 -110
6162 -110 -38 -175 8 -214 157 148 258 -87 178 84 -71 230 226 267 -136 115 -213 65 97 -111 347 -65 292
6185 292 -164 147 -174 -223 292 75 270 -26 104 101 103 -14 130 214 104 174 -14 274 -188 37 -94 -66 131
6208 131 -174 -26 -294 159 50 112 -150 212 59 -267 97 -461 -170 -195 78 -66 -264 224 -290 -46 -319
6229 -319 227 -89 -58 5 -330 242 -176 109 -285 -62 214 -12 213 -161 248 -269 152 -61 -56 -117 -204 204
6251 204 -147 176 -269 36 13 -194 368 257 259 -74 298 -355 223 211 -151 174 -98 574 -56 -107 34 192
6273A92k05p1L8L8M12n06nJ27K11l02r1J71k03K05j50J08j15L99P9o02K83l14
6295c01K34j67J20r8K56J43p9j27K9j16q1J91J54l71M73o18L45k09K70p6Q0pj44
6318i9J97o9O8l20M56l39K10j36j09K43n85N69k26K03j26K99j7l3L78q83N36k85
6340f8rJ82J30J27l50L36l04O0o8J02Kl82L23l41M00k71J15p3J63P9k69J45l45
6363c16L20k26K52m7j35K33m93K73P2N8k43J11p4O5J69m4M12p97M47j63l9K34
6385F9j8Q0k14J29k67L93q6p3K01j75j18k08P16m82j03o4N0P4j2M25o92N16j83
6408d2M38m99K34r6k51L72k62K28q3j57J21J37Nm42L39j64K66o1j20J00l25P02
6430D40n05J59j90L7j73K43j9o2M36l88L7l20N11l16J12pm01M57k77M94n64kL94
$$ plain form
6273 192 -13 -84 -46 -8 404 -102 -107 20 231 -71 -162 9 -194 11 -139 -31 -146 253 332 -270 13 -301
6295 -301 -67 -234 -114 -212 44 187 108 -19 10 -106 -187 4 158 -213 260 -358 -13 -222 48 -28 52 45 -99
6318 -99 98 29 97 -223 233 -106 104 -32 -141 102 -483 86 -140 63 -63 236 219 186 564 -319 217 -68
6340 -68 -77 105 235 362 12 348 44 104 36 138 140 -242 81 -260 140 -131 -16 -89 74 153 -116 29 -316
6363 -316 4 -222 30 -17 -152 81 -412 -139 -67 -9 -252 -141 -215 -150 19 -25 387 -410 37 -126 -165 69
6385 69 51 131 -83 46 -221 172 86 13 214 39 -79 -287 429 -53 -156 -220 -170 -96 -108 317 -375 141 -42
6408 -42 396 -103 131 35 -216 156 -106 122 39 -118 3 140 145 -297 42 -122 144 83 -37 63 -262 440
6430 440 -65 94 -96 -59 -232 11 -8 -70 366 -22 15 -305 206 -110 2 -5 -406 51 -226 268 -296 -298 96
6453I6l20K55k44L87m69K46r7p5O9L5MP7L40m71R0J8n0K6j67N86l83J18j74J53
6477E0O1q8k64J38J88j58K26k33J96k6k84M25m39K59k2Q3j3J58J91o57M57m57
6499b09M40l02K53k81l6K53j1J41j88K68l52K08l52N5M68l12J30k76K14l79J97
6520g1Q2m00K04N7M42o70M02P1k65j0K51j65m0K2r8L34l64J84J78j95K04l97L39
6543I5l47M25j82R3M3k85J52j46M99l47K67l31R1J96k79K67k78K76k40j28K22
6564F3j43L99n02M09n07N49k87J76m0j91J07k09L75m70K63J25n6mJj2k64L81l25
6587a62J52K08l03P6k51N36n07M46n64K74J20k02K98l97L53j24k9q6K5J71O2j15
6609a9m25N31k81M71l68Q6ok63M33k61J08l16N50l19r4M31m33K38j42J79k02L71
$$ plain form
6453 96 -224 31 -213 174 -295 -49 -146 -221 -152 -117 -113 -36 304 -167 -77 -59 -109 -83 -250 336 -47 71 -103 50
6477 50 111 23 -241 -103 85 -73 153 -80 116 90 -194 231 -208 51 29 112 99 257 448 -209 248 -209
6499 -209 231 -71 182 -99 -135 118 107 248 60 328 -24 184 -168 -113 355 43 173 -103 111 -268 -71
6520 -71 11 -389 -185 -128 314 -356 46 117 -148 -158 93 -72 -112 -90 -188 146 -218 -34 144 -51 153 -244 95
6543 95 -252 173 -9 84 127 -158 -6 -152 347 0 267 -64 27 223 -56 211 -67 209 -31 -159 63
6564 63 -80 319 -183 226 -281 268 -19 157 117 -74 33 -176 199 -271 -8 117 61 57 58 46 -218 163 -162
6587 -162 -10 198 -105 -29 -280 256 -251 195 -369 -95 25 -177 121 -276 77 -47 -76 -162 -137 34 96 -19
6609 -19 -444 87 -194 277 -91 -5 -11 -274 159 -102 6 -310 240 -79 -173 258 -175 63 -79 100 -102 269
6631B69l07l45N54k73L99m42M69l42J46k12j75N49k21K1m11L03K16j24K3j11K4
6652A0j93L01k64K20j28j15L09k42M27n26K62P4J38l55L1J71o74O81j78M5O7m7
6674A4j04r9K87j77k2p6L54m05L86j85j08J78j35K12q1q5j65O1L43m93K92j36
6696a44O6J21j0R1j58J88m6m5k64L92l26K77L26k52r6l60M45j79qJ86j79n7K40
6719B08j53o1O3k52J16J8P5J89l18K88m17J95L9j35L0m7J05j9J66k05L5OJ33j53
6743i4k11N33k23m9k21J27K2l0K08j83M21l47R2k11L57l63j30L11j46K44k36L35
6765B06l87L15M5m5j85j67M89n60L90j36J10M00k27k26l13N20j85K58q2n01L30
6786D9k6J51m36N74k90J91l32K06J30k52J27k45J37l1O3R4j58J35n3L8r1J24j77
$$ plain form
6631 269 -38 -383 171 -102 297 -145 324 -18 128 -84 -259 290 69 90 -321 -18 198 74 97 -14 10
6652 10 -183 118 -146 74 -54 -169 140 -102 325 -201 61 135 273 -82 -51 120 -554 127 -51 -6 61 14
6674 14 -90 -189 98 -79 -101 -177 177 -228 158 -27 -135 43 -92 120 39 -46 -211 -150 193 -300 -8 -144
6696 -144 -78 43 33 124 -34 154 108 63 -201 191 -135 142 468 216 120 -240 205 26 18 204 25 -32 208
6719 208 55 -6 57 -195 -79 -61 14 203 -115 173 -244 -49 -10 -145 -115 -162 -57 -76 90 -115 -80 -74 59 -94
6743 -94 -305 228 5 -44 -265 -138 -116 -146 62 -121 300 -47 45 -166 191 -172 -302 9 -137 107 -129 206
6765 206 -181 134 179 134 -51 -218 271 -289 101 -35 75 475 248 22 -291 229 44 302 220 -281 49
6786 49 23 174 -262 312 22 213 -119 87 217 -35 92 -153 -16 -47 16 110 -48 87 34 72 -19 105 -72
6809g2P9j30R3P6k85J15JL02p6Qj05r9j18j00N55l39K45j78J42k55k73O14k82
6832h2L3K94q1j87K26J03k95M1k52K16J12j9q6j39J40k03j6O1O8J43K02j79k78
6855a78L87n36N05k15J03j83J12O4j00K46j61J63m17O95n72L0J58l38M69q8p6
6876F8j86R0K28j48j27Mm2M8J95j21k93M32k32J57k98L46l96K90R7k28K27k03
6898i2J26n07N80J62k82k96M04l61M75j83p21R93m99L28k66K10k45J69n6O3j64
6919a62J97k7N3k12K04q6K33j49ml9j00J19k24K13j6J5j06L16l35K10k94NK73
6942H4k41K56n6j11J68p8O1m07N05k96Q0J1L3P1K6l6l43K34k45N96k82k91K47
6965a4k48L99l25J22j19L31j97PK68m14M12m51N90m24Q7j62K16m8l98O19n15K14
$$ plain form
6809 -72 7 -123 -30 46 -239 -124 -123 179 103 111 6 -93 -211 -311 244 -95 150 -28 114 -141 -414 200 -82
6832 -82 -49 245 164 -23 203 306 11 52 -200 16 128 109 23 -116 24 -179 -195 -134 -66 77 279 100 -178
6855 -178 209 -327 178 -37 66 -117 -5 59 -41 205 44 207 -210 485 -87 -57 101 -237 232 144 68
6876 68 -118 -28 200 52 -75 -71 -113 -65 130 9 -284 148 -84 73 -225 121 -275 15 112 -116 111 -92
6898 -92 34 -473 107 269 -13 -309 95 -266 209 26 -695 298 -201 127 -139 71 -174 -5 -61 2 -162
6919 -162 35 8 61 -151 53 -33 200 51 47 8 -92 27 -197 16 0 15 -91 225 -110 100 -194 -189 84
6942 84 -157 99 43 -68 100 22 83 -324 181 -115 -35 -24 9 80 106 70 -273 -39 -284 312 30 -261 -14
6965 -14 -262 137 -188 -66 -185 146 -51 -44 224 -190 222 -229 361 -63 24 -138 78 30 -368 251 -264 -50
6987e0q3L2j13N7K63l47L07L4j15j38K99M3k29K51m60L56l4K83m00K6J80k06J16
7010G2j89J54k18K07O8k38L21m82J63J43R8j93O3P1k27L27j99L58m27L11n0j23
7032A0J37k74K41l64M05k36J88N1k30J70k77L09n08L21r8J01r1L8J04l13K14k49
7054c51L72m33N53k36J04J21j98J96k23K16p8o4K98k41K09n63N37m73O20l76r3
7075a03L59m96J72j68J63o0P5j65M04j55m46K71J96pR5M3l07j29M70k36J28m74
7097c70M26j79r0K88P6j28j32M28l48J61j36k53K94k40K54l33M03p4j39P4j45
7118a63L40m26J65K1J62k80L14k33j54O08m25J72k05K01j81j40p0L8L46l95K81
7139b4k44O07L9n53M24r7j71l69N34j36J69j39p2K83l98M31m81M67l79J51q9K6
$$ plain form
6987 -50 -133 -101 -214 -157 106 -241 66 100 -15 -153 146 189 -40 211 -249 107 73 356 -44 -18 162 -44 72
7010 72 -117 37 -181 26 94 -144 177 -305 -142 1 99 -94 -31 40 -187 140 -59 299 -128 183 133 10
7032 10 147 -127 114 -250 155 -81 107 158 -72 98 -179 130 -378 -57 -155 -54 -145 -107 -3 -316 -102 -351
7054 -351 21 -412 141 -95 9 130 -68 128 -95 121 43 -21 277 36 245 -318 219 -254 366 -10 -103
7075 -103 256 -240 -68 -236 -73 -133 -58 -223 181 26 -420 -149 47 40 135 178 -129 -258 212 -24 104 -370
7097 -370 56 -123 -213 75 151 23 -109 319 -29 132 -4 -257 37 -203 51 -282 121 47 -92 -18 -163
7118 -163 177 -249 -84 -63 99 -181 133 -100 -254 354 -71 101 -104 97 -84 -224 -294 -256 90 -305 -24
7139 -24 -268 339 378 -175 249 152 -19 -388 146 10 179 40 -32 251 -147 284 -197 270 -109 42 -47 -21
7161b1M00n95K37K27o8m14M57l24l6K94l68L08j5J23k49K09l7j77K29m72K10P1
7183a1K26k92R0Q9l03M37l98N10n29L89j4k85K76l00K42j75K89m94K54Q1k21J81
7205D2k07P0j41L01k35n7K90r7n4p2K96l72O6L72m11M85o06M89l88L60oj57J46
7228A14Q4n1m52M69q5O9j52L30k38N2O2m68O02j72j59O2l4p1J89J0j09O3j72N5
7252bJ2K14j65k52M87l05K22k42Ko2k48N45k87K28n1J08l46J32M7k09M1J74k8
7275A5j52M25j21k88M8%J65k78K63j12k4L20j61m5Qj5l00L60j11j08lk06M15j70
7299g5L83n78K62J71k51M79o30K27R9n6k23K10Q8k16J97k74M54k43N8k44M51k79
7321A0j85N75n76L20j35K06j16k13J59j0j45r1L81k41K13j62k9K51m95L42k26
$$ plain form
7161 -21 379 -216 21 248 180 -234 223 -101 -137 157 -211 97 82 205 -44 165 128 -49 180 -292 -82 -11
7183 -11 215 -77 13 102 -201 236 -162 348 -181 208 194 -91 185 -115 127 -48 241 -253 1 82 -139 42
7205 42 -165 -95 -236 65 -170 -227 63 -34 -88 -160 136 -236 -170 202 -209 276 -330 159 -229 131 125 -32 114
7228 114 198 147 -305 164 79 148 -4 326 88 140 202 -266 336 164 5 67 33 -38 151 161 52 115 -57 -2
7252 -2 10 224 59 -193 294 -11 211 -31 -29 -91 -339 206 -81 147 96 204 -142 -10 37 -172 -131 43 15
7275 15 -137 288 167 -121 -73 -73 92 -186 77 -35 -59 261 100 55 63 48 -252 108 -3 -111 -114 -320 95 -75
7299 -75 308 -270 -8 163 -88 391 -239 -12 87 31 -192 18 106 -110 87 -187 267 24 82 -162 289 10
7321 10 -175 400 -176 144 9 215 99 -114 45 35 -110 -201 180 -61 152 -10 -39 212 -283 59 -167
7342a67J95j00K75q2k4k9k65J56k62J53m8J54n4O9J36l02K08j11J85k25J95n7
7364@l1Qo2L45o78L19L74l84L16k64K51n56L42J60J25k39J62l2l14L95l30L68
7386B75l83J86N8j63J08l05N76n12M01j93N4Jp3K07j56J19k15J68o9J95j73k41
7408a35O7J4K04k77K17j78o4K62j97J39p9r9k33L24j25K07k22oL59l33K08k78
7430b25L67j21o8J11j82J58l50K86L0j86J44j32K16k21J65M7O1k70O7K24m69K00
7452a48r0K53j38R9J75l83L85j94J26k46M10l77K47J21j55j30o4j5r0N25j63k92
7474a44O1M0K21r2o3q6l6J88j33j03J86J82l63K80l12J52j22N3k5K7L24l80R0
7497e5j0J78j89MK74l93K01l4R8k32p4R3K19n4l97L35j6J42q1M1K04m00L34k16
$$ plain form
7342 -167 28 -72 203 121 97 68 -197 -41 -303 -150 -198 -44 -98 -29 107 -195 13 -98 87 -138 57 0
7364 0 -31 -23 -85 260 -418 -99 275 -109 207 -57 194 -362 -20 140 265 26 188 156 -158 237 -93 275
7386 275 -108 78 136 -27 81 -224 352 -160 241 48 102 103 30 237 81 200 -15 153 84 279 106 -135
7408 -135 -68 -54 150 -127 90 -88 -152 110 -87 52 -27 -126 -359 -35 -160 47 -175 -181 178 -155 53 -225
7430 -225 142 21 -47 64 -118 40 -310 -24 6 -180 -36 -168 48 -173 -8 39 100 -170 -103 121 -348 -148
7452 -148 -238 15 -123 -24 151 -232 153 -41 85 -161 249 -128 119 240 85 -45 -109 -124 -214 311 148 -144
7474 -144 -83 -43 178 86 23 -63 -99 89 -44 -147 39 221 -142 138 -174 -22 -144 -91 -116 -89 235 -145 -55
7497 -55 -65 113 -76 -72 202 -191 10 -24 74 -158 -232 -139 80 26 -371 -36 -52 90 9 50 254 -146 188 -28
7521b8j1K11m5j87J05J90k69j06l36M57k9m1K89n5Q6j13O1l69L34l10K19p9j28
7544a54K42O7k1l05K78j2J08l4j54J14l3J07m74L77p6K0J84k92J42j90J76j68
7566i8m5J07p9L21m36K10J37l65L24j21L12l69J90k20n5L18J10l41J12k88K60
7587a6K72l78L43l65L44j87k65L35k55K47k51Q5Q2K97j75l49L06r7J66k95L70
7608B14m20L02J43k16mM3J93m67M23J4j20o0j46K16p1K6k78N02l26r3L46l44J09
7631a4k58N37l4k18J58k53M5K1or2N5k16K11K26k26K05n8j34Q0J47k76k2R7q9
7655a14j1M8J0r9L40q4j28j3l6j02M1K36n4N7J04r8J25l62J45k95M52k70L88j46
7679A34k46K21K2Nj52K3K15l75L45j33L0j71K3pO6p1L6J29j51P1j4J45j87l1J9
$$ plain form
7521 -28 -39 172 127 -60 45 235 -34 -140 -476 -19 -48 -89 200 145 231 118 179 -190 144 -166 53 -26 -154
7544 -154 88 155 134 -171 107 95 203 169 15 129 96 203 -271 106 30 50 234 -58 84 -106 70 -98
7566 -98 -143 -36 -115 206 -230 -20 117 -248 76 -45 267 -102 88 -132 -187 131 241 -100 12 -276 -16
7587 -16 256 -122 221 -144 200 13 -252 83 -172 75 -176 -91 -9 288 113 -236 70 -27 139 -156 214
7608 214 -206 96 239 23 19 62 255 -212 211 225 105 45 -101 115 44 70 -208 294 -32 -125 221 -123 -14
7631 -14 -272 265 231 13 171 -82 -37 -16 -22 -114 -59 -275 -64 162 -64 141 83 -51 29 176 -100 -122 -25 -114
7655 -114 -125 -77 -67 -166 174 90 -38 -51 -87 -189 -148 88 34 91 195 97 222 -140 5 -290 162 -108 280 134
7679 134 -112 109 131 136 -16 7 222 -153 192 59 89 -82 -59 -66 0 -71 -35 94 -57 14 0 145 -42 -73 -54
7704e4N5J00l29L36j93L81l02m5K06n07P33l95J64k12L15j98j59J68k88K17l04
7725c11N25l82L0J88j05K97k38J38l67M08j17r8qM4J70k84K39m04N96m62K68k09
7747h2J77J4j86L33l21p4J17K0R8k5L40n75L95j53J09l23L09o4l2J34l84N14m25
7770h4K8N0J54j99J49Q5j43p1K06k38P0j28K26j83R0k80L03N4Q9Lk22J3j12L70
7794B30k55P5j01J70k32r5L48k30J18j00J69k5k33K64j45J25j78K87k94K59k7
7815A30l58J42j30L42p9L8P9j96J75k26M03m46J26QJ01o2J83o5o5j48p7L34j11
7838I8j61J11O3j94J04P8k41J40J36k60L37m72K89l0K32l31L71l23O3k4l2J53
7860A07k35M7J24n8O7m3K02k59p0j9K58k58l8K56k3o4pJ67k02N9o0O4k7K11k45
$$ plain form
7704 -54 1 101 -228 108 -85 296 -6 -51 155 -352 381 -14 150 -62 253 55 -104 64 -224 -7 -311
7725 -311 214 -168 -138 50 -55 242 4 142 -225 183 66 -32 -40 4 174 -110 129 -275 321 -141 127 -82
7747 -82 95 109 -77 256 -65 -139 -22 -2 96 71 411 -164 231 78 187 -136 173 109 77 211 -173 341 -84
7770 -84 -56 -6 148 -51 98 183 40 -31 175 -63 7 -121 105 -78 12 -268 35 89 178 181 -41 -28 -140 230
7794 230 -25 50 -51 119 -113 -208 140 -90 28 -72 97 72 -161 103 -42 83 -95 192 -102 157 130
7815 130 -228 -86 -216 126 47 85 164 -32 143 -83 320 -126 0 8 109 47 230 165 100 -48 -125 209 98
7838 98 -63 48 111 -83 21 99 -142 -2 134 -126 211 -261 28 -2 230 -101 270 -53 10 -14 -46 107
7860 107 -128 -81 43 -15 52 9 211 -48 -118 -137 121 -137 -175 81 58 -6 -13 154 -48 11 -49 15 -12 199 -46
7885d6j48M00l77L19l12K48j50l6K70l18K74k49K48j41J81j05l97J37R0K43p4
7906E7q5J06j2J07l34K38J06j58n2p4J72P7j19p6J74l60M53k69M1K19k13K14k17
7929eK51n2k07k08L96l73K44J70l02K07k95K63l23L37l9j75J99k77L9MJ21j81
7951b06j0J91j66M03l26J19l9j85J73j80J19L1J95k59J87k35L3L74m83M98k24
7972A0j68J14J64o4j22Q9q2J77l47L79j36j37%p1J86j74L80k06R0j94J07K04j47
7995E2K2lJ37j77L66l94J7J36k16J2k0K80k02N9p6J91k65J0L89l88J68k08R1j61
8019a80J71Q3k81L85M2r7l03M85l35J45j21m8J10p0L0L1j29L1L70k30k35R1J20
8042F5J63k13K9q0k01M81l47k0K85l83K56Ml2k22K82o4P0k0j68N8P5J3M5l11R9
$$ plain form
7885 -46 -194 206 -171 148 -164 84 -66 -102 168 -150 124 -125 123 -18 163 58 -339 -202 -112 131 57
7906 57 -28 78 66 173 -161 77 183 25 -27 -101 71 148 29 -47 127 -233 220 -49 -8 211 -2 212 -5
7929 -5 246 194 -13 -221 175 -198 46 216 -86 121 -174 89 -234 103 64 -111 88 -189 -150 -146 -25 -206
7951 -206 -216 -25 -191 212 -114 5 -34 -219 -46 -226 -107 -76 119 -140 47 -188 -155 219 -264 234 10
7972 10 -158 -44 120 56 -66 23 -59 118 -229 150 14 -123 -123 -194 -8 -182 198 -8 82 -112 -5 199 52
7995 52 74 71 208 31 397 3 20 156 -60 -48 -68 212 10 69 -7 184 -81 -71 318 -70 98 -110 -19 -180
8019 -180 -9 74 -207 178 220 123 -180 305 -30 115 -6 -54 56 -14 16 47 -82 -51 319 89 -146 -55 65
8042 65 228 15 44 -36 -237 244 -103 -123 162 -221 35 39 7 -215 67 3 73 53 -115 -57 18 31 76 -235 -136
8067a36K30q4Q2j24r0L04j43k02J64k53K03K80l52J0K92k87O1R2J23J21k13Qr2
8090fL39n96Q1K53N7mj57J62k02L00j96J56l29J42K35l24J49j21k7l03K79J30
8112A8J55j34k88P8Q0M02n19q0L00j5m2R2N6l02L90k24Q0o6o6K38j90J22k63K4
8136a54K43k14P3r3J28J21J6M4l6k95L66j06j74J95m24M27j97Q0K41j81m5J9R3
8159A27J9J5J15k87J42k55j06K38K69m76J25%q0L24l48L29k99L1J20N4J2k33j01
8182b65j1K66j33J92K59p7j81l0k55
$$ plain form
8067 -136 94 10 92 -32 -122 182 39 -163 1 -252 -49 231 -121 -111 181 -106 -45 47 170 291 78 86 -6
8090 -6 333 -263 -182 71 128 124 -33 129 -73 227 31 187 -142 0 235 -89 60 -61 -88 -391 -112 18
8112 18 173 39 -249 -171 -91 311 -208 -288 12 -3 -45 47 103 -199 191 -33 47 -19 -85 153 -37 85 -178 -154
8136 -154 89 -125 -52 -145 -17 104 120 164 128 -167 199 93 -81 114 -310 117 -80 0 241 60 15 34 127
8159 127 146 161 276 -11 131 -124 -230 8 277 -199 -74 -74 -154 170 -178 151 -148 -117 3 57 69 -164 -265
8182 -265 -276 -10 -143 49 308 231 50 20 -235
8191b35
$$ Imaginary data points
##PAGE= N=2
##DATA TABLE= (X++(I..I)), XYDATA
0@%%%%%%%%%%qJ6j6J8k6L2m0N6o6P4r0J13j35J60j87K14k51K91l34L86m42N02
32B67n73O52p33Q23r27J040j162J297j444J605j781J973k181K408k659K933l232
49a694L559l918M316m757N248n795O410p108P905q833R923j1220J2801j4776J7321
64I382k0740K5599l3090M6241p5944K59124O0740l72283K03898R911J7985k1477
76A09346l1985m0395R7950M1043o6065j02514R2235k8547q0749J94301o0951j59198
88c5529Q8232J06421j06974q6014Q4420m5086O6002K3297o7467n3991N5820K4713
100E3844j10997O9907M6681j17243L3358J58826j58288r0228J09904j2599K2822
111E987k7425P286l9588N7120L9582j60005M3980R9968p7305j8631J36502q6884
$$ plain form
0 0 0 0 0 0 0 0 0 0 0 0 -8 8 -8 10 -16 16 -24 32 -34 40 -50 63 -72 88 -99 115 -136 155 -179 207 -235 267
32 267 -306 346 -387 436 -491 549 -613 684 -760 845 -936 1037 -1144 1264 -1395 1538 -1694
49 -1694 1865 -2053 2263 -2494 2754 -3041 3369 -3739 4166 -4667 5256 -5964 6837 -7939 9382
64 9382 -11358 14241 -18849 27392 -48552 210572 271312 -100971 102927 112838 130823 109346
76 109346 77361 36966 134916 175959 109894 7380 99615 71068 -9681 184620 123669 -35529
88 -35529 52703 159124 52150 -33864 50556 5470 71472 94769 27302 -26689 29131 53844
100 53844 -57153 12754 59435 -57808 -24450 134376 -23912 -114140 -4236 -16835 5987
111 5987 -21438 -14152 -53740 3380 42962 -117043 -73063 26905 -50400 -69031 67471 -19413
123a9413r1164Q0823L1169l9569k5486M6653m0086Q6835J2393j42647J452J08056
135I016J9962j11008P4157J2245n7626O7287J691j03625J0216J05700l3174o0
147e219m094k6374j9928P4978q79j47926J12479O6310p2596j457K7495n5525j2533
160f5269Q5031m0871k5281L5544J8678n2686M5501K459j16355P5913Q2398m8104
172c042o6250P5535j4494m5586O1595m9472j9885N9206M3597p7513P458M5584
184A6733o9136M674P2047k0825p1997J01298p869o0825L7942j6847k4208K6790
196a2223P1378p2011j0943O0859l4259k9909M3123l440o5940J00166J8852p8631
208a2978j260L8540j9233j3332N4649o0396J3042O6692k3141p4622K8789M9246
$$ plain form
123 -19413 -110577 -29754 1415 -38154 -63640 -16987 -57073 29762 42155 -100492 -99040 9016
135 9016 28978 -82030 -7873 4372 -53254 14033 15724 -87901 -77685 28015 -5159 -5219
147 -5219 -9313 -35687 -55615 19363 18484 -129442 -16963 49347 -23249 -24706 2789 -52736 -65269
160 -65269 19762 -21109 -46390 -10846 7832 -44854 647 3106 -113249 -37336 45062 -3042
172 -3042 -69292 6243 -8251 -53837 7758 -41714 -61599 -2393 41204 -36309 -28851 16733
184 16733 -52403 -47729 24318 3493 -68504 32794 24925 -35900 2042 -14805 -39013 -12223
196 -12223 59155 -12856 -23799 37060 2801 -27108 16015 12575 -53365 46801 65653 -12978
208 -12978 -14238 24302 5069 -8263 46386 -14010 -968 65724 42583 -32039 -3250 45996
220D5996o9734M6468L1431m9824q790N6865l6954m3369N8942k7854m227M5611
232D4561J1485q4439J8399O6048p2497N520L9558j4333k1905O0701l7039o0149
244d4090N7672J613k4433R555M2629n6282O177N1117o1156k2860N2509J4205n5620
257b8964N5455r85n7233K8799J3122l1587k669O2332m7356n789N0596l3461n1797
270d9537M0077M2907o7543L9398K1980m0780P885K5165m0886k1823P8038k7578
282G303k6038L4993J1106n6990J4807M6446o5932K8262L9754k6109k1814M0157
294B5945k2987m5339O0759l903k8936J9529L8300n7564K64M6627n6051J914M5158
307B3716L482m7913M3065k329n2576L8715N193k9179Q209N6290m9393j7803M5294
$$ plain form
220 45996 -23738 22730 54161 4337 -4453 52412 15458 -27911 31031 3177 -1050 44561
232 44561 56046 -28393 -9994 56054 -16443 -10923 28635 14302 -7603 53098 16059 -44090
244 -44090 13582 15195 -9238 317 42946 -13336 -7159 43958 -17198 -40058 12451 26656 -28964
257 -28964 26491 25506 -31727 -2928 10194 -21393 -24062 38270 -9086 -14875 35721 2260 -49537
270 -49537 -9460 33447 -34096 5302 27282 -13498 -5613 19552 -21334 -43157 34881 7303
282 7303 -18735 16258 27364 -29626 -14819 31627 -34305 -6043 33711 7602 -14212 25945
294 25945 2958 -42381 18378 14475 -14461 5068 43368 -14196 -13932 32695 -23356 -21442 23716
307 23716 27198 -20715 22350 20021 -32555 6160 11353 -17826 -9617 46673 -2720 -20523 24771
320B4771k8765k9052L3671K6330n3611M1431Q633m9909J8235J9740k9296k0567
332c8389P0915k4315l1176L2376n760l8720K1344L3714n6686L0798L1484l4455
344h870j8078L2951j7714l7936O4764j1488k7126K0832J7469m3568j65M5389n1050
357c4590Q513M3795j1437l7443L4377p210m2251M5652K843k6843N720M8835m3281
370a3320k2511M4696l3564m404L5708N317m4853L5969J3012n1002J7052K1384
382C484k0712q810N8236l3830k7110L5370j0903k2872J8893K8366n0332L3408
394C188K9156m8396p932K9869p139k3888N0333j6857k5659L0099J0409m4232K351
407a8698M5272l9015J9532K5325k6826k2093L4635K148m6924M2219O513k1222
$$ plain form
320 24771 -3994 -33046 625 26955 -26656 14775 23408 -26501 -8266 11474 -17822 -38389
332 -38389 32526 8211 -22965 9411 3651 -35069 -13725 19989 -36697 -5899 25585 -8870
344 -8870 -26948 6003 -11711 -49647 15117 3629 -23497 -2665 14804 -28764 -28929 16460 -34590
357 -34590 -26077 17718 6281 -31162 3215 -3995 -46246 -594 2249 -24594 -18874 29961 -13320
370 -13320 -35831 8865 -24699 -29103 6605 11922 -32931 3038 16050 -34952 -17900 3484
382 3484 -17228 -26038 32198 -1632 -28742 6628 -4275 -27147 -8254 20112 -30220 3188
394 3188 32344 -16052 -23984 5885 -1254 -25142 25191 8334 -17325 12774 23183 -21049 -18698
407 -18698 26574 -12441 7091 32416 5590 -16503 18132 20280 -26644 15575 22088 866
419H66J4612K3645m5441j1001M9723k7150m300K5537q16l2435L6371K928n5978
432b3439L0284K2761j3076j0315L4973k9651k0600M5536k1774k5226K6342K4783
444D0598l7823K2756Q889m5052J1875L0377j1752l1565M9562j1073k6792K6850
456B6850r364k9307J5236M0935m0876O949K3473k7387q733K7582j0209l8374N1606
469B8381N725k9306K777J4262k5688l095M2505m1339K371L3989j0450k9540J8713
482I305L773l9670L8350J5251k9426q973L6056k3226k1305L1956k6032k531L0148
495A3676P294m6459J6594K1336m1608J4893J8592j7046j4318M3648j6949l5214
507c5561K4025k445j3521J5087K1544m5152J8466K7835l8190q711K2042L448k6101
$$ plain form
419 866 15478 39123 -6318 -17319 32404 5254 954 26491 25675 -6760 29611 32539 -23439
432 -23439 6845 29606 16530 6215 41188 11537 -9063 36473 14699 -10527 15815 40598
444 40598 2775 25531 34420 -10632 1243 31620 19868 -11697 37865 26792 0 26850
456 26850 17486 -11821 3415 44350 3474 10423 33896 6509 -2224 25358 15149 -23225 28381
469 28381 34106 4800 7577 21839 -3849 -6944 35561 -5778 -3407 30582 20132 -9408 9305
482 9305 13078 -26592 11758 27009 -2417 -11390 24666 1440 -19865 12091 -13941 -16472 13676
495 13676 20970 -25489 -8895 12441 -29167 -14274 4318 -12728 -27046 16602 -347 -35561
507 -35561 -11536 -13981 -27502 -12415 9129 -36023 -17557 10278 -27912 -36623 -14581 -11133 -37234
520c7234M0085n850l4439J8684J1633k2706k268L3364l0533J0890K7445k4958
532a5887k7095K8227J5926l9628L0980Q381k1155N772J9641k5850j5703M2279
544E888j9157l444K4631n566l3322K4990J9227m4891J5905K4083o914j3808K5210
557A2832k1030k1196M1496j3403j7341J7483K0154l2012J0060J8881l8048M382
569a7742L0202m47l0594L0053k934k2671K1167n382j9530J1580L7085l6607j504
582g324K6071k2173j1039K1499P787l4252L1958R829k5198L884R213j8172j03
595h020L9842l2289o553L0262m369k9683J2418J9231l2881K3331J4784j8979o767
608C27K0854j5780j6367L7028j9170j1309K5339J1096l8506M829K6287k9259P346
$$ plain form
520 -37234 2851 -2999 -37438 -18754 -7121 -29827 -32095 1269 -29264 -18374 9071 -15887
532 -15887 -42982 -14755 1171 -38457 -7477 904 -20251 -14479 5162 -20688 -36391 5888
544 5888 -13269 -16713 7918 2352 -30970 -5980 13247 -31644 -15739 8344 1430 -12378 12832
557 12832 -8198 -29394 12102 -1301 -18642 -1159 18995 -13017 -2957 15924 -22124 -17742
569 -17742 12460 12013 -18581 11472 8538 -14133 7034 1652 -17878 -6298 30787 -5820 -7324
582 -7324 18747 -3426 -14465 7034 14821 -19431 12527 22356 -2842 1042 10255 -7917 -8020
595 -8020 31822 -467 -7020 23242 18873 -10810 1608 20839 -12042 11289 26073 7094 327
608 327 21181 5401 -10966 26062 6892 -4417 20922 32018 -6488 -1659 24628 -4631 2715
621B715J6403n347j7321K7114r081k8696K6848m787j3121J4478K2287l9355m86
634h349L3325k3278j4351J4222J2523k0082K3595p503k8592K0966Q946k0508m356
647a3442L7295k7314o295K7653j5823k4727J5691K4421k8383J3593M934j6729
659i126Q610J2588k5370j2800M7142j5581j7573J7017N716k6010O182K5097l0820
672a4928R283J6749p076q689J4390j5442j7802M0080q163k3559J3097K6397k9976
685e639p436K4024k0113J917J4294K889j8986J9679o149k5900K9395J127k4481
698a5379M722L8586k5767j8147K1251p447p425J0341Q936k5553K3829M790k6244
711a3507R545Q814j6019n645M2444k1879k4015K2607P516j8578k513J5563j7653
$$ plain form
621 2715 19118 13771 -3550 23564 14483 -14213 12635 7848 -5273 9205 31492 -7863 -8349
634 -8349 24976 1698 -12653 1569 14092 -5990 17605 10102 -18490 2476 11422 -9086 -13442
647 -13442 23853 -3461 -9756 17897 2074 -22653 -6962 17459 -10924 2669 7603 -9126
659 -9126 -516 12072 -13298 -26098 21044 5463 -12110 4907 10623 -15387 -9205 15892 -14928
672 -14928 -5645 11104 4028 -4661 9729 -5713 -23515 16565 8402 -15157 -2060 24337 -5639
685 -5639 -13075 10949 -9164 -7247 7047 9936 -9050 10629 4480 -21420 7975 9102 -15379
698 -15379 -10657 27929 2162 -15985 5266 -2181 -9606 735 9671 -15882 7947 12737 -13507
711 -13507 -3962 4852 -11167 -16812 25632 3753 -20262 2345 9861 -8717 -11230 4333 -13320
724a3320K1275P324k4801m859K3601q897k2886L5809j0099j5976J5897J3925k6499
737i506r456K5979j2169O950O826j2424r021K8705q573l4657K7644R529j2369
750b542j823K1083k3166q791K6964j5854m301R667N662j5647K0132k268l3660
763b4544J9167J9095j5593j4128L1002j3650j1738J7231r187j1513Q381J8865
775A3388k3262J4143N795k5975P442K0341j2865k3664L4199M51j5473M774J668
788I62j4235O901K1840k8416R006J4988j1013r410J5557m838k5663L3302N780
801A4761j9211j344J5168j2358l046J7849k2780M242K1191N12k6341J4841O472
814I956k4657K1977N475j5063m308K7405j2501j6666J5846r112p88J4781N822
$$ plain form
724 -13320 7955 15279 -9522 -14381 9220 323 -22563 13246 3147 -12829 3068 16993 -9506
737 -9506 -18962 7017 -5152 1798 8624 -3800 -12821 15884 7311 -27346 298 9827 -2542
750 -2542 -4365 16718 -6448 -15239 11725 -4129 -8430 1237 6899 -8748 11384 9116 -24544
763 -24544 -5377 13718 -1875 -16003 14999 1349 -10389 6842 -2345 -13858 -5477 13388
775 13388 -9874 4269 10064 -15911 -8469 11872 -993 -24657 9542 9993 -5480 -706 962
788 962 -13273 -6372 15468 -12948 -3942 11046 33 -9377 6180 1342 -24321 8981 14761
801 14761 -4450 -5794 9374 -2984 -6030 11819 -10961 -6719 14472 14984 -11357 3484 9956
814 9956 -14701 7276 12751 -2312 -6620 20785 8284 -8382 7464 -1648 -2436 12345 18167
827A8167k9510J7134J4219k5074J573J2107l186j2008K8337j1817j8620J5272
839F594j19r359L491J5149k3975J1858J7329k1273j2509J7137M123j8961K3099
852A2584o365j3413J0125Q499j8205o635K5503j7694M390J3819j1493j7142J8086
865B059P716k6983J6232O122p774k36J3592j8997r609K6946j2096m908J0077N132
879G273j9761J3308R704k9049R371J5349l348j1477J7282j2090r946K0554p747
892e77j2490P767K0437k2594N164J0358j9049J249J4908q94j8905K2169k920j4208
906i585J0707o97j3434L807K4874k2613J35J3481q572j0025J0473M508k1523K1494
920C030N251j4882j048J0468j1787m268K4012j8547l326J5102J607j9631P845
$$ plain form
827 18167 -11343 5791 20010 -5064 -3491 8616 5430 -6578 21759 9942 -8678 6594
839 6594 6475 -2884 607 15756 -8219 3639 20968 -305 -12814 4323 8446 -10515 12584
852 12584 6219 -7194 2931 11430 -6775 -13410 12093 -5601 -1211 12608 1115 -16027 2059
865 2059 9775 -17208 -976 5146 -2628 -2864 10728 -8269 -17878 9068 -3028 -7936 2141 7273
879 7273 -12488 820 10524 -18525 -9154 6195 2847 -8630 8652 -3438 -13384 7170 -577
892 -577 -13067 -5300 15137 -7457 -2293 8065 -10984 -9735 5173 4279 -14626 7543 4623 -9585
906 -9585 1122 425 -13009 -9202 15672 -6941 -6806 6675 -1897 -11922 -1449 3059 -18464 3030
920 3030 8281 -6601 -7649 2819 -8968 -13236 10776 -7771 -11097 4005 5612 -14019 -6174
933f174R712k0178J5702N616q926o120J7713j0390j2796K0979q357o353J0791
946A219J1451k2456L422J4487j7155M907Q907k364j1638K2038o428j9013J5080
959B457K511q849K180J8793k1087K250J5684j3517p118J1131N832j7170J9526
972A2623j625j6406P920Q398j1725o501K4371j4935k846J2892n559j4221R612
985A998J0509k1065J5575M118j1390j294J2450j0232j3726K4535p363o932P326
998D509N266j7184N717J1614k0382R608R523m727j1825J6604n889j6481J8809
1011E162k087p840L103J5150j8476K1J4002j5815R52J1687R71j6559J7977r15
1025G333j6727R831M389p815k926K1614j6617l903J3277q148o927Q216P696j8409
$$ plain form
933 -6174 3538 -16640 -938 4678 -4248 -10368 7345 -3045 -15841 5138 -3219 -9572 1219
946 1219 12670 -9786 -6364 8123 -9032 -4125 4782 2418 -9220 12818 6390 -12623 2457
959 2457 4968 -3881 -1701 17092 -3995 -1745 13939 422 -6696 4435 10267 -6903 12623
972 12623 10998 -5408 2512 10910 -815 -7316 17055 2120 -726 12166 6607 -7614 1998
985 1998 12507 -8558 7017 11135 -255 -1549 10901 669 -13057 11478 4115 -2817 4509
998 4509 9775 -7409 -1692 9922 -10460 -852 8671 3944 -7881 8723 2834 -13647 5162
1011 5162 3075 -4765 -1662 13488 -4988 -4967 9035 -6780 -5828 5859 6830 -9729 8248 7333
1025 7333 -9394 437 4826 -2989 -5915 15699 -918 -4821 8456 308 -6619 1597 9293 -9116
1039i116J6303L971j5770N41J1654p202j0563K2737j0752m681R314k48j3814M850
1053b776J3571j9321J0232P730r400o386J3436m635j5564J9174k712o545M031
1066H35Q611j7336J881J5268j7139L550Q932l74j2772J3940k009j8316J5613M213
1080D897q793k098J6249j4215k486J2558j1559l284J0156O883j8346J3044K464
1093E470j5610P229P469p025q374K1648r625o817Q798l564q144P787J0439j9709
1107a0028J1014P043j0469l796R861l731j2325K2423o168r516N660N766j1543
1120e809J103J2577j6841P997R448o083j1978J3073m22j5063J6671j182p832Q04
1134c537J3611j4037m762J3993j1378K468Q488m61j5619J3978L970j7451P130
$$ plain form
1039 -9116 7187 11158 -4612 -4071 7583 381 -10182 12555 1803 -2878 6436 6188 -7626 -2776
1053 -2776 10795 -8526 1706 9436 36 -6350 7086 2451 -13113 6061 3349 -3196 835
1066 835 9446 -7890 -6009 9259 -7880 -4330 4602 4228 -8544 5396 3387 -14929 684 4897
1080 4897 -3896 -5994 10255 -3960 -6446 6112 -5447 -8731 1425 8308 -10038 3006 5470
1093 5470 -10140 -2911 4558 -2467 -10841 10807 1182 -5635 3163 -401 -8545 -758 9681 -10028
1107 -10028 986 8029 -2440 -6236 3625 -106 -12431 9992 3824 -5692 -32 5734 -5809
1120 -5809 -4706 7871 -8970 -973 8475 2392 -9586 3487 3065 -11998 4673 3491 -4341 -3537
1134 -3537 10074 -3963 -8725 5268 -6110 -3642 4846 4385 -11234 2744 6714 -10737 -3607
1147c607N978l941n115J6915j2855o944J3175n192m795M895Q075j6151J1497O049
1161G984j6040K58J0706o77j1694J6951p519o172R227r3j0441J819J4515j5127
1175f303O997N983r471n766J2998K88j6859J6529l52o019K204N285j1694R4J6164
1190A0078j3992J200P899q31j1736J1414K221j7819J2523N474m944m979J0852
1203G360r628k833J4223j1502l239Q772P606j6530P182N350j3716N663P436l817
1217B327r331J6255o583p179Q818m232n068N323J1623j8053M992R158r290l345
1231d585P758j02j1795J7128l295r294L909L933p435O03J3001j6455M094J0672
1245H137m538j1821P704N871j2951J1784m90o276M62R232j0167m404J4593j0098
$$ plain form
1147 -3607 2371 -1570 -6685 10230 -2625 -9569 3606 -1586 -6381 -1486 6589 -9562 1935 7984
1161 7984 -8056 -7798 2908 2231 -9463 7488 -31 -6203 3024 2931 -7510 -5691 8824 -6303
1175 -6303 694 6677 -2794 -8560 4438 4726 -12133 4396 4044 -1975 229 5514 -6180 -6086 10078
1190 10078 -3914 -2714 5185 4354 -7382 4032 6253 -11566 957 6431 1487 -3492 7360
1203 7360 -2268 -5101 9122 -2380 -5619 3153 10759 -5771 1411 6761 -6955 -1292 6144 2327
1217 2327 -7004 9251 2668 -4511 4307 75 -4993 330 11953 -6100 -1108 8050 -1240 -4585
1231 -4585 3173 3071 -8724 8404 5109 -4185 -276 3657 -3778 -3175 9826 -6629 -2535 8137
1245 8137 3599 -8222 -518 5353 -7598 4186 3696 -2580 -2118 7114 -3053 -7457 7136 -2962
1259b962n49P948K367j5441P268Q396j3625N837L243j775m233J1825r287p610
1273h598J3422l712m665M136Q405j5671O313Q820j2136j205P308K979j0288J1916
1287G024n398p473J0368p52q735J505J4609j4016J408Q179o161o614P848N229
1301G021j3142J0573j380n384M262L381j0231k073J8399j1336m344P557J522j0138
1315e313N027N448j3000R151L306m797l381Q515p437n270J5388q560m979O294
1329C92P939j3962J750Q105r881M005M285j161p577J1665n591p419J1345l034
1343H61o440L024J3673j4847j836R881n286j575L183J767q569J3142l751r481
1357f254O443M274p086k505J5309j1443k601P937j078p085K781O082j0127J0308
$$ plain form
1259 -2962 -3511 4437 6804 -8637 -1369 7027 -6598 -761 2482 707 -3526 8299 -988 -8598
1273 -8598 4824 1112 -3553 583 8988 -6683 -370 8450 -3686 -4891 2417 5396 -4892 7024
1287 7024 1626 -5847 4521 3769 -4966 -3461 11148 -2868 -1460 6719 558 -6056 1792 7021
1301 7021 -6121 4452 3072 -2312 1950 5331 -4900 -6973 11426 90 -4254 3303 4825 -5313
1315 -5313 -286 5162 -7838 1313 4619 -178 -3559 4956 -2481 -7751 7637 -923 -5902 392
1329 392 8331 -5631 -3881 4224 -5657 -1652 2633 1472 -6105 5560 -31 -7450 3895 861
1343 861 -5579 -2555 11118 -3729 -5565 4316 -970 -2545 638 2405 -6164 6978 3227 -6254
1357 -6254 189 4463 -2623 -5128 10181 -1262 -3863 4074 2996 -4089 -1308 4774 -5353 4955
1371D955q61q048J488Q847p456p254J5108o623l168M702L427j1353K644R124j0738
1386e206N047J652l106k968J0595p490r706J4584q40o351k43R704j0543Q77P505
1401C511r242J749M955P94q736J0940l376j0104R889L147o885l135J3767q608
1415a334j783N878n240j693N374M079j2540J0567J117q375L021N322n517n112
1429f236J4903o570m416M381J153n753K909O145j2164Q713L298o231l517Q041
1443D656k490q659J2969l430n370K373O525q891J08O942r507N396M451l107r218
1458g252J0528L29j0845Q440k19l177k05Q921j0319j894Q990n842j221M398J761
1473B393j0673J0464P97j0057L619M558j770m924J0954q183k575Q096k641n421
$$ plain form
1371 4955 4094 -3954 -2466 6381 -1075 -8329 6779 156 -3012 1690 5117 -6236 -3592 5532 -5206
1386 -5206 -159 1493 -1613 -4581 6014 -1476 -11182 3402 2562 -3789 -4032 5672 -4871 -3994 3511
1401 3511 -5731 -3982 973 1767 -6969 3971 595 -9509 380 3527 -3358 -6493 7274 -1334
1415 -1334 -3117 2761 -2479 -4172 1202 5281 -7259 3308 4425 -3950 -929 4393 -1124 -6236
1429 -6236 8667 2097 -2319 2062 3215 -2538 371 6516 -5648 3065 6363 132 -3385 4656
1443 4656 2166 -6493 6476 3046 -2324 49 6574 -2317 -2209 4733 -4774 622 5073 1966 -7252
1458 -7252 3276 3605 -7240 1200 981 -2196 -2401 6520 -3799 -5693 3297 -2545 -3766 632 2393
1473 2393 -8280 2184 2981 -7076 -3457 1101 -669 -5593 5361 -2822 -5397 2699 58 -5363
1487e363L150O529r930P624J827p993l83Q300j850q667J1911m659j977L717Q74
1502C110p621K647R697j0947L088M519l265m702Q066j664q916J0078k95l482n14
1517b01N667q250O33R634r552j28N140K125q837O132M16q560P453K139m758l408
1533d355J0105o679k320O692n157j846M486N594j2558O340L294p189J937L889
1547B233k314n268J1544n544m144M500M29m585K541P696j1939M604M990l769m113
1562c139N093R08p184J0928l683n004K975M968o495j129Q577q115K426M050j081
1577D095p893O809K563r137P368j98l067r98P590p496l484R362m928j189K822
1592B219K598r410O236L049q789L405K647r93m754R014o774m511Q411j554n006
$$ plain form
1487 -5363 -2213 4316 -5614 2010 3837 -4156 -4539 3761 1911 -6756 5155 496 -1481 2236 3110
1502 3110 -4511 -1864 7833 -3114 -26 4493 1228 -3474 4592 2928 -5988 4090 3795 313 -201
1517 -201 5466 -2784 -2151 7483 -2069 -2197 2943 5068 -3769 2363 2779 -5781 1672 3811 -947 -4355
1533 -4355 5750 -929 -3249 3443 -1714 -3560 926 6520 -6038 302 3596 -3593 -1656 2233
1547 2233 -81 -5349 6195 651 -3493 1007 1436 -3149 -608 7088 -4851 -247 4743 974 -3139
1562 -3139 1954 2862 -4322 6606 2923 -2081 894 5862 -633 -1762 6815 -1300 1126 5176 4095
1577 4095 -3798 3011 5574 -3563 3805 3607 540 -458 7132 -364 -3848 5514 586 -603 2219
1592 2219 4817 -4593 1643 4692 -4097 -692 1955 962 -3792 5222 -1552 -6063 2348 794 -4212
1607d212J282O918r138L865K995o388l95N682l09p671R688l809m097M318J781
1622E10o053k91R953q380J259L266k336l568N821J002r441R293K96l955n72N452
1638B256n396k296J0202o785p77K978K514o735M058K733q113O478K049l029l989
1653c852Q769m908l875P488l385k029K010N685r114L022L871o379K558L163j305
1668A719o241R935l433n545M743O92l240j09P611r292K358M358l836k347L866
1683A239J665p516Q666j951n049J922M701m469k982R272o924N63L290n66n527
1698c666M273L767q413O407N45l350j444O890m572m560Q837l648j288J256L483
1713D517p555L780M600q173L455K802r89m855P494l583n489P423q54l295j42O937
$$ plain form
1607 -4212 -2930 3988 -5150 -1285 1710 -4678 -5073 609 300 -7371 2317 -1492 -5589 -1271 510
1622 510 -5543 -5834 4119 -4261 -3002 264 -2072 -5640 181 1183 -8258 1035 1331 -2624 -3196 2256
1638 2256 -3140 -5436 4766 -2019 -2796 182 2696 -4039 19 2752 -5361 1117 3166 137 -3852
1653 -3852 4917 9 -3866 3622 237 -1792 218 5903 -3211 -189 3682 -2697 -139 3024 1719
1668 1719 -4522 5413 1980 -3565 1178 1870 -1370 -1479 6132 -3160 -802 3556 -280 -2627 1239
1683 1239 2904 -4612 4054 2103 -2946 -1024 3677 -792 -3774 5498 -1426 -863 2427 1861 -3666
1698 -3666 607 4374 -4039 2368 2913 -437 -1881 5009 437 -4123 4714 1066 -222 1034 4517
1713 4517 -3038 742 5342 -2831 624 3426 2437 -2418 5076 1493 -3996 3427 2573 -722 -864 6073
1729F073q104J668L870n290O70L152J338q302Q319j643n642M016J866l519k214
1744c742Q830p162l26L246j647l088L480K753q683P332M63m547p00N015l042l877
1760e695R291o113j286K653K075n880K357L999p344N238J550k857l591P420k322
1775e05n557P773k779j549P26M918p141J202N290n799K180K450m44n930Q290j604
1791A521o199M974J201j870k002P241p095M19N191m050j288K886L027p935P074
$$ plain form
1729 6073 -2031 -363 3507 -1783 -1113 2039 3377 -4925 3394 1751 -3891 125 1991 -1528 -3742
1744 -3742 5088 -2074 -2400 846 -801 -3889 -409 2344 -6339 993 1456 -3091 -3791 1224 -1818 -5695
1760 -5695 3596 -2517 -3803 -1150 925 -4955 -2598 1401 -5943 -705 845 -2012 -5603 1817 -505
1775 -505 -6062 1711 -1068 -2617 -1891 3027 -4114 -2912 2378 -3421 -1241 1209 765 -5165 3125 1521
1791 1521 -4678 296 1497 -373 -2375 4866 -2229 -1810 3381 -669 -1957 929 3956 -3979 3095
$$ [...]
8191a4
##END NTUPLES=NMR FID
##END=
