##TITLE=1H_TG-2307-x1y
 CDCl3, 8 sc, 
 24.11.2020
##JCAMPDX= 6.0         $$ Bruker NMR JCAMP-DX V2.0
##DATA TYPE= NMR FID
##DATA CLASS= NTUPLES
##ORIGIN= UXNMR, Bruker Analytische Messtechnik GmbH
##OWNER= root
$$ XWIN-NMR		Version 3.5
$$ Tue Nov 24 10:15:45 2020 Russian Standard Time (UT+4h)  she@DPX200
##.OBSERVE FREQUENCY= 200.1315066352
##.OBSERVE NUCLEUS= ^1H
##.DELAY= (6, 6)
##.ACQUISITION MODE= SIMULTANEOUS
##.ACQUISITION SCHEME= undefined
##.AVERAGES= 8
##.DIGITISER RES= 18
##SPECTROMETER/DATA SYSTEM= spect
##.PULSE SEQUENCE= zg30
##.SOLVENT NAME= CDCl3
##.SHIFT REFERENCE= (INTERNAL, CDCl3, 0, 15.7039)
##AUDIT TRAIL= $$ (NUMBER, WHEN, WHO, WHERE, WHAT)
$$ ##TITLE= Audit trail, XWIN-NMR		Version 3.5
$$ ##JCAMPDX= 5.01
$$ ##ORIGIN= Bruker BioSpin GmbH
$$ ##OWNER= she
$$ F:/spectra/data/she/nmr/H-F/1/audita.txt
$$ ##AUDIT TRAIL=  $$ (NUMBER, WHEN, WHO, WHERE, WHAT)
(   1,<2020-11-24 10:12:22.89 +0400>,<she>,<DPX200>,
      <created by zg, POWCHK disabled, PULCHK disabled
       configuration hash MD5:
       00 E9 B6 7A A2 85 ED C7 34 08 36 98 17 FE 4E 26
       data hash MD5: 16K
       81 AF 75 93 7D FE 3A DB D1 93 E5 46 4C 99 6E A0>)
$$ ##END=
$$ 
$$ hash MD5
$$ 67 1B F4 92 B7 88 35 8E 28 E0 F3 A0 6A 15 31 36
##$RELAX= 
##$RELAX= 
##$RELAX= 
##$RELAX= 
##$RELAX= 
##$RELAX= 
$$ Bruker specific parameters
$$ --------------------------
##$DU= <F:/spectra>
##$EXPNO= 1
##$NAME= <H-F>
##$PROCNO= 1
##$TYPE= <nmr>
##$USER= <she>
##$AMP= (0..31)
100 100 100 100 100 100 100 100 100 100 100 100 100 100 100 100 100 100 
100 100 100 100 100 100 100 100 100 100 100 100 100 100 
##$AQSEQ= 0
##$AQ_mod= 1
##$AUNM= <au_zg>
##$AUTOPOS= <>
##$BF1= 200.13
##$BF2= 200.13
##$BF3= 200.13
##$BF4= 200.13
##$BF5= 200.13
##$BF6= 200.13
##$BF7= 200.13
##$BF8= 200.13
##$BYTORDA= 1
##$CFDGTYP= 0
##$CFRGTYP= 5
##$CHEMSTR= <none>
##$CNST= (0..31)
1 1 145 1 1 1 1 1 1 1 1 1 1 1 1 1 1 1 1 1 1 1 1 1 1 1 1 1 1 1 1 1 
##$CPDPRG= <>
##$CPDPRG1= <>
##$CPDPRG2= <>
##$CPDPRG3= <>
##$CPDPRG4= <mlev>
##$CPDPRG5= <mlev>
##$CPDPRG6= <mlev>
##$CPDPRG7= <mlev>
##$CPDPRG8= <mlev>
##$CPDPRGB= <>
##$CPDPRGT= <>
##$D= (0..31)
0 1.2 0 0 0 0 0 0 0 0.06 0 0.03 0 0 0 0 0.0002 0 0 0 0 0 0 0 0 0 0 0 0 
0 0 0 
##$DATE= 1606198342
##$DBL= (0..7)
120 120 120 120 120 120 120 120 
##$DBP= (0..7)
150 150 150 150 150 150 150 150 
##$DBP07= 0
##$DBPNAM0= <>
##$DBPNAM1= <>
##$DBPNAM2= <>
##$DBPNAM3= <>
##$DBPNAM4= <>
##$DBPNAM5= <>
##$DBPNAM6= <>
##$DBPNAM7= <>
##$DBPOAL= (0..7)
0.5 0.5 0.5 0.5 0.5 0.5 0.5 0.5 
##$DBPOFFS= (0..7)
0 0 0 0 0 0 0 0 
##$DE= 6
##$DECBNUC= <off>
##$DECIM= 32
##$DECNUC= <off>
##$DECSTAT= 4
##$DIGMOD= 1
##$DIGTYP= 9
##$DL= (0..7)
0 120 120 120 120 120 120 120 
##$DP= (0..7)
150 150 150 150 150 150 150 150 
##$DP07= 0
##$DPNAME0= <>
##$DPNAME1= <>
##$DPNAME2= <>
##$DPNAME3= <>
##$DPNAME4= <>
##$DPNAME5= <>
##$DPNAME6= <>
##$DPNAME7= <>
##$DPOAL= (0..7)
0.5 0.5 0.5 0.5 0.5 0.5 0.5 0.5 
##$DPOFFS= (0..7)
0 0 0 0 0 0 0 0 
##$DQDMODE= 0
##$DR= 18
##$DS= 0
##$DSLIST= <SSSSSSSSSSSSSSS>
$$ [...]
##$SUBNAM2= <"">
##$SUBNAM3= <"">
##$SUBNAM4= <"">
##$SUBNAM5= <"">
##$SUBNAM6= <"">
##$SUBNAM7= <"">
##$SUBNAM8= <"">
##$SUBNAM9= <"">
##$SW= 16.9725356469052
##$SWIBOX= (0..15)
0 0 2 0 0 0 0 0 0 0 0 0 0 0 0 0 
##$SW_h= 3396.73913043478
##$TD= 16384
##$TD0= 1
##$TE= 0
##$TE2= 300
##$TE3= 300
##$TEG= 300
##$TL= (0..7)
0 120 120 120 120 120 120 120 
##$TP= (0..7)
150 150 150 150 150 150 150 150 
##$TP07= 0
##$TPNAME0= <>
##$TPNAME1= <>
##$TPNAME2= <>
##$TPNAME3= <>
##$TPNAME4= <>
##$TPNAME5= <>
##$TPNAME6= <>
##$TPNAME7= <>
##$TPOAL= (0..7)
0.5 0.5 0.5 0.5 0.5 0.5 0.5 0.5 
##$TPOFFS= (0..7)
0 0 0 0 0 0 0 0 
##$TUNHIN= 0
##$TUNHOUT= 0
##$TUNXOUT= 0
##$USERA1= <user>
##$USERA2= <user>
##$USERA3= <user>
##$USERA4= <user>
##$USERA5= <user>
##$V9= 5
##$VALIST= <valist>
##$VCLIST= <CCCCCCCCCCCCCCC>
##$VD= 0
##$VDLIST= <DDDDDDDDDDDDDDD>
##$VPLIST= <PPPPPPPPPPPPPPP>
##$VTLIST= <TTTTTTTTTTTTTTT>
##$WBST= 1024
##$WBSW= 4
##$XGAIN= (0..3)
0 0 0 0 
##$XL= 0
##$YL= 0
##$YMAX_a= 436793
##$YMIN_a= -493752
##$ZGOPTNS= <>
##$ZL1= 120
##$ZL2= 120
##$ZL3= 120
##$ZL4= 120
##$ABSF1= 10
##$ABSF2= 0
##$ABSG= 5
##$ABSL= 3
##$ALPHA= 0
##$AQORDER= 0
##$ASSFAC= 0
##$ASSFACI= 0
##$ASSFACX= 0
##$ASSWID= 0
##$AUNMP= <proc_1d>
##$AZFE= 0.1
##$AZFW= 0.1
##$BCFW= 1
##$BC_mod= 2
##$BYTORDP= 1
##$COROFFS= 0
##$CY= 11.3945322036743
##$DATMOD= 1
##$DC= 2
##$DFILT= <>
##$DTYPP= 0
##$F1P= 15.9154993809931
##$F2P= -4.1035820241983
##$FCOR= 0.5
##$FTSIZE= 0
##$FT_mod= 4
##$GAMMA= 1
##$GB= 0.15
##$INTBC= 1
##$INTSCL= 1
##$ISEN= 128
##$LB= 0.24
##$LEV0= 0
##$LPBIN= 0
##$MAXI= 10000
##$MC2= 0
##$MEAN= 0
##$ME_mod= 0
##$MI= 1.114404
##$NCOEF= 0
##$NC_proc= 0
##$NLEV= 6
##$NOISF1= 3.799351
##$NOISF2= 2.8
##$NSP= 1
##$NTH_PI= 0
##$NZP= 0
##$OFFSET= 15.70392
##$PC= 1
##$PHC0= -11048.57
##$PHC1= 8.80089
##$PH_mod= 1
##$PKNL= yes
##$PPARMOD= 0
##$PSCAL= 0
##$PSIGN= 0
##$REVERSE= no
##$SF= 200.130013532006
##$SI= 16384
##$SIGF1= 3
##$SIGF2= 2
##$SINO= 400
##$SIOLD= 16384
##$SREGLST= <1H.CDCl3>
##$SSB= 0
##$STSI= 0
##$STSR= 0
##$SW_p= 3612.71676300578
##$SYMM= 0
##$S_DEV= 0
##$TDeff= 0
##$TDoff= 0
##$TI= <>
##$TILT= no
##$TM1= 0
##$TM2= 0
##$TOPLEV= 0
##$USERP1= <user>
##$USERP2= <user>
##$USERP3= <user>
##$USERP4= <user>
##$USERP5= <user>
##$WDW= 1
##$XDIM= 8192
##$YMAX_p= 0
##$YMIN_p= 0
$$ End of Bruker specific parameters
$$ ---------------------------------
##NTUPLES= NMR FID
##VAR_NAME=  TIME,          FID/REAL,        FID/IMAG
##SYMBOL=    X,             R,               I
##VAR_TYPE=  INDEPENDENT,   DEPENDENT,       DEPENDENT
##VAR_FORM=  AFFN,          ASDF,            ASDF
##VAR_DIM=   8192,          8192,            8192
##UNITS=     SECONDS,       ARBITRARY UNITS, ARBITRARY UNITS
##FACTOR=    0.0002944,     1,               1
##FIRST=     0,             0,               0
##LAST=      2.4114304,     0,               0
##MIN=       0,             -493752,         0
##MAX=       2.4114304,     436793,          0
$$ Real data points
##PAGE= N=1
##DATA TABLE= (X++(R..R)), XYDATA
0@%%%%%%%%%%%qJ6j6K4l2L6m4N4o8Q0r4J16j36J60j90K20k58K99l43L96m53N16
$$ 0 0 0 0 0 0 0 0 0 0 0 0 -8 8 -8 16 -16 20 -24 30 -38 42 -52 64 -72 88 -102 118 -140 159 -184 212 -241 275
33B75n86O64p50Q43r49J066j191J331j481J644j825K020k236K473k730L011l317
$$ 275 -311 353 -397 446 -503 563 -628 703 -778 866 -959 1061 -1175 1298 -1432 1579 -1738
50a738L653m025M434m887N391n953O589p309Q134r092J0216j1564J3211j5281
$$ -1738 1915 -2110 2324 -2563 2828 -3125 3464 -3845 4289 -4803 5413 -6151 7060 -8221
64h221J7977k1662K7085l6074N5181j81270n4470k92298K02587N43788l5654J97455
$$ -8221 9756 -11906 15179 -20895 34286 -146984 -201454 -493752 -291165 252623 216969 414424
76D14424j98833l33748k25974j12621K62540K39683K06712J54800k14282j95370
$$ 414424 215591 -118157 -344131 -456752 -194212 45471 252183 406983 192701 -2669
86b669k14126j43024L6857K40297L08265Q6410J1071k10903l30743m1305m3798
$$ -2669 -216795 -359819 -322962 -82665 225600 312010 323081 112178 -218565 -259870 -303668
97c03668J61957K84323Q4052P5035j10042k27166k13856p4311K10466R2177K20622
$$ -303668 -141711 142612 226664 301699 191657 -35509 -249365 -323676 -113210 -21033 199589
108A99589J63270k61561p1115j17359j97174J10100J38021J97491P4729k6638
$$ 199589 362859 101298 30183 -87176 -284350 -174250 -36229 161262 235991 209353
118B09353o9243l26305m2681J10999m838K24014J35721k0607q5831j62964r9559
$$ 209353 140110 -186195 -228876 -117877 -122715 101299 237020 216413 130582 -32382 -131941
129a31941j05306J12169K02817Q5700Q1830j02788j22989j25344r8140J20788
$$ -131941 -237247 -125078 77739 163439 245269 142481 19492 -105852 -203992 -83204
139h3204L1319J55622J66607j36304k7236j60368j61044J20362J2057J59997J31770
$$ -83204 -51885 103737 270344 134040 106804 -53564 -214608 -94246 -82189 77808 209578
150B09578r3391K1147j31725j51159J6892K1344J36021R9428L1789j7189j50953
$$ 209578 116187 137334 5609 -145550 -128658 -107314 28707 128135 159924 142735 -8218
161h218r1520j2391J4784N2331J24372Q7303r2321k3059p1830j64853P6738R2438
$$ -8218 -99738 -112129 -97345 -45014 79358 166661 74340 51281 -20549 -185402 -108664 -16226
173a6226M6532P7104J0060m3923j49549k1932J5381o7647J81118R1260n8012L5887
$$ -16226 30306 107410 117470 73547 -76002 -97934 -82553 -150200 30918 122178 64166 100053
185A00053j15890q9541j3420J3356J06904K1555P9386J2262j30481j4912q6876
$$ 100053 -15837 -105378 -118798 -105442 1462 23017 102403 114665 -15816 -30728 -117604
196a17604k0394J22150K4576P3795K3295q3174m5985n2637k0957Q286R0829P9810
$$ -117604 -137998 -15848 8728 82523 105818 22644 -23341 -75978 -96935 -88649 2180 81990
208H1990k8545K3861o0053j11786J3999K8626L2861L5611P6403n253j17702L2861
$$ 81990 53445 77306 17253 -94533 -80534 -51908 -19047 16564 92967 87714 -29988 2873
220B873n5209q3961J51811K5647j0882O5259o3446n9522l3837J844K5798K0065
$$ 2873 -52336 -136297 15514 41161 30279 95538 32092 -27430 -61267 -59423 -33625 -13560
232a3560Q6684P496m5414k4266o3777j5886J8049N2195M6638M438K1227n8165
$$ -13560 73124 80620 35206 10940 -52837 -68723 -50674 1521 48159 52597 73824 15659
244A5659m4598j6085m1247P9229L6400P793N3266o9366m2374j1631k6842K8312
$$ 15659 -28939 -45024 -86271 -7042 29358 37151 90417 21051 -21323 -32954 -59796 -31484
256c1484J6475P0135R149m8461K4324q2257l2896O2796o256M5855J9740q597r495
$$ -31484 -15009 55126 64275 15814 40138 -42119 -75015 -12219 -18475 27380 47120 38523 29028
269B9028o6963J1360q369j2374Q1154J1264j3703p803l4599k2809j8568L9456
$$ 29028 -37935 -26575 -34944 -47318 33836 45100 31397 23594 -11005 -33814 -52382 -12926
281a2926K4633J984L7729j6515m0322l0355o17R299N052O9260m650l2903K3414
$$ -12926 11707 13691 51420 34905 -5417 -35772 -36389 -27090 -22038 47222 42572 9669 33083
294C3083o1488j6055K0167j0162N8708R129Q25K12o0412K175j1379L100M7401
$$ 33083 -28405 -44460 -24293 -34455 24253 33382 34207 34419 -25993 -23818 -35197 -32097 15304
307A5304o414L0498k294m7337M95k3021n040L0425L3628K423k2977K4908m3262
$$ 15304 8890 39388 37094 -10243 -9748 -32769 -37809 -7384 26244 28667 5690 30598 -12664
320a2664l8820N3898k3324O569N5909j5375k1257j5595R94k2997K089O3319k7241
$$ -12664 -51484 2414 -20910 -14341 41568 26193 4936 -10659 -9665 -32662 -30573 32746 5505
333E505Q85L6198n7521q654Q011j1002K2642J6826K2338k3350j6189M415m0595
$$ 5505 6390 42588 -14933 -23587 -15576 -26578 -3936 12890 35228 11878 -4311 104 -40491
346d0491K2037J7786q593M1983o037k2940l518k0569r555J0921L2665l475J687
$$ -40491 -18454 -668 -9261 32722 26685 3745 227 -20342 -29897 -18976 13689 10214 11901
359A1901K4236m4494r566J3450k4331J8656K5731J0017j5916p489J0515m5970
$$ 11901 36137 -8357 -17923 -4473 -28804 -10148 15583 25600 9684 2195 12710 -33260
371c3260J4983L4639l3947L4349J4123l1372M428j7013J441K058Q877K7230k0876
$$ -33260 -18277 16362 -17585 16764 30887 -485 3943 -13070 -11629 -9571 -694 26536 5660
384E660L842l65k7054J0267l658R525J5948k204Q267j9753j0514r37m993K0079
$$ 5660 9502 9137 -17917 -7650 -11308 -1783 14165 11961 20228 475 -10039 -10976 -15969 4110
398D110j662J3804O232k4095O625j8292q216J8098J37K0502l623o550J814k6205
$$ 4110 2448 16252 22484 -1611 5014 -13278 -21494 -3396 -3259 17243 13620 7070 8884 -17321
412a7321P048O25j813K1824l827R209j0381j9152J3155j7710P266K2183j0239
$$ -17321 -10273 -9648 -11461 10363 6536 15745 5364 -13788 -633 -18343 -11077 11106 867
425H67N134J061n716j4590l467J9605j4647J2061J9545k7438J729M013j1434Q50
$$ 867 6001 7062 1346 -13244 -16711 2894 -11753 308 19853 -7585 -5856 -1843 -13277 -12427
439a2427R949J2089j4946J2639K821l4917J8331J807j2379K7326l458o456J486
$$ -12427 -2478 9611 -5335 7304 10125 -24792 -6461 -4654 -17033 10293 6835 379 1865
452A865p418m169j0061J6995Q99k351K5766k1640r866J3633k1224M418J6492j000
$$ 1865 -5553 -9722 -19783 -2788 -1889 -4240 21526 -114 -9980 3653 -17571 -13153 3339 2339
466B339j982R949K245k7328R119R130k3471K5398J0622k0004R981J302j1915o026
$$ 2339 357 10306 12551 -14777 -5658 3472 -19999 5399 16021 -3983 5998 7300 -4615 -10641
480a0641J4026J405j2545K6151p751k1030K0532j0936o335J6762k045j365m81
$$ -10641 3385 4790 -7755 18396 10645 -10385 10147 -789 -7124 9638 7593 6228 5747
493E747N291j1699o834J7209j2556P725J6197k0343N536M04j2498M968L219L790
$$ 5747 11038 -661 -7495 9714 -2842 4883 21080 737 6273 6677 -5821 -853 2366 6156
507F156j233Q828k01j8941R452m808r101J8273k248j253L461k445l707j1088R380
$$ 6156 4923 13751 13550 -5391 4061 -747 -9848 8425 6177 4924 8385 5940 2233 -8855 525
522E25l350k943J8709j0197k603M758j1517M569j974J322O024n303P379n102n790
$$ 525 -2825 -5768 12941 2744 141 4899 -6618 -2049 -4023 -2701 3323 -1980 5399 297 -5493
537e493L878m407O818j861J095L583j0826O675j751o543J0037k107K750J70l435
$$ -5493 -1615 -6022 796 -1065 30 3613 -7213 -538 -2289 -8832 1205 -902 1848 2018 -1417
552a417L44q541R149m53m101J5057r373j021N668j2768J767L577K186J666J614
$$ -1417 -1073 -9614 -465 -918 -5019 10038 665 -356 5312 -7456 -5689 -2112 74 1740 3354
567C354N078j2789L663N080j6995J2754N124r086J0792l36p775l398O581j900
$$ 3354 8432 -4357 -694 4386 -12609 145 5269 -3817 6975 6639 -1136 -4534 2047 147
581A47p928J6418n475r909J7393j0421q519J1314k576l870M604N649j2161P61
$$ 147 -7781 8637 3162 -6747 10646 225 -8294 3020 444 -3426 1178 6827 -5334 -4573
595d573J3107j6649M948J3449j6388O365N913j1596J05N888P67o352J0266J197
$$ -4573 8534 -8115 -3167 10282 -6106 259 6172 -5424 -5319 569 1336 -5016 5250 6447
609F447j6346J4120k959j4332J5130n49n520P993J710q936k455R484r660j531
$$ 6447 -9899 4221 1262 -13070 2060 1511 -4009 3984 5694 -3242 -5697 3787 -5873 -7404
623g404J6288j1090M95J1382j2282k165N056j632k969N300M649j0826P095M169
$$ -7404 8884 -2206 -1711 9671 -2611 -4776 280 -1352 -4321 979 5628 -5198 1897 6066
637F066j4390Q425J741o788P206J11l262j648M121k56n887R477m859m699J0206
$$ 6066 -8324 101 1842 -4946 2260 2371 -891 -2539 1582 1326 -4561 4916 57 -4642 5564
652E564q263r14N022l614L679k67N06k416k927N048n618K648M136m735O528k373
$$ 5564 -2699 -3613 1409 -2205 1474 1207 1713 -703 -3630 1418 -4200 -1552 2584 -2151 4377 2004
668B004l424K031n169L762K24K46L238k959K844l190j914K128n307O462L76l454
$$ 2004 -1420 611 -4558 -796 -572 -326 2912 -47 2797 -393 -2307 -179 -5486 976 1352 -2102
684b102O257m135j687L148k711n07K84M616l431q01O046q870L289N705q914L722
$$ -2102 4155 20 -1667 1481 -1230 -1737 -1453 3163 -268 -1069 4977 -3893 -604 5101 -3813 -91
700i1K257l954Q92K084k46n295P226J720j0166Q900j624q717R719k70n061M161
$$ -91 2166 -1788 -896 1188 942 -4353 2873 4593 -5573 3327 1703 -7014 2705 2435 -2626 1535
716A535L297n484j626P143r091j426J2928r553N30R144r083p40N038l399m295
$$ 1535 4832 -652 -2278 4865 -4226 -5652 7276 -2277 -1747 7397 -1686 -2426 2612 -787 -5082
731e082N817M333r020O699L511j2773Q082K493r657N921L708n468L89O133n511
$$ -5082 735 5068 -3952 2747 6258 -6515 1567 4060 -5597 324 4032 -1436 -1047 5086 -425
746d25m633J0838o010n554J1466o660l088Q590l559m001M447K498p064K433N145
$$ -425 -5058 5780 -230 -5784 5682 -978 -4066 4524 965 -3036 1411 3909 -3155 -722 4423
761D423r902M848O414r180M292K983o072J040K373k299l670P039j98n793Q471
$$ 4423 -5479 -631 5783 -3397 895 3878 -2194 -1154 1219 -1080 -4750 2289 2091 -3702 4769
776D769m364n199P592l873j936M117l48m97L13K014m400j055N124n546K162K845
$$ 4769 405 -4794 2798 -1075 -3011 1106 758 261 574 2588 -1812 -2867 2257 -3289 -1127 1718
792A718m061L206j60j512q3p25J457j810J993N65k806M297k513o60K848m314K549
$$ 1718 -2343 863 703 -809 -892 -1617 -160 -1970 23 588 -2218 2079 -434 -1094 1754 -2560 -11
809a1M97k882K420l86N63m05R92k19l089L665k028k641N736l213K74M558l683
$$ -11 486 -2396 24 -362 201 -204 788 569 -2520 1145 -883 -3524 2212 -1001 -727 3831 148
826A48q49Q39K66k580J678L547n580L826L084p657M114R92n624L494K518k643
$$ 148 -701 138 404 -2176 -498 3049 -2531 1295 4379 -3278 836 1828 -3796 -302 2216 -427
842d27q75M738k041m733P424m375m505R231l680l198N768j748l082K718K330o477
$$ -427 -1302 3436 1395 -3338 4086 -289 -4794 4437 757 -2441 3327 1579 -1503 1215 3545 -2932
858b932J889N592p684K286O041q105K815M876o408l50M876k763l676P273j817
$$ -2932 -1043 4549 -3135 -849 5192 -2913 -98 4778 -1630 -1980 2896 133 -3543 3730 1913
873A913n762Q731k979n973O241j781l845M531J641m331J164M780o363k38O363
$$ 1913 -3849 4882 1903 -4070 2171 390 -3455 1076 2717 -1614 -450 4330 -2033 -2271 4092
888D092p895J646O482n500L73M126k739k517L477J6n405N324J232o000N921m19
$$ 4092 -3803 -2157 4325 -1175 -802 3324 585 -1932 1545 1561 -3844 1480 2712 -3288 2633 2214
904B214m914L950k30k924J217K010k060j14M234m059o60M675m595N09K604l349
$$ 2214 -2700 1250 1020 -1904 -687 1323 -737 -851 3383 -676 -1336 3339 -1256 -747 1857 -1492
920a492J284J591n04j119R12Q02l810K675M0l409M498q36j366K319j506o01O17
$$ -1492 -208 1383 879 -240 672 1474 -2336 339 379 -3030 1468 632 -734 1585 79 -522 95
937I5n60j52o7J807j547J303R63l815K753m79k602K494j9q98J119P57j232j204
$$ 95 -465 -617 -684 1123 -424 879 1842 -1973 780 301 -2301 193 174 -724 395 1152 -80 -1284
955a284K800k669p89M601m377M43M208l613L50J912k113j223K264K48l541M077
$$ -1284 1516 -1153 -1942 2659 -1718 -1275 2933 -680 -330 1582 -531 -1754 510 758 -2783 1294
971A294O07m622M833q68m640M396l69l154K440J874k897J05M558m727j378N884
$$ 1294 1901 -2721 2112 1244 -3396 1000 631 -2523 -83 1791 -1106 -1001 3557 -1170 -2548 3336
987C336n814k57N565l795q41M204j785l992L581R79n641M970J623o233N138J446
$$ 3336 -2478 -2735 2830 -965 -1806 2398 613 -3379 202 1181 -4460 510 2133 -4100 1038 2484
1003B484n821K952J717l610R5M190l046j533N620l365k337N382l978k220N256
$$ 2484 -3337 -385 1332 -2278 -2183 2007 -1039 -2572 3048 -317 -2654 2728 -1250 -3470 1786
1018A786k214k025L329O38l813L087J571n890L204K421n126L306J994l610J231
$$ 1786 -428 -2453 876 1514 -2299 788 2359 -3531 -327 2094 -3032 274 2268 -1342 -111
1033a11K180k653j308L341j303k513N045k327k264M497k389j336K101q38j290
$$ -111 2069 -584 -1892 1449 146 -2367 2678 351 -1913 2584 195 -1141 960 122 -1168
1048a168J534J383k409J301J789l732J689R22l055K223P46j713J226L75j058m33
$$ -1168 366 1749 -660 641 2430 -1302 387 1309 -1746 477 1223 -490 736 1111 53 -380
1064c80J391j843p88K738j762L92K282k610R21Q25j687K14M74p8r88K189l66k259
$$ -380 1011 -832 -1620 1118 -644 -252 2030 -580 341 1166 -521 -307 167 89 -899 1290 924 -1335
1082a335K588q83k293L218k176q99L063r43j039J657K55k640J444J731m182K116
$$ -1335 1253 370 -1923 1295 -881 -1780 1283 340 -699 958 1213 -1427 17 1748 -2434 -318
1098c18K733m099K531J326l449Q56J817k076j189L703j768k183N057k571l074
$$ -318 2415 -1684 847 2173 -1276 -420 1397 -679 -1868 1835 67 -2116 2941 370 -2704
1113b704M932k143k331L522p13k239K532J497m010J759K777n547J979L174m994
$$ -2704 2228 85 -2246 1276 563 -1676 856 2353 -1657 102 2879 -2668 -689 2485 -2509
1128b509J916L342l687O7K792k423j880M154j465l542N531j118l256M374j378
$$ -2509 -593 2749 -938 -871 1921 -502 -2382 1772 307 -3235 2296 1178 -2078 2296 918
1143I18l477K666J263l526J496L247m413J290L542n176P48L455l691N10K605j967
$$ 918 -2559 107 1370 -2156 -660 2587 -1826 -536 3006 -2170 -1422 2033 -1658 -1148 1457 -510
1159e10r27L340r38l033L379n66l555M230m34k641L212l13k453J611P24k271N59
$$ -510 -1437 1903 965 -2068 1311 745 -2810 1420 986 -1655 1557 1244 -1209 402 1126 -1145 -586
1176e86K629l000N99K575k954N06J827k498J58J480j009l30J712k55j426J921
$$ -586 2043 -957 -358 2217 -737 -231 1596 -902 -744 736 -273 -603 1109 854 -572 1349
1192A349p71k228K777j270j166K274j185k81J422m85j181O54M97j663J168J455
$$ 1349 578 -1650 1127 -143 -1309 965 -220 -501 921 436 -745 -91 406 -1257 -89 1366
1208A366k432J654O02k405J823j18j804R57J095j328L04J793k316J38K406l260
$$ 1366 -1066 588 1190 -1215 608 490 -1314 -357 738 -590 -286 1507 -809 -671 1735 -1525
1224a525K12K668k187K76K165j458j149K133m25k562K692J50l469L927k54k977
$$ -1525 -1313 1355 -832 -556 1609 151 -998 1135 710 -1852 840 990 -2479 1448 1194 -1783
1240a783K652J47k420J119J237k684P88L322l384K6L670l842n0L375l185k80L067
$$ -1783 869 1016 -1404 -285 952 -1732 -944 2378 -1006 -980 2690 -1152 -1202 2173 -1012 -1292 1775
1257A775j192k245L031q6l760L306J42m042L865N01l331K516J054l041Q47K450
$$ 1775 583 -1662 1369 1283 -2477 829 971 -3071 794 1295 -2036 480 1534 -1507 -660 1790
1273A790l005l77L919l336n02M063k767j484L413j533j880L003o27k388K443J119
$$ 1790 -1215 -1592 2327 -1009 -1511 2552 -215 -1699 1714 181 -1699 1304 677 -1711 732 1851
1289A851l753K641R09m025K651J082k806J230J835j865j75K519k352j049L260
$$ 1851 -1902 739 1648 -2377 274 1356 -1450 -220 1615 -250 -425 2094 -258 -1307 1953
1304A953k374q02L172j645j040K352j211j505J511P6j524J555Q13k291J975O48
$$ 1953 -421 -1223 1949 304 -736 1616 405 -1100 411 487 -1037 518 1331 -960 1015 1663
1320A663k980J744L77j595Q58R26j341M35J489j736m70J783k057K93J639k238
$$ 1663 -1317 427 804 -791 67 993 -348 87 1576 -160 -630 1153 -904 -611 1028 -1210
1336a210P71J102r76o6J215r70j377K046p57r62K236o61j335J781j078j411J771
$$ -1210 -439 663 -313 -379 836 -134 -1511 535 -222 -1184 1052 391 -944 837 -241 -1652 119
1353A19l90r74J262N83j758R62J269l032J485J222k820J689J538k121M24J926
$$ 119 -271 -1245 17 600 -1158 -196 1073 -1959 -474 748 -2072 -383 1155 -966 -542 1384
1369A384j919o93K272j732j392L448j758j352L103j214j864K286o62j905K199
$$ 1384 -535 -1228 1044 -688 -2080 1368 -390 -1742 1361 147 -1717 569 -93 -1998 201
1384B01P17k461J617J710l134J452J393l388J229J971k398N15K234j764j005K855
$$ 201 918 -1543 74 1784 -1350 102 1495 -1893 -664 1307 -1091 -576 1658 -106 -1111 1744
1400A744j496k648L892j278k149L281q44j708K106L20k697J671J297l085J430
$$ 1744 248 -2400 1492 214 -1935 1346 502 -1206 900 1220 -1477 194 1491 -1594 -164
1415a64K416l198J088J736l025M51K007k125l87K456j049j506K701p32k359L083
$$ -164 2252 -946 142 1878 -1147 -696 1311 -814 -1201 1255 206 -1300 1401 669 -1690 1393
1431A393j147k214L148l21j680J649L17j972J129J070k592O33K177k674Q69J770
$$ 1393 246 -1968 1180 859 -821 828 1145 -827 302 1372 -1220 -587 1590 -1084 -215 1555
1447A555k147O82Q12j211m58J375n79o45J934r35j080J946j304p63J971j234p62
$$ 1555 -592 90 902 -309 -767 608 29 -616 1318 383 -697 1249 -55 -818 1153 -81 -843
1464h43J551l26j101J279J56k066J520O63k143J503N25j342O55Q45j478L52J187
$$ -843 708 382 -719 560 716 -1350 170 833 -1310 193 718 -624 31 876 -602 -250 937
1481I37j232n34J641j304k2J971j956m35J947j586j79J268n89p01J717k45k108
$$ 937 -295 -829 812 -492 -514 1457 -499 -934 1013 -573 -752 516 -73 -774 943 698 -1410
1498a410K552o82k040K415K74k546K294O27k317R46J495k817M48K048k065m1K671
$$ -1410 1142 460 -1580 835 1109 -1437 857 1484 -833 113 1608 -1209 -761 1287 -778 -819 1852
1515A852k233o53K689j580j110K143p49j487K025L05k385K189M2k297J856L67
$$ 1852 -381 -1034 1655 75 -1035 1108 359 -1128 897 1202 -1183 1006 1048 -1249 607 974
1531I74k583K039O69k058R54J357k198L6K605k716n44L200k181p59L146j826j406
$$ 974 -1609 430 1099 -959 -5 1352 -846 -810 1795 -921 -1465 1735 -446 -1205 1941 115 -1291
1548a291K367n41k163K096M94k748K103P97k733J500O59j553N85J087j277R2J736
$$ -1291 1076 535 -1628 468 962 -1786 317 1114 -1619 -119 540 -1013 -428 659 -618 -526 1210
1565A210j679q7J786j984j54J827j607l2J810j430n39J968j058j003J576k41k060
$$ 1210 -469 -556 1230 -754 -908 919 -688 -720 1090 -340 -879 1089 31 -972 604 363 -1697
1582a697K352p6j948K008K07j506M07Q59j037k41J686j291Q2J144j493K96R05
$$ -1697 655 579 -1369 639 846 -660 -253 606 -431 -672 1014 -277 -195 949 -544 -248 657
1599F57j172m4R26p68L49P13p13o61J478j237q63K052j064j087K693j030j316
$$ 657 -515 -559 367 -401 -52 661 -52 -713 765 -472 -1335 717 -347 -1434 1259 229 -1087
1616a087K176p92j621J323Q39k064P39J909k553O99J536k034J92J348j640J19
$$ -1087 1089 297 -1324 -1 838 -1226 -487 1422 -1131 -432 1104 -930 -738 610 -1030 -911
1632i11J798j332k48J605j017q38K175j387j058K212j278o38J986n70k019K007
$$ -911 887 -445 -693 912 -105 -943 1232 -155 -1213 999 -279 -917 1069 499 -1520 487
1648D87L94k448J754J353l185J626J895k878M70K150k267k28K498j421j136K485
$$ 487 881 -1567 187 1540 -1645 -19 1876 -1002 -532 1618 -649 -877 1621 200 -936 1549
1664A549j042j642K517r49j485J499L32k063J543M86j515J251P1j268P80R51k033
$$ 1549 507 -1135 1382 433 -1052 447 779 -1284 259 745 -770 481 552 -716 64 1015 -1018
1681a018J714J8j409O11J301j978J49J648j423p51K454j054k012K981o62k214
$$ -1018 696 714 -695 -84 1217 -761 -612 1036 -387 -1138 1316 262 -1750 1231 569 -1645
1697a645K092O30k588K013P46k388J255Q78j400K44J164j062p27J199p44M36L60
$$ -1645 447 1077 -1511 502 1248 -1140 115 993 -407 -163 1001 -61 -788 411 -333 103 463
1714D63r38P28N21r48KJ158j699J21J994o82j204J432q22j508K161q76j030J728
$$ 463 -475 253 774 -174 -172 986 -713 -592 1402 720 -484 948 126 -1382 779 -97 -1127 601
1732F01K13k186J147J358k214Q33Q65j416K76Q28o87J46Q16q68j38N43o34K2P98
$$ 601 814 -1372 -225 1133 -1081 -248 617 -799 -523 305 -382 -236 580 -288 -426 117 -517 -495 303
1751C03j025J076O69j072k69J451k056P73J436j117j537K672n67k386K030J79
$$ 303 -722 354 1023 -49 -318 1133 -923 -150 1286 169 -1368 1304 737 -1649 381 560
1767E60k105J677J055j669N83J460j521m74J496j575J65J137q69q69K112r25j250
$$ 560 -1545 132 1187 -482 101 1561 40 -434 1062 -513 -348 789 -80 -949 1163 238 -1012
1784a012J798n66j147J789m40j744K756j014j536K448o16k119J825Q35k196P33
$$ -1012 786 220 -927 862 422 -1322 1434 420 -1116 1332 716 -1403 422 1257 -939 -206
1800b06J730k357J39K534k327m59K450j704r34K290r58j314J833J30j964J162
$$ -206 1524 -833 -694 1840 -487 -946 1504 -200 -1134 1156 198 -1116 717 847 -1117 45
1816D5R64j947R36N55j287R85N69j509J074m32j095Q87j39j313J250J407j915
$$ 45 1009 -938 -2 553 -734 251 820 -689 385 -47 -1142 -255 -394 -1707 -457 950 -965
1833i65P67J202j998J30K106j554o67K080p17j590K051J30k193J609L72j539P14
$$ -965 -198 1004 -994 -864 1242 -312 -979 1101 384 -1206 845 975 -1218 391 763 -776 -62
1850f2Q65j121L1R56q12k70Q80o42j7O36o31Q64j9p77N83J34j155L83Q78r30r1
$$ -62 803 -318 -287 669 -143 -413 467 -175 -192 444 -187 677 658 -119 464 598 -557 -174 704 -226 -317
1871c17J865j838n52J946j026j037J205Q13j744O44N87j678J297Q93j608L52J274
$$ -317 1548 -290 -842 1104 78 -959 246 1059 -685 -41 546 -1132 165 1058 -550 -198 1076
1888A076j680L0R06p51O60J03p47K78K79n25j02J311j413K31J952k380k52K163
$$ 1076 -604 -574 332 -419 241 344 -403 -125 154 -371 -473 838 -575 -344 1608 -772 -1024 1139
1906A139j665n90K428j429j485K160L60k161J561P78k414R53J451j784jJ817j732
$$ 1139 -526 -1116 1312 -117 -1602 558 918 -1243 318 1096 -1318 -365 1086 -698 -699 1118 -614
1923f14l20J843j106o76J501p66l78J312n00p94J288o40r28J232k60j353J724
$$ -614 -934 909 -197 -873 628 -138 -516 796 296 -498 790 150 -778 454 194 -1159 565
1940E65p9j384J605k6k028J524O47k039Q80J640j988j29K272j873q61K285r17
$$ 565 486 -898 707 681 -1347 177 824 -1215 -335 1305 -683 -812 1460 -413 -1274 1011 94
1957I4j185J995o15j434J553J66j296P62N80j070K55O36j079P23O37j240O26Q9
$$ 94 -1091 904 289 -1145 408 574 -722 40 620 -450 -195 441 -638 85 722 -518 108 197
1975A97j012O35N28r59N81J264j885K36J283j444k34J931j400p09J781n33p91
$$ 197 -815 -180 348 -611 -30 1234 -651 -415 868 -576 -810 1121 -279 -988 793 260 -531
1992e31R08j60j172R80O49j272O09N86j044N11K50q29N45K24p39M41N83r53M92
$$ -531 377 217 -955 25 674 -598 11 597 -447 64 314 -515 30 254 -485 -44 539 -414 78
2011G8K79j220N97R89j554K91J390j346j42J901j489o38J570l76j404J740p1j842
$$ 78 357 -863 -266 723 -831 -540 850 -496 -638 1263 -226 -864 706 330 -1074 666 595 -1247
2029a247J612O02j772O41P41j527M68R97j077P7J260j228L65Q61j062J80J006
$$ -1247 365 967 -805 -164 577 -950 -482 515 -562 -485 775 -453 -88 773 -289 -109 897
2046H97j403O2J653j433k07J472r88q00J751q89j410K141R9j852J328N08j788
$$ 897 -506 -444 1209 -224 -431 1041 53 -747 1004 115 -1295 846 945 -907 421 929 -859
2063h59R18J411j937K10J547j756j58J903j382n71J303o91o18J320l68j049J170
$$ -859 59 1470 -467 -257 1290 -466 -624 1279 -103 -674 629 -62 -680 640 272 -777 393
2080C93m08o87J324l82j101J247j28q02R25K08j363J023N63j800R56Q12j662O06
$$ 393 -15 -702 622 240 -861 386 258 -544 381 589 -774 249 812 -988 -32 780 -882 -276
2098b76J217j295l13J633j121o64J454l44j189J332j65j206J451l27j152J275
$$ -276 941 -354 -667 966 -155 -819 635 291 -898 434 269 -937 514 187 -965 310
2114C10L6q38P06j3n62N24j5p58P66K5r62P26L27j115O29R10j190K81R53j104
$$ 310 346 -492 214 201 -361 163 148 -610 156 181 -781 -55 272 -843 -214 696 -494 -213 740 -364
2134c64l14J386o97p17J493r27o36J379o51n57P08q6m37N86K86q55M47K70o63
$$ -364 -678 708 11 -706 787 -140 -776 603 -48 -605 103 17 -420 166 452 -403 44 314 -349
2153c49O02O2r62P20N45j086O25P83j525K04J081j180J03J230j061n94J641r28
$$ -349 253 315 -647 73 618 -468 157 940 -585 -381 700 -480 -377 853 -208 -802 839 -89
2171h9j032J746l70j137J291L48j488R21P90j621O29O62j374M48J166j410L69
$$ -89 -1121 625 255 -882 409 757 -731 190 980 -641 -12 650 -724 -276 890 -520 -151
2188a51P43p82l85J232j259j96J494j005l13J404q27p47J203j17j037J287J89
$$ -151 592 -190 -575 657 -602 -798 696 -309 -622 782 -45 -792 411 294 -743 544 733
2205G33j726J455N93j918R34Q50j582L52R99j313j26J443q33n4R15r69o81J523
$$ 733 -993 462 1055 -863 71 921 -661 -309 690 -623 -749 694 -139 -193 722 -247 -928 595
2223E95n90k86R60n20p76Q64J10q48O51q8o09Q78J14j251J058N24j290O76K02
$$ 595 5 -281 679 159 -617 247 357 -491 160 72 -537 341 455 -796 262 786 -504 172 374
2242C74q49J33R88r71J23J052j020l75J010o57m70J154o89j05O40n4q82J051m03
$$ 374 -475 -342 646 -325 -202 850 -170 -545 465 -192 -662 492 -197 -302 338 284 -598 453 50
2261E0q00P81J16o46Q50j19n87M40K50r91N84K68q20O50N05j000K05J073j352
$$ 50 -750 31 147 -499 351 232 -355 85 335 -656 -72 196 -624 26 531 -469 -264 809 -543
2280e43NJ070j046l41J300n58n21Q77k23q33J147l35j002J431j23j138J177K94
$$ -543 -538 532 -514 -855 445 -113 -634 243 20 -813 334 -1 -1003 428 305 -833 344 638
2298F38j339J026L12j259Q08L32j007K86Q26j075J20J230j402R4J284j063k47
$$ 638 -701 325 637 -622 186 518 -489 -203 623 -452 -332 898 -504 -410 874 -189 -436
2315d36J112p57p73J899p83r42J045l4j357J309K75j017O53L81j151M71P57j210
$$ -436 676 -81 -854 1045 262 -680 365 331 -1026 283 558 -459 194 575 -576 -105 652 -558
2333e58M29R18j077J57Q61p68l28J213p78p22J297o82q47J568m22j137J144j26
$$ -558 -129 789 -288 -131 730 -38 -366 847 69 -653 644 -38 -885 683 261 -876 268 142
2351A42r78R54J49r33Q48N07j205L45O51j188K52J009r89O6Q66o02m23R10p77
$$ 142 -836 118 267 -666 182 689 -516 -171 480 -708 -456 553 -436 -370 496 -106 -529 381 -396
2370c96M3R02o91m94J223l11r12R50j81o75J010l30o20M80L32n88M78J33r26L88
$$ -396 -353 549 -142 -636 587 276 -636 314 133 -542 468 138 -482 -2 330 -258 220 353 -573 -185
2390a85M91p08K84O47q68J68P19o37l8P60p56l56J059o87l24J010k84p67Q93j48
$$ -185 306 -402 -118 529 -339 -171 548 -89 -127 633 -123 -479 580 -107 -431 579 295 -472 421 273
2410B73j003J194k17n74O92O1r25P61M11j530O72J006r48O0Q95j172J23P51q31
$$ 273 -730 464 247 -327 365 426 -499 262 673 -857 -185 821 -127 -67 828 -344 -221 530 -301
2429c01l41J427r65l76J135o91n24J268n26q46J207l88r07J051Q8j021R43K99
$$ -301 -642 785 -180 -556 579 -112 -636 632 106 -740 467 79 -828 223 311 -710 233 532
2447E32j107N37L30o06K67P04j060j5R77j034J1J238j187OR07n46p46J340n25
$$ 532 -575 -38 292 -314 -47 657 -403 -418 559 -475 -464 774 -413 -407 500 -46 -792 548 23
2466B3p63J206n4j058Q81K33j173O92L49r30P26M88j152O56M08q41k13J164r79
$$ 23 -740 466 412 -646 235 468 -705 -13 336 -594 132 620 -532 124 532 -309 -522 642 -337
2485c37j22Q84q66n1P96k85n97Q95k26n84R29k97o66R50j64j063Q26M68q64L19
$$ -337 -459 425 -441 -492 304 19 -578 317 91 -493 436 139 -527 423 259 -804 22 490 -374 -55
2505e5M45p43J93O42p83K01O15o15lN65o47j09N65k92k60M41j01o53J000l67o93
$$ -55 390 -353 -160 482 -301 -100 515 -100 -103 462 -185 -294 271 -21 -281 160 59 -594 406 39 -654
2526f54R51l7q29O04J64o77M17M37q15P01J32r98P08N25j050L65O73q76P4O76
$$ -654 297 260 -569 35 199 -478 -61 376 -439 262 394 -604 104 629 -421 -56 617 -259 -185 491
2546D91q17l1P59p10j64R95n77o24J080m53n40J026j81r01R78q7p54R26jo78M59
$$ 491 -326 -357 402 -308 -472 523 -54 -678 402 -51 -591 435 254 -647 331 244 -510 416 415 -263 196
2567A96L02o86L9O54q86J80P43r51J93Q45j026j00R39m25m44J123l54j022J358
$$ 196 498 -188 -149 505 -381 -201 542 -409 -216 629 -397 -497 442 17 -427 696 342 -680 678
2586F78m82q70Q85L41j337Q69M25j012M33O95j215K59P63q85J12R47q65Q1O39
$$ 678 196 -674 211 552 -785 84 509 -503 -70 625 -590 -331 432 -453 -341 606 -259 -178 461
2605D61l80l13N93n0j094J127Mo08O30K2j023J068j95o53P13K7q20N64N15q44
$$ 461 81 -232 361 311 -783 344 348 -260 370 392 -631 437 242 -411 302 329 -491 73 588 -256
2625b56Q2O24o85P4R57j004j15M60l75j14P58m84k21P85m30l18O51l23m37L63
$$ -256 -174 450 -235 -161 796 -208 -323 137 -238 -352 406 -78 -299 486 56 -262 389 66 -371 -8
2645hK39q34Q59J88q41N09L10p21N12M9k86K9L33p30O2P90p08O0O05p62k4R11
$$ -8 231 -603 256 444 -397 112 422 -299 213 262 -24 5 338 -392 -330 460 -248 -188 417 -345 -369 542
2667E42p96L8O35l33m92R87n73l79Q15l30m91M95m5n35N84J01o20M98M13q76J99
$$ 542 -254 -216 419 86 -406 581 8 -371 444 114 -377 118 73 -462 122 223 -397 101 514 -362 -163
2688a63N98q72J21R29r20q2J105o27l29Q58p61l42P28J98q48O67k90n31Q91J8
$$ -163 435 -437 -316 613 -307 -389 716 89 -240 618 -143 -485 243 441 -407 260 -30 -561 330 348
2708C48j154Q05L84q43N57L35q93M96N64p69r6R22j010N6R80q41k55R22o11j42
$$ 348 -806 -1 383 -460 97 432 -461 35 599 -170 -266 656 -354 -298 682 -159 -414 508 -103 -245
2728b45J061j001l22P43j66n21O58M27j141P02K07r15N50N89q80K04M01o74J36
$$ -245 816 -185 -507 236 70 -451 207 634 -507 195 402 -513 37 626 -254 -50 351 -323 -187
2747a87N68o28q4R71p73l0N38l68k89N66m57l71R74l92m33Q39j46q20Q89r2p29
$$ -187 381 -247 -331 640 -133 -163 375 7 -282 284 -173 -544 430 38 -395 444 298 -522 367 275 -454
2768d54N40K57j81k4J59o56Q1Q55p43%N50m53k89P85l27k95O35k81m91P70k19
$$ -454 86 343 162 138 297 -359 -278 577 -166 -166 384 -69 -358 427 100 -195 440 159 -332 438 219
2789B19j97J99j83n54Q67j30o03L63J74n00M21K51q34O55K12o28L41M33p31lO21
$$ 219 22 221 38 -516 351 221 -382 -19 155 -345 76 327 -507 148 360 -268 73 506 -225 -228 393
2810C93n44n1P47o53n14R99n31l33Q03k99n22O44k74m01N37N2k96M23K53q26K53
$$ 393 -151 -202 545 -108 -622 377 -154 -487 316 17 -505 139 -135 -536 1 53 -243 180 433 -393 -140
2831a40O78r28L36M39p07J49L65p34L14O09l89n28R85m73o01J072l65p04R85k98
$$ -140 538 -390 -54 385 -322 -173 192 -542 -228 381 -8 -536 449 -24 -625 447 82 -622 363 65
2851F5n09P69k9r22O80N18r57N53L66r81L46O69j135M21M75n68j5O45n62j36O39
$$ 65 -444 325 296 -626 54 572 -385 168 534 -447 -101 568 -567 -146 329 -239 -254 391 -171 -307 332
2872C32n76q7O56p8p62R73j0q77R04k64n17P86l01n80L83O23r87L16M59p12K26
$$ 332 -244 -331 325 247 -515 458 448 -429 475 211 -306 480 179 -401 -18 605 -382 -66 393 -319 -93
2893i3L93l65k77Q31p32j5N02k47l35Q81q19l7P35k94m66L21L20p22O89j98m43
$$ -93 300 -65 -342 489 -243 -258 244 -3 -338 543 -276 -313 422 128 -338 -17 303 -419 270 72 -371
2914c71L54L63q04L54J53j97J31M22o98p6O46m98J68L12n36J0N15qm74N78l78
$$ -371 -17 346 -458 -104 49 -148 -17 405 -293 -369 277 -221 -53 259 -277 -267 248 240 -234 344 -34
2935c4l30O95j71n06N40k48j53M86L4l94L62k15l52L67L33q86M80L17n01J15N87
$$ -34 -364 331 160 -346 194 -54 -207 279 313 -81 281 66 -286 81 414 -472 8 325 -176 -61 526
2956E26q35K23N02o28NP19o18k90R39o22k91Q98m17l30M95K05q27M06M13r47L53
$$ 526 -309 -86 416 -212 -207 512 -106 -396 543 -79 -370 528 111 -219 276 481 -346 60 473 -474 -121
2977a21L32m66K85N20r73L69O23o62lN52n49j06O55n32j19N99m24m04O67j37n03
$$ -121 211 -255 30 550 -423 -54 569 -93 -96 456 -93 -199 456 -76 -195 404 -20 -424 243 106 -397
2998c97Q72j42p27N57K68o04L92J05n38J48L44n39K29O69q36KP16q60J47O47l90
$$ -397 475 333 -394 163 431 -173 219 324 -214 -66 278 -261 -32 637 -199 -197 519 -341 -194 453 63
3019F3l64P20m25l77N84J29p00N23o1m04L15L49n97K36K96n63M62L27o21o0L34
$$ 63 -301 419 -6 -383 201 330 -370 153 92 -312 3 352 -245 -9 287 -276 186 513 -108 -168 166
3040A66m71J68L19k34m54Q83j77l39M18Ln67M59r4l02L25o4n60P58o1m36K20K25
$$ 166 -305 -137 182 -52 -506 377 200 -139 279 282 -285 174 80 -222 103 39 -521 237 176 -260 -40 185
3062A85m87P04n5n66l3M39n34L76L22q69K59P47o09J65J44k79k82P29l67m19Q13
$$ 185 -302 402 347 -219 -252 187 -347 29 351 -518 -259 488 -121 44 188 -91 -373 356 -11 -430 383
3083C83n37j65K92K35n82N37j74l76O46o7m55M02O1o98N84K77m88J8N86p30L17
$$ 383 -154 -319 -27 208 -374 163 -11 -387 259 192 -263 139 200 -498 86 363 -125 -107 479 -251 66
3104F6K86l05j64L03l86l68J158n58l69O68k78m53N24K65j230R47J30m47J47M92
$$ 66 352 47 -117 186 -200 -568 590 32 -337 331 53 -400 124 389 -841 106 236 -211 -64 428
3124D28p54N35K56o04J34L94m91k21Q53p29L7O98o30j29N21j97o72N80k0k55L40
$$ 428 -326 209 465 -139 -5 389 -102 -323 530 -199 -162 536 -94 -223 298 101 -571 9 -11 -266 74
3145G4q0j50K70J44m96L22J86o68M79K9m15J01K59m82N4O53o04j28O13k11O2L59
$$ 74 -6 -156 114 258 -238 84 270 -398 81 110 -305 -204 55 -427 -373 280 -324 -452 161 -50 12 371
3167C71k17n90P78p5n10N97j97k88K79J21l87K5M55o40J96L21o33N60q3m12R8
$$ 371 154 -436 342 267 -243 354 157 -131 148 269 -118 -93 362 -278 -82 239 -394 166 83 -329 -231
3188b31O30o81K40M08m80kM74l10k84P14l84m76O72l96o4L72R7m70L10N7n01K54
$$ -231 399 -282 -42 366 -114 -116 358 48 -236 478 94 -382 290 -106 -170 202 299 -171 139 196 -305 -51
3210e1K54m59M77L47q04M30J56m45k01N05k64k13P28p52K81L32k69RJ26k09j15
$$ -51 203 -256 221 568 -236 194 350 -95 -296 209 -55 -268 460 -292 -11 321 52 61 187 -22 -137
3231a37M69m27p3M26j09o45P19J59n05K52L57q09K07L95n95L13K22l90J01N20
$$ -137 332 -95 -168 258 149 -496 223 382 -123 129 486 -323 -116 279 -316 -3 219 -171 -70 450
3251D50p49J47K58j72k04R34p98j28K64J35o39Q23k17m65N87J17o05L55j85l93
$$ 450 -299 -152 106 -66 -270 664 -134 -262 2 137 -502 321 104 -361 226 343 -262 93 -92 -485
3271d85N13K86o81J69P53o86Q9M71o66j16P78p58N1P40m61m28Q90l92l72K96L3
$$ -485 28 314 -367 -198 555 -131 -42 429 -237 -353 425 -333 -282 458 -3 -431 459 67 -305 -9 24
3292B4l86O11j04m21M35J74p23K88N02q26O48K04r00M66L05m62J82K64m02l9L91
$$ 24 -362 249 145 -276 159 333 -390 -102 400 -426 222 426 -474 -8 297 -165 17 281 -121 -160 231
3313B31o05J86J48Nl01N53l4n52L74Rj81M39l3m47J94L15j005Q30J79o29N49J75
$$ 231 -374 -188 -40 -35 -336 217 183 -369 5 14 -167 272 239 -208 -14 301 -704 126 305 -324 225 400
3335D00o59K00M01k15j93J83K5m31O39j63k24L75n02j60N30o8j10J44O2m01L87
$$ 400 -259 -59 342 127 -66 117 142 -289 350 187 -37 338 -164 -324 206 138 28 172 234 -167 220
3356B20J81p45L03O3l00K32J74l24K35K07n9k85L19m63ON57k98j88M62m86l1L82
$$ 220 401 -344 -41 22 -278 -46 128 -196 39 246 187 -98 221 -242 -236 321 23 -165 297 -189 -220 162
3378A62j01o27Q75r1r04R60l26l73O53j11k27R8K91o29N36P7l87q0N02l27j65
$$ 162 61 -566 309 218 -686 274 -52 -425 228 117 -110 -12 279 -350 186 263 -124 -204 298 -29 -194
3399a94N81m95j51M36Qk23K99l93L4K22k93j7N12o2l82K12J84p76M65J30k84L15
$$ -194 387 -108 -259 177 185 -38 261 -132 -98 124 -169 -186 326 264 -118 94 278 -498 -33 97 -187 128
3421A28J75m88M85j50l17J90L01j53p09P13k50j01M52j26j92P8J16m63M09k5l79
$$ 128 303 -185 300 150 -167 23 324 171 -538 175 -75 -176 276 150 -42 36 152 -311 98 73 -306
3442c06N25J72o45N23j06k07J78K04p59O00O8l88q5M50k13P4L81p16l5M56j99
$$ -306 219 391 -254 269 163 -44 134 338 -421 179 247 -141 -226 224 11 85 466 -250 -285 171 -28
3463b8l1K37k30j49M12l73j06N51l1m35L98j5l07p3M69n59K50L56p72M56k2j40
$$ -28 -59 178 -52 -201 211 -162 -268 283 252 -183 215 200 -107 -180 289 -270 -20 336 -436 20 -2 -142
3485a42J85K73o38K58K66m70K22M96l83P9O1j87K9K06k87k41N97n7o62N37k5n84
$$ -142 43 316 -322 -64 202 -268 -46 450 67 146 207 20 49 255 -32 -273 324 267 -395 142 117 -467
3507d67N11J76m34K79K49l26p1K41k30k2M60k75k45L73m53P7L63m24j83O15k9
$$ -467 44 220 -214 65 314 -12 -83 158 -72 -94 366 91 -154 219 -234 -157 206 -218 -401 214 185
3528A85m17K50o6l1q1j07OL18N37q81K60P0P2P59q27k56K54J7m90K85J070p66
$$ 185 -232 18 -48 -79 -160 -267 -261 57 594 -287 -27 43 115 874 47 -209 45 62 -428 -143 927 161
3550A61n5N20p07N6J18j35k21M19q1l93L97R6m61N08j22k44J05K23n69M06J47
$$ 161 106 626 -81 -25 93 -42 -263 156 75 -318 79 175 -286 222 100 -144 -39 184 -385 21 168
3571A68j70N6J72l77P7K21k25o1L17l73K42O3k97o4M46j15k13M24k57k98L00L1
$$ 168 -2 54 226 -151 -74 147 -78 -139 178 -195 47 110 -187 -251 195 80 -133 291 34 -264 36 67
3593F7k75L36k49o9K54k9k50P6M20l36PL16k86O6N8n65K53L01k57JJ31J47j57
$$ 67 -208 128 -121 -190 64 35 -215 -139 281 -55 -48 268 -18 48 106 -459 -206 95 -162 -161 -30 117 -40
3616d0J16K3k53M16l49l64N64J29m34J30L12o08J90N21q66N57J25o06M73K84n54
$$ -40 76 99 -154 262 -87 -451 113 242 -192 -62 250 -358 -168 353 -513 44 169 -437 36 320 -234
3637b34L06K21o17K37L87l23j92O15k23m52O95jn12L56j78k63K74K63p24L34L94
$$ -234 72 293 -324 -87 300 -23 -215 400 177 -275 420 419 -93 263 85 -178 96 359 -365 -31 363
3658C63m05q1K84j81K14J57k98k46O95o64K14L60q46J94M26n10n2O22k11l25O58
$$ 363 -42 -123 161 -20 194 351 53 -193 502 -162 52 412 -434 -240 186 -324 -376 246 35 -290 368
3679C68j76l72J75Q7k54Q5J67j68O3L38o85K98J12k83J37M65m69N0O06l00l54
$$ 368 192 -180 -5 82 -172 -87 80 -88 -25 313 -372 -74 38 -245 -108 357 -112 -62 544 244 -110
3700a10L60m37J65J53k1l08O02m28j12M13j60o7J88J7l27L63o5l98N3P00p82K40
$$ -110 250 -187 -22 131 110 -198 404 -24 -136 277 117 50 238 255 -72 291 226 -172 -119 581 -201 39
3722C9Q6m29J89K72m13J54M43k66m62M13r1r3K73n4j02J67N0l44L71j52k06K09
$$ 39 125 -304 -115 157 -256 -102 341 75 -387 26 -65 -158 115 61 -41 126 176 -168 203 51 -155 54
3744E4L06n93K60Q5k97J81J66l25O8O8p2k05N57r4k48M39l40k80N61l14l7J42
$$ 54 360 -233 27 112 -185 -4 162 -163 -95 -27 -99 -304 253 159 -89 350 10 -270 291 -23 -60 82
3766H2K2k58K81Mj93P3Q4j95R4J23l57L50q0m3q5L01l11r1N01n00j56M77k05J62
$$ 82 104 -154 127 131 -62 11 95 -100 -6 117 -240 110 30 -13 -98 203 -108 -199 302 -198 -354 123 -82 80
3790H0K83m75j94P5J73j40L55k46j7J06N20q14K70L04l87J78J21l59K1J99j83
$$ 80 363 -112 -306 -231 -58 -198 157 -89 -106 0 520 -294 -24 280 -107 71 192 -167 -146 53 -130
3811a30K2L69j26k97K72j03l58N83l46r8K40J99k82M68m61k66N51l29o1R5J29
$$ -130 -108 261 135 -162 110 7 -351 232 -114 -212 28 227 -55 413 -48 -314 237 -92 -153 -58 71
3832G1l46K46K03m25K77J30n17L00L25j83o1M23n57l7J72j28j05L99r3l26M07
$$ 71 -275 -29 174 -251 26 156 -361 -61 264 81 20 443 -114 -151 21 -107 -212 187 94 -232 175
3853A75n5l08K70j73l47M86p8k50M10k10k59O60k27k63K03L51m66pK68k65j82
$$ 175 120 -188 82 -91 -438 48 -30 -280 130 -80 -339 321 94 -169 34 385 -81 -88 180 -85 -267
3874b67L04p0J14K60m53n0K97m1j21J53j16j48L15j7l91K20J96n13N45Q1k76j11
$$ -267 37 -33 81 341 -112 -162 135 94 -27 126 10 -138 177 160 -231 -11 185 -328 217 298 22 -89
3896h9M54m20K99J06o98M38J48l73j61P68n69KN2L66o77N93O3m97K14K1r2j65
$$ -89 365 -55 244 350 -348 90 238 -135 -296 472 -97 -95 -43 323 -354 239 302 -195 19 40 -52 -217
3918b17K34r3Q3K53k33pJ31m34N33o7r6j18L00k13k15M88m87L7M11l31j80L64
$$ -217 17 -76 7 260 27 20 151 -283 250 183 87 -31 269 56 -159 329 -158 -121 290 -41 -221 143
3940A43j61r1P8J46m69M43j57j24L52j52o9J65j8k26K27k8j30J03j05k33J45K46
$$ 143 -18 -109 -31 115 -354 89 -68 -192 160 8 -61 104 86 -140 87 59 -71 32 -73 -306 -161 85
3962H5j71%K51l08Q4L31j76r8L84l64j32M90k14j98K69k91j4q5M29k09l7L15m00
$$ 85 -86 -86 165 -143 -59 272 96 -2 382 18 -114 376 162 -36 233 -58 -72 -157 272 63 26 341 -59
3985e9LLnJ94l3k06j43N92k42k47M48k13j87L80j99j58K70k24l70M96J56j06j37
$$ -59 -56 -53 -58 136 103 -103 -246 346 104 -143 305 92 -95 285 86 -72 198 -26 -396 100 256 150 13
4008A3Q0l94N13j86k51L18P7k64rK32k21k5K27r4OL08l57r4L0J82k06M26l55L0
$$ 13 93 -301 212 26 -225 93 170 -94 -103 129 -92 -117 110 16 22 330 -27 -121 -91 91 -115 311 -44 -14
4032a4J96m3l73M33K28p06L98k8j77N0L18l65K70q1r6R7J33l98P5K00k71L2L44
$$ -14 182 139 -234 199 427 -279 119 91 -86 -36 282 -83 187 106 10 107 240 -158 -83 117 -154 -122 222
4055B22j32j45J24N4j51J59O3m97J93K83k92N9J24j59j31M11n28K41K53r3k65
$$ 222 90 -55 69 123 -28 131 194 -303 -110 173 -119 -60 64 -95 -226 185 -343 -102 151 58 -207
4076b07N13m28Q6M3J16k76J13l9j47K79J31l84J18J94m69M45p1l05M24k6l59L86
$$ -207 306 -122 -36 7 123 -153 -40 -79 -226 53 184 -200 -82 112 -357 88 17 -288 136 110 -249 137
4098A37Qm47J56J66k16J39L67n46j1M77l01J1J81j90R1k0k42J58J99k43Q6J60
$$ 137 145 -302 -146 20 -196 -57 310 -236 -247 230 -71 -60 121 -69 22 2 -240 -82 117 -126 -40 120
4120A20r6Q6J19M0m58K75jk10M34j31l98Q1L03m15M2K83Ml10N19m31P2J70k1j71
$$ 120 24 110 229 269 -189 86 85 -125 309 178 -220 -139 164 -251 -209 74 78 -232 287 -144 -72 98 77 -94
4144i4L60n67K43K07j47k76Q7K9RM89m82J97j45L73m60N9K53N1j19j89k12J03
$$ -94 266 -301 -58 149 2 -274 -187 -158 -149 340 -142 55 -90 283 -177 -118 135 186 67 -122 -334 -231
4166b31N39l99K12mj21m7Q7j07j62M67j17k5M8k42l0K47n5k42K71k4j49J46J03
$$ -231 308 -91 121 117 -4 -51 36 -71 -233 234 117 92 140 -102 -132 115 60 -182 89 65 -84 62 165
4189A65k65K55l04n1j01L29O4J08j53j24J21J06k00J14L06l78j48M41m72Q2K83
$$ 165 -100 155 -149 -200 -301 28 92 200 47 -77 44 150 -50 64 370 -8 -156 285 -187 -105 178
4210A78m1l05R0K47l07RL24m85L85J87o20J96J64j14P9l7J80j49M4J0l01M50k56
$$ 178 137 -168 -78 169 -138 -129 195 -290 95 282 -338 -142 22 -92 -13 -50 130 -19 25 35 -266 184 -72
4233g2m0J28K0j61K45p1l55N06k41k90N52r2k01J41O4m42L15J71l62L16N7l22
$$ -72 -112 16 36 -125 120 49 -306 200 -41 -331 221 129 -72 69 133 -309 6 177 -185 131 188 -134
4255a34k55O26j63j07J04j89p0M05m18K12O5l44J62O1J46j31o5L01n04L56k35
$$ -134 -389 237 74 -33 71 -118 -188 217 -201 11 76 -268 -106 -45 101 -30 -95 206 -298 58 -177
4276a77J3K82m0R2J2k50k49M67m9k24o1L71j21J2j59Q5j60M19n8j03M1o3l71L87
$$ -177 -164 118 78 170 182 -68 -317 150 101 -123 -184 187 66 78 -81 4 -156 263 205 102 143 80 -291 96
4300I6O8n06L55k3l87M83j06N2j22k5O4K2L52o76J29L81j51k29J20l4J1K33q8
$$ 96 164 -342 13 -10 -397 86 -20 32 -90 -115 -51 -29 323 -353 -224 157 6 -223 -103 -137 -126 107 19
4323A9k69L89j48J16N9k40PM72k57k54J42Jj50M4J40o7N1J00n26M71l9K1L4M2
$$ 19 -250 139 -9 107 166 -74 -67 405 148 -106 36 37 -113 -69 71 4 55 155 -371 100 61 82 116 158
4347A58k04k43O18l83J20J4n4k27J51J57j89J54K25n27K36J97l52mM16m10J42
$$ 158 -46 -289 329 -54 66 80 26 -201 -50 107 -82 72 297 -230 6 203 -149 -153 263 -147 -5
4368eK4N3N4J74l65k8Q8n5q8P9p9n3K05M9k28L26k26j18K48J4r7q6J92l05K40
$$ -5 19 72 126 300 -65 -93 -5 -60 -148 -69 -148 -201 4 53 -175 151 -75 -193 55 69 -28 -114 78 -227 13
4393A3j52K86j01K35n16K92j32M6k66J18J12O3M49n47O0O4j09q0K40k26L00J5
$$ 13 -139 147 46 281 -235 57 -75 -29 -295 -177 -65 -2 447 -100 -40 24 -85 -165 75 -151 149 164
4415A64n7j35J76k56K46M5r2j95j48L27j21J01J13j48q3L45n99K02K59k47J60
$$ 164 107 -28 148 -108 138 183 91 -104 -252 75 -46 55 168 20 -63 282 -317 -115 144 -103 57
4436E7K34l58j04M39o4k30R8j76k82M82k20LK10J8n05K11K47k45J09L49m98M10
$$ 57 291 -67 -171 268 204 -26 72 -104 -386 96 -124 -121 89 107 -398 -187 60 -185 -76 273 -225 185
4458A85r1k10J31m3p1l21P28l92l92K34L21j34Q7o6l3K08j90R0J18r7k27L00r9
$$ 185 94 -116 15 -28 -99 -420 308 -84 -476 -242 79 -55 32 -34 -67 141 -49 41 159 62 -165 135 36
4481C6n8J17J8Qk48L03k16K79q8k6k87K26J29k99M40m17q9L78j87r5L69l28J42
$$ 36 -22 95 113 121 -127 176 -40 239 151 125 -162 64 193 -106 334 -83 -172 206 19 -76 293 -35 107
4504A07j18J12l66K27O4j56K63k93J30%K24m09J6N06m18L4K03L71k45l31K47m23
$$ 107 -11 101 -265 -38 26 -130 133 -160 -30 -30 194 -215 -199 307 -111 -77 126 497 252 -79 168 -255
4526b55L73K3k19J54J12j63R6r0j28N5J97o8p3K47m73kK55j83K85q4o2K30j49
$$ -255 118 141 -78 76 188 25 121 31 -97 -42 155 87 14 261 -212 -214 41 -142 143 59 -3 227 78
4549G8o3k01K87j58m1M62l88j06J19j60N8J23j15J1R1o1J26J82j32k49j3K01P0
$$ 78 15 -186 101 -57 -98 364 -24 -130 -11 -171 -113 10 -105 -94 -3 -64 62 244 112 -137 -150 51 121
4572A21k23J75j46J05J60k12j19J64j8km2n7p4K69o3j90J98j64K02P1k94m5N0
$$ 121 -102 73 -73 32 192 -20 -139 25 7 5 -37 -94 -168 101 38 -152 46 -118 84 155 -139 -184 -134
4595a34J82k45K83R0l44J16Q4j46J1K91l26N6Q9K15l38K78l49kM60j32k87J80
$$ -134 48 -197 86 176 -168 -52 32 -114 -103 188 -138 -82 7 222 -116 162 -187 -189 271 139 -148 32
4617C2k63J3M04j23m8K04j28j98j15J86j46J39R5l17K76M9R5Rl55J47K26q7n9
$$ 32 -231 -218 186 63 15 219 91 -107 -222 -36 -182 -43 52 -265 11 60 155 164 -191 -44 182 95 36
4640C6j81K62j09j44J23J52k07okQJ01L98n40J32J54l65L73k85j26J25J88r4k2
$$ 36 -145 117 8 -136 -13 139 -68 -74 -76 -68 33 431 -109 23 177 -188 185 -100 -226 -101 87 -7 -29
4663b9j3N5l08L54R7k52K99j84O0n4n3o7L28j03k33N08m60L9P5K32k69M0P4k05
$$ -29 -42 13 -295 59 156 -96 203 19 79 25 -28 -95 233 130 -103 405 -55 -16 59 291 22 62 136 -69
4687f9J57j69j29L58k35J0J38j32q1m9L73m4l13J02p3R2J32j38J6N5k68QM78j63
$$ -69 88 -81 -210 148 -87 -77 61 -71 -152 -201 172 128 -185 -83 -156 -64 68 -70 -54 1 -267 -259 219 56
4711E6o14P34j52p61P67k65o7M72P0l41L11N62j107J413l24j250L45j82N57j22
$$ 56 -558 176 24 -737 30 -235 -302 170 240 -101 210 772 -335 1078 754 -496 -151 -333 224 102
4731A02j74Q2k07J9Ml7J81J93j28j33J96j14m9L70m75L47j36k04K52%j12k04K09
$$ 102 -72 10 -197 -178 -174 -211 -30 163 35 -98 98 -16 -65 305 -170 177 41 -163 89 89 -23 -227 -18
4754a8j29O2Q7K13k15o0J02k2k0j46J86L8k35R8K63k78k44M60j27k21L34J29n79
$$ -18 -147 -85 2 215 0 -60 42 20 0 -146 40 78 -157 -59 204 -74 -318 142 15 -206 128 257 -322
4777c22K23J35m5k85K42j18J10K43l66N8N49m89k11N91j40k07j6K37k76l7N2q2
$$ -322 -99 36 -9 -294 -52 -170 -60 183 -183 -125 424 -65 -276 315 175 -32 -48 189 -87 -124 -72 -154
4799a54M3RLk24M85l90j00O06n92K59J84k6j17R3j27P1J90m83J87L60k85j10M25
$$ -154 -111 -102 -99 -323 162 -228 -328 278 -314 -55 129 103 -14 79 -48 23 213 -270 -83 277 -8 -118 307
4822C07k03l10L15j57J10j18J02j18K15k69K07j3k37q2M38j54k59L46j13J73j05
$$ 307 104 -206 109 -48 62 -56 46 -72 143 -126 81 68 -169 -251 187 33 -226 120 7 180 75
4843G5l51M77o3O1m23J56j35P5K97m08o10N45P38q27N21j74R9j01Rk11K31N1o3
$$ 75 -276 201 138 199 -224 -68 -203 -128 169 -239 -849 -304 434 -393 128 -46 53 -48 -39 -250 -19 32 -31
4866c1j57m3L29q5K6q3j73L31K00l36j16K40k04q0J38l4k8J41Pp3o0p3J48K05
$$ -31 -188 -231 98 13 39 -44 -217 114 314 -22 -138 102 -102 -182 -44 -78 -106 35 42 -31 -91 -164 -16 189
4890A89l1q2j52K37q9p3J80l20M14M8l90j00K38j52K4K78n29K28J76p8j79K10
$$ 189 158 76 -76 161 72 -1 179 -141 273 321 -69 -169 69 -83 -59 219 -310 -82 94 16 -163 47
4912D7N6p7Q0j10k04L50n8k00N43k95k08L96l60o8L72k36k86J85O0o0L9J73j21
$$ 47 103 26 106 -4 -208 142 84 -116 427 132 -76 320 -40 -108 264 28 -258 -73 -13 -73 -34 139 18
4935A8l5L2P4j39J90j63k95M03j63l8L2o0L0J99K1l52K28J61j97J28R6l91M16
$$ 18 -17 15 89 -50 140 -23 -318 85 -78 -116 -84 -144 -114 85 106 -246 -18 143 -54 74 170 -221 195
4958A95M2j39l98N88m05K82n7M0j62P6L0k43L13n6k39K36l68L11J62l45K02k94
$$ 195 237 98 -300 288 -117 165 108 148 -14 62 92 -151 162 106 -133 103 -265 46 208 -137 65 -229
4980b29O16l05k79M58n48L39J53k55j01N20m95nL34l04R7K30l68K33J11j74j92
$$ -229 387 82 -197 261 -287 52 205 -50 -151 369 -126 -131 203 -101 -4 226 -142 91 202 28 -164
5001a64M69k84n0j97L39J12l63L8j49L29j72n5J40K26l48L20k54P1j4J98l86L09
$$ -164 305 21 -29 -226 113 225 -138 -100 -249 80 -92 -147 -7 219 -129 191 -63 8 -6 192 -194 115
5023A15lk83l7L78k65N0J20o1p9r7L32j75j05k3J32nq6nj18P9K34P6J44l66P5
$$ 115 112 -171 -208 170 -95 -45 75 14 -65 -162 170 -5 -110 -133 -1 -6 -92 -97 -215 -136 98 174 318 -48 27
5048B7K65l75j46L22j71K47l26K71k07K70l04J2K00j14j01K75j69K5L7J95l55
$$ 27 292 -83 -229 93 -78 169 -157 114 -93 177 -127 -115 85 -29 -130 145 -24 1 38 233 -122
5069a22L5O0k32L47j43j50LK97j15K00o7k32pK58k75J03K86k13M0Q6k38p8L64
$$ -122 -87 -27 -259 88 -55 -205 -202 95 -20 180 113 -119 -126 132 -143 -40 246 33 73 159 -79 -157 207
5092B07k23n1PJ09k42L20Rk41J72J20j69P0k37L3O6J27j37R8Q2k69K10K00m13
$$ 207 -16 -67 -60 49 -193 127 136 -105 67 187 18 88 -149 -116 -50 77 -60 38 120 -149 61 261 -152
5115a52O1J30k47K1M19l31K15j9Q0j12k48J90l9J43K8j50K2JJ78J5o7k92J59J10
$$ -152 -91 39 -208 -187 232 -99 116 97 177 65 -183 7 -32 111 139 -11 11 12 190 205 138 -154 5 115
5139A15p6J9M8o5qR7j49N7l5j35J00J82j89P0j01J95l15J90r8L21k81J95l39P9
$$ 115 39 58 106 41 33 130 -19 38 3 -132 -32 150 -39 31 -70 125 -190 0 -98 223 -58 137 -202 -123
5163a23K99l40j73O33k17k53J00K6K23k7k5n7M6p4k6Jj6q2R9P0j21M6l0O8L8r4
$$ -123 176 -164 -337 296 79 -174 -74 -48 175 148 123 66 112 38 12 13 -3 -85 14 84 -37 9 -21 47 85 -9
5189ik16L35p8o3K68j55q8mL2k33L25j06j20L53k06lN1k0r8J24m9J60j34J43j42
$$ -9 -225 110 32 -31 237 82 -6 -10 22 -211 114 8 -112 241 35 32 83 63 -35 89 40 200 66 209 67
5214F7k76K67j81J72p9J8Kj54J57j42M2O9jJ69r4K0pJ46k05k32K33Q7r3K51k31
$$ 67 -209 58 -123 49 -30 -12 -10 -164 -7 -149 -107 -38 -39 130 36 56 49 195 -10 -242 -9 78 -15 236 5
5239En7J74m8l22K87j64j2J32PL4O6k33N8K40r8M1l5j6j64O9J46m0j42K75l50
$$ 5 -52 122 74 -248 39 -125 -137 -5 2 36 102 -131 -73 167 69 110 75 59 -105 -36 110 70 -72 203 -147
5264a47J64R4n5j2o1K66m43L54Q9k77L50l83o4K39j22j98L37j21r1p5M16k45J4
$$ -147 17 111 56 44 -17 249 -194 160 249 -28 322 -61 -125 114 -8 -206 131 10 -81 -156 260 15 29
5287B9J48k30n9K35j91k9J95j40k49M46O2l54K21k96j7J84l1k7K5J75k16K14j0
$$ 29 177 -53 -112 123 -68 -97 98 -42 -291 155 217 -137 84 -212 -229 -45 -76 -103 -78 97 -119 95 85
5310H5k77P7J72j64J10o2J98k91J39j2j34L65m18J99J51k22N6J38j52K2K64j12
$$ 85 -192 -115 57 -107 3 -59 139 -152 -13 -25 -159 206 -212 -13 138 -84 -28 110 -42 -20 244 132
5332A32j46K19k29r3QL69l88p0J14K58q6P6l60J47J35m05K94J59j30j88N5j82
$$ 132 -14 205 -24 -117 -109 260 -128 -198 -84 174 88 164 -196 -49 86 -319 -25 134 4 -184 -129 -311
5354c11L25Nl7j27K48n4k64K00k9J00M5l17J24M01n01r7Q1M07j72l82P35j07k82
$$ -311 14 19 -18 -145 103 49 -215 -15 -44 56 101 -216 -92 309 -192 -289 -208 199 27 -355 380 273 -9
5377iK3j7j46K10j83N7J85j40k9j0k4M2K00k73P1K73j06o9k82K60J62j64Qj63
$$ -9 14 -3 -149 61 -122 -65 120 -20 -49 -59 -83 -41 159 -114 -43 230 124 55 -227 33 195 31 39 -124
5401a24p1J49j28L2R8R7q5L8K9j0K35m07j08L63j24j16q5K24J78j23J35m34J63
$$ -124 -195 -46 -174 -142 -44 53 -32 6 35 25 260 -147 -255 108 -16 -132 -217 7 185 62 197 -237 -74
5424g4l6r9K43P0j16J6N2n4O0j38J73k51K20O6l89L23n2k14M45j69m7p5K5Rp2
$$ -74 -110 -209 34 104 -12 4 56 2 62 -76 97 -154 66 132 -257 66 14 -200 245 76 29 -46 -21 -12 -84
5449h4p2J3K55j6k25J06J19j29J88k25k29K85J38j98O3M0K6k54J09p8JP5N0J18
$$ -84 -156 -143 112 96 -129 -23 96 -33 155 -70 -299 -14 124 -74 -11 29 55 -199 -90 -168 -167 -92 -42 76
5473G6kr3M8OK1M2k62J09ON6k75P8L22kq7j79J24J05K61k56p3M9oo3J01r8j17
$$ 76 74 -19 29 35 56 98 -164 -55 -49 7 -268 -190 132 130 43 -136 -12 93 354 98 25 74 68 5 106 8 -109
5500a09J99pj45J00K91r5m12J42J46j15J25j67l87K41M6J70J11k02q1L20k3l99
$$ -109 90 83 -62 38 329 234 -178 -36 110 -5 120 -47 -434 -193 -147 23 134 -68 -149 171 148 -251
5522b51J80m0N0J56L2k39K0Q5J05q2j1oO7N6pk5j35k9r9L40l1l98L77R2l22J06
$$ -251 -71 -111 -61 95 127 -112 -92 -7 98 16 5 -1 66 122 115 90 -45 -74 -173 167 136 -262 115 207 -115 -9
5548ij05r5M00q4m63M33J26l21j4K54J06l75M28k78J62k03J84p0K72m88R9J6k35
$$ -9 -114 -209 191 107 -356 77 203 -118 -132 122 228 -147 281 3 165 -38 146 76 348 -140 -41 -25 -260
5571b60M25n6j6j7k4m2l9R5p4J99j94K36l12J70l3q6L17k45k46Oo3M9J13j18K48
$$ -260 165 109 93 76 52 10 -29 66 -8 191 -3 233 -79 91 58 -28 289 44 -202 -196 -259 -210 -97 -215 33
5596C3K8k7k35l0M18j45l5K35l49oQ8J68j83o9K48k49J86N4q0k13J98k58K05k05
$$ 33 61 34 -201 -231 187 42 7 242 -107 -113 -25 143 -40 -109 139 -110 76 130 50 -163 35 -223 -18 -223
5620b23L0J30j00r9N0K71O4k96K93K22l72J16p4j74J03Q7k7n3KJ81k10O7j33j
$$ -223 -193 -63 -163 -262 -212 59 123 -173 120 342 -30 86 12 -162 -59 28 1 -52 -50 131 -79 -12 -145 -146
5644a46K09k55R6J72k4j62j4L05j34J30j39j99m1J71l5K07l17Q5n5L13j87o0m
$$ -146 63 -192 -96 76 52 -110 -124 181 47 177 38 -161 -202 -31 -66 141 -176 -91 -146 167 -20 -80 -84
5667h4M6M3k50M46j83N3lJ05k79n0J20P7R7r0j68K73l06J60K38k69K4R2m4J8Q3
$$ -84 -38 5 -245 201 18 71 68 173 -106 -156 -36 41 138 48 -120 153 -153 7 245 -24 0 92 48 66 149
5692A49l85J21K14l28j68N79k22J74j96j20K60j26J68j74L5J20j63j07J6J57J10
$$ 149 -236 -115 99 -229 -397 182 -40 134 -62 -182 78 -48 120 -54 -19 101 -62 -169 -153 4 114
5713A14k49j71M54O8j94J39k40k30L65j53L1K21q8k15l7L40j65j91MK39L55P2
$$ 114 -135 -306 148 216 22 161 -79 -309 56 -97 -66 155 67 -148 -185 155 -10 -201 -197 42 397 469
5735D69n97J8K07Q1K98p80N45M02p15j00k15R56l87o8k70K72k55K27R1k33N2P7
$$ 469 -128 -110 97 178 476 -304 241 643 -72 -172 -387 569 182 114 -156 116 -139 88 179 -54 -2 75
5757G5l10J68J88l55N53l04J62k25M22l87N9j0j13K44l65K85j74k7p6M8k9M5R1
$$ 75 -235 -67 121 -234 319 15 177 -48 374 -13 46 36 -77 167 -198 87 -87 -114 -190 -142 -171 -126 -35
5780c5J09q1l9K02j29k12K85l8O1k77L18j43j62J45n6K0n5J67J31k05o3k1J29
$$ -35 74 -7 -46 156 27 -185 100 62 123 -154 164 21 -141 4 -52 -32 -87 80 211 6 -57 -78 51
5803E1k19O0O3n6O7J94k95k0K51lj89M6p8k02K73P0M2P7j76M1K1N1k95pM31k08
$$ 51 -168 -108 -45 -101 -34 160 -135 -155 96 93 -96 -50 -128 -330 -57 13 55 132 -44 -3 18 69 -226 -233 198 -10
5829a0M0j18Q3o2k5O9j79O2L3J7J89P1K7l03M0j2J23m6j10O1P4m6p1J40kq1J07
$$ -10 30 -88 -5 -67 -92 -23 -202 -140 -107 -90 99 170 197 -106 -66 -78 45 -1 -111 -50 24 -22 -93 47 45 -36 71
5856G1m5J02p3m3n9J98l46K82r3L4J01r4k29J67L8K0K7j54M0j32K96l7r3K94j39
$$ 71 26 128 55 12 -47 151 -195 87 -6 28 129 35 -194 -27 11 31 58 -96 -56 -188 108 71 -22 272 133
5881A33O0j89j15J15J04j64J00Q5j74J76m4J16k31J40L0l75K21L3J00j20j45R4
$$ 133 193 4 -111 4 108 -56 44 129 -45 131 87 203 -28 112 142 -233 -12 21 121 1 -144 -50
5903e0j06J62Pl3K3j33%O2L9k28n7L07Q7N6k34K27l01J70J27j84RR1m7J47j39
$$ -50 -156 6 13 -20 3 -130 -130 -68 -29 -257 -314 -7 80 136 -98 129 -172 -2 125 -59 -50 41 -6 141 2
5928Bj87J54J12N7q3J40j90L77o31J55l1N9o7l6j5K52j20j14L60j24j16Q2J74
$$ 2 -185 -31 81 138 55 195 5 382 -249 -94 -125 -66 -133 -169 -184 68 -52 -166 194 70 -46 36 210
5951B10j07k72q1J43K80Q1l50J19k5pJ13k06J50k33J94l8L61k30n9K21l48K86
$$ 210 103 -169 -250 -107 173 254 -96 23 -2 -9 104 -102 48 -185 9 -29 332 102 43 264 -84 202
5973B02k68J60p5j23N7J11j63j16r9L24qLmj93J80j4J44j64J90p1J1q0J21j01
$$ 202 -66 94 19 -104 -47 64 -99 -215 -314 10 2 5 1 -192 -12 -26 118 -46 144 73 84 4 125 24
5997B4o4J69j27j48L58j87kJ2n1Q3j76K32l59K57j35K26p2K22m99M43k69p4r9
$$ 24 -40 129 2 -146 212 25 23 35 -16 67 -109 123 -236 21 -114 112 40 262 -237 206 -63 -137 -236
6020b36J41k15L37O8p0k6J66l45k65O40k02m8L6j72K90k24R2j24R4J90j57J08
$$ -236 -95 -310 27 95 25 -1 165 -180 -445 195 -7 -55 -19 -191 99 -125 -33 -157 -63 127 -30 78
6042G8J58j54J8k2P0k07J95r4l5R5J02j08q3j13j93L84k5m5j74n1j00N04J16k8
$$ 78 236 82 100 78 148 -59 136 42 7 102 204 96 13 -100 -293 91 66 21 -153 -204 -304 200 316 288
6066B88m59J97r2K3k49K0K22M3K91m39o53Q14p7K14j89o2L99q6m70L93k29J02
$$ 288 -171 26 -66 -43 -292 -272 -50 -7 284 -155 -808 6 -71 143 -46 -108 291 205 -265 128 -101 1
6088An7P8N7M7l44L14j95k45K84M9j99j8L03j47K2J14Rj73J00N1k1n8O5R0N1k70
$$ 1 -56 22 79 126 -218 96 -99 -344 -60 -11 -210 -228 75 -72 -50 64 73 -100 0 51 30 -28 37 127 178 -92
6114i2j0L3K71k78K34j62N0mJ02m54L50p6N6j01m1j79L13K69o4l40O2J89q3p9
$$ -92 -102 -69 202 -76 158 -4 46 42 144 -310 40 -36 20 -81 -122 -301 12 281 217 -123 -61 128 45 -34
6138c4p4J75m0J33j83J4j11J04J46r7j9l3n0K2N3r3J42k72M2K47k34J90k02J25
$$ -34 -108 67 27 160 -23 -9 -120 -16 130 33 14 -19 -69 -47 6 -87 55 -217 -175 72 -162 28 -174 -49
6162d9J78j40J02j96r3K25LK6k5k3l3Q7j51J62k06J41k24L5J23Q6M4j35K25k54
$$ -49 129 -11 91 -105 -198 27 30 56 31 8 -25 62 -89 73 -133 8 -216 -181 -58 28 72 -63 162 -92
6186i2J44R7j85J1p9KP4j0L9j68J01k8K25k4j83J50j10J58j23K18j39J11k46J89
$$ -92 52 149 -36 -25 -104 -102 -28 -38 1 -167 -66 -94 131 107 -76 74 -36 122 -1 217 78 189 -57 132
6210A32l17L34j69M7J59k57J3j6J82m6j57K57R3m13L14j57O6o7R8p3J39m9j12
$$ 132 -185 149 -20 27 186 -71 -58 -74 108 62 -95 162 255 -158 156 -1 65 -2 96 23 162 113 1
6233AN8j91J81J49m82O29l72J46m4k86J64K49m00K30J80k53M7R1j86R1J8Q4p6
$$ 1 59 -132 49 198 -284 345 -27 119 75 -211 -47 202 -198 32 212 -41 6 97 -89 2 20 104 28
6256B8J4j61L40k60n8J07M6j7Q4J9m18L63O8q9k4J53j71r5K05k14K09l29J92N
$$ 28 42 -119 221 -39 -97 10 56 39 123 142 -276 87 155 66 42 195 24 -71 134 -80 129 -200 -8 -3
6280cm0O2m4J07o6N1j07j72J14N9J52J93k69l8l49N12r1n0m4J33k16K04j37k53
$$ -3 -43 19 -25 82 16 67 -40 -212 -98 -39 113 306 37 -1 -350 162 71 21 -23 110 -106 98 -39 -292
6304b92K76L06k77k20J28j5m7K76j74Pj21J00L43o0n9k48L66l34L80n63K40k8
$$ -292 -16 290 13 -207 -79 -94 -141 135 -39 -32 -153 -53 290 230 171 -77 289 -45 335 -228 12 -16
6326a6J65j77J9M1j06m0j63K14J31l1j1j3j75J36k30K94j87n2K07K6k61Q4J55
$$ -16 149 -28 -9 32 -74 -114 -277 -63 68 37 26 13 -162 -26 -256 38 -149 -201 6 32 -229 -145 10
6349A0K6l2K60m80L57j21K47m28J20K18j08Q2j80k7l23J24L42R0P1j72N9j68L2
$$ 10 36 4 264 -216 141 20 267 -161 -41 177 69 151 -29 -56 -379 -255 87 177 248 76 135 -33 -1
6372aR1o6j24J40o1K33j72n6j99J05J15J07j45J54p9k34M42j39j67N0Lj54l9L24
$$ -1 90 24 -100 40 -21 212 40 -16 -215 -110 5 112 -33 121 42 -192 250 111 -56 -6 -3 -157 -196 128
6396A28j53J61J60m96K37j09j27J39R6j33O4Q2pq2j11M6J89j77N3J60J1j77j48
$$ 128 -25 136 296 -200 37 -72 -199 -60 36 -97 -33 49 42 -40 -151 -105 84 -93 -40 120 131 -46 -194
6419a94J78J05Rl04k5L00q9K95l80j24K32J79l55L84j01k6k7l97O02j99k2J50
$$ -194 -16 89 98 -206 -231 69 -20 275 -105 -229 3 182 -173 211 110 84 57 -340 262 63 41 191
6441A91j22m00L75j23P0K00j83K93k58K40j85Lo4k28K36J28k28p0J65r5n7L48
$$ 191 69 -331 44 -79 -9 191 8 301 43 283 98 101 37 -191 45 173 -55 -125 40 -55 -112 236
6463B36k10m0M3o8K86l77J3J29K58l73M66n54J17L8K60k88M1r9r3L62j99N8J30
$$ 236 26 -14 29 -39 247 -130 -117 12 270 -103 363 -191 -74 -36 224 -64 -23 -122 -215 147 -52 6 136
6486A36j12m2NJ24P5l07L02k90K73j62Q1k54L74j06k57J22J5j54K87k41P3L2O6
$$ 136 24 -18 -13 111 186 -121 181 -109 164 2 83 -171 203 97 -160 -38 -23 -177 110 -131 -58 -26 40
6509D0j48L20j69j1J97m53J97m4l6K28n7M5R7l03L46m48L43j83p5K71k15jqK36
$$ 40 -108 212 43 32 229 -224 -27 -71 -107 121 64 109 206 -97 249 -199 144 -39 -114 157 -58 -59 -67 169
6533A69j22j98M10k24N1p9p8L40l06R4K62j64j38L5k9m4J02j17K54l97J49J14
$$ 169 47 -151 259 35 86 7 -71 269 -37 57 319 155 17 52 23 -21 81 -36 218 -179 -30 84
6555H4k4Q6k84k0K03k79M23k42J8J32k45l6N8J6l1J71m10L38J0n4J30m3L2k7o8
$$ 84 60 146 -138 -158 45 -234 189 -53 -35 97 -148 -184 -126 -110 -141 30 -380 -42 -32 -86 44 1 33 6 -62
6580f2p4L73k57n5P5J5l5N3J07m12M13k77n2N54k45k36K2O5J7J78Pk15n5J92k50
$$ -62 -136 237 -20 -75 0 15 -20 33 140 -272 141 -136 -188 366 121 -115 -93 -28 -11 167 174 -41 -96 96 -154
6605a54j8J97j35M0L0J50j5l04N18l97J10J90m40P4L03l14J64K9j44J40n8R3j40
$$ -154 -172 25 -110 -70 -40 110 95 -209 309 -88 22 212 -228 -154 149 -165 -1 28 -116 24 -34 59 -81
6628h1K05k51J57l4J23m03K23J99l12M40l11M4K4L5J32k50n7J75r1L26l82r4K12
$$ -81 124 -127 30 -4 119 -284 -61 138 -174 266 -45 -1 23 58 190 -60 -117 58 -33 293 -89 -183 29
6651B9O9p0J93k46q2JJ55L0k12K74r0J29k30K61j37l00o7K58K37m04N6L59o76
$$ 29 98 28 221 -25 -107 -106 49 79 -133 141 51 180 -50 211 74 -226 -293 -35 202 -202 -146 213 -463
6674d63L18J33j71L05j19j84Q7J16n1N6R6m24L80K0N1J9l22K79k90L12Ml46J15
$$ -463 -145 -12 -183 122 3 -181 -94 22 -29 27 123 -301 79 99 150 169 -153 126 -164 148 152 -194 -79
6697g9n7K07l5M5p9L1Ok62j7M32l60J89p8Q7j58P3mm3K51k04J44r6J41k7j2r4
$$ -79 -136 71 36 81 2 33 39 -223 -240 192 -168 21 -57 30 -128 -55 -59 -102 149 -55 89 -7 134 107 95 1
6723AJ35j2j20o4Q9j67j04L4L85n5m8r7L7K8m0M0q8J74l3j93J02J09K1q0N0j43
$$ 1 136 124 4 -60 29 -138 -242 -208 177 122 74 -23 14 42 2 42 -46 128 95 -98 4 113 134 54 104 -39
6749c9n7J99k88J08K01J35j16j12j31J24M4q7J05J9J9K2m3j41K04k32L5n3R0o0
$$ -39 -96 103 -185 -77 124 259 143 31 -100 24 68 -19 86 105 124 146 103 -38 166 -66 -31 -84 6 -54
6773e4K2K88j81r0m0j45J61N7j86K8J69L6k32P3K14j86o6J38K11k61K22k94J36
$$ -54 -32 256 75 -15 -55 -200 -39 18 -168 -140 29 65 -167 -94 120 -66 -132 6 217 -44 178 -116 20
6796B0J8l10N9K87m3J76k54J1J28r9J31l31J24NQ1p4L8J8J73n36O32m17R0K52
$$ 20 38 -272 -213 74 31 207 -47 -36 92 -7 124 -207 -83 -78 3 -71 -33 -15 158 -378 254 -163 -73 179
6820A79l56J82l9j50J48j12j57K73j66L03j1l21J32j04L12K1r7o9P2K31j01j49
$$ 179 -177 5 -34 -184 -36 -148 -305 -32 -198 105 94 -227 -95 -199 113 134 37 -32 40 271 170 21
6842B1J93j06j24j05J68m4QM5Q6k45L72m84K48j44J96k21K79k64J80L9p8p5M4
$$ 21 214 108 -16 -121 47 3 11 56 142 -103 269 -215 33 -111 85 -136 143 -121 59 98 20 -55 -11
6865a1j2p8K58k71K59j41O8j49l9R7J06J34m34O8K00p9J49j80J32j14J2j3K08
$$ -11 -23 -101 157 -114 145 4 72 -77 -116 -19 87 221 -213 -145 55 -24 125 -55 77 -37 -25 -38 170
6888A70j20J66j35k97N50m93J61J69R1n61N56n36L04k18j07L0K00N5M6n8o4M3
$$ 170 50 216 81 -216 334 -159 2 171 262 -299 257 -279 25 -193 -300 -270 -70 -15 31 -27 -91 -48
6910d8J19l39K95J05o7j76J06K36j22j24j9O2o1L2l5j27K42j65O3m4J67J32l07
$$ -48 71 -268 27 132 65 -111 -5 231 109 -15 -34 28 -33 -1 -36 -163 79 -86 -23 -67 100 232 -75
6933g5J21p0N1J76R1k64J07k8l77K80J14j04O0j19K53j77k33K33Rk37J8M18m34
$$ -75 46 -24 27 203 294 30 137 109 -268 12 126 22 82 -37 216 39 -194 39 48 -189 -171 247 -187
6956a87J36j09J92l45K29L64k96k11K27m2J54j95J73j27l54L92K71l45o9L48k5
$$ -187 -51 -160 32 -313 -84 280 -16 -227 0 -42 112 -83 90 -37 -391 1 272 -73 -142 206 181
6977A81l02J23o4O8O7l7j74J84J05l49K70j22J44k97K08n1K1J44l6r5r3K37J72
$$ 181 -121 2 -62 6 73 36 -138 46 151 -198 72 -50 94 -203 5 -46 -25 119 83 -12 -105 132 304
7000C04nm45J53l3P5K4r3O4l0J05n8J77k91J34j00Q4j16Q4j32K54j29n9k13L66
$$ 304 299 -146 7 -26 49 73 -20 44 14 119 61 238 -53 81 -19 65 -51 33 -99 155 26 -33 -246 120
7024A20q9m0P4j99K06o0k38K75k1j71J47j37J83P8o0J9l7k87K03j0M2R7n7N0K6
$$ 120 31 -9 65 -134 72 12 -226 49 28 -143 4 -133 50 128 68 87 50 -237 -34 -44 -2 95 38 88 114
7049A14j69K94n7j70N8K24l04r0J50r4K8J72j80Q3j03J85L3j76K1j22R9p2L3O6
$$ 114 -55 239 182 12 70 294 -10 -100 50 -44 -16 156 -24 59 -44 141 174 -2 19 -103 -4 -76 -43 23
7073B3o7KK32k29J66j80L07o1r4k26K12q3R1j38j6O5j91J03r4K40r3J86k10M9
$$ 23 -44 -42 190 -39 127 -53 254 193 99 -127 85 2 93 -45 -61 4 -187 -84 -178 62 -31 155 -55 -6
7097fJ17k57L46j50j18j23L01j55j25K36o9J14r3J90K6o7k29K24k69J81j18mj89
$$ -6 111 -146 200 50 -68 -191 110 -45 -170 66 -3 111 18 208 234 167 -62 162 -107 74 -44 -48 -237
7120b37K79P5k16p2l6K02L0j67M8M8K81k10l1M5M0M1m6j61J61l40J70L1j14L92
$$ -237 42 117 -99 -171 -207 -5 25 -142 -94 -46 235 25 -6 39 79 120 74 -87 74 -266 -96 -65 -179 213
7144B13k29m8R3r1J37J00k37n7L02l29L49l97J19j38K05o0L35l68K46j58jj0n9
$$ 213 -16 -64 29 -62 75 175 -62 -119 183 -146 203 -194 -75 -213 -8 -68 267 -101 145 -13 -14 -24 -83
7167h3M6J7m2j3m5N8j52L61kK1j84K16j37p5J27j74K41l09M8J31J02k96K59j5
$$ -83 -37 -20 -62 -75 -120 -62 -214 147 145 166 -18 198 61 -14 113 -61 180 -129 -81 50 152 -144 115 100
7191A00k3O4j42j6J94j83K17L9k36l8r1L19K9j02j04j74L6J49M3k18K78l03J75
$$ 100 77 141 -1 -17 177 -6 211 250 14 -24 -115 204 233 131 27 -147 -111 38 81 -137 141 -162 13
7214A3m5L8K15k85O3j85K49k28J76j77J20J59q7j2K8p0nK06K9l59M04o5R4k89
$$ 13 -32 6 221 -64 -1 -186 63 -165 11 -166 -46 113 26 14 42 -28 -33 173 202 -157 247 182 276 -13
7238a3j84L44m5p3J22k24J32j35J38p2jN2k56M01k18Q9j06J08N9j12J73q4j55
$$ -13 -197 147 102 29 151 -73 59 -76 62 -10 -11 41 -215 186 -32 57 -49 59 118 6 179 95 -60
7261f0k52N88o45L17j68M00k2j52l94K40J04K00R6k6J04n30n2L71k7j78K4lK21
$$ -60 -312 276 -369 -52 -220 180 158 6 -388 -148 -44 156 252 226 330 -200 -252 119 92 -86 -62 -65 156
7284A56k33J58j14Q5k88q6q2N24k55L71k70O1M7o0j41K70r0j52L7R0R3r7K5J90
$$ 156 -77 81 -33 52 -236 -322 -404 120 -135 236 -34 27 74 14 -127 143 53 -99 -62 28 121 24 49 239
7308B39m0j6m16l66M11K66J6J13q10L15K77k02L15J65j67k91K50j25J69l5j16
$$ 239 199 183 -233 -599 -188 78 94 207 -603 -288 -11 -213 102 267 100 -191 59 -66 103 68 -48
7329d8J25j0q6m9J5K05P9k31q3J69o1M7M4M0j18K5j00m6j36L5L66l38J20n1P1
$$ -48 77 67 -19 -68 -53 152 231 0 -83 86 25 72 116 156 38 63 -37 -83 -219 -184 182 -156 -36 -87 -16
7354a6r0K88k80J78o8J94k31P5J54n2m8k76K58K8k06Q2Pl7R6O1j23l7J2J3J06
$$ -16 -106 182 -98 80 12 206 -25 50 204 152 104 -172 86 114 -92 -10 -3 -40 56 117 -6 -43 -31 -18 88
7379H8n1j24j9K95k37K55k02k2j8K8n9L38l60M7J26j42j08J70M7Q3l4n1k15K08
$$ 88 37 -87 -106 189 -48 207 5 -17 -35 -7 -66 272 -88 -41 85 -57 -165 5 52 135 101 50 -165 43
7403D3n3j71N1k0N98m77n3J43J14j21k4q6j7L9j2n8j58K75N1M4k5k9j10J87j24
$$ 43 -10 -181 -130 -150 448 -29 -82 61 175 54 30 -56 -73 -34 -46 -104 -262 13 64 108 83 54 -56 131 7
7428GR6k59Q0M25k04r0Pp6m7Q9o5j16Q9j49K86k50L05Q1j41j59J15k51J31K16
$$ 7 103 -156 -76 349 145 55 62 -14 -61 28 -37 -153 -64 -213 73 -177 128 209 68 -91 24 -227 -96 120
7452A20m01M09k18j6n4J16K3q4L51k22k28M29l36qK19q3k7J8j35K13j85M19k73
$$ 120 -281 128 -90 -106 -160 -44 -21 -105 246 24 -204 225 -111 -119 100 17 -10 8 -127 86 -99 320 47
7475D7m3J54j88J21l71L42k36K77k71J45J22O1n6j64K7m6J16n5q1Q6K1j28J35
$$ 47 4 158 -30 91 -280 62 -174 103 -168 -23 99 160 104 -60 -33 -79 37 -18 -99 -13 8 -120 15
7498A5N5l15K98J66p2k53L29p7k05J0L4J31k74K26N8m0j09J67l42J27L61j56o
$$ 15 70 -245 53 219 147 -106 223 146 -59 -49 -15 116 -158 68 126 86 -23 144 -198 -71 290 134 128
7521A28N6k33M20l40k36L71L1j93q4K15j07q3J2J44j73M0J52j33O8N4m4q7O6k24
$$ 128 184 -49 371 31 -205 166 197 4 -80 135 28 -55 -43 101 -72 -32 120 -13 55 109 65 -22 44 -180
7545a80J14p6K71l25L78k23j78MJ1J40Q0P3l21K09J85k72J28J97N2k61j15L46
$$ -180 -66 -142 129 -196 182 -41 -219 -215 -204 -64 16 89 -232 -23 162 -110 18 215 267 6 -109 237
7567B37n44M62j50l7l2K50j13j55K91m00L23k00J19j46Q3L7q5l3j21K80l25J13
$$ 237 -307 155 5 -32 -64 186 73 -82 209 -191 132 -68 51 -95 -12 25 -60 -93 -214 66 -259 -146
7589a46r6K49l0K03j07l64P1J26L48j60n1o3j91L79m02K46K22j24k34L38k61j97
$$ -146 -242 7 -23 180 73 -291 -220 -94 254 94 43 -20 -211 168 -234 12 234 110 -124 214 -47 -244
7611b44M72j52k65RJ78r6M5P0K21p7k72k2K92j99J50Q6k47o3L59k29j40J80N4
$$ -244 228 76 -189 -180 -2 -98 -53 17 238 161 -111 -133 159 -40 110 196 -51 -114 245 16 -124 56 110
7634A10J66o7l3p7j65n1Q7m3O5%L5r8L47k18p6r8j0L41l48K50p9J28l52l5L24
$$ 110 276 209 176 99 -66 -117 -30 -73 -8 -8 27 -71 276 58 -18 -116 -126 215 -133 117 38 166 -186 -221 103
7659A03j19r1k0l3L30j89J84k21j11M22m37n3K86l7k30K43k60L43K6l09K41K1
$$ 103 -16 -107 -127 -160 170 -19 165 -56 -167 255 -182 -235 51 14 -216 27 -233 110 136 -173 68 89
7681H9m4K0J03j04j67O8Q4j10j28k9K04P0n1P7PR6J04m80J39N8k72M04j28J43
$$ 89 45 65 168 64 -103 -35 49 -61 -189 -218 -14 56 5 82 89 185 289 -191 -52 6 -266 138 10 153
7705A53j82j36J01j82M02o7m1r8J11J08m75L33m7O0l8K36p0r8K57k80N7ql2K9
$$ 153 -29 -165 -64 -246 156 89 48 -50 61 169 -306 27 -20 40 2 238 168 70 327 47 104 96 64 93
7729I3j30K67l19P8N1p9r5j37K60j55J82J43p6n2L96l33l2j79J58J55k54O8j3
$$ 93 -37 230 -89 -11 40 -39 -134 -271 -11 -166 16 159 83 31 427 94 62 -117 41 196 -58 10 -3
7752cJ21k61K63j46k3M30k40j05K1M2k35K79k13L6j6M6J56j98L8M8j18J70n7p5
$$ -3 118 -143 120 -26 -49 381 141 36 57 99 -136 143 -70 -34 -50 -4 152 -46 -8 40 -78 92 35 -40
7776d0n8n7J2J60l6L95k52k54q3L5J48J03K71m89L59k93K2J8m7P5P7J02l61K68
$$ -40 -98 -155 -143 17 -19 376 124 -130 -213 -178 -30 73 344 -145 214 -79 -57 -39 -86 -11 66 168 -193 75
7800G5J90k49ol3J89k66K05R5l61J07n4K25j54K2J33q2M4l31J57K13Q7m63L14
$$ 75 265 16 10 -23 166 -100 105 200 -161 -54 -108 117 -37 -15 118 36 80 -251 -94 119 206 -257 57
7823E7J59q5l47J13J40p3j95L04j05K4j44l7J28O1l56K74J03l0j93Q0K83k65n4
$$ 57 216 131 -216 -103 37 -36 -231 73 -32 -8 -152 -189 -61 0 -356 -82 21 -9 -202 -122 161 -104 -158
7846a58J24o4P6K46q8j6P3k61J42n9o3j64K22j52R4M12j40m60L95k92K06p7j03
$$ -158 -34 -98 -22 224 136 120 193 -68 74 15 -48 -212 10 -142 -48 364 224 -236 159 -133 73 -4 -107
7869a07Q9N0J9k62J28j06K85J5k79J65K26j43r9J2J81k31J7Pl8R2p1O0k02K39
$$ -107 -18 32 51 -211 -83 -189 96 111 -168 -3 223 80 -19 -7 174 -57 -40 -33 -71 21 -50 10 -192 47
7893D7m72M01jp0p6M9J94k37o7J76j43Q3K40k22K5J9K49m03K72p9j24J53K5k57
$$ 47 -425 -24 -25 -95 -171 -122 72 -165 -232 -56 -199 -116 124 -98 -73 -54 195 -208 64 -15 -139 14 39 -218
7917b18L40j14k0P1l6J80l63J74O5j37r6o7L21k51J71l9P2J2p1o6J48o8j87K59
$$ -218 122 8 -12 59 23 203 -160 14 79 -58 -154 -221 100 -151 20 -19 53 65 -6 -72 76 8 -179 80
7941H0m0J42Qk29k31L29j2K78l80M34j68k02J2O4l92K57J91l35P5J87m3r3o1R0
$$ 80 40 182 190 -39 -270 59 47 325 -55 379 211 9 21 85 -307 -50 141 -194 -119 68 25 -68 -129 -39
7965c9J02N0k96K42O7j53P1j60J69j58J46q7j50K46L6l67K34Kp2Q0K42j41k54
$$ -39 63 113 -183 59 126 -27 44 -116 53 -105 41 -46 -196 50 86 -281 -47 -45 -117 -37 205 64 -190
7988a90J20J36j50K30j95j2L54m51L66l26o8R4L8J07J74k41O4J47k35O7Pk8R3
$$ -190 -70 66 -84 146 -49 -61 293 -158 208 -118 -186 -92 -54 53 227 -14 50 197 -38 29 36 8 101
8011A01n3l9K72l48K34j65N1k4J06j72j65K06m0KJ04K9k81K13rk23O7P6j4J42
$$ 101 48 9 281 -67 167 2 53 29 135 -37 -202 4 -36 -34 70 99 -182 31 22 -201 -134 -58 -72 70
8035G0J6j55m7K00L8k20M9p7J70j55J89k11M09k89J10j35M3p2K06j30j28p8M32
$$ 70 86 -69 -116 84 122 -98 -49 -126 44 -111 78 -133 276 -13 97 -38 5 -67 139 9 -119 -197 235
8058B35k37k89N16j21q2n7kN6J75k50K21q4o5J51k83j04L36k86J96J1l12N35m
$$ 235 -2 -291 225 104 22 -35 -37 19 194 -56 165 81 16 167 -116 -220 116 -170 26 37 -275 260 256
8081B56l88K4K5J39m7j8j15K20j29K56k85O8O3Qk54R2J36MoO0l33K08J14Q9j15
$$ 256 -132 -108 -83 56 9 -9 -124 96 -33 223 -62 6 69 77 -177 -85 51 55 49 109 -224 -16 98 187 72
8106G2j12k6K18j49K1j39j60J16k4M7K65j11P3K1J65l70K49j55j10L70j24K51
$$ 72 -40 -66 152 3 24 -115 -275 -159 -183 -136 129 18 91 112 277 -93 156 1 -109 261 137 388
8128C88j44m67L16q0j05J64j46J09l6K67k69p3J09m07M27R1j30K%O5r4p8K76m93
$$ 388 244 -223 93 13 -92 72 -74 35 -1 266 -3 -76 33 -374 53 144 14 16 16 81 -13 -91 185 -308
8152c08J94J42k6J63k10K98q7k66J39K5J48l11N1K61l22J34p1r4Pk9N11n07M15
$$ -308 -114 28 2 165 -45 253 166 -100 39 64 212 -99 -48 213 -109 25 -46 -140 -133 -162 349 -158 257
8175B57j24j19j52L5j70L04J53k83K64k32m6k3K79k14%P0
$$ 257 133 14 -138 -103 -273 31 184 -99 165 -67 -113 -136 143 -71 -71 -1
8191a
$$ Imaginary data points
##PAGE= N=2
##DATA TABLE= (X++(I..I)), XYDATA
0@%%%%%%%Qj6J6j6J8k6L2m0N6p2Q8j08J32j60J92k32K73l15L70m32N02n82O66
$$ 0 0 0 0 0 0 0 0 8 -8 8 -8 10 -16 16 -24 32 -40 48 -60 72 -88 104 -128 145 -170 200 -232 270 -312 354
30C54p63Q70r86J120j266J428j604J797k012K246k500K778l082L415l778M173
$$ 354 -409 461 -525 595 -671 757 -847 950 -1062 1184 -1316 1462 -1620 1795 -1983 2190
46B190m608N082n601O172o796P486q251R101j0052J1119j2331J3720j5323J7205
$$ 2190 -2418 2664 -2937 3235 -3561 3925 -4326 4775 -5277 5842 -6489 7231 -8092 9113
60I113j9452K2186k5596K9984l5870M4216n7039P9434j29497M36147m1496o82872
$$ 9113 -10339 11847 -13749 16235 -19635 24581 -32458 46976 -82521 353626 312130 -370742
72c70742K13671k76160K55229L99089J12138Q1499j78012k34099j99179j99564
$$ -370742 -157071 -433231 -178002 221087 333225 414724 236712 2613 -196566 -396130
82c96130K20069J90481K53095J69278j46656k68828k35447p1669K7577J89073
$$ -396130 -176061 14420 267515 436793 290137 21309 -214138 -285807 -258230 -69157
92f9157K87101M0120N7054j69242l18692q4347o2611J62185K95399J19803K1069
$$ -69157 217944 258064 315118 145876 -172816 -257163 -319774 -157589 137810 257613 278682
103B78682j62987j31823k19829j16524K33916N9140J93685K29472k18413j53418
$$ 278682 115695 -16128 -235957 -352481 -118565 -59425 134260 363732 145319 -8099
113h099j50346j22161O9055J23682K56150K4756l8745J9566l10264j36736P4123
$$ -8099 -158445 -280606 -211551 -87869 168281 193037 154292 173858 -136406 -273142 -199019
124a99019N2758J98124J35127M2704j23504j69729n2000j04015O9362J49524J13807
$$ -199019 -146261 51863 186990 229694 106190 -63539 -115539 -219554 -150192 -668 113139
135A13139J09487r5736q3418j60127j23286J57419K5978J31769J45986j29576
$$ 113139 222626 126890 43472 -116655 -239941 -82522 -56544 75225 221211 91635
145I1635J2j41806j47041R0654r681J69631J51741q2551k3944j27740j10044j39
$$ 91635 91647 -50159 -197200 -106546 -116227 53404 205145 122594 98650 -29090 -139134 -139273
157a39273K8313J39748P7284L3136O473j23016j38035m3339P0309L8616J09858
$$ -139273 -110960 28788 106072 139208 145681 22665 -115370 -158709 -88400 -49784 60074
168F0074J29477j10024m9536l3337j45470P081Q2686J05616M9276J7482J1604
$$ 60074 189551 79527 29991 -3346 -148816 -141735 -59049 46567 95843 113325 124929
179A24929j91965m6408N7321p5108J31239R9250k0113K0021r4605o1945o3380
$$ 124929 -67036 -113444 -56123 -131231 8 99258 79145 99166 4561 -57384 -120764
190a20764P878J28481P196P2408J2117j21162k706p3876k7147R7490L0308O8789
$$ -120764 -112886 15595 22791 95199 107316 -13846 -16552 -90428 -117575 -20085 10223 79012
202G9012K6257o0438q1035n1754J9124j1621Q0853R3871l9624O152l3342r5951
$$ 79012 105269 44831 -36204 -87958 -68834 -80455 398 94269 54645 60797 27455 -68496
214f8496m2789L9076Q2148l832Q0082L3088j57363J7414j1431r8775J05200N9286
$$ -68496 -111285 -72209 9939 6107 86189 119277 -38086 -20672 -32103 -130878 -25678 33608
226C3608J2432L6112l3705n1731p5393P848L9893Q712P2816J8906k5077l0402
$$ 33608 46040 82152 48447 -3284 -78677 -70829 -30936 -22224 50592 69498 44421 14019
238A4019n2519j9491j1498N8427N1402N471K4386o6888k7812m385n0778P1522
$$ 14019 -38500 -57991 -69489 -11062 40340 45811 70197 3309 -24503 -28888 -79666 -8144
250h144L0974L305M9651m6623m2159m0114k555M2381p112P7505R828o5325K8395
$$ -8144 22830 26135 75786 29163 -12996 -53110 -55665 -13284 -20396 57109 66937 1612 30007
263C0007o0693l9130L7207J4859O0124K379J395r396q5584J0903R490j2701N7552
$$ 30007 -30686 -69816 -32609 -17750 42374 44753 46148 36752 -48832 -37929 -28439 -41140 16412
276A6412K8304N918k5699k7707k1565m0671L6626M1178Q204J8724l397k0517n1033
$$ 16412 44716 50634 24935 -2772 -24337 -65008 -28382 12796 21000 39724 36327 15810 -35223
289c5223M445J2173k0226P2504J3005l0584J6298n5473r116J1957p889N1536l594
$$ -35223 -30778 -18605 -38831 33673 46678 16094 32392 -23081 -32197 -20240 -28129 23407 19813
302A9813R076N354n2290J733k0883J0589M9448r787K3047m126m3133o680m764
$$ 19813 28889 34243 -18047 -16314 -37197 -26608 22840 13053 36100 31974 -11159 -17839 -22603
315b2603P16J476N0183J9053m6599K7204l2834n6749M8924P174J54K9944J2611
$$ -22603 -21887 -20411 29772 48825 2226 29430 -3404 -60153 -11229 -4055 -3901 26043 38654
328C8654j7671m1593J8198k4180k3243P4890n495q702K7652l8591j7368n170N503
$$ 38654 20983 -20610 -2412 -26592 -49835 25055 19560 10858 38510 -81 -17449 -22619 -17116
341a7116Q933M136L9783j9018j5813O172m4406J6503K0358q854K8649J674j6905
$$ -17116 -8183 -4047 35736 16718 905 7077 -37329 -20826 -468 -9322 19327 21001 4096
354D096j0914l341j0977q664M3819r77j1578K6694l6365j8686J4169j393M672
$$ 4096 -6818 -10159 -21136 -29800 14019 13042 1464 28158 -8207 -26893 -12724 -14117 -9445
367i445R889L1675k3295k1755K5351m8268R55M6237j8343K0358Q323j6839o885
$$ -9445 444 32119 8824 -12931 12420 -35848 -34893 11344 -6999 13359 21682 4843 -2042
380b042k1394J1648o429O444L5792j2974K156o469k3823M413n679J4479J0417
$$ -2042 -23436 -11788 -18217 -11773 24019 11045 13201 6732 -17091 -12678 -18357 -3878 6539
393F539p4J3143j5241n242j0933p306K1697n905J6910P272k1974P290j3538k466
$$ 6539 6465 19608 4367 -875 -11808 -19114 2583 -3322 13588 20860 -1114 6176 -7362 -9828
407i828Q313k846K2165o670l294L052k4968Q381P83N122J6065j1252J3807j1591
$$ -9828 -1515 -4361 17804 11134 7840 10892 -14076 -5695 -4912 210 16275 5023 18830 7239
421G239k1169J5760j3218L687K0785L318k482j1079N658j7902j0994K8402j0590
$$ 7239 -13930 1830 -11388 -7701 13084 16402 13920 2841 8499 -9403 -20397 8005 -2585
434b585L660K3526j4897j0396m433n15q931P104K5909j9971P798J3372l3273Q824
$$ -2585 1075 24601 9704 -692 -5125 -5640 -14571 -7467 18442 -1529 6269 19641 -13632 -4808
448d808K468j2209J7777M549J121q169j274J21j7830K1041o73j2538K6759j2725
$$ -4808 -2340 -14549 3228 7777 8898 729 -545 -424 -18254 2787 2114 -10424 16335 3610
462C610j2696J1625j0031m774J1621J3322j3384R9J5471k9735K980K0614k0969
$$ 3610 -9086 2539 -7492 -12266 -645 12677 -707 -608 14863 -14872 -11892 8722 -12247
475a2247J2424J6727j0566p703J845p86j8611J7905J3615k0800K1475J944k3703
$$ -12247 177 16904 6338 -1365 480 -306 -18917 -1012 12603 -8197 13278 15222 -8481
488h481R948n249n780P705R886K174r315J1546j0862j3465J8644j3130K096J8633
$$ -8481 1467 -3782 -9562 -1857 8029 10203 888 12434 1572 -11893 6751 -6379 -4283 14350
502A4350j1009J148n3o526l317L056R848j0951Q047O923j8108R336j020r682J0456
$$ 14350 3341 4489 4436 -2090 -5407 -2351 7497 -3454 4593 11516 -6592 2744 1724 -7958 2498
517B498K454J954o250J194M64j3612J4108k24p352J5237p727j886pr162O052l076
$$ 2498 4952 6906 656 1850 2314 -11298 2810 2586 -4766 10471 2744 858 851 -8311 -2259 -5335
533e335P260O203p347N491o239l427Mm468R924k811M881N760j3009K995k482n048
$$ -5335 1925 8128 781 6272 33 -3394 -3390 -7858 2066 -745 4136 9896 -3113 -118 -2600 -7648
549g648N688r56O056k839J892K084j4075Q671j321o005J4245o444k298N105n001
$$ -7648 -1960 -2916 3140 301 2193 4277 -9798 -1127 -2448 -8453 5792 -652 -2950 2155 -2846
564b846r57j510N916l598j248J1908j5760N19J0570j3791P787O762p396J20L840
$$ -2846 -3803 -5313 603 -2995 -4243 7665 -8095 -7576 2994 -10797 -3010 3752 -3644 -3524 316
579C16j012j1744R016N143j2905J7130P67j6397J0845k065r106M952O986l569
$$ 316 -696 -12440 -3424 1719 -11186 5944 6711 -9686 1159 -906 -10012 -5060 1926 -1643
593a643k575J5575j2187r649J6644j3986m87J6021q769l76O979k026q236K708
$$ -1643 -4218 11357 -830 -10479 6165 -7821 -8308 7713 -1056 -1432 5547 3521 -4715 -2007
607b007O989j2773R607R985j8389R862M095j3105O557M024n386j472R371m252
$$ -2007 4982 -7791 1816 11801 -6588 3274 7369 -5736 821 4845 -541 -2013 7358 3106
621C106j0030J4034n332p890J6435p238n956Q059l250m457J840O005o144J538
$$ 3106 -6924 7110 1778 -6112 10323 3085 -2871 5188 1938 -2519 -679 5326 -818 720
635G20J0614j4192P17P072j1012N051M720l442J148K145O75q629L419J879q266
$$ 720 11334 -2858 -2141 4931 -6081 -1030 3690 248 1396 3541 4216 -4413 -994 885 -7381
650g381J2035j260n676P731n703j016Q22j937K023k156N915j973l802N282o271
$$ -7381 4654 3394 -2282 5449 -254 -1270 -448 -2385 -362 -2518 3397 1424 -2378 2904 -3367
665c367J793K901n043N074j911K13K128m473L415j662R96J797l676L362l994R29
$$ -3367 -1574 1327 -3716 1358 -553 -340 1788 -2685 730 -932 64 1861 -1815 1547 -2447 -1518
681a518M100o260N456O61m612M199k915k201O73K802M07k522P078m913l442P689
$$ -1518 2582 -3678 1778 2439 -2173 2026 -889 -3090 -2417 385 792 -1730 5348 435 -3007 4682
697D682q372o40P266l660J228K382l02n051J061N052r971M867O624j0277P711
$$ 4682 -3690 -4330 2936 -724 504 2886 2584 -2467 -1406 3646 -6325 -1458 5166 -5111 2600
712B600K600r109K738L117l221k310P437k889o436J1929n277p532J1759n627l850
$$ 2600 5200 -3909 -1171 1946 -1275 -3585 3852 963 -5473 6456 1179 -6353 5406 -221 -4071
727d071P401k586m568L016N120p384J429Q740j1796K625P889j1405K648P511n219
$$ -4071 3330 744 -3824 -808 4312 -3072 -1643 7097 -4699 -2074 5815 -5590 -2942 4569 -650
742f50l96N686k567p003P599n27j0111J1492m03p811R965k154p137L362K947n340
$$ -650 -1046 4640 2073 -4930 2669 2142 -7969 3523 3120 -4691 5274 3120 -4017 -655 2292 -3048
758c048M33P814o666l74R186r234q86O599n891M11M115r72l378L392K450q142
$$ -3048 -2615 5199 -1467 -1841 7345 -1889 -2775 3824 -2067 -1656 2459 1487 -1891 1501 3951 -4191
774d191N267J837q077P231Q9n894N082l08j175K80J437j367l212N728l081k335
$$ -4191 1076 2913 -5164 2067 2156 -3738 1344 1036 -139 141 1578 211 -3001 2727 -354 -2689
790b689N689l459O50K616l667J54o52N58n55L10K761k834K620j64m207L643k621
$$ -2689 3000 -459 191 2807 -860 -706 -1358 -800 -1355 -1045 1716 -1118 1502 1338 -2869 774 -1847
807a847j04L532k670J892R48j758o1p08M90k459K529K036m347M404j028l569M632
$$ -1847 -1951 1581 -1089 803 1751 -7 -68 -776 -286 -2745 -216 1820 -2527 1877 849 -2720 1912
824A912k557k066K628L77r26j85L495l646n43N895o706O76M828n975J910L713
$$ 1912 -645 -2711 -83 294 -632 -817 2678 -968 -1511 4384 -2322 -1646 3182 -2793 -883 2830
840B830l282j233L744N2n558M750M75p235Q139L38o162O130n25m082J705K154
$$ 2830 -452 -1685 2059 2111 -3447 1303 1778 -5457 2682 3020 -3142 2988 2463 -1619 86 2240
856B240l952o87O921m443k305Q550o933j869O756n219k049N712q65m022M847J010
$$ 2240 -1712 -2399 4522 79 -2226 6324 -609 -2478 4278 -941 -2990 2722 1857 -2165 2682 3692
872C692p636N885K020q657O325J955o035L805K781m816q86N482l796l689P684
$$ 3692 -3944 1941 3961 -4696 1629 3584 -2451 1354 4135 -681 -1567 3915 119 -3570 4114
887D114m781k902Q377m654k293M907j973k837K497J117m579K232N134o654K580
$$ 4114 -667 -3569 4808 154 -2139 2768 795 -2042 455 1572 -3007 -775 4359 -2295 285
902B85L363p160L288J507m079J481K431j023j749L589k214l496N143k401k650
$$ 285 3648 -3512 -224 1283 -2796 -1315 1116 93 -1656 1933 -281 -3777 1366 -1035 -3685
917c685N022k379n84K992j577j200P9J615k704O86K867l692K593J033l651K479
$$ -3685 1337 -1042 -1626 1366 -211 -1411 -1332 283 -2421 -1735 1132 -2560 33 1066 -2585 -106
933a06n80j597J652o72N0J52J259o20m64J994k884Q48K126l658K345Q01j576J357
$$ -106 -686 -2283 -631 -1303 -1253 -1101 158 -462 -926 1068 -1816 -968 1158 -2500 -155 646 -930 427
951D27P29j260j735K310o05k548M124j241k452N482l085k029L142j768r28K294
$$ 427 1156 -104 -1839 471 -134 -2682 1442 201 -2251 3231 146 -1883 1259 -509 -1437 857
967H57P56k900J692L032n617K298K385n870L431K458m304K038K174k605j340L828
$$ 857 1613 -1287 405 3437 -2180 118 2503 -3367 64 2522 -1782 256 2430 -175 -1515 2313
983B313k638l381O547k168l604O231k172l368M181m64m089K387K788n125J655
$$ 2313 -325 -3706 2841 673 -2931 3300 1128 -2240 1941 1477 -2612 -225 2563 -2562 -907
998i07M867o236J608M625o415J178L417l552Q2L683j586k959M999r37n372N576
$$ -907 3960 -2276 -668 3957 -2458 -1280 2137 -1415 -1333 2350 764 -2195 2804 1867 -3505 2071
1014B071j406l817M971n1l537L122R73l942R32L304n148Q96N176n005P86L744
$$ 2071 665 -3152 1819 1768 -1769 1353 2326 -1616 -684 2620 -2528 -1632 3544 -1461 -675 3069
1030C069m173j8L035j949j968K935N62l382L489M12m518L909l83l393L053k19
$$ 3069 -1104 -1122 1913 -36 -2004 931 1493 -1889 1600 2012 -2506 1403 1020 -2373 680 461
1046D61j629J168J353j902q7K410k871l79L052l153J285K071k255O23O76j103
$$ 461 -1168 0 1353 -549 -636 1774 -1097 -1476 1576 -1577 -292 1779 -476 147 823 -280
1062b80o70Q17k79j475K881p14j464K802k316q58K358j565r4J197j44r5O64N39
$$ -280 -950 -133 -412 -1887 994 280 -1184 1618 -698 -1556 802 -763 -857 340 196 101 765 1304
1080A304k493J424R60l103K855l81k192K996l0k273J380M69j941N35K307k977
$$ 1304 -1189 235 1195 -1908 947 566 -1626 1370 1340 -933 447 916 -1025 -490 1817 -1160
1096a160J86L993l652p8L207l189m65K868j696j819L304J20l491L779j96m713
$$ -1160 -974 3019 -633 -711 2496 -693 -1158 1710 14 -1805 1499 1619 -1872 1907 1711 -3002
1112c002M264K23m370L592P38k745J693J808l591j13M212m247k94N053m330m17
$$ -3002 1262 1485 -2885 707 1445 -1300 393 2201 -1390 -1503 2709 -1538 -1832 3221 -1109 -1526
1128a526M741l485j504L186j309k848L611N88m701M426J283n363L423R96m039
$$ -1526 3215 -270 -1774 1412 103 -2745 866 1454 -3247 1179 2462 -2901 522 1518 -2521
1143b521K387K025l315J00M111l163j218M356l738j760N236k902j241L495j322
$$ -2521 -134 1891 -1424 -1324 2787 -376 -1594 2762 -976 -2736 2500 -402 -1643 1852 530
1158E30k003K540j21l316K119J995m092K492K108m024K282J240k957O23J473j713
$$ 530 -1473 1067 946 -2370 -251 1744 -2348 144 2252 -1772 510 1750 -1207 -584 889 -824
1174h24l61K709j468j471L418k495j106K743k033m85K041o67p29J172K16k175
$$ -824 -1185 1524 56 -1415 2003 -492 -1598 1145 -888 -1373 668 1 -728 444 660 -1515
1190a515J476Q11k775K136L45j965K119k79j430J356p9j183J5J290j219L60K173
$$ -1515 -39 772 -2003 133 478 -1487 632 353 -1077 279 200 -983 -968 322 -897 -537 1636
1207A636k644P15J652k641J043Q91j664N42J589q16p77J439o60j606K689j622
$$ 1636 -1008 -293 1359 -1282 -239 652 -1012 -470 1119 303 -474 965 305 -1301 1388 -234
1223b34j258L197j435j057K122q58j526J588M84k687J943J620l509K335K028m170
$$ -234 -1492 1705 270 -787 1335 477 -1049 539 1023 -1664 279 1899 -1610 725 2753 -1417
1239a417J611J524l026P35K478k006r76L638k352k111M054k083k492M419j617
$$ -1417 194 1718 -1308 -573 1905 -101 -1077 2561 209 -1902 2152 69 -2423 1996 379
1254C79k158L678n30l138K139J518l840J704K395m272J736K927l810Q28K550l452
$$ 379 -1779 1899 1369 -1769 370 1888 -1952 -248 2147 -2125 -389 2538 -1272 -444 2106 -1346
1270a346J31K819j913j582L617j299k569M309j564l055L729p88k479K604N38k640
$$ -1346 -1215 1604 -309 -1891 1726 427 -2142 2167 603 -2452 1277 489 -1990 614 1152 -1488
1286a488J560J759l443Q70K641l874J165K550k835L67K070j789o48J930j200j712
$$ -1488 72 1831 -1612 -742 1899 -1975 -810 1740 -1095 -728 1342 -447 -1095 835 -365 -2077
1302b077K877n56k398L513q68j891K326p55j636J288N78j553P22J911k413N96
$$ -2077 800 244 -2154 1359 491 -1400 926 171 -1465 -177 401 -1152 -430 1481 -932 -336
1318c36J515k857J002J405j620N47J209j039k57J401r72j212J728p84j080K527
$$ -336 1179 -1678 -676 729 -891 -344 865 -174 -431 970 -2 -1214 514 -270 -1350 1177
1334A177j367o09J838j402k74O12m18o19J289L63j738J500N56k062J849J41k301
$$ 1177 -190 -799 1039 -363 -637 -25 -443 -1062 227 590 -1148 352 908 -1154 695 836 -1465
1351a465J767N80j398P00Q12j304k70J992k211j06K453k564L64K262j888k46J827
$$ -1465 302 882 -516 184 996 -308 -578 1414 -797 -903 1550 -1014 -650 1612 -276 -522 1305
1368A305j230j542K405l83k139K878r1k495K381O6k738J778O86k263J296J592
$$ 1305 75 -1467 938 555 -1584 1294 1203 -1292 1089 1155 -1583 195 881 -1382 -86 1506
1384A506k271M16K552l051l71L220l242j28L348k213o58K351q75k213K674k55
$$ 1506 -765 -349 2203 -848 -1219 2001 -1241 -1369 1979 -234 -892 1459 584 -1629 1045 790
1400G90l122L148K09k856K478O26l006J637J194k329M80K360k349o9K999k503
$$ 790 -2332 816 1025 -1831 647 1273 -1733 -96 1098 -1231 -751 1609 -740 -809 2190 -313
1416c13o06K950k119q95K236j296q71K343k51k235J903O09l350K557N33k717K108
$$ -313 -919 2031 -88 -983 1253 -43 -914 1429 1178 -1057 846 1455 -1895 662 1195 -1522 586
1433E86R38k498J217J493k297N1J778j550l26K277j909k14K246j672r42J750r87
$$ 586 1524 -974 243 1736 -561 -510 1268 -282 -608 1669 -240 -454 1792 120 -822 928 -59
1450e9o40J258Lj301J605k49j659J575k69j445J967k28j295J343M08j350M20P75
$$ -59 -699 559 562 -739 866 617 -1042 533 264 -1181 786 558 -737 606 1014 -336 84 859
1468H59j905P98J364k240O92J910j930n6J227j564j43J437m65p28J440m76j285
$$ 859 -1046 -248 1116 -1124 -432 1478 -452 -508 719 -845 -988 449 -16 -744 696 220 -1065
1485a065K369r96j511J754o04r38J511j67j226J206N49k195J246R13k515J709
$$ -1065 1304 308 -1203 551 -53 -991 520 353 -873 333 882 -1313 -67 846 -1669 40
1501D0J180k508J564J642k685J37J908j828m70K693j413j629L135j371j908K725
$$ 40 1220 -1288 276 1918 -767 -630 1278 -550 -1020 1673 260 -1369 1766 395 -1513 1212
1517A212q85j766K057r0j703J189J335k846J616J378l181J242J368k223J106J515
$$ 1212 327 -1439 618 528 -1175 14 1349 -1497 119 1497 -1684 -442 926 -1297 -191 1324
1533A324k166K38K096k188n52K465j888j151L408j306j959K820o76k231K210N93
$$ 1324 -842 -604 1492 -696 -1248 1217 -671 -1822 1586 280 -1679 1141 465 -1766 444 1037
1549A037k797J489J664k600Q64K002k797K80J584j694K39J558j048k24J575q60
$$ 1037 -1760 -271 1393 -1207 -343 1659 -1138 -858 726 -968 -729 829 -219 -443 1132 272
1565B72j425J735r91r20K051p72p90K026q13j478J716l94j412J456P74k301J174
$$ 272 -1153 582 -409 -1329 722 -50 -840 1186 373 -1105 611 217 -1195 261 1035 -1266 -92
1582i2J467k466Q83J361k100K19J151r43k75J528n69j003J390o57p57J589j046
$$ -92 1375 -1091 -208 1153 -947 -728 423 -520 -795 733 164 -839 551 -106 -863 726 -320
1599c20mJ108r82l29J139p28q20J297j68j193J524q4j689K010k17j974J616P83
$$ -320 -324 784 -198 -527 612 -116 -936 361 193 -1000 524 440 -1249 761 544 -1430 186 969
1617I69k232P63J627j662J71K034j811l89J533j359l66J708j273m00J746q05j199
$$ 969 -1263 -500 1127 -535 -364 1670 -141 -530 1003 -356 -722 986 -287 -687 1059 254 -945
1634i45J586k73j436J705k81j463K046J19j966J963k98k021J555Q46k391J004
$$ -945 641 368 -1068 637 356 -1107 939 1058 -908 1055 757 -1264 291 1137 -1254 -250
1650b50K046k623J21K738k579q91K735j472j160K393l59k122K067P25k912J781
$$ -250 1796 -827 -706 2032 -547 -1438 1297 -175 -1335 1058 699 -1423 644 1369 -1543 238
1666B38Q03k500J428J121j795J107M52j535N76P60j591L54J937k470Q80J935k215
$$ 238 1041 -1459 -31 1090 -705 402 854 -681 -105 655 -936 -582 1355 -1115 -235 1700 -515
1683e15J73J749k293k96K101j239j267K890J35k534J833J92k946K300Q84k141
$$ -515 -342 1407 -886 -1182 919 -320 -1587 1303 1438 -1096 737 929 -2017 283 1167 -974
1699i74K90J884j506j7J337j095n06J255j237L94N93N27q76K19Lq73J336j292
$$ -974 -684 1200 -306 -323 1014 -81 -587 668 -569 -175 418 945 69 288 291 -582 754 -538
1717e38J70R34J39j585J862r73j257K323p38j773J185Q12j578R39J262j912K54
$$ -538 -368 566 705 -880 982 9 -1248 1075 337 -1436 -251 561 -1017 -78 1184 -728 -474
1734d74J500j484K92M06k60m90R84o64m62O58J86o57P46n96O4O51p74J10R56j683
$$ -474 1026 -458 -166 240 -20 -510 474 -190 -652 6 192 -465 281 -315 -251 400 -374 -264 692 -991
1754i91MJ384m52j101J304O99l027K795N0k111Q41J644k078L02K017j695k24K456
$$ -991 -987 397 -55 -1156 148 847 -2180 615 665 -1446 -605 1039 -1039 -737 1280 -415 -639 1817
1772A817j914q64J263J11j404K003j85j518J387M38j720J276k54r66J010kj764
$$ 1817 -97 -961 302 413 -991 1012 827 -691 696 1134 -586 690 436 -530 480 478 -1286
1789a286J547K44j739J444J057k692J221R22j805J137J690j870j223L318j523
$$ -1286 261 505 -1234 210 1267 -1425 -204 718 -1087 50 1740 -130 -1353 1965 442
1804D42k123K535j72j815K170P9k288J274O66j127J74J077j960R52J152j746K7
$$ 442 -1681 854 682 -1133 1037 1116 -1172 102 768 -359 -185 892 -1068 -116 1036 -710 -683
1821f83J527j117M25O73r86j68J150j790J359J223k057j52J387j041j137K402
$$ -683 844 -273 152 825 -161 -329 821 -969 390 1613 -444 -596 791 -250 -1387 1015
1837A015q58j306J706K94k005J278J004k367Q74J715j883J10J313j126k82J078
$$ 1015 157 -1149 557 851 -1154 124 1128 -1239 -365 1350 -533 -423 890 -236 -518 560
1853E60p35p73J034l24m58J210p65J3O82j128J97Q05o88r1J376j161k67J481p69
$$ 560 -175 -948 86 -238 -696 514 -251 -238 444 -684 -487 318 -370 -461 915 -246 -513 968 199
1872A99j720K096m68j521J538M86j819J342J060j946l2J727j403j47J546j723
$$ 199 -1521 575 107 -1414 124 610 -1209 133 1193 -753 -785 942 -461 -608 938 -785
1888g85M14J189j306J13R28p85j21R27j89j019J699p30j043J925j260j446K477
$$ -785 -371 818 -488 -375 553 -232 -353 574 385 -634 1065 335 -708 1217 -43 -1489 988
1905I88l56j702K187l68j925J403Q52k350R25K015k450m9K232j582r33K327j174
$$ 988 632 -1070 1117 749 -1176 227 1079 -1271 -346 1669 -781 -830 1402 -180 -1113 1214 40
1922D0r37J404k88j079J053J26j278J255k8j117J345j90r22J195j2j313Q68Q74
$$ 40 -897 507 219 -860 193 319 -959 296 268 -849 496 306 -616 579 567 -746 122 996
1940I96j993P42J017j934Q40J469j927R1K070j761o03J897o29j986K224J06j925
$$ 996 -997 -255 762 -1172 -332 1137 -790 -699 1371 -390 -993 904 275 -1711 513 619 -1306
1957a306J651O99j976Q62O20j348M41Q94r35L00O99o54m0P12j303M27O78r77N90
$$ -1306 345 1044 -932 -70 550 -798 -357 537 -398 -98 601 -53 -93 619 -684 -257 421 -556 34
1976C4O44j202M90J009j047o24J565r74p99J911m95j329J627j38j487J009N62
$$ 34 678 -524 -34 975 -72 -696 869 -105 -904 1007 512 -817 810 672 -815 194 756
1993G56j457M23J410j694M60O83q94J75Q25r03Q2O48o16K07M23o34J79O00j056
$$ 756 -701 -278 1132 -562 -102 581 -313 -138 687 -216 -134 514 -102 105 528 -106 73 673 -383
2012c83J2J141j209m66J851r33n53J507q17j287J582J09j966J385J091k006R67
$$ -383 -371 770 -439 -905 946 13 -540 967 150 -1137 445 554 -1412 -27 1064 -942 25
2029B5J281k154L79J250j372o0J440r61l71J138o28p09J292p97l99J351n74p37
$$ 25 1306 -848 -469 781 -591 -651 789 -172 -543 595 -33 -742 550 -247 -646 705 131 -606
2047f06J508n24j299J352J17j341J235M18j995J235O96j818R94J186j855k3J948
$$ -606 902 378 -921 431 548 -793 442 860 -1135 100 796 -1022 -28 1158 -697 -720 1228
2064A228j656m18J955j084r72J800p65j099J460rr58P34M26r92O75J29j084Q54
$$ 1228 -428 -846 1109 25 -947 853 88 -1011 449 440 -518 216 642 -350 325 454 -630 224
2082B24J09j297J388R4j009N55N32j217M99Q42j243J06J525j578k4J352r60n52
$$ 224 333 -964 424 518 -491 64 596 -621 -122 720 -523 -417 1108 -470 -494 858 -102 -654
2100f54J403o50j091J491j99j390J376N32j458O61P28j178L05N34p50K63O03p84
$$ -654 749 99 -992 499 300 -1090 286 818 -640 21 749 -429 -124 410 -340 -77 526 -258
2118b58J29P45j162N34L72r53K99R19j169O9J258j361j35J336q05o63J607n60
$$ -258 -129 616 -546 -12 360 -593 -294 625 -544 -475 783 -578 -713 623 -182 -845 762 202
2136B02r74J195k00j090R13N65j442Q24N33q56K33O73j004l6J176j296N28P07
$$ 202 -772 423 223 -867 46 611 -831 -7 526 -330 -97 576 -428 -464 712 -584 -56 651
2154F51j328P77P54j041j68J060r26l35J175l55q78J795q04j231J889p36j220
$$ 651 -677 100 854 -187 -355 705 -221 -556 619 264 -614 1181 377 -854 1035 299 -921
2171i21J056Q86k112J180P62j603M22J224j566K71J288j095M4R54p97o10J266
$$ -921 135 1021 -1091 89 851 -752 -330 894 -672 -401 887 -208 -164 790 -7 -617 649
2188F49o61m50J122q43o00J486o86q09J207l84q18R46L71j214R19P79j662O52
$$ 649 -12 -462 660 -183 -783 703 17 -792 415 31 -787 159 530 -684 235 1014 -648 4
2206DR27j525K51J167j214m80J653j053l14J232o45o58J050n09o55J061j85m55
$$ 4 931 -594 -343 824 -390 -870 783 -270 -584 648 3 -655 395 -114 -769 292 107 -348
2224c48N25L47j224P82K29r75P03N35j052O18M74j171M76Q98j618M37R55p08k52
$$ -348 177 524 -700 82 311 -664 39 574 -478 140 614 -557 -81 817 -801 -364 591 -117 -369
2243c69R43p14o24J461o88o67J350p87l60R05k26o68N72J73j158Q21K39p48P86
$$ -369 574 -140 -764 697 9 -658 692 -95 -455 450 224 -444 128 301 -857 -36 203 -545 241
2262B41J61j201Q96M23r94N45M94j336N57O43n69P7Q81j272j26J027m30q54J320
$$ 241 402 -799 97 520 -474 71 565 -771 -214 429 -140 -63 818 -454 -580 447 17 -837 483
2281D83n99o81J224j09j037J120j0j126R91K30j340J167M76j380N80N90j070L43
$$ 483 -116 -797 427 318 -719 401 391 -735 256 486 -854 313 789 -591 -11 579 -491 -148
2299a48O10o68j87J076r51j52J240r80l83J186r05p10J645n50o98R31J79j189
$$ -148 462 -206 -393 683 -268 -420 820 -160 -543 643 -262 -972 673 123 -575 356 535 -654
2317f54P99M13j470J006Q19j664P73Q19j463J11J303j313J36J059r16l99J282
$$ -654 145 558 -912 94 913 -751 22 841 -622 -511 792 -521 -385 674 -242 -641 641
2334F41p19n04J206n70o62J227m82o62J027n4j178J195J44j301Q25M73j321N95
$$ 641 -78 -582 624 54 -608 619 137 -525 502 448 -730 465 609 -692 133 606 -715 -120
2352a20Q24j204J24J089j038j03R36o59l18J107n22o30J278p84o20J105j82j184
$$ -120 704 -500 -376 713 -325 -428 508 -151 -469 638 116 -514 764 -20 -640 465 283 -901
2370i01J089K92r19O80J30r29N51M90q96N03M24j128O50M62p66K1N01n68q8Q48
$$ -901 188 480 -439 241 371 -558 -7 483 -413 90 514 -614 36 498 -268 -247 254 -314 -402 446
2390D46o82m4J041r35j75Q19m00q45J136k28n95Q96q7q12P16J16q34O95Q2j102
$$ 446 -236 -280 761 -174 -349 470 70 -775 361 133 -462 434 347 -465 251 367 -467 228 310 -792
2410g92J009N14j218N14M46j056L52P22q96M2Q42o56k71R04o22o69J422m69p36
$$ -792 217 731 -487 27 473 -583 -231 491 -405 -363 479 -177 -448 456 -166 -835 587 118 -618
2429f18J294n93o28J263l59j021R69J52j289J109K57j089N75Q94j337L59O21j003
$$ -618 676 83 -545 718 359 -662 307 459 -830 279 536 -553 22 916 -421 -62 559 -444
2447d44K48P67q65l4J061j015j72J127p23n62J122k23q37J118l19q82R04J75j012
$$ -444 -196 571 -294 -328 733 -282 -454 673 -50 -612 510 287 -550 568 249 -633 271 446 -566
2466e66M91O05j180O50M89r89L77Q18q81j28P04o33k10J037m45q17J464o57o91
$$ -566 -75 530 -650 0 489 -500 -123 695 -186 -314 390 -243 -453 584 139 -678 786 129 -562
2485e62Q50l25q28J026k34o46J124l1j039O63O09j348P02N22q99M27N18j130M01
$$ -562 288 -37 -865 161 -73 -719 405 374 -665 -2 607 -741 -39 483 -416 11 529 -601 -200
2504b00N66p19k46J099j012r1J041o05j94Q40n59m67Q56l49k00M86m19m48J210
$$ -200 366 -353 -599 500 -512 -603 438 -167 -361 479 -80 -547 309 -40 -240 246 -173 -621 589
2523E89j1j072P13L97j128P03K77r55M65M41p04J74N81p30J30O27n82j23O62o48
$$ 589 578 -494 219 616 -512 191 468 -487 -22 419 -285 -111 470 -260 -130 497 -85 -208 454 -194
2543a94M2Q05m93n83O66%q66Q16K45p31P53j29p95O75k9o54O37L51j091P59M56
$$ -194 -152 653 160 -423 243 243 -623 193 438 -293 460 331 -464 211 182 -472 165 516 -575 184 640
2564F40q31O6Q64r45k3Q55n68k07P37q09l44J048k93q65J066j56p26Q67j0j261
$$ 640 -191 -125 739 -206 -229 626 58 -149 588 -221 -565 483 190 -675 391 235 -491 376 366 -895
2584h95R03L06q59O82O34j113N5Q50q61k7J030p74m87J239p81j60P58m29n84J057
$$ -895 8 314 -545 137 771 -342 -287 563 -298 -325 705 -69 -556 683 -98 -258 500 71 -513 544
2604E44m59p39J006m6q50O98J44q06P30J81q96N06M55p82J76P67j011J47O96p34
$$ 544 85 -654 352 306 -544 154 298 -508 222 403 -493 13 468 -314 -138 629 -382 -235 461 -273
2624b73j90J058r01j94J081p70l57O66p6m06P65J13p90N47m1n63M77P5m67J97
$$ -273 -463 595 -306 -500 581 -189 -546 120 44 -362 403 516 -274 273 232 -331 146 221 -246 -49
2644d9M66p76K14O3l94N46L18o88J61M73n32k91Q41m41k82P63k51n47N47k64j46
$$ -49 417 -359 -145 -82 -476 70 388 -300 -139 334 -198 -489 352 -89 -371 392 141 -406 141 -123 -269
2665b69N48j64o72Q30j47n94Q08k10p94O83K48p69M79N29p87L23M49p50J01P68
$$ -269 279 115 -557 273 126 -468 340 130 -664 19 267 -502 -23 506 -281 42 491 -259 -158 610
$$ [...]
8191a4
##END NTUPLES=NMR FID
##END=
