##TITLE=1H_TG-2307-x
 DMSO, 8 sc, 
 18.11.2020
##JCAMPDX= 6.0         $$ Bruker NMR JCAMP-DX V2.0
##DATA TYPE= NMR FID
##DATA CLASS= NTUPLES
##ORIGIN= UXNMR, Bruker Analytische Messtechnik GmbH
##OWNER= root
$$ XWIN-NMR		Version 3.5
$$ Wed Nov 18 12:32:15 2020 Russian Standard Time (UT+4h)  she@DPX200
##.OBSERVE FREQUENCY= 200.1315066352
##.OBSERVE NUCLEUS= ^1H
##.DELAY= (6, 6)
##.ACQUISITION MODE= SIMULTANEOUS
##.ACQUISITION SCHEME= undefined
##.AVERAGES= 8
##.DIGITISER RES= 18
##SPECTROMETER/DATA SYSTEM= spect
##.PULSE SEQUENCE= zg30
##.SOLVENT NAME= DMSO
##.SHIFT REFERENCE= (INTERNAL, DMSO, 0, 15.7039)
##AUDIT TRAIL= $$ (NUMBER, WHEN, WHO, WHERE, WHAT)
$$ ##TITLE= Audit trail, XWIN-NMR		Version 3.5
$$ ##JCAMPDX= 5.01
$$ ##ORIGIN= Bruker BioSpin GmbH
$$ ##OWNER= she
$$ F:/spectra/data/she/nmr/H-F/1/audita.txt
$$ ##AUDIT TRAIL=  $$ (NUMBER, WHEN, WHO, WHERE, WHAT)
(   1,<2020-11-18 12:29:45.29 +0400>,<she>,<DPX200>,
      <created by zg, POWCHK disabled, PULCHK disabled
       configuration hash MD5:
       00 E9 B6 7A A2 85 ED C7 34 08 36 98 17 FE 4E 26
       data hash MD5: 16K
       F9 36 B9 B7 04 21 17 07 20 23 32 04 EC 7B 83 02>)
$$ ##END=
$$ 
$$ hash MD5
$$ E4 E3 BB F0 A4 4A 5E 80 12 3C 7A 78 84 66 98 18
##$RELAX= 
##$RELAX= 
##$RELAX= 
##$RELAX= 
##$RELAX= 
##$RELAX= 
$$ Bruker specific parameters
$$ --------------------------
##$DU= <F:/spectra>
##$EXPNO= 1
##$NAME= <H-F>
##$PROCNO= 1
##$TYPE= <nmr>
##$USER= <she>
##$AMP= (0..31)
100 100 100 100 100 100 100 100 100 100 100 100 100 100 100 100 100 100 
100 100 100 100 100 100 100 100 100 100 100 100 100 100 
##$AQSEQ= 0
##$AQ_mod= 1
##$AUNM= <au_zg>
##$AUTOPOS= <>
##$BF1= 200.13
##$BF2= 200.13
##$BF3= 200.13
##$BF4= 200.13
##$BF5= 200.13
##$BF6= 200.13
##$BF7= 200.13
##$BF8= 200.13
##$BYTORDA= 1
##$CFDGTYP= 0
##$CFRGTYP= 5
##$CHEMSTR= <none>
##$CNST= (0..31)
1 1 145 1 1 1 1 1 1 1 1 1 1 1 1 1 1 1 1 1 1 1 1 1 1 1 1 1 1 1 1 1 
##$CPDPRG= <>
##$CPDPRG1= <>
##$CPDPRG2= <>
##$CPDPRG3= <>
##$CPDPRG4= <mlev>
##$CPDPRG5= <mlev>
##$CPDPRG6= <mlev>
##$CPDPRG7= <mlev>
##$CPDPRG8= <mlev>
##$CPDPRGB= <>
##$CPDPRGT= <>
##$D= (0..31)
0 1.2 0 0 0 0 0 0 0 0.06 0 0.03 0 0 0 0 0.0002 0 0 0 0 0 0 0 0 0 0 0 0 
0 0 0 
##$DATE= 1605688184
##$DBL= (0..7)
120 120 120 120 120 120 120 120 
##$DBP= (0..7)
150 150 150 150 150 150 150 150 
##$DBP07= 0
##$DBPNAM0= <>
##$DBPNAM1= <>
##$DBPNAM2= <>
##$DBPNAM3= <>
##$DBPNAM4= <>
##$DBPNAM5= <>
##$DBPNAM6= <>
##$DBPNAM7= <>
##$DBPOAL= (0..7)
0.5 0.5 0.5 0.5 0.5 0.5 0.5 0.5 
##$DBPOFFS= (0..7)
0 0 0 0 0 0 0 0 
##$DE= 6
##$DECBNUC= <off>
##$DECIM= 32
##$DECNUC= <off>
##$DECSTAT= 4
##$DIGMOD= 1
##$DIGTYP= 9
##$DL= (0..7)
0 120 120 120 120 120 120 120 
##$DP= (0..7)
150 150 150 150 150 150 150 150 
##$DP07= 0
##$DPNAME0= <>
##$DPNAME1= <>
##$DPNAME2= <>
##$DPNAME3= <>
##$DPNAME4= <>
##$DPNAME5= <>
##$DPNAME6= <>
##$DPNAME7= <>
##$DPOAL= (0..7)
0.5 0.5 0.5 0.5 0.5 0.5 0.5 0.5 
##$DPOFFS= (0..7)
0 0 0 0 0 0 0 0 
##$DQDMODE= 0
##$DR= 18
##$DS= 0
##$DSLIST= <SSSSSSSSSSSSSSS>
$$ [...]
##$SUBNAM2= <"">
##$SUBNAM3= <"">
##$SUBNAM4= <"">
##$SUBNAM5= <"">
##$SUBNAM6= <"">
##$SUBNAM7= <"">
##$SUBNAM8= <"">
##$SUBNAM9= <"">
##$SW= 16.9725356469052
##$SWIBOX= (0..15)
0 0 2 0 0 0 0 0 0 0 0 0 0 0 0 0 
##$SW_h= 3396.73913043478
##$TD= 16384
##$TD0= 1
##$TE= 0
##$TE2= 300
##$TE3= 300
##$TEG= 300
##$TL= (0..7)
0 120 120 120 120 120 120 120 
##$TP= (0..7)
150 150 150 150 150 150 150 150 
##$TP07= 0
##$TPNAME0= <>
##$TPNAME1= <>
##$TPNAME2= <>
##$TPNAME3= <>
##$TPNAME4= <>
##$TPNAME5= <>
##$TPNAME6= <>
##$TPNAME7= <>
##$TPOAL= (0..7)
0.5 0.5 0.5 0.5 0.5 0.5 0.5 0.5 
##$TPOFFS= (0..7)
0 0 0 0 0 0 0 0 
##$TUNHIN= 0
##$TUNHOUT= 0
##$TUNXOUT= 0
##$USERA1= <user>
##$USERA2= <user>
##$USERA3= <user>
##$USERA4= <user>
##$USERA5= <user>
##$V9= 5
##$VALIST= <valist>
##$VCLIST= <CCCCCCCCCCCCCCC>
##$VD= 0
##$VDLIST= <DDDDDDDDDDDDDDD>
##$VPLIST= <PPPPPPPPPPPPPPP>
##$VTLIST= <TTTTTTTTTTTTTTT>
##$WBST= 1024
##$WBSW= 4
##$XGAIN= (0..3)
0 0 0 0 
##$XL= 0
##$YL= 0
##$YMAX_a= 202872
##$YMIN_a= -202317
##$ZGOPTNS= <>
##$ZL1= 120
##$ZL2= 120
##$ZL3= 120
##$ZL4= 120
##$ABSF1= 10
##$ABSF2= 0
##$ABSG= 5
##$ABSL= 3
##$ALPHA= 0
##$AQORDER= 0
##$ASSFAC= 0
##$ASSFACI= 0
##$ASSFACX= 0
##$ASSWID= 0
##$AUNMP= <proc_1d>
##$AZFE= 0.1
##$AZFW= 0.1
##$BCFW= 1
##$BC_mod= 2
##$BYTORDP= 1
##$COROFFS= 0
##$CY= 11.3945322036743
##$DATMOD= 1
##$DC= 2
##$DFILT= <>
##$DTYPP= 0
##$F1P= 15.9154993809931
##$F2P= -4.1035820241983
##$FCOR= 0.5
##$FTSIZE= 0
##$FT_mod= 4
##$GAMMA= 1
##$GB= 0.15
##$INTBC= 1
##$INTSCL= 1
##$ISEN= 128
##$LB= 0.24
##$LEV0= 0
##$LPBIN= 0
##$MAXI= 10000
##$MC2= 0
##$MEAN= 0
##$ME_mod= 0
##$MI= 1.114404
##$NCOEF= 0
##$NC_proc= 0
##$NLEV= 6
##$NOISF1= 3.799351
##$NOISF2= 2.8
##$NSP= 1
##$NTH_PI= 0
##$NZP= 0
##$OFFSET= 15.70392
##$PC= 1
##$PHC0= -11027.2
##$PHC1= -14.5991
##$PH_mod= 1
##$PKNL= yes
##$PPARMOD= 0
##$PSCAL= 0
##$PSIGN= 0
##$REVERSE= no
##$SF= 200.130013532006
##$SI= 16384
##$SIGF1= 3
##$SIGF2= 2
##$SINO= 400
##$SIOLD= 16384
##$SREGLST= <1H.CDCl3>
##$SSB= 0
##$STSI= 0
##$STSR= 0
##$SW_p= 3612.71676300578
##$SYMM= 0
##$S_DEV= 0
##$TDeff= 0
##$TDoff= 0
##$TI= <>
##$TILT= no
##$TM1= 0
##$TM2= 0
##$TOPLEV= 0
##$USERP1= <user>
##$USERP2= <user>
##$USERP3= <user>
##$USERP4= <user>
##$USERP5= <user>
##$WDW= 1
##$XDIM= 8192
##$YMAX_p= 0
##$YMIN_p= 0
$$ End of Bruker specific parameters
$$ ---------------------------------
##NTUPLES= NMR FID
##VAR_NAME=  TIME,          FID/REAL,        FID/IMAG
##SYMBOL=    X,             R,               I
##VAR_TYPE=  INDEPENDENT,   DEPENDENT,       DEPENDENT
##VAR_FORM=  AFFN,          ASDF,            ASDF
##VAR_DIM=   8192,          8192,            8192
##UNITS=     SECONDS,       ARBITRARY UNITS, ARBITRARY UNITS
##FACTOR=    0.0002944,     1,               1
##FIRST=     0,             0,               0
##LAST=      2.4114304,     0,               0
##MIN=       0,             -202317,         0
##MAX=       2.4114304,     202872,          0
$$ Real data points
##PAGE= N=1
##DATA TABLE= (X++(R..R)), XYDATA
$$ [...]
1882A484j135j551J912K54k393J275J495k137J54J868r19j760K199k74j524O73
1898c79J136j407J28J207m70j056R69N64j113k88J254l41j168Q43O71j023j94
1915f67J787r40j438J994J37k019R23J477j903k05J744n99j752J987M59k003R76
1932d2J368j795l18J925r73j346J740Q9j307N05R49o95n42R96k24j200R80R31
1950A041j374l25J286o1j510Q67P68o94l25J353p68j187J351L72j748N59J737
1967A342j761p06K129q05j256J654N4j528N35J067q76o52J497m94j270J187O63
1984G80j283O4J232o91q52J172K94j333L11J229q93p63J290P7j438P11J219j456
2002c30n99J656n36j145J476J27j638P35J382j462l81J425n60j266J597L02j288
$$ plain form
1882 1484 349 -1202 710 964 -1429 -154 1341 -796 -642 1226 307 -1453 746 472 -1052 -379
1898 -379 757 -650 -522 685 215 -841 128 692 -421 -709 545 204 -964 -121 550 -473 -667
1915 -667 1120 180 -1258 736 873 -1146 -223 1254 -649 -854 890 291 -1461 526 985 -1018 -42
1932 -42 1326 -469 -787 1138 165 -1181 559 648 -659 -154 795 100 -442 554 330 -870 110 1041
1950 1041 -333 -658 628 567 -943 -76 692 -2 -327 1026 258 -929 422 794 -954 -395 1342
1967 1342 -419 -1125 1004 199 -1057 597 651 -877 -342 725 -151 -803 694 200 -1070 117 780
1984 780 -503 -439 793 102 -750 422 716 -617 -306 923 30 -733 557 634 -804 -93 1126 -330
2002 -330 -929 727 191 -954 522 649 -989 -254 1128 -334 -715 710 150 -1116 481 783 -505
2019e05L9R97n99n77Q60J59o37Q8Q41m97n58P92j67p29M73P92j290J00J129l14
2039C97j078J108N11j715P37J216j724p4J641r86j071J388l5j068Q68O63j194
2056d16k01J238m49q73R02K02o89J73L46o8m77M52L3k21l11R45l59j081J192J72
2076E10j118J84J220j166n24J224P0j362J298L46j475P03Q80j027m63J340o53
2093a3o48Q66L59j095M38Q33j079p6O87j61p89O74L96n83l9O03k02l02j94Q52
2113E27m27n24Q77j30j053M19P34j042J41J223r29n93J483j55j098O00L30j092
2131g09L26J052j062l46J315l57r87J021J37r37K46Q27m02l65N85q0o20M00L8
2150H2k15l4K83O2l50P2M65n49j87P09l0q62O94L69r30LQ43l97m96P68j90o37
$$ plain form
2019 -505 -466 531 -68 -645 215 374 -263 -175 666 169 -389 403 236 -493 -20 772 -518 -418 711 397
2039 397 -681 427 938 -777 -40 1176 -548 -622 1019 33 -1038 350 315 -753 115 778 -416
2056 -416 -617 621 172 -701 201 403 -286 -113 233 165 -312 140 173 -48 -359 586 227 -854 338 510
2076 510 -608 -424 796 -370 -894 330 400 -962 336 682 -793 -90 790 -237 -700 640 -13
2093 -13 -661 205 564 -531 -93 740 -339 -415 272 111 -678 -4 392 -191 -230 373 171 -131 -325 527
2113 527 100 -424 453 323 -730 -311 423 -619 -478 745 -184 -777 706 551 -547 53 383 -709
2131 -709 -383 669 -393 -739 576 219 -768 253 390 -547 -301 526 124 -241 344 264 -356 44 82
2150 82 -133 -167 116 178 -172 -100 365 -184 -371 338 308 -554 140 509 -421 -418 425 28 -468 300 110 -527
2172e27O71O28j172J0J166r46j82N92R1q95O81L37n77m7N46o9j49J16m4l79P3
2193g6O32l77l36K87L11n13O0L05l79RK50l5n39M32L96n39k5O23o82j33M53j59
2215c5o35O87Ll5nJ37j32M3j29K77j18j14N7k33J49n0M38l63l98M24P0l02M25
2238A61J74q14M93M16l88j66N10n02l37O68q5o47Q23K7p24O34o5l41q5O45k37
2259A60l10L44k98k19M91k95K25k20j08K77k68J47j29N98m78m9M27n11j13N43
2279B14j1m43K96P1l29K08K92n34j17O66l42m21P64J4q71O98J3o48K87M59n80
2300c14J30P32q39j7N95l26n5M3O3O0J69m49j06L42p8l06N89j5o29O20j65p85
2322g41J093j21n59L71P7m47K89N92q36K79N46o46k53P04m86j49M55k15n5LJ87
$$ plain form
2172 -527 144 772 -400 -390 776 -170 -352 240 331 -564 117 454 -123 -170 376 307 158 274 230 -149 -76
2193 -76 556 179 -157 130 441 -72 -12 293 -86 -77 173 138 -401 31 427 -112 -137 486 -196 -329 124 -35
2215 -35 -670 17 20 -15 -20 117 -15 28 -101 176 58 -56 1 -232 -83 -133 305 -58 -456 -32 38 -264 161
2238 161 335 -479 14 430 42 -124 386 -116 -453 215 130 -517 306 333 -391 243 178 -163 -248 397 160
2259 160 -150 194 -104 -323 168 -127 98 -122 -230 47 -221 -74 -203 395 -83 -132 295 -216 -329 214
2279 214 203 -240 56 127 -202 6 298 -236 -353 313 -29 -450 314 328 -543 155 168 -480 -193 266 -314
2300 -314 -184 548 -291 -308 287 -39 -94 -51 12 72 241 -208 -314 28 -50 -356 233 218 -411 209 44 -741
2322 -741 352 231 -328 43 120 -327 -38 554 -282 -3 543 -103 -356 348 -138 -287 168 -47 -102 -99 88
2343H8m79M26Q2j49J35j6j16r0P9Q3j58J35m6OK69m56J81K36m3m83N14j78j47
2366a27K40k22j45L28K29l76K20K27n44K82N7j59J01l8l82K84L67k09m09K84K21
2387B29j23j41qJ86q8K71k51k38J20j2J57k10m9J96J57l25J47J36m69K15K99m78
2409b79O4L77k99l8K31J41m52L64q8j04J98o1k85K67K04l33L2J72P0k38K56m57
2431b58L47K17k40j45L17l69J6J22k22J10J06J1l26M04L9n83N88J77p02M44J6
2452F9j44J45L41l56j45L52l32J04J15k00N4J3l60K84L53k84m91O63ok98L72j01
2474A48m08L62N2m12K85M14m23j49J96k89M9N83m52p0N54n00j47L97k93j81K96
2495A2K08m77M93j47k05J41J98l62j8J68k23KM64l54J2K13k36j08N49m52k48O00
$$ plain form
2343 88 -391 35 117 -32 103 87 -29 -119 -40 43 -115 20 -26 -20 249 -207 -26 210 167 -316 198 20 -127
2366 -127 113 -109 -254 74 303 -73 147 374 -170 112 169 10 111 73 -309 -25 342 133 -276 8 229
2387 229 106 -35 -43 143 55 326 75 -163 -43 -55 102 -108 -157 39 196 -129 18 154 -315 -100 199 -279
2409 -279 -215 162 -137 -175 56 197 -255 109 21 -83 115 54 -231 36 240 -93 -61 111 181 -57 199 -258
2431 -258 89 306 66 -79 238 -131 -115 7 -215 -105 1 12 -314 90 129 -454 134 311 -391 53 69
2452 69 -75 70 411 55 -90 262 -70 34 149 -51 3 16 -344 -60 293 9 -482 181 175 -123 249 148
2474 148 -260 102 154 -258 27 441 18 -131 65 -224 -175 408 -44 -114 440 -60 -207 190 -103 -284 12
2495 12 220 -257 236 89 -116 25 223 -139 -157 11 -212 -210 254 -100 -88 125 -111 -219 330 -122 -370 230
2517B30J67p00K18L29m36J20K80l36n9J33J8j86L69l08j9K86j77j08K21j18j60
2538b36L79r2l31L75O4n53L94K68k26n3M50o55L6M98l48p0N01n12J51R6k34l70
2560d68L93J63l25K65J43m17N14j94K9j57r9r8K38J37j34j4K45L2l16K09j60L4
2582B0J47l83P5K34j03o7K66m1p6K70k06j10l0L01l53m7K53j83J18K04m87J78
2604b0n9J33q6j0n2J42J43j48o3R0Ql17L34j29j36K58n6j93J57M15o20l5L47J1
2628A14qJ61k56k3M9J09J13k71m5k44M06k7k02L70j52m9l0M8L9o7J64m54J23K25
2652I3k65J36K41J34n34M73k31l33N13j71p2J2j36l9J95O3k32N6K78m15J02M46
2674C14m46O4K55k06l11L15n9L4J80j01l91M76Om67N74J20o50N69j1j21j20M06
$$ plain form
2517 230 397 -303 -85 244 -192 -72 208 -128 -187 -54 -36 -222 147 -161 -180 106 -71 -179 42 -76 -236
2538 -236 143 51 -280 95 159 -394 0 268 42 -11 439 -216 -180 318 -30 -100 401 -111 40 136 -98 -468
2560 -468 -75 88 -237 28 171 -246 268 74 103 -54 -153 -251 -13 124 -10 -24 221 253 -63 146 -14 20
2582 20 167 -216 -141 93 -10 -77 189 148 72 342 136 26 -4 297 -56 -103 150 -33 85 289 -198 -20
2604 -20 -79 54 -32 -42 -94 48 191 43 -20 70 78 -239 95 -34 -170 88 32 -161 -4 411 -209 -244 103 114
2628 114 106 267 11 -12 37 146 259 -12 -57 -301 105 78 -124 246 94 45 15 63 102 35 199 -255 -132 93
2652 93 -172 -36 205 339 -195 278 47 -286 227 56 -16 -4 -140 -179 16 79 -153 -97 181 -234 -132 314
2674 314 -132 -68 187 -19 -330 -15 -74 -40 140 39 -352 124 130 -337 237 357 -293 276 265 144 24 430
2696D30o53j00M45k4k9l4j91R4L79n19K1M95k82l21N17k0k11K72k43l8K24J96
2718D08o20L38J85m44J67J87k79q8M33k63q8J76n7k65K41j05j05L64j11k66K11
2739A9M8%l41M79k88J45K75l93K01J0n5l53K95L3k15M09k09L8j64J95m53M09j21
2762c6k72L44n7L9j00L25l23l1J61j25J20M4k83P5K49r8r1J0J60l98K17j4r5M6
2786a33L04j22k1L20m78L40j74k05Q4L01k60r1L18l72K43J04q1k4J72j05k42K97
2808A75K1m45L80M0l64M7K27m57M10J88k17j74O5R5j02L40k33j34L13k11K3J46
2830A33j18l78K58K26k33L48k75j51J60qk70J91P2o2J11j00rK9L7R1l58M23O1
2853A78m61N41k64j60J35J73r9m7L6k66J74J42l40l8M61l05K87j95k26L43O6j49
$$ plain form
2696 430 -223 -323 122 98 69 35 -156 -62 317 -202 -181 314 32 -289 228 208 -3 269 26 -12 212 408
2718 408 -212 126 311 -133 34 221 -58 -146 287 24 -64 112 55 -210 31 -74 -179 185 74 -192 19
2739 19 67 67 -274 205 -83 62 337 -56 145 155 100 -253 42 75 -140 269 60 98 -66 129 -324 85 -36
2762 -36 -308 36 -21 18 -82 243 -80 -111 50 -75 45 89 -194 -119 130 32 -59 -49 111 -287 -70 -84 -179 -133
2786 -133 171 49 28 348 -130 210 36 -169 -85 216 -44 -135 183 -189 54 158 77 53 225 120 -122 175
2808 175 196 -249 131 171 -193 -146 81 -376 34 222 5 -169 -104 -9 -111 229 -4 -138 175 -36 -13 133
2830 133 15 -363 -105 121 -112 236 -39 -190 -30 -38 -308 -117 -45 -107 4 -96 -105 -76 -39 52 -306 117 178
2853 178 -283 258 -6 -166 -31 142 43 -4 32 -234 -60 82 -258 -296 165 -140 147 -48 -274 69 135 -14
2875a4j56M26n20K34P5L01m51L38k31k31M85r9k30j5J23l2J68k0k39r2L01j53
2897c2l25L45Rk26N62k26n06O69m75K1K13N7l79K39K07k60J97Q9l04J71P7k7j77
2920h1M10l97L4K74j52k77L42j63N3J42q7j35J65K9m63J22J76j13k27P40l48r4
2942e0N5p5j22L38k92n0K75P1k74K8j2n2L23K7m29L10j00m6M7J82m38M6K12o0
2966h6J75r1K29j86J16l36j68M43k74P6M16l01k22J58L67m30rJ34n4j46J52j96
2988b33K37J19P1j07Kk64J05O6K7k58M56j06l53K58J02k50K42km90K52J59j46
3010a13L6K87l00q7L18l27J01N5k56J46M31m81K64J77j49j14J41j1j62J87j23
3031B0j57K51Kl97K84J39m59L40l1j79J22P9j47n4J17J11k85L43j4j12J42j78
$$ plain form
2875 -14 -170 256 -264 -30 45 346 -105 233 2 -229 256 157 -73 -88 35 3 171 151 -88 -180 121 -32
2897 -32 -357 -12 -3 -229 333 107 -399 270 -205 -184 29 86 -293 -54 153 -107 90 179 -125 46 123 96 -81
2920 -81 329 -68 -34 240 88 -189 153 -10 43 185 98 -37 128 157 -306 -184 -8 -121 -348 392 44 -50
2942 -50 5 -70 -192 146 -146 -196 79 150 -124 -96 -108 -160 163 190 -239 71 -29 -75 -28 154 -284 -238 -26 -86
2966 -86 89 -2 227 41 157 -179 -347 96 -178 -102 314 13 -209 -51 316 -114 -123 11 -43 -189 -37 -233
2988 -233 4 123 194 87 89 -175 -70 -4 23 -235 221 115 -238 20 122 -128 114 112 -378 -126 33 -113
3010 -113 -77 210 -90 -177 141 -186 -85 -30 -286 -140 291 -190 74 251 102 -12 129 118 -44 143 20
3031 20 -137 114 116 -281 3 142 -317 23 -8 -187 -65 14 -133 -187 -70 41 -244 99 85 -27 115 -63
3053f3l4O5k31l0K30Q6l84K27L46k48m5M29k81k73K87Mj6p0j1m0l7L6j80L58k37
3078a12j18R7j6k18K81O4k6Q3K11m53J78L00k81k32L45j91J63K2J9j83L20j98
3100E5m63L58J00q9J19J51k44N9J18K9k33L39k19k56J35q2r8J77j20K8n1K24j09
3123g2L5J34o35O82Ll42M16l52m4K40J79m87J20L72o16J74J95l8r6K28p3j45N2
3146g0o8R9R7j34O0o3L13j97P3J88m58L9J65l93M31o7j29N2L09m1l62L90l76j63
3170c05K41oj8L68l02N5j30j0k05L40J64n73K21L50l15N6K42l96J26N2K09k51
3192h7L16k21j07O45m84L5k14R2j61K99J03l41J57j95j13K32J15k39K22l5J3j11
3214g9M47l35k41N64m05l32L82K74j37L7kp9L3j95K68p6J21l19O1J47l90J56O3
$$ plain form
3053 -63 -97 -32 -263 -293 -63 23 -361 -134 212 -36 -81 348 67 -206 81 85 69 -1 -12 -52 -89 -53 -233 125 -112
3078 -112 -230 -133 -149 -367 -86 -22 -48 35 246 -207 -29 271 -10 -242 103 -88 75 97 116 -67 253 55
3100 55 -408 -50 50 -39 80 231 -13 46 164 193 -40 299 80 -176 -41 -123 -221 -44 -164 -136 -187 37 -72
3123 -72 -37 97 -538 144 147 -195 221 -131 -175 65 244 -243 -123 249 -367 -193 2 -36 -132 96 23 -122 -70
3146 -70 -138 -39 58 -76 -16 -79 234 37 110 298 -160 -121 44 -349 82 15 -114 -62 247 206 -156 234 -142 -305
3170 -305 -64 -70 -88 280 -22 33 -97 -107 -312 28 192 -381 -160 190 -125 -69 173 -223 -97 -45 164 -87
3192 -87 229 8 -99 546 62 97 -117 -25 -186 113 216 -125 32 -163 -276 -44 71 -168 54 19 32 -79
3214 -79 368 33 -208 356 -49 -381 1 275 138 175 173 94 127 -68 200 124 245 -74 -13 134 -256 -100 -37
3237c7j21J46K37m0l36K24P9k42J17N8rL16l34j57J64j27q9J95l2k79L68P1k82
3260a10M2M02o54j35O91m32M37k94N8MR1Q4n65M77l0P7j21K01k14J70m2m14J83
3283i4M32k85j27K63m73K29K0j43N6N07m41j11J82k27l6L80L9k29J29K21j36j54
3305BJ34l1l9o6K20n08K76j96J18J43L1j70M3j40R2R7p6qM4K66o10M17k5k78K41
3330b3L78m12J9O6m8K1K89k59j98L19j96o28Q94m1j84L9M87j120P79K49r23j40
3352f32J177J15p21N35o12L2j10L18k14J74q2J06q8j94J01L48l44K31K01k66j53
3373g8K12k8j85L7K98n38L7L49j25N2Q6j19q1K30p4j76J90K90n43K27Q1k02J64
3396A04j17M2K32j47k71J32m7k7p2J13Q6K5%j73M98l45j48J05N3r5k62M11o5j50
$$ plain form
3237 -37 -158 -12 225 185 -151 73 152 -90 27 85 76 392 58 -99 65 -62 -151 44 12 -267 101 172 -110
3260 -110 -68 334 -320 -455 236 -196 241 -53 5 9 100 184 -381 96 66 143 22 223 9 179 137 -277 -94
3283 -94 338 53 -74 189 -284 -55 -35 -178 -122 385 -56 -167 15 -212 -248 132 171 -58 71 292 156 2
3305 2 136 105 66 0 220 -288 -12 -208 -90 53 84 -86 -43 -183 -91 6 -70 -78 -34 232 -378 39 14 -264 -23
3330 -23 355 -57 -38 28 -20 1 290 31 -167 152 -44 -672 222 181 -3 36 523 -597 182 431 -492 -632
3352 -632 545 660 -61 474 -138 -106 -216 102 -112 62 -20 86 -2 -196 -95 253 -91 140 341 75 -78
3373 -78 134 106 -79 -42 256 -282 -245 104 -21 31 117 -2 -83 147 73 -103 87 377 -166 61 142 -60 104
3396 104 -13 29 261 114 -157 -25 -72 -99 -171 -58 28 53 53 -120 378 33 -115 -10 43 -52 -314 97 32 -118
3420a18M8J39l00K03J34k25J45J36k84n2M16k17l2K19J4j94j77K13j74n4J36p
3442c1k41O0k40N51p0o0k10R4j90O52q8l74J73J37k83J02J14k72k91O60o6k77
3464a50J89O3n6R3J24m78L93k0n47L70J26k47Q2J81j95k9P8O0J4N8j83J19K11
3487B56l81J40K28l34J79J95j62j52K46j6j75K82k17p6k45L99j49l87M85m3q4
3508a1K33j60nR0M1m83N22l26J06j82m0M35n27J60p8N53j81k39J00J87l11J78
3530F2J15k61l7L08m88K60R7k06k03M32n6k46K86o6j67L17j3l56M8N35q8l63J26
3553C6j35j8K64o3j40p3J70J65j60j77K07Ml46K20J18Mq6K32k42m1PL70m02L06
3577B20j72k6j77K19k02N7K22j37k4J81J9k05O2q1p8K79J81l66k10L36J3k30J22
$$ plain form
3420 -118 -70 69 -231 -28 106 -119 26 162 -122 -174 242 25 -7 212 226 32 -145 68 -106 -160 -24 -31
3442 -31 -272 -212 -452 99 29 -31 -241 -147 -337 315 227 -147 26 163 -120 -18 96 -176 -467 193 127 -150
3464 -150 39 102 46 139 263 -215 178 158 -389 -19 107 -140 -58 123 -72 -101 -23 37 51 109 -74 45 256
3487 256 -125 15 243 -91 88 283 121 -31 215 199 24 306 89 13 -232 167 18 -369 116 73 -11
3508 -11 222 62 57 147 188 -295 227 -99 7 -175 -215 220 -307 -147 -225 328 147 -92 8 195 -116 62
3530 62 177 -84 -121 187 -301 -41 56 -150 -353 79 23 -223 63 -3 -170 147 134 -222 -174 361 273 -90 36
3553 36 -99 -117 147 84 -56 -129 41 206 46 -131 76 80 -266 -46 72 76 -10 222 -20 -61 -54 316 -86 220
3577 220 48 22 -155 64 -138 -81 141 4 -20 161 180 -25 37 -44 -122 157 338 -28 -238 98 111 -119 3
3600CJ41k23r3K35j29nJ0R1K17l25M2J43j42J9M16l76j71N19k90l57K17nq3K08
3624F2P7k12j07M36j43j13J69j41k88M02j89j37J63K6J19m4k22oP1J53k1JN0l03
3648a97L22j55l09O93l55j64K99M2l3j61K80k78r1L83m14n2J51K08k41j13K51
3669F6j48j06M09k72J06M0L3j59L49l77l0M20m30N7n8j03K66k8m03M17J88l14
3691g7J6N9j67k69L89P8k31K84K05o76L10R7K0k1o6K48j83MR9l79L27J06l10L5
3715a02K69j58o4N9L21l03j52M7N11l58j25J8N2k3L8m7n3j4J90l44L75M3j15m23
3739c58N26K01o69M05M1j54m75M74J85l27M98j83n69N92k17o60R32j68J00M05
3759E79r43J035o46k21M3j19M59k2l05o6r0Q0L79n18O27k29l50M26k2k20p1M64
$$ plain form
3600 3 144 -79 -172 63 -66 -71 -61 30 247 -78 -36 107 -35 -16 400 24 -147 372 82 -275 -58 -63 -146 62
3624 62 139 -73 -180 256 113 0 169 28 -260 142 -47 -184 -21 5 124 80 -142 -148 -77 76 55 56 106 -197
3648 -197 125 -30 -339 354 -1 -165 134 176 143 -18 262 -16 -107 276 -138 -190 -39 169 -72 -185 66
3669 66 -82 -188 221 -51 55 95 128 -31 318 -59 -89 331 -99 -42 -100 -203 63 35 -368 49 237 -77
3691 -77 -61 -2 -169 -438 -49 29 -202 82 287 -389 -79 18 38 17 -49 199 16 20 119 -260 67 173 -137 -102
3715 -102 167 9 -55 4 325 22 -130 -83 428 70 -55 -37 15 -8 30 -17 -70 -84 106 -238 137 180 65 -358
3739 -358 168 369 -300 105 146 -8 -483 -9 176 -151 347 164 -405 187 -30 -690 242 74 174 579
3759 579 -364 671 25 -196 -153 -272 187 165 -140 -206 -296 -216 163 -355 272 43 -307 119 97 -123 -194 270
3781B70j99l99L93j22l11K24J35j43j35L76K0m03N66J8l78N8L3j64R8K52j93k62
3803b66K73k4N7k60q3J98J63J08N8j00k92K09j94l2J5K37k72K02R6K2m61M97k27
3826g6k94O74l58l32J56L71k01o6O13o39O7L0k34J70J59J42j32J08r8j96M8k3
3848a11J09J31k71O4K97j24l24M56j34n3J71j71j43K25O1m59M12Q1m31L14O9o9
3870A00k51O4J91ok8P8k83l3K43n2k41K33n7j7J84k77M01l2l41K09r6j29L26l3
3894A53k97M06N0l76j50L36k3m27O32l84n65N18L19j83r2L37m66M45k27j31L8
3915h7Q4J40l9n3k31K83j03K11k75M03m74J56K09l95J91L2j24J03K64j42k31J7
3937f1K40k33J72J05j07l69M69k15k70M87k71M6M2r0Q3L9Qk18J52K23l82lK60
$$ plain form
3781 270 71 -328 65 -57 -368 -144 -9 -152 -287 89 109 -294 272 290 -88 -30 3 -161 -63 189 -4 -266
3803 -266 7 -17 40 -220 -303 -105 58 166 224 124 -168 41 -153 -185 -170 67 -205 -3 93 115 -346 151 -76
3826 -76 -370 304 -54 -386 -230 141 -60 -126 487 -152 -85 -55 -289 -119 40 182 50 158 60 -136 -88 -111
3848 -111 -2 129 -142 -78 219 95 -229 227 93 40 211 40 -103 122 183 -276 136 217 -214 100 169 100
3870 100 -151 -87 104 98 70 148 -135 -168 75 23 -218 15 -42 -59 125 -152 249 217 -124 85 -11 -140 186 153
3894 153 -144 262 312 -64 -214 122 99 -328 304 -80 -645 -127 192 9 -83 254 -212 233 6 -125 -87
3915 -87 -3 137 98 45 -186 97 -6 205 -70 333 -141 15 224 -171 20 52 -72 31 295 153 -78 -61
3937 -61 179 -54 118 223 116 -253 216 1 -269 218 -53 -7 35 -55 28 67 75 -143 9 232 -150 -153 107
3960A07m6k00J23P0JK96k78K52k74j8J18k4n1j40K96k18k00M69k01J13j7k82k22
3983c26M64j53q6L2K7r8r8N43r4l09j25K37o5K21k29J84l2l05p4M76k62j11J63
4006b0R0q1j46K07j34k02J76M5K41m1j50r6L96m66K05J04k88M09Rj21j91J16j66
4029a04l8J70k80K08K19J43m49P0J12j0J96k94j3j10J52o6K29l17L2M50k09k68
4051a77J75j63L0O4J38k98J35P6j1R6j46L62n03M57j22p0j23L11n4l64J18J92
4073A23j57P6m5K2q1M07k55N6k86k16L36O0p0k61K82j91J54J71j12J3M7j02O4
4096C5Jk24N5Q3j21l1L42j44j07P5L4j8k52L93k28J2K11m69J4M97k43j64J14J3
4120a22R7k02N9J8J17K3J15j70M2r2J86q3k14L52j18m5j6J68l92K82L29l64k16
$$ plain form
3960 107 61 -139 -16 54 55 351 73 325 51 33 151 127 76 -64 232 14 -186 283 82 195 178 -104 -326
3983 -326 138 -15 -101 -69 -42 -140 -238 305 211 -98 -223 14 -51 170 -59 125 93 -212 -286 190 -72 -183 -20
4006 -20 70 -11 -157 50 -84 -286 -110 -65 176 135 -15 -111 285 -181 24 128 -160 249 258 137 -54 62 -104
4029 -104 -142 28 -252 -44 175 318 -131 -61 51 41 237 -57 -70 -180 -28 -94 135 -182 -150 300 91 -177
4051 -177 -2 -165 -135 -71 67 -231 -96 -20 -31 65 -81 281 -222 235 113 43 -80 231 177 -187 -69 123
4073 123 -34 42 -3 19 -62 345 90 146 -140 -356 -20 40 -30 -291 -9 -200 -46 125 13 26 73 -29 35
4096 35 36 -188 -133 -50 -171 -202 140 -4 -111 -36 -2 -20 -272 121 -107 -95 116 -353 -339 158 -85 -249 -135 -122
4120 -122 -25 -227 -168 -150 -33 -10 105 -65 -23 -115 71 -12 -226 126 8 -37 -53 115 -277 5 334 -30 -246
4143b46L97k00j15N05m74j00N23k28l18M06k62j16p3L12N4o7J55l41R8M54m10
4164d6J1J19m3M4l1J74l00M3J36j12j25J77O8M7J02k40O9J1L1k13o7QK09J92l40
4189g6l03N48l77K31K0J4j95K20l2j98M04j08l13J08l2J1J55j16k31K45j10pJ05
4212c7K08k05n1R6k42J66J69J37j38o1k71J99oJ91l17pM00j24p3j49L4J4J61j49
4236e5o3J67r4K10Q5l94J71J21j05J30l54K04j88L43R7n71K17J4K45j16M7M0j19
4259C2j76q0M9N1L03m85K98N6K9l1r1r7O1L84l86K42l51K7L37l56J80Q1J44l48
4283a27J52K89l19J63o0l33j8L53n05L96R5J2l36M56k79r0K57j06O1k70M21l01
4305h9J42J28j13j67K64m88L87K5j65j28K25r8Q0K46l70P2J46q1l65L15J85J01
$$ plain form
4143 -246 151 -49 -164 341 -133 -233 290 62 -256 150 -112 -228 -301 11 65 -2 153 -188 -90 364 -46
4164 -46 -35 84 41 85 54 228 -72 -29 107 -5 -130 47 115 162 264 24 93 104 135 -78 -145 -137 72 264 -76
4189 -76 -379 169 -208 23 43 57 -138 82 50 -148 256 148 -165 -57 -89 -78 77 -39 -270 -25 -135 -142 -37
4212 -37 171 -34 -85 11 -231 -65 104 241 103 42 -229 -30 -36 155 -162 -169 231 107 34 -115 -81 -67 94 -55
4236 -55 -118 49 -45 165 250 -144 27 148 43 173 -181 23 -165 178 275 -296 -79 -65 180 64 111 151 32
4259 32 -144 -224 -175 -124 179 -306 -8 48 77 46 -45 -142 -81 303 -83 159 -192 -165 172 -184 -4 77 221 -127
4283 -127 25 314 -5 158 98 -235 -253 100 -405 -9 86 98 -238 218 -61 -151 106 0 61 -209 212 -89
4305 -89 53 181 68 -99 165 -323 64 89 -76 -204 21 -77 3 249 -121 -49 97 16 -349 -34 151 252
4327B52k69J03l20N34l43J15J13k2k84k80M82p2QP1j45K5N3k9j41J35J30k49Q9
4350d4J73j77Q1j10O1J18qj41J90m1r2J66j48K30l93K52K52o46N0M01L0K5j85
4373D4m4O9l18J46J94k84J4K46O2J6q4L1J0k04N22o50J39n7L30j31p9L4q8M1J04
4398F3j45k9K72l9J8K78m42L6R2k57J75k2J31n9k06K45l54K72J31m07K17jk1J56
4422A04j6n9J35k6j07j84J94j51j8J08M8q9J66J6k63J39L6n6k96K68k6j8J92k52
4446a55N0J16k5O5j61j55J33M90k25j64j43L28q0J1K33l70J57k58j6K45J04j54
4468B6j9j01j07K59qk71J46R7J3n25M64p1K41j84K06k65J98J10p9l89L37k56L64
4491A86n54K99k0J67j19k6M9j05J64P0J47k53N6l96L52J39l50K21O0l86K77O8
$$ plain form
4327 252 -17 86 -234 300 -43 72 185 163 -121 -401 81 9 17 88 -57 -32 21 -8 -149 -14 116 -133 -44
4350 -44 129 -48 33 -77 -16 102 94 -47 143 102 10 176 28 258 -135 117 369 -277 -227 174 204 229 44
4373 44 0 69 -249 -103 91 -193 -179 67 129 145 61 92 102 -102 420 -230 -91 -148 182 51 -28 6 -82 -41 63
4398 63 -82 -111 161 122 140 418 -24 12 104 -153 22 0 131 72 -134 111 -243 29 160 -247 -30 -31 -52 104
4422 104 88 29 164 138 31 -153 41 -110 -128 -20 28 -61 105 121 -142 -3 33 -23 -319 -51 -77 -95 97 -155
4446 -155 -105 11 -14 51 -110 -265 -132 358 133 -31 -174 154 74 85 318 -52 105 -153 -169 76 180 26
4468 26 7 -94 -201 58 50 -221 -75 22 35 -490 -26 -97 144 -40 166 -99 99 209 130 -259 78 -178 186
4491 186 -368 -69 -89 78 -41 -67 -18 -123 41 111 258 5 61 -335 17 156 -194 27 87 -299 -22 46
4513D6J15n6N8l37Q0P9R4k66J31k4N0j38K22o6k35L61j57L29l77K4R9M2j94K13
4537I3r7m9j31P7K38p0M5Q5k59L02r6j19N3j16j9j10L74l48J4QK61n5m6l11J64
4562a12P2m8Q1O1m7j85L09P6m83M70l13k75M43qm2qJ28n8L7k2R2j66K21l6p2Q7
4588B02n7m54K80L12k49r6J85j26K23j43O8l03M82j36l37J55J2K7q9p2JL08J5
4611B08rk50K74m05N52k25k42l7J84l23L11j7J40k54J53j21J51J28k45J47N7j35
4633D2j67J69q0R5k37J02j19R5k8J68k9j34l3%L99m19k7K54rj2Q9K5l0N7m50L98
4659A19j33k29L7K98J4l04J00M2q9K44J35k66K22j82M5k80M34k33m4j28j04K19
4681h3m4K32k52J39Q3k10N3K07k83O9J56J2k40M38m51L0K56m2j90J97k00l9J66
$$ plain form
4513 46 161 105 163 -174 -94 -15 79 -187 -56 -80 -30 -168 54 -12 -247 114 -43 286 -91 -67 32 74 -120 93
4537 93 -4 -53 -184 -107 131 61 106 191 -68 234 138 19 72 -44 -63 -173 201 -147 -133 -125 136 81 35 -276 -112
4562 -112 -40 -88 -7 54 7 -178 131 207 -276 194 -119 -394 49 41 -1 -9 119 61 98 76 168 2 223 187 115 202
4588 202 145 -309 -29 283 34 -62 123 -3 220 77 145 -158 324 188 -149 6 18 45 -44 -116 -115 193 208
4611 208 199 -51 223 -182 370 145 -97 -134 50 -273 38 21 161 -93 60 -61 90 218 -27 120 177 42
4633 42 -125 44 -36 59 -178 -76 -195 -100 -128 40 11 -123 -156 -156 243 -176 -203 51 42 30 119 144 114 171 -279 119
4659 119 -14 -243 -206 92 106 -198 -98 -56 -145 99 234 -32 190 8 53 -227 207 -26 -70 -198 -302 -83
4681 -83 -127 105 -147 -8 75 -135 -82 125 -158 -89 67 79 -161 277 -174 -144 112 70 -120 77 -123 -162 4
4704Dj86L30j06k03l24N47k2j39j97K67q5J42j93p9j74K0L69J27J61m75L17l50
4726b49K22m80N59k04M0K59l01J19K50l15J32J41j64K12j52j17J06M8J86j48p
4747A37k28J52J18l1j77R0q1o6N8J5o3J12J9L9m9r9J06j69K54j93M5q8P1J56J2
4772A40k22J2K86m9J07k75L04j68m9j18K4r5J03K18m80K44M7m2j74K11n4m2N1
4795b1J2j24L05l96J42L95o4J22m07Q0k6j46M08o6k26J23k19J25K10p9l15K55
4817H8k53J79J43l43L51j70J23j68L9J96k88J02J71l49J35l7J49j54J5k37K92
4838a6J24j95K29q6j20K21N9l53P6K78l83J58R0m9j98K7k0L0K00R8k47NN5j97
4862b14P1J35j41o9M99l58O9J95l53L00j46J09J5r4k57J8L69J3j74K19l76j83
$$ plain form
4704 4 -182 148 42 -161 -485 62 40 -99 -296 -29 -114 28 -165 -244 -418 -398 -29 98 259 -216 101 -249
4726 -249 -27 -507 52 -152 -112 147 -154 -35 215 -100 32 173 9 221 69 -48 58 106 292 144 137
4747 137 -91 61 179 148 -29 61 -20 -86 -28 -13 -76 36 55 94 45 -54 52 -117 137 -56 -11 -99 -28 128 140
4772 140 -82 -70 216 167 274 -1 303 135 86 -32 -8 -103 0 218 -262 -18 29 -13 -187 24 -30 -72 -21
4795 -21 -9 -133 172 -224 -82 313 249 371 -36 44 18 -128 280 214 -12 111 -108 17 227 148 -167 88
4817 88 -165 14 157 -186 165 -5 118 -50 -11 185 -103 -1 170 -179 -44 -81 68 -86 -71 -308 -16
4838 -16 108 -87 142 56 -64 157 216 -137 -61 217 -166 -8 82 33 -165 -138 -158 -128 72 170 -77 -72 -17 -214
4862 -214 -143 -8 -149 -218 281 -77 -8 187 -166 134 -12 97 112 18 -239 -221 148 161 -13 206 -170 -353
4884c53L57K3n3O6J47k06K38J2j54n7J81O2j61rk0J69k41R0j77n3K68n06M97k25
4908a05R3Rl16L21K1j55J87k27J28k9L43l18k1J5P1j41O9O6l21K80N7J16j20J50
4932A73O3j28j38K7oj09J73j40m6L84m30K33K6K07j76k71K20k82K52k95J50J16
4954Cj43k08J68J49j41K79k57J0L26J54l59j97K81k44K8K7J85n2Q2J93l18j77
4976b11K42om6o7J30k31K52j04j80J06J83m97N89k92J03J5l7l9J50l10K33K8j27
4999a16J21J24j78J35j6j85J13l2k6J71L01m87K95l04K61k76O0Q7j99K39J36j22
5021A02n3m6k56L01J23Rl59K41J41j54q1J0J37J88j76l01N2J99J11k11J09p6k7
5044a7L11k70j06K39j79j29L51j91m4n7K86l19J65J63k17J90q7K02n30K60N6j35
$$ plain form
4884 -353 4 27 -26 40 187 -19 219 231 77 20 201 263 102 93 73 242 1 91 -86 -139 129 -377 120 -105
4908 -105 -12 -3 -319 2 23 -132 55 -172 -44 -73 270 -48 -69 -54 17 -124 -55 11 -310 -30 27 143 23 173
4932 173 236 108 -30 -3 -9 -118 55 -85 -131 253 -177 56 82 289 113 -158 62 -220 32 -263 -113 3
4954 3 -140 -348 -180 -31 -172 107 -150 -140 186 340 -19 -216 65 -179 -151 -124 61 9 91 284 -34 -211
4976 -211 31 25 -21 -88 42 -189 63 -41 -221 -115 68 -429 160 -132 -29 -14 -51 -90 60 -250 -17 11 -116
4999 -116 5 129 -49 86 70 -115 -2 -34 -60 111 412 -75 220 -84 177 -99 -39 48 -151 88 224 102
5021 102 49 3 -253 48 171 180 -179 62 203 49 -32 -22 115 303 127 -174 -122 77 188 -23 86 10 -17
5044 -17 294 24 -82 157 -22 -151 200 9 -35 -92 194 -125 40 203 -14 176 89 291 -239 21 77 -58
5066e8J44q6j93PK81l02L15K8j00K3o6k47Q8J57L12l19j14J31O4j05J45k27L76
5089B54n9p6n0R3j13m1o5O0J86k39k02N00o8k97j4K25j84K04k88J04nL71k22l4
5113D0j89M1J7J54p2q4J68k41L70l13L54k06j59l08M62O4N0j17K40l5q4j1j6r0
5137C5l3P6J42k26j63K12j42J73Nk0J0j43J63K82k61l07L48l2k76M4L04m01K90
5160H0j37K38j13j54J14j13K93j38j58P7J44rJ6k9k79K50j29j34K93j95J5L03
5182B35n7m02J99j1k12K71p5qL0J26k96J04j8J79j18J64j51j83M8J5K28r2R4j01
5206c1J66J18m82K95j7r0lJ95m1j18J27k01M5l7j68K09j35M1J8J78k94K12K68
5229B55l96j51K96K24k58j2L09l40J50J19k65J66Ok09J87q7O9k99Q6J08j54K60
$$ plain form
5066 -58 86 0 -193 -186 95 -207 108 136 36 59 -7 -254 -166 -9 303 -16 -130 1 65 -40 105 -122 254
5089 254 195 119 69 162 49 8 -57 3 189 -50 -252 248 180 -117 -131 94 -90 114 -174 -70 -75 296 74 40
5113 40 -149 -108 -91 63 -9 -93 75 -166 204 -109 245 39 -120 -428 34 98 148 31 271 236 152 141 125 35
5137 35 2 78 220 -6 -169 43 -99 74 79 59 69 -74 89 371 110 -197 151 119 -157 -113 191 -210 80
5160 80 -57 181 68 -86 28 -85 208 70 -88 -11 133 124 140 111 -168 82 -47 -181 112 -83 -68 235
5182 235 178 -224 -25 -36 -248 23 -52 -60 -30 96 -200 -96 -114 65 -53 111 -40 -223 -175 -160 68 -24 70 -31
5206 -31 135 253 -229 66 49 -41 -44 151 110 -8 119 -82 -37 -74 -242 -33 -168 -127 -109 69 -225 -13 255
5229 255 -141 -292 4 228 -30 -42 267 -73 77 196 -69 97 103 -106 81 -6 63 -236 -150 -42 -196 64
5251F4j56J97J87j83j30J76k04j62O1l1P3L28k06r2J18L3j59K13k11J81j8k11
5273a32J25l6RO7l48L17Q5k31J15J02k99O4nPL51j89j05J55j52N0k18N42j6l01
5297d3K20m01L96j33o8k8O2Qj52j7L7L60m41N4J10J01j95K44q3%Q4l01L80m1n38
5322c85Q41q25N41M0j060P04N06k26J51r23O25K65l86K34P2l56K75n3L1k2k28
5343a79J7O9N4M0L4%J01j68J10k1l6J44k25J15K28j16m98L79j77O5J73Q4k46j92
5367b45j5N25k84K85l16j35J26O8j68nO2J73n3j12m2J94J10j36k32K41n1K31j34
5390H7O7j26p7N6o2R6j75M64m12K02k09K04m44M80J10k49j82J95j4Mj21J12k10
5413b04N55k20j49J99j42j17J01q8j03J59P9j5j17J84qk90M51l27K81l83J11M59
$$ plain form
5251 64 -92 105 292 109 -21 155 -49 -211 -150 -181 -108 220 14 -78 40 73 -86 127 -84 97 79 -132
5273 -132 -7 -43 -34 33 -315 2 87 -144 -29 73 -226 -162 -167 -160 191 2 -103 52 -100 -50 -268 274 258 -43
5297 -43 177 -224 172 39 -29 -57 5 13 -139 -156 -119 241 -200 -146 -36 65 -130 114 31 31 115 -186 194 153 -385
5322 -385 456 -369 172 212 -848 -144 362 136 287 -636 -11 254 -132 102 174 -182 93 40 71 49 -179
5343 -179 -162 -93 -39 1 35 35 136 -32 78 57 21 165 -60 55 283 167 -331 48 -129 -64 109 193 -53 -245
5367 -245 -260 265 -19 266 -50 -185 -59 9 -159 -164 -102 71 18 -94 -136 58 168 32 -200 41 -10 221 87
5390 87 154 28 -49 7 -55 41 -134 330 -82 120 -89 115 -329 151 261 12 -170 25 11 15 -106 6 -204
5413 -204 351 131 -18 181 39 -78 23 -65 -168 -9 70 55 -62 122 114 -176 275 -52 229 -154 -43 416
5435D16n01J83j77j3M2k35J87J34o2K75k50O2Oj00N0J11k41j74K28J49j23j2K77
5458B32k71M1J51j31n2n3P9j71M86l82q3K33j62j33K22j15M0J27j55P7N2L61l30
5481F3J94m42K69k51L17j11q9J66k09M5j14J35J59o4J0k98L24k1j12K30k15j60
5503a74J81k21j0K55n9j1J72p1r2O9kM2j9j52mK52j90O1m18N11j36J06k8pj86
5528a31L70n53m4q1N21N8m3K5k98K64k12L10k58jJ0J25j77K07k74Q0J80k34J61
5551EL5j7n1j30j83M01l0m9q2L94l02J2Q2J81k29K75l09k64K59L31m24P0p7K1
5575h1J82m8r7P1r3M8K6j37M0J74J6j04m5o3L6l2J29o4J06j26J32j74O6K98j42
5600A18k30R6M8K6J33k61j01j3K95k51J57o4Oq3m8K01k1J09j13n2K63o4l49p9
$$ plain form
5435 416 -85 98 -79 -92 -50 -285 -98 36 -26 249 -1 61 67 -33 17 128 -113 -287 -59 90 -33 -45 232
5458 232 -39 2 153 22 -30 -83 -4 -175 311 -71 -154 79 -83 -216 6 -109 -69 58 -97 -20 32 393 63
5481 63 257 -185 84 -167 150 39 -50 116 -93 -48 -162 -27 132 68 78 -220 104 83 -29 201 -14 -174
5503 -174 7 -214 -224 31 -28 -39 133 62 -30 39 37 79 60 -92 -96 156 -34 27 -391 120 -16 90 62 55 -131
5528 -131 239 -314 -358 -439 82 140 97 122 -176 88 -124 186 -72 -73 -63 62 -115 92 -182 -102 78 -156 5
5551 5 40 23 -28 -158 -341 60 30 -19 -101 293 -9 3 85 266 37 312 3 -261 -2 329 -95 -25 -102 -81
5575 -81 101 53 -44 27 -66 -18 8 -129 -89 85 101 -3 -48 -111 -75 -107 22 -42 64 -62 70 -104 -38 260 118
5600 118 -112 -16 32 58 191 -70 -171 -184 111 -140 17 -47 -41 -124 -172 29 8 117 4 -48 215 151 -198 -277
5624b77M2K73j57K57L4o1l74L06kk99J64n7Q0M4J20r5k0r4J72Lj16L05j53R2m32
5649b45K68r7K17l26R4R2K84l50j17K37p8j24N4M3o3K18j81J9K79j91l8J16Q8
5672A99j15k17j8K79k45J39J65o9Q9k30L0j78N4J36j69l9J50J87k73KK94j79N2
5695D4J30l46L4O1J35j17o6oL0K44m04J42L85l81K56k21J36M5J4R1l10K05q5r6
5719h0Jo5K46m21M71j92m3Q8l2k85L56O0k0q4K84m18J14J35j78K04k85J31J82
5742A69n5j78K70o6k01K18o1j35J55r4K14R2m15N2n1O5j8j3J56J50j38k57J88
5765D7j57Q4K33l94m9L34j20K67k61J32j20k55J80K39q8qk23L03K16l35J01rk91
5788a74K3oK64k9k66J79k29J98j17j53L42k4k9J68k46QJ68J7j14N9J81m06K41
$$ plain form
5624 -277 -235 38 -119 138 172 111 -263 43 41 -258 -94 -151 -71 -27 93 -2 -22 -116 56 59 -57 248 95 187 -245
5649 -245 23 -74 143 -183 -89 3 287 -63 -180 57 -21 -145 -91 -48 -111 107 -74 -55 224 33 -5 111 199
5672 199 84 -133 -151 128 -117 22 187 118 207 -23 7 -171 -117 19 -150 -189 -39 148 -125 -123 171 -8 44
5695 44 174 -172 -138 -77 58 -59 -125 -131 -101 143 -261 -119 266 -115 141 -80 56 101 115 206 -104 101 16 -80
5719 -80 -79 -144 102 -319 152 -40 -83 5 -27 -312 44 104 84 0 284 -134 -20 115 -63 141 -144 -13 169
5742 169 114 -64 206 140 -61 157 96 -39 116 22 236 328 -87 -35 -86 -21 -39 -52 104 254 116 -141 47
5765 47 -110 -26 207 -187 -236 98 -22 245 -16 116 -4 -259 -79 160 72 64 -159 144 360 25 126 117 -174
5788 -174 -151 -157 107 78 -188 -9 -238 -40 -157 -310 32 8 -21 147 -99 -91 77 94 -20 39 220 -186 55
5811E5Nj57K1L57k94j45K09Oj99L11j5j50Jr0K58q8k7Q9j71L5K28j61p0j89n0
5836b31K19r6j1M27n54J41J87n9J2k13J22P9j8J1N8o7j54J37J37l04J34P3j82
5859a52J28j19L3m7j06K92k41L41j09j98J46J93k28J12j08j09J11P9M0j50J96
5880A04k55L17M1j29or0J23j55KJ87P5k1l34J39m5J59P5j43l19L76j99MN9K0J77
5905A62j21j28L20m05L32l47K12L6j36K09k51J57oR4k06l8j3P1q4M4q0M48k20
5928E0q7K51r0J16k82Q3r3N2j86J31M3J39l27J62K23j49j83K1J36k33J95R6k8
5951D0P6J51q2J39l13j20K87rk71j08J91q0L38k36K25k36n4o3j0L23j39O0Ml21
5975b08K39l10M67o9l60M16k56k12K87q7L82j29j02J6k53K89k81J85j71K91k52
$$ plain form
5811 55 60 -97 -76 281 -13 -158 51 57 -142 169 154 4 5 -85 173 85 58 147 -24 11 239 78 8 -181 -231
5836 -231 -12 -108 -119 308 -246 -105 82 23 35 -178 -56 23 5 16 74 7 -147 -10 127 -177 -43 30 -152
5859 -152 -24 -143 -110 -157 -263 29 -212 129 20 -178 -32 161 -67 45 -63 -172 -61 18 58 -92 104
5880 104 -151 166 207 78 72 -18 105 -50 -48 139 214 193 -141 -2 -47 112 187 44 -275 101 -98 -94 -35 -15 162
5905 162 41 -87 233 -172 160 -187 25 61 -75 134 -117 40 34 128 -78 -116 -129 -58 -142 -98 -178 270 50
5928 50 -37 214 124 240 -42 41 -52 0 -186 -55 -12 127 -200 -38 185 36 -147 -126 10 -223 -28 68 40
5951 40 116 267 185 324 11 -109 178 169 -102 -210 -19 -99 239 3 228 -8 -62 -125 -135 188 49 109 113 -208
5975 -208 31 -279 188 119 -241 175 -81 -293 -6 -93 289 160 58 74 -179 110 -171 14 -157 134 -118
5996a18K27L0J28m42P1J20k88J49J94j97J0L68j54k34K60q8J47j44K22k21o3K82
6018B59l70j2J91K30k30j04r7j1J05K27m03J11L10j24k06P4r2L34j14j2KJ54k80
6041e8q3K53K01l01J12K1k24O3q5J92j10k0J07k1j0J15l94j4J92k31L18j29J78
6064G2Rp5N9j79J7Q3M0K7J16k89J76j02L7J31k48M0J02l47J78J57L7R1l9l47L03
6089D9K4K04j65l54J7K14O9j60J95l30L50k98J95J4j77q3L35M6n4J3j04k02L41
6112A39m8p0P1j37kN1Nr1K1k29M66j16j48J13P4p9l8Qq1q6L71j07r5J19k5J09
6138A95j13Q9l0j63oj25K17K57m17j10K63p5J07j53r1n4J5R2Q9j41O8m0L82m45
6162a89K18j64J92j33J51K97m61jL7K31j43j6P9j47L6p5M1L77j13k87j08M05j21
$$ plain form
5996 -118 109 139 267 -175 -104 16 -272 -123 71 -126 -116 252 98 -136 124 36 183 39 261 40 -23 259
6018 259 -111 -123 68 298 68 -36 -133 -144 -39 188 -215 -104 206 82 -124 -50 -142 192 78 66 68 222 -58
6041 -58 -141 112 313 12 124 145 -79 -16 -101 91 -19 -39 68 47 37 152 -242 -256 -64 -295 23 -106 72
6064 72 81 6 65 -114 -97 -14 26 53 169 -120 56 -46 -9 122 -126 -86 16 -331 -153 4 41 132 93 -254 49
6089 49 73 277 112 -242 -225 -11 58 -102 93 -237 113 -185 10 24 -153 -236 99 145 91 104 0 -202 139
6112 139 91 21 92 -45 -47 4 9 -82 -61 -290 176 60 -88 25 99 20 -18 -10 -91 -177 194 87 -8 111 86 195
6138 195 82 171 141 -22 -28 -153 64 321 -96 -206 57 -18 89 -64 -155 -209 -194 -102 -13 -154 -86 -126 256 -189
6162 -189 29 -135 57 -76 75 372 -89 -90 -53 178 35 19 98 -49 -13 -88 -47 330 217 -70 -178 227 106
6185A06k27m8J28M8L8l0j90L67k54J18l6pj88K80n3j79J89p1J00m8o8q6NO8l8
6210g6J85o2k16J21J82l66K83P7j10m80L68J09n5J09J33l62O5K59j28k33J3Q3
6232a01J96l3k32R3K69j77n7L80l41k49N05m0j30j36j72J05L0J75l79L00J47j74
6254b1K44l24J42L1kPQ5j93O5J01Nl2k29M47j83k86M2l5j48K80k30O3L82P0k70
6279A1J96n9j57K5Q3o7j80K36k85J24j9K88l36m7M03k06K71j66m9j08j00K4L78
6302B60l43K57o9j70K14l46L29l92R9J38J72k8j41j09L1J25L51j93k34O3P0k06
6324a22M4K17N6K10o58K99j34j55L62j28J44k30k7J60k92J01k6J0J99N0J4m6K9
6347G7k9P5m5QN6J6r7%O1k28J68k48J92m5P8j34R8J56q2J16l63J43J6r2Q5P2j41
$$ plain form
6185 106 -121 -169 -41 7 45 15 -175 192 -62 56 20 13 -175 105 52 -127 62 -9 91 43 -25 -111 -106 -38 -76
6210 -76 109 47 -169 -48 134 -232 51 128 18 -462 -94 15 -40 69 202 -160 -95 164 36 -197 -184 -101
6232 -101 95 62 -170 -77 192 15 -42 338 -3 -252 253 213 83 -53 -225 -120 -90 85 -294 6 153 -21
6254 -21 223 -101 41 72 70 77 162 -31 34 135 140 108 -121 326 143 -143 -101 -136 -284 -4 -234 -171 211 281 11
6279 11 207 148 -9 16 99 32 -148 88 -197 -73 -92 196 -140 -187 216 10 281 115 66 -42 -142 -118 260
6302 260 -83 174 105 -65 149 -197 132 -260 -161 -23 149 121 -20 -129 -98 27 378 185 -49 14 84 -122
6324 -122 -78 139 195 405 -253 46 -88 -243 119 -9 135 -95 -122 38 -254 -153 -179 -169 30 80 94 48 77
6347 77 48 123 78 86 142 158 61 61 122 -106 62 -186 6 -39 39 -95 3 159 77 193 -170 -27 -11 -103 -18 54 -87
6374h7J6J11l8R5k75L16P1k16j90L06j21j83M01p3j49J3j06L3k9J41P0j51L00
6397B55k85n6J76n2K7k3k34J07O8N3K05q9m05L22K4M0j2j37N9j2o1qK23Pk60P7
6423IJ3m7k4p5L07l32k07M96l12K11K52l99P1m9K07J45j84l81N55k62J47o50r9
6446f08M35m54M6J271M57r58Ok40J02O1j9r1j29k3J85m7n6R5K34m10l8K48j41
6469g4L23j52n1p9j7K0J52m4j27R4k84J70p8J15Jp4N9k16L33k84J76J1k19L14
6493F9P0j34J46o9Q2j68K3k61J69J06j24M9J59j82j3K10k51j9K9K6J42r1o2J09
6517A5J02J15k64r1K67j73O9j23j40K89Oq7L0K6k42K00J26o1j51J02J46J5r8J27
6541B05k37j18K39J3q5N7k05L04J7k64M6L7m8K19l84j81L69J36l6k23M27j57j62
$$ plain form
6374 -87 -71 40 2 97 -178 138 209 -7 -197 109 -12 -195 206 133 -16 -3 -109 -76 -105 36 106 -45 255
6397 255 -30 -86 90 38 65 42 -192 -85 -17 36 241 152 -253 69 93 133 121 -16 43 31 -30 -38 185 192 -68 9
6423 9 22 -25 -49 -124 183 -149 -356 140 -172 39 291 -108 -37 -86 121 266 82 -299 256 -6 141 -509 -608
6446 -608 -173 -627 -581 690 1147 189 195 -45 57 118 99 8 -121 -144 41 -6 -62 33 267 -143 -181 67 -74
6469 -74 249 97 46 -33 -50 -30 122 78 -49 45 -239 -69 -147 -32 -31 -105 -46 -262 71 -213 -37 -26 -245 69
6493 69 139 5 151 82 164 -4 19 -242 -73 33 -91 -42 117 -65 -78 132 -119 -138 -109 -83 59 -32 -94 15
6517 15 117 232 -32 -123 144 -29 40 -83 -223 66 72 -15 15 41 -201 -1 125 64 -87 15 161 176 78 205
6541 205 -32 -150 89 102 17 74 -131 173 190 -74 -28 9 -39 180 -204 -385 -16 120 84 -139 288 131 -31
6564c1m4L2o0K67k6k3j12K52n0j79L09l39o6L1j37K38j25J43k15j34L71j3L7k13
6588h7N7r9M5N0m7O8K02j69M8j59J64j84J89o3K98n08L66j22J59k74J7J69j00
6611B0k22L38k95K09K31j86j74L00l42l7K96k49q2q4l9J86m6L8K46j54m6M0J87
6634A35k59K2J58J01l48K45j76L29J62m44J52j4L1P5k42M15l15P6K76m52M7K3
6656cJ79j49N9l23lM76k07k42LJ73l13K02L36k40o3N4Q6j79J92n6Q5k34j67K29
6680a05J85P3l24L86l35K73k96K30k10N9P5j4R3RL4m6q5k0j09J93k06R0J41k24
6704a33nN8q1R1R8n1k2j81L06L3j86J84k09J21L81l86K05j99K22k98J7j11K24
6727G8j69K28j68J51j12q7J52l61K08L1J52l64J53L6J50j60J21L7k20J65j36L4
$$ plain form
6564 -31 -75 -43 -103 164 138 115 3 255 205 26 335 -4 -70 -39 -176 62 -63 80 -135 -269 102 89 126 -87
6588 -87 -30 -129 -84 -34 -81 -13 189 20 68 -91 73 -111 78 15 313 -195 171 49 208 -66 -49 120 20
6611 20 -202 136 -159 50 281 95 -79 221 -121 -158 138 -111 -193 -277 -316 -130 -176 -138 108 -46 -92 -52 135
6634 135 -124 -102 56 157 -191 54 -122 207 369 -75 77 63 94 169 -73 342 27 103 379 -73 -26 -3
6656 -3 176 27 86 -237 -240 236 29 -213 -210 -37 -350 -148 188 -52 -115 -61 25 -154 38 -18 67 -167 -334 -105
6680 -105 80 153 -171 215 -120 153 -143 87 -123 -64 11 -3 90 99 133 87 2 -18 -127 66 -140 -50 91 -133
6704 -133 -138 -80 -161 -70 28 -23 -45 -226 80 113 -73 111 -98 23 404 18 223 24 246 -52 -35 -146 78
6727 78 -91 137 -31 120 8 -79 73 -288 -80 -49 103 -261 -108 -72 78 -82 39 76 -144 21 -115 -81
6749h1p9J63K26P1k11pj37K29l99J84j82Q0L02J6j33j34j86J02N8j50K28J34o7
6772B7K35l11J4J18j20m83O35K6j58K47m48K62J9r8J51n4k32J10k06L92j04R3
6794A15j56q3L0J03J6J59m4n5J92l78j4L77l87K77J2n8L6l04J54O5q6M9j45M00
6818B75k94J43J31n7j60j4K03j76r1K52k93J03j67J74M1j86L2L4q4L6Q3J38k57
6841a34K32p1j92R9K98J40m01J20q8j01k71L54Q2J71n86L58j20M4L8r3K61j22
6863A8j51qJ21J84r5j44J62l59L29j55J55o2ll6J7jR0o1K41k06j58J07J35j48
6887b8J96j75J48k31K1J27j62K03j1l6j81K58j12n5J59j03n9qk17J03J50M8q1
6910d6L5j70J83O3j72j07L23N8j73J5qM5L0j30%k61L25L52l48L39m24L6Q8j97
$$ plain form
6749 -81 -160 3 229 300 89 82 -55 174 -225 -41 -223 -143 159 175 42 -92 -278 -176 -118 -268 -40 94 27
6772 27 262 -49 -35 83 -37 -520 115 141 -17 230 -218 44 63 -35 116 62 -170 -60 -266 126 22 115
6794 115 -41 -124 -94 9 25 184 140 85 277 -101 -115 262 -125 152 164 106 142 -162 -8 57 -29 20 -125 275
6818 275 -19 124 255 198 38 24 227 51 -40 212 -81 22 -145 29 70 -116 -84 -50 -134 -98 -15 123 -134
6841 -134 98 27 -165 -66 232 372 -29 91 3 -98 -369 -15 67 238 -348 10 -110 -66 -28 -121 140 18
6863 18 -133 -141 -20 164 69 -75 87 -272 57 -98 57 -5 -8 -44 -27 -28 62 1 242 36 -122 -15 120 -28
6887 -28 168 -7 141 -90 -69 58 -104 99 88 52 -129 129 17 -38 121 18 -41 -49 -266 -163 -13 35 -46
6910 -46 -11 -181 2 65 -107 -214 109 167 -6 9 1 46 76 -54 -54 -315 10 362 14 353 -71 -35 53 -144
6934a44M2J93m9l29K23PJ84K9j85J60j66j56L47m58K55j28J60P5j20K52o4J08
6956B36m04L68l98L6J23j1J13q3r3J58M9k54M6K28J5k14J04k6n9j34j27J43J70
6979a4p0J01Q3mj25j42J58p6Jk01L11j93L92n9O3j49J3k31j3K13j97L56k25n3
7003f1qj8J26j14JK30j6j01j52J20m8k3J21n6j63J31Q9q3qM5j08NR6m8j28j85
7029c56O26j11j34%n0L62m60K29k45J01P2Pm3Lj01K75k65K47j30n2K54j01P1l60
7053a61O7J8N8k2j89L27j29Pj27K66j72J63j71o4K17j9k34J92J83l30M54k79m3
7076A2j55K50j98j34K46J59j91Q6j92J28P8j02J77m3j19J4N2j95J15P6J66j72
7098E8r2r2O8j73J49QJ06o8P3kj29J55M0K38n20L57n4j28N3M4p5J02j15L5q6J38
$$ plain form
6934 -144 -102 91 42 -287 -64 -57 127 156 -29 131 -35 -191 156 -302 -47 -175 -15 60 -60 192 128 236
6956 236 -168 200 -198 -162 -39 -50 63 -20 -113 45 94 -160 -114 114 129 -85 19 -7 -66 -200 -327 -184 -14
6979 -14 -84 17 100 96 -29 -171 -13 -89 -88 -289 22 -171 221 162 225 76 89 -142 -155 58 -139 217 -8 -61
7003 -61 -69 -87 39 -75 -74 156 140 39 -113 7 -41 -64 57 1 -162 -31 58 -25 -33 12 -96 -91 5 -43 -171 -356
7029 -356 270 159 25 25 -25 337 -123 106 -139 -38 34 41 -2 1 -100 175 -90 157 27 -25 229 128 199 -161
7053 -161 -94 -76 -18 -40 -229 98 -31 -24 -151 115 -57 106 -65 -129 88 69 -165 27 210 -120 334 55 12
7076 12 -143 107 -91 -225 21 180 -11 75 -117 11 89 -13 164 121 2 16 68 -127 -12 64 230 58
7098 58 -34 -126 -58 -231 -82 -74 32 -36 37 35 -94 61 101 339 -181 176 122 -6 47 91 16 118 3 38 -48 90
7124I0L42k95j47J39k05j32K71k7j10j69N25j53K9l8l01k7M58r6q8j14l3MN3m9
7148g3J98Nq8J64K43n61L3J39J9j09K60l36L2J30r9l8J17l17K74P5J04M0j90Q6
7172A08l6j59L8p3J65K05j33k2o8Ok1j72J05K97k04J58k41J16j30N9nR4j38j54
7196b05J79k21K0J43K1mJ62Q4O0k32pj51J59j59J06K2%j73K80l12P0r9K19LO1
7221B6k23j61L93Q5k72J94R5k50K32k18KK76j08m2l16J58L13k97p5L00p8j89j31
7244b86L13N9r6N8j80J23j49L24lk75Q1K77r7r0j39L12l27k1K27j93k2J82k61
7267a83K22nj59o3p8K71K11O2M4m41O9J13j5Q1j62Rol9j06J44L0L3J86j95M9K50
7293C22j15k38K1m0j23K75P5k81J35k59K12J86k75QK60j03j59J52j54j09M7R2
$$ plain form
7124 90 432 137 -10 129 -76 -208 63 36 -74 -243 282 129 158 120 -181 -208 250 154 66 -48 -81 -77 -24 -73
7148 -73 125 130 42 206 449 -112 -79 60 79 -30 230 -106 -74 56 -43 -81 36 -281 -7 68 172 212 22 108
7172 108 72 -87 -49 -122 43 248 115 93 25 31 10 -162 -57 240 36 194 -47 69 -61 -2 -7 87 -51 -205
7196 -205 -26 -247 -227 -84 -63 -67 95 179 239 7 0 -151 8 -151 -45 -23 -23 -196 84 -228 -158 -257 -38 -35 26
7221 26 -197 -358 35 120 -152 42 137 -113 119 -99 -97 179 71 29 -287 -129 184 -113 -188 112 34 -155 -286
7244 -286 27 86 -10 48 -132 -9 -158 166 163 -112 -31 246 149 59 -80 232 -95 -116 111 -82 -104 78 -183
7267 -183 39 34 -125 -188 -266 5 216 278 322 -119 -50 63 48 129 -33 -24 -30 -69 -175 -31 -1 32 218 23 72 322
7293 322 207 -31 -10 -50 -173 102 177 -104 31 -228 -16 170 -105 -97 163 60 -99 53 -101 -210 -163 -71
7315g1k64L26j2K20k08j3M2K9j66J14m5L09k40j05L16j47J75j02k33PK37m33K06
7338e8K0N3q4p6N5o1J72J46k5q5k19M21j86o8j9J15m12M43l77L48r0k06K8J68
7362CK04m51J09K53j45q9J09J54O6l18P0l4k6J21J13j86j95L18l3L0J7j46J71
7385A15l54M54k30O7j51n1k7J98j12k24M00j7j02O6J24k54J86j58J18k37K55r4
7407b8J5Q5j12J17k03K72l05L33j77M6p1j72J95k33J29q7K01m0K78k74p9R4o3
7430g9K32k02j78L19j97Q6Q6j05j0L04j05j83mk7J92j70J42j33p1R5J31J1Q7k93
7454g2JOM5RJ19k55K07j84O2K06j93j49K47j37R0K2J6ll0j50L00k84J59O3j7O
7480H4j84K03j08r0l5J26p3L6K31J27l58n4j4J44M9K1j64N0J08k88J97R4k20R2
$$ plain form
7315 -71 -335 -9 -21 199 -9 -22 20 49 -117 -3 -48 261 21 -84 232 85 260 158 -75 -68 169 -264 -58
7338 -58 -38 15 -69 -145 -90 -151 21 167 142 57 -162 259 73 5 -14 101 -311 132 -245 103 13 -193 -165 3
7362 3 207 -244 -135 118 -27 -116 -7 147 213 -105 -35 -69 -95 26 139 -47 -242 76 43 73 90 -56 115
7385 115 -239 215 -15 52 -99 -150 -177 21 -91 -315 85 68 -34 32 156 -98 88 -70 48 -189 66 -28
7407 -28 -13 72 -40 77 -126 146 -159 174 -3 43 -28 -200 -5 -238 -109 -196 5 -35 243 -31 -110 -16 -79
7430 -79 153 -49 -227 92 -105 -19 67 -38 -48 256 151 -32 -36 -63 129 -41 101 -32 -103 -8 123 134 221 -72
7454 -72 -71 -65 -20 -11 108 -147 60 -124 -62 144 -49 -198 49 -88 2 24 40 37 7 -143 157 -127 32 95 78 84
7480 84 -100 103 -5 -95 -130 -4 -77 -41 190 317 -41 -95 -109 35 84 105 -59 -9 99 -189 8 102 -118 -26
7504b6L2l8l2K02p6J51l7o4q6l0j46J58P9J0k47J31J26j08K42j32k40K97j31j97
7528a62L03o4l7M3k61L02L9k76J81O6k74j12L43n1j49K48J49l59j64K40J18J43
7550B66j83N4m0K2n2Q0l25K8L08l7j83Rj01J62n6Q2q4j48J14J21J21j72j34J76
7574B8j27K80k3m00L48q2N9J40j2m33K57l05K91j8P9p7qk3J40r9j02J52K70n20
7598a85M05l37Q6K35j34q9O8J48j45l03N27K08p13L07j01n1K7J10O6J13r7j66
7620b1J27k02M4k78K83K93l86j27L0k5L03J7J7Q9k13k13K17r9o8L53Oj29p8K40
7644A80l97R7J01j64J60J03j2j46M24k33j51KqJ07k23jJ64k6J72l13j9J83m8J14
7668F6O7k62j00K43L8j5N9Q1k48lK30j94Q3J71m58J16k0K39j8l35K75n3j3j20
$$ plain form
7504 -26 6 -32 -64 138 62 213 176 112 26 -4 -150 8 87 97 -150 -19 107 -1 241 109 -131 166 35 -162
7528 -162 141 77 40 83 -178 124 163 -113 68 134 -140 -252 91 40 -109 139 288 -71 -235 5 123 266
7550 266 83 137 97 119 67 147 -178 -150 158 121 -62 -53 -154 8 -48 34 -50 -198 -84 37 158 -14 -148 28
7574 28 -99 181 158 -242 106 24 83 223 211 -222 35 -270 21 3 82 5 -3 -26 114 15 -87 65 335 -185
7598 -185 220 -117 -31 204 70 -19 49 197 52 -251 276 484 -229 78 -23 -74 -47 63 129 242 145 -21
7620 -21 106 -96 -52 -330 -47 246 -140 -267 -237 -262 41 58 75 164 -49 -262 -45 -144 -212 141 147 18 -60 180
7644 180 -217 -120 -19 -183 -23 80 68 -78 346 113 -38 -36 -44 63 -160 -161 3 -23 149 -164 -183 0 -48 66
7668 66 133 -129 -229 14 52 37 96 177 -71 -74 156 -38 45 216 -242 -126 -146 93 75 -260 15 -38 -51 -171
7692a71J96K59k75l9P8k58J19N1L8P6j10O1J7k70K71Q1J52k65p2m7J27K10k5J1
7716B15k11l8Q4j65k5J93j84J38j66K44j3J16j48K0J15j39k35K25M05k35k61J05
7738D0J14m17L52J07l86K28l6K1j93L9J59j12J48j55J16n0kJ43j07j67L24q1j91
7761a06J56k2L0n8K3j34K99l25K21m10K62o2Q1j66J46J34k54M1j02J57K7j13N4
7784a21N2n2J60J7M2K9K5n0p2j59J52Q3k32P7j63K09K79k51p4J30j64L31o1k41
7808e4K68j36l5J79k22J05Jm3j96K97jJ31j82j67n1J63k35K79o9r9N05k78k02
7831d2J10l46M85l35L05k10K12K3j02J16k89O3j34K41m8Q9j50J4J36l9p7r2J34
7854F4kj54K18k50P6J45k58L55j96J09k67K72k11M0k90L07N8oO1o0j45R3j12J48
$$ plain form
7692 -171 25 284 9 -30 48 -210 -91 -40 -2 74 -36 25 42 -228 43 124 276 11 -61 -108 19 229 204 215
7716 215 4 -34 50 -115 -140 53 -131 7 -159 85 72 188 40 60 175 36 -199 26 431 196 -65 40
7738 40 154 -263 89 196 -190 38 2 23 -170 -131 28 -84 64 -91 25 -25 -27 116 9 -158 166 85 -106
7761 -106 50 28 58 0 23 -111 188 -137 84 -326 -64 -126 -45 -211 -65 69 -185 -144 -246 -89 -62 -175 -121
7784 -121 -69 -121 39 56 98 127 152 102 30 -129 23 106 -126 -49 -212 -3 276 25 -49 81 -83 248 187 -54
7808 -54 214 78 43 222 0 105 106 63 -133 164 163 294 112 -55 -106 57 -178 101 32 -67 438 160 -42
7831 -42 68 -278 207 -128 177 -33 179 202 100 216 -73 -10 -144 97 49 138 -12 2 138 99 22 -70 64
7854 64 62 -92 126 -124 -48 97 -161 194 -2 107 -160 112 -99 -59 -349 -42 16 10 71 11 -134 -41 -153 -5
7878eK54k68J47K2k75N8J66l5jj30ml8K62k35J89K1j10p7r7o9L73k27K1j80L55
7903A17ok27j35K76j9r0J07k04N3J62p2j17p8J70J11J07k74J01R6m4k43R7L0J67
7927H5M9q7Qk14K42M0p7K36n73K29q1J61k54K83j98J96l3Rn8J48r7J43k7q8o8
7952b6lM7k19J05J30O8k65m6rJ73J50K9k02J14j48Q1j73K25n9N6N5j31K02n7j8
7977G9j34K34k37k25m2K94J36J15k16J95k41J02j96J33n5J69k71K33m4P5r4R8
7999A08j80j57J60Rk11L78k02Q3%J92k96l0J08J55j62M19l47j44P2lk7K50J40
8022C15l22m5N3J70q4O2r7m3n6m5M6K99j61M0j8j46r1k6K56l0n1K04j47j05j13
8047a35J17j03J10O1j19Q6L4j5n0l1P3m1j91J95J14K9L9l83Q6L10m4j34j29J38
$$ plain form
7878 -5 249 -19 128 150 -125 -67 99 64 63 -67 -71 -109 153 -82 107 128 18 -59 -156 -225 148 -79 -58 -238 117
7903 117 111 -116 -251 25 6 -84 23 -181 -128 34 -38 -155 -233 -63 48 155 -119 -18 78 34 -209 -112 -82 85
7927 85 134 47 55 -159 83 123 46 282 -291 -62 -143 18 -236 47 -151 45 12 21 -37 111 14 157 130 42 -26
7952 -26 -29 18 -201 -96 34 102 -163 -209 -218 -45 105 134 -68 46 -102 -21 -194 31 -28 28 83 -48 154 97 79
7977 79 -55 179 -58 -283 -325 -31 105 220 4 199 -42 60 -136 -3 -58 111 -160 73 29 104 10 108
7999 108 -72 -229 -69 -60 -271 107 -95 -12 -12 180 -116 -146 -38 117 -45 374 27 -117 -45 -48 -75 175 315
8022 315 -7 -52 1 171 87 149 52 9 -47 -92 -46 253 92 132 114 -32 -123 -149 107 77 26 230 83 -22 -135
8047 -135 -18 -121 -11 50 -69 17 51 36 -14 -45 28 -13 -204 -9 105 134 173 -210 -124 186 142 8 -121 17
8071A7j03R2k01L40k35K21L9j72P1k54J95N39m97m4kpm0M5J51k65m7pj56K36r8
8096a82K73j44R7o2J2j54R0k1J39r5K22m01M23k53J39j07Q3j7p5q0J43J30o9j63
8120g2K5Pj29J73J97J17k17o1r6p2M9J8n8Q1J80N9k87P1j77L58k59J7Q4k04q7
8145b83J83K48j01Q0k5j36K23k39j28K2K81k46Q1J0P8k5N6J50k33j82K19K38o11
8168c40L58l6l34K57J51J44l35K94j06j09K27p4M7j84j50J18p7J57J7J4%o3k18
$$ plain form
8071 17 -86 6 -195 145 -90 131 170 -2 69 -185 10 549 52 8 6 -1 -41 4 155 -110 -157 -164 -320 -84 -182
8096 -182 91 -53 44 -18 -6 -160 -70 -91 48 -47 175 -226 197 -56 83 -24 59 42 -33 -113 30 160 91 -72
8120 -72 -47 -40 -169 4 201 318 101 40 -56 -128 -79 -61 -119 -38 142 201 -86 -15 -192 166 -93 -76 8 -196 -283
8145 -283 -100 148 47 127 102 -34 189 -50 -178 -156 125 -121 -40 -30 48 23 79 229 -4 -186 33 271 -340
8168 -340 18 -18 -352 -95 56 200 -135 159 53 -56 171 97 144 -40 -190 -72 -149 8 25 39 39 -24 -242
8191b42
$$ Imaginary data points
##PAGE= N=2
##DATA TABLE= (X++(I..I)), XYDATA
0@%%%%%%%%%%nJ3j6J6j6J6k4L2m0M8n6P2q8J03j19J36j59J83k08K42k78L16l59
33a91M07m60N19n84O56p34Q15r08J012j123J245j377J521j678J851k042K248k474
51a297K727l005L316l663M052m496N003n594O289p118Q131r400J1043j3263J6444
66I169k1406L0256n0697J79670N5880m05189P4873K32706P7506k30156j38241
77a85629J99904J75286j40494k07208O2152K82772n6799k89273J7169K82172K5083
88A65135k65117o3351K29381J02537j70504j72134J37024K00314q8557k14031
98a39303J8117K45842L2702k66639n3636K37521R2823k13834j27743J94850J21935
109A42635j26219j30153L4886J84699P877k19986k9360K14575P7286k20463j04789
$$ plain form
0 0 0 0 0 0 0 0 0 0 0 0 -5 8 -8 8 -8 8 -16 16 -24 24 -32 40 -48 55 -64 72 -87 96 -112 130 -148 168 -191
33 -191 216 -244 275 -309 347 -387 428 -480 532 -591 654 -723 798 -880 971 -1071 1177 -1297
51 -1297 1430 -1575 1741 -1922 2130 -2366 2637 -2957 3332 -3786 4345 -5055 5988 -7275 9169
66 9169 -12237 18019 -32678 146992 202872 -202317 -127444 105262 182768 -47388 -185629
77 -185629 14275 189561 49067 -158141 -95989 186783 129984 -159289 -142120 140052 165135
88 165135 -99982 -163333 66048 168585 -1919 -174053 -37029 163285 74728 -139303
98 -139303 -121186 124656 157358 -109281 -162917 74604 167427 -46407 -174150 20700 142635
109 142635 16416 -113737 -78851 105848 113725 -106261 -135621 78954 156240 -64223 -169012
120a69012K21797R3851j68440j03203R1940J46499m5055j65270J197J71133N3417
131A28854j90813q0055J89829Q9417j55655j17075J33531J35018j10201j23075
141a00225M8785J30462J5199j65143l6965J65252O1320j34579j15811J32672J46765
152A47732j40944j32957J03256J22885m4795j30925M521J26910L6875j17356q6435
163a11233J17947J15308j14101j28902R8881J41224q6579j34031O0491J09164
173F8169p355j04421m2443J10989P0498r6158j05004Q1763J38613q8217j38081
184a11647P6771J17783l1872j16044l181J15100K1192q9239n9967O8730J04960
195I2586p2418j16981O4969J16036l7346j27766K0090J27300r259j03851j8775
$$ plain form
120 -169012 52785 146636 -21804 -125007 -33067 113432 68377 -96893 -95696 75437 128854
131 128854 -61959 -142014 47815 137232 -18423 -135498 -1967 133051 22850 -100225
141 -100225 -51440 79022 94221 -70922 -107887 57365 118685 -15894 -131705 967 147732
152 147732 6788 -126169 -22913 99972 55177 -75748 -71227 55683 92558 -24798 -111233
163 -111233 6714 122022 7921 -120981 -22100 119124 32545 -101486 -40995 68169
173 68169 60814 -43607 -86050 24939 95437 -721 -105725 -23962 114651 26434 -111647
184 -111647 -34876 82907 51035 -65009 -68190 46910 68102 -21137 -81104 -12374 92586
195 92586 20168 -96813 -31844 84192 46846 -80920 -60830 66470 57211 -46640 -65415
206f5415Q4383N3232p1533p5626M7898J00779k8771j25270K4470J27988j2425
217E9710j17572p841J10205J6368q7863k7747M6828O5584k3224j03413K5122J12589
229F8746j7392j12237r22J15033Q438j01234j6905P4289M0833n2894o5278L6185
241b3338P8551j3513r5595K25J06189M802r5141k1952Q3199M2506q2309m4920
253f1296O6240M5728l2626o2836J1023P6742J803p8144k6406Q6264M4924r7683
265b6267l9260Q6233L4364n6502m7197L3519N5734j1692n7641j7914P1629L6922
277F1928q7552l6711Q2479L6985o7271m3213N3519M5855l1672n0699O387O2295
289C2330P125o6003k0170O1940M0188o3528m8891O1516M6890m4040n4538K7907
$$ plain form
206 -65415 18968 72200 667 -74959 -27061 73718 44947 -80323 -55853 72135 59710
217 59710 -57862 -65703 44502 60870 -26993 -54740 -7912 57672 34448 -68965 -43843 68746
229 68746 51354 -60883 -61805 53228 61666 -39568 -56473 17816 58649 5755 -59523 -23338
241 -23338 55213 41700 -53895 -53670 52519 57321 -37820 -59772 23427 65933 -16376 -61296
253 -61296 4944 50672 18046 -44790 -33767 42975 44778 -33366 -59772 26492 71416 -26267
265 -26267 -65527 20706 55070 -1432 -48629 -15110 40624 28932 -28709 -46623 25006 61928
277 61928 -25624 -62335 20144 57129 -10142 -53355 164 46019 14347 -36352 -29965 32330
289 32330 39455 -26548 -46718 15222 55410 -8118 -57009 4507 51397 7357 -47181 -19274
301a9274O3100k1922n3387N401M0697K6229m6521m5988N3118N0707m7886n6546
313e2272M2984O0122l9076n0467K0903M2224L767m3441k1322M1736L8740l8074
325E824n6279M2254N8291m2016m9883K5608M9110r088m9974L36M0502J5988l4476
338c803l6483L7258M3302l2387m5397K0283N4868j4836n9035J2665M8389J86m0214
351a5204j5303L7525K4036k6989l5869J5769N0265j3969n5797J2726N2965m455
363B5700n0178j490M3206O413k9397k0637J9987L6389j7487m0904R286M6732j069
376B6551n5199J648N1215k73l6604j1963K8758K3297k4348k7459J2296L5007j717
389B1209m5516J169M6565J939m1635r915L8114J3821l1332j7897K0315K7719j3055
$$ plain form
301 -19274 43826 21904 -31483 -26082 14615 40844 -5677 -51665 1453 52160 4274 -52272
313 -52272 -9288 50834 11758 -38709 -17806 24418 28185 -15256 -36578 5158 43898 5824
325 5824 -50455 -8201 50090 8074 -41809 -16201 32909 23821 -26153 -25817 14685 30673 -3803
338 -3803 -40286 -3028 40274 7887 -37510 -17227 37641 22805 -36230 -23565 24824 25010 -15204
351 -15204 -30507 7018 31054 4065 -31804 -16035 34230 20261 -35536 -22810 30155 25700
363 25700 -24478 -25968 17238 23651 -5746 -26383 -6396 29993 12506 -28398 -19112 27620 26551
376 26551 -28648 -27000 24215 23942 -12662 -24625 4133 27430 3082 -24377 -12081 22926 21209
389 21209 -24307 -23138 23427 25366 -16269 -26184 11930 25751 -5581 -23478 -3163 24556 11501
402A1501l3879Q053L2963K457l5987j2308M1360J3775l7369j5585K8674K2201
414B5856k4725k4038J6831K1616j632k6254r788L4843J2422l5690j6392L2662
426E711K1211l2394j8850K4849J6700r548k2550j263K8538O281l0061j2811L1553
439G366J7288l1569j6114K3858J7813j4753k4194J0129K6094m659k4016m419K6147
452H971R203k6043j2151J8941K0699j5624k7569J8032K6576j5100k2391N508K2100
465A1152N99j9198p296J4798J9390j6255k6148K0082K3829j7557k1701J1593K1657
478A4945o364j7093k531J4549J3932j8855j8552K1146J7144j4918j9665J1039
490e223K1261p783j9161J00J9044P245k1735p895J9489R112j2784j5064Q931J8848
$$ plain form
402 11501 -22378 -14325 18638 21095 -14892 -27200 14160 27935 -9434 -25019 3655 25856
414 25856 1131 -22907 -6076 15540 13908 -12346 -22134 12709 25131 -10559 -26951 5711
426 5711 26922 -5472 -24322 527 17227 7679 -14871 -16134 12404 18685 -11376 -24187 7366
439 7366 24654 -6915 -23029 829 18642 3889 -20305 -10176 15918 11259 -12757 -17176 8971
452 8971 18174 -7869 -20020 -1079 19620 3996 -23573 -5541 21035 5935 -16456 -10948 11152
465 11152 11751 -7447 -14743 55 19445 3190 -22958 -2876 20953 3396 -18305 -6712 14945
478 14945 8581 -8512 -11043 3506 17438 -1417 -19969 1177 18321 3403 -16262 -5223
490 -5223 16038 8255 -10906 -10806 8238 15483 -6252 -14147 5342 14454 1670 -13394 -4463 14385
504A4385o810j9684J670K3577M58k4804P26J8051L229j2309j0565R812J5183o373
518F546j8841K866K3073l664k2996L871J6889K141j3424p984J3093R717r154j4212
532a2079M986J9903o514j8715N419J4965K159j5980o643J6037P202j2468j0118
545a1846R384J4398q405j3398L902J2975J991j6272l850J6709N248j3548q303
558a1015J2821R676j1365r018N005J1792j89j5219j89J5003K811j3287p434J4012
572C404P954j2277p321P026J0856m064j2679K229J1364K014j2188n395J3937N526
586A0386j2075n984P844R372p254j0325M910J0225j51j1988k613J3765J959j1494
600c423m587Q512Q382q082r259O372R208j881j2440Q31J2758j434q922k375P445
$$ plain form
504 14385 7575 -12109 -10439 13138 13596 -11208 -10482 7569 10798 -1511 -12076 -2264 12919 6546
518 6546 -12295 -9429 13644 9980 -13016 -9145 7744 9885 -3539 -11523 1570 11287 2133 -12079
532 -12079 -7093 12810 6296 -12419 -7000 7965 10124 -5856 -12499 3538 10740 -1728 -11846
545 -11846 -2462 11936 3531 -9867 -5965 7010 9001 -7271 -11121 5588 10836 -2712 -11015
558 -11015 1806 11482 117 -8901 -3896 7896 7707 -7512 -7701 7302 10113 -3174 -10608 3404
572 3404 11358 -919 -8240 -1214 9642 5578 -7101 -4872 6492 8506 -3682 -9077 4860 10386
586 10386 -1689 -7673 171 9543 2289 -8036 -3126 7099 6948 -5040 -7653 6112 8071 -3423
600 -3423 -8010 502 8884 802 -8457 -2085 7123 5242 -7198 -6367 6391 4957 -3965 -6340 1105
615A105O594q041p948O333R542n002j1430N217J0594l264q078j182P428M783q349
630a698o478O987R508o729r932P066P450l858o522q24P405L685q524m534Q164
645A166O773r207o071P872M238k765o163q59R457J721r939k438Q899L925r361
660b752l259O919K990j277o560o54R907j064r724O17Q694R69p763p35M939K560
676C807j945o988J572R842l486q363K634P615j070o529m54L457M092k973p425
691f214N338P337n405n740K905N572j824m607n30L823M748n545n888P532M569
706F071o572m283L525N312k392m151n25N005M254p583m057P326J907m981j825
721b969K023M658j872m647j69N221J624p305j36O556K20l803k182K307L914k584
$$ plain form
615 1105 7699 -342 -8290 -1957 7585 2583 -8847 -3630 6964 3700 -4378 -5560 1868 6651 -1698
630 -1698 -8176 -1189 8319 1590 -8342 -1276 6174 2316 -4206 -5030 2375 6060 -2464 -6998 1166
645 1166 7939 -1268 -7339 533 4771 2006 -4157 -5016 4441 6162 -3777 -6215 2684 6609 -2752
660 -2752 -6011 908 3898 2621 -3939 -4593 5314 4250 -5474 -4857 3837 4806 -2957 -3692 1247 3807
676 3807 1862 -5126 -3554 6288 2802 -5561 -2927 4688 3618 -2911 -3365 92 4184 1211 -6214
691 -6214 -876 6461 1056 -4684 -1779 3793 1969 -2638 -3168 655 5403 -142 -6030 1502 6071
706 6071 -501 -4784 -1259 4053 1661 -2490 -3015 1990 6244 -1339 -5396 1930 3837 -1144 -2969
721 -2969 -946 3712 1840 -2807 -2976 2245 3869 -3436 -3572 2984 3204 -599 -2781 -474 3440 856
737H56m443J153O134j54p063J251N156o62l041k858L515L731l019l971K162N140
753C887k145n441K268K994m4k598j960L978K161l484k896K517M277k807m607K987
769i13L097J97l890j298M216Q72l092k304K596L748l091k893K353K718p73l973
785b430N33L627J6k569j755K877L289l968k721K917K388j129l500J219L380l40
801A834k516j839L389J999l964j176K862J864j826k275J301K142j42l193q47M515
817B128K94m166N36K380Q94j814k362J057K689K84l971J94M946j248l592J036
833g15J023P71q17j937Q23L189n89m202J700L609k723j812R78R88J218j300j946
850a742J448K645j610l706K601K492k571m4l30J040J821k364k306K518K197l155
$$ plain form
737 856 -3587 -2434 3700 3546 -3517 -2266 2890 2228 -813 -3671 -156 3575 556 -3415 -1253 3887
753 3887 1742 -3699 -1431 1563 1519 -1079 -3039 939 3100 -384 -3280 -763 3514 707 -3900 -913
769 -913 2184 2381 -1509 -2807 1409 2281 -811 -3115 -519 3229 138 -2755 -402 2316 1543 -2430
785 -2430 -1897 1730 1746 -823 -2578 299 3588 -380 -3101 -184 2204 1075 -2425 -1206 2174 1834
801 1834 -682 -2521 868 2867 -1097 -2273 589 2453 627 -1648 -347 1795 1653 -1540 -2387 2128
817 2128 2422 -1744 -1208 1172 2066 252 -2110 -1053 1636 1920 -2051 -1857 3089 1841 -1751 -715
833 -715 308 1079 262 -1675 -852 2337 1748 -2454 -754 2855 132 -1680 -702 286 1504 204 -1742
850 -1742 -294 2351 741 -2965 -364 2128 -443 -487 -817 223 2044 -320 -2626 -108 2089 -1066
866a066j268L749q62j019O36j963J549K014l152j392L992M87l308l3K917j416
882a35k26L4j968L053P30k872k12K821j54k865P14J503m87Q65j987j68L417j405
900F58k928J674J817j359q05O40K53J033K72k910N93L266k454j665K414N36j010
917B5J74j94l67J518n00k987K517K071l131L4J730j54n65n06j63N37J031j003
935F7j453K510M54k040Q4J81J016m47j203M68J287M84k110j93J852j188j73O9
953c35k19J572n72j647Q87J367l97k241J196J261j081J04l28M26J137j035j221
970a126L39J727l08k041J394J039q88m85j27N83L71j054K55K98P68J2j810P20
988c33J221n98j160J05J730k47j183N70o8P73m48j440P21R92P0r77O6J199r49
$$ plain form
866 -1066 -2334 1415 553 -466 170 -1793 -244 1770 -1382 -2774 1218 1705 -1603 -1636 1281 -135
882 -135 -361 -327 -2295 758 1488 -1384 -1596 1225 1071 -1794 -1080 423 -64 801 -1186 -1354 2063 658
900 658 -2270 -596 1221 -138 -943 -303 -50 983 1255 -1655 -1062 2204 -250 -1915 499 1035 25
917 25 199 5 -362 1156 656 -2331 186 2257 -874 -840 890 736 171 -335 -498 39 1070 67
935 67 -1386 1124 1578 -462 -378 -197 819 372 -831 -363 924 1408 -702 -895 957 -231 -404 -335
953 -335 -554 1018 446 -1201 -314 1053 656 -1585 -389 872 -209 -105 -433 -7 1130 95 -1126
970 -1126 -787 940 632 -1409 -15 1024 136 -349 -476 107 478 -576 -321 -23 745 757 -1053 -333
988 -333 888 290 -870 -765 965 718 -465 105 37 810 362 -1078 -357 635 705 -272 -206 993 44
1007D4k42j53J69J001q67o66R02J82l56k01j84P23K48l92j098J087J539k262k75
1026h01J750n29r81N82P8j40P63j48j671J268J194k575N88J406p64m32P30l17
1044Ak12Q12p07j249K221l74j704J311O70q27L90n33k84O96L35j328M26J665j456
1063a47l44J176j093M69P44j410j03J798p42j529J832N23k220P28R87j535J170
1080C04N17j703Q22J259j419j160K050m96j366J680j75r28J383p85p93R90J62
1097C42j203M78J196q50l54Q90j238L26J508j917L8J474o74k39P95l64q13R66
1115C61l48j134J804k04j525J195J066j644M2R25o09o47J353r24J3J425q70j153
1133h74J509m18q27O43M7j35J19M42q92N79M65j123K26N29m54M24L9k52O8N90
$$ plain form
1007 44 -198 -351 -182 819 -48 -714 188 370 14 -187 -371 352 600 208 -890 197 1736 -526 -801
1026 -801 949 420 -561 21 99 -41 722 574 -1097 171 1365 -1210 -622 784 20 -412 318 1
1044 1 -211 601 -106 -1355 866 492 -1212 99 769 -58 332 -201 -485 211 546 -782 -356 1309 -147
1063 -147 -491 685 -408 61 805 -605 -708 1090 348 -1181 651 1174 -1046 -318 669 -866 304
1080 304 821 -882 -60 1199 -220 -1380 670 174 -1192 488 313 -615 768 -17 -810 180 342
1097 342 -861 -383 813 -37 -391 499 -739 -413 1095 -822 -784 690 16 -223 572 208 -605 361
1115 361 13 -1121 683 479 -1046 149 1215 -429 -387 538 -71 -718 635 -289 -276 1149 279 -874
1133 -874 635 217 -610 33 80 -55 64 506 -386 193 658 -465 -239 290 -164 260 299 47 115 705
1153G05o07q15J163k57q87R54Q8l33O20n70m14K18K87l88p1Q73m28l30K43k06
1173a55J01q3j15K29K19J12k28j62M12l51j99j15n6P93q03QQ08n33J23M2m27K88
1195i2K9R5l40M83L2p13O96pm96L19j09m3L75ol24j40O99p28k38M42O2k11R29
1218G14r31K86N02p52n23R39Lo32N56L85r72R19k44j061R24N5o33M10N13k94k60
1239i6P12q02j16Q71m76o97J189k32j155J302k78o38J82P07n35P7R89j469M14
1258e1Q78j393J70J135p30l96Q74k49m86R70q9j310R94P1j090J150j5o56N50L66
1278F93o84k60J054r07m12J334r08m86J329o98n76J054k53j045R53L10j076O11
1296C3Q94j748R35K32q25KJ088j096P4R96n43m96P99j22j170J491p08n56R15r2
$$ plain form
1153 705 98 -717 446 189 -698 256 344 11 631 61 -353 -135 152 -236 -307 566 138 -192 51 -155
1173 -155 -54 -137 -252 -23 196 308 80 -82 330 -21 -220 -335 -391 402 -401 -393 415 -118 5 47 -380 -92
1195 -92 -63 32 -308 175 207 -506 190 183 -313 6 -103 -146 229 223 -101 -241 458 -270 -508 -66 -4 -215 714
1218 714 -217 69 571 -181 -704 235 238 -394 162 547 -425 494 250 -811 113 168 -465 -55 458 164 -96
1239 -96 616 -186 -302 569 93 -604 585 353 -802 500 222 -416 -234 473 -62 15 1004 -465 -51
1258 -51 827 -566 -396 739 9 -387 487 238 -248 722 633 -677 317 388 -702 448 433 -223 327 693
1278 693 9 -251 803 -104 -516 818 -90 -576 753 55 -521 533 280 -765 188 498 -578 33
1296 33 927 -821 114 346 -479 -477 611 -485 -411 585 42 -454 345 223 -947 544 -164 -720 195 103
1316A03n39L60O38j023l32J398j078j9J106j083K06N83p29j84O80k46k21M49O02
1335F71j262O60K06r50M35K67o42N11M01l21j10K13j50k50M38j87l28P81l55k27
1355a99N98r3l67LK42r28Q41K46n19O30J48r07K77K46m70K27J08K2l06N98l21
1376G6l88K00J77m57M33j20J99p1j42L46k91l73K10J0K45j27M8J4l96P85k57o97
1398e76L01N77p29K59M16j57q6J46m58j13N76k23k90N02k12k09O62k23j76l04
1418c17R2J57K85p0l23N97l26o07O82j28n78O58L15p08K13P35p67j99Q20q07k92
1439e68R16k70m46N65M23j170O33P67j347n2J075p29mO87k75n96N79O8l31L97
1459C22m0o06Q75j90n46Q68o19l63O19l42l59Q11m0p31K90Q05j765P82J167j610
$$ plain form
1316 103 -436 -76 562 -461 -793 605 -473 -492 614 -469 -263 320 -409 -593 87 -159 -380 69 671
1335 671 -591 69 275 -675 -240 27 -615 -104 297 -24 -134 79 -71 -321 117 -70 -398 383 28 -199
1355 -199 399 306 -61 -58 184 -744 97 343 -176 454 602 -305 -28 218 -252 -25 83 105 -201 397 76
1376 76 -312 -112 65 -392 41 -79 120 49 -93 253 -38 -411 -201 -191 54 -73 -25 -11 -407 378 121 -576
1398 -576 -275 302 -427 -168 248 91 5 151 -307 -420 156 -67 -357 145 -67 -276 386 163 -13 -317
1418 -317 -225 -68 217 147 -176 421 95 -512 170 42 -536 122 437 -271 -58 677 -90 -289 531 -276 -568
1439 -568 348 78 -368 197 620 -550 83 850 -497 -549 526 -203 -207 480 205 -391 188 256 -75 322
1459 322 282 -324 551 361 -185 683 64 -299 320 -22 -381 430 390 -341 -51 754 -1011 -229 938 -672
1479f72J67J532p03q18J343k37j265R42J41r91P10Q38j650M86P31n95n02Q88p5
1498B70n45M29J0l37L13j71k35M94m22J76M59n66J12M32m14n04R45P9j456J079
1518A48O76j395O58Q75j293o2R46m35q64J077P2j324R14Q96j265k81J286q52p2
1537b95R33m66m04N41P3n84J26K29k35O0m4N58n03m79O89p0m49kN60M9p50J330
1559H67q51q23J090J21j224Q52O14n87n39J075l85j179J721o0j087P31J053k131
1577g42j61J735o66p79O00L37o61k95M85K17m19M56O45j391M59O51m68o03Q18
1596B18L58j214O48N42j223j6J186o01q49J212J25j214Q39P10j211j73J394p14
1614A7q17R79J54o19O0M23l64o19R91K26j096N50R38p27r83J090M12j409N71R68
$$ plain form
1479 -672 -505 1027 324 -494 849 612 -653 289 430 -561 149 987 -663 -177 554 -41 -543 345 270
1498 270 -275 154 164 -173 140 -31 -266 228 -194 -18 441 -125 -13 419 5 -499 446 525 -931 148
1518 148 824 -571 87 962 -331 -393 553 118 -746 331 403 -921 -7 889 -376 -657 629 -223 -295
1537 -295 638 172 -232 309 382 -202 -76 153 -82 -22 -66 492 -11 -490 199 129 -320 -322 238 287 -463 867
1559 867 16 -807 283 404 -820 32 646 59 -480 595 210 -969 752 692 -395 336 1389 -742
1577 -742 -903 832 166 -613 -13 324 -337 -632 -147 70 -349 107 752 -639 -180 471 3 -600 218
1596 218 576 -638 10 552 -671 -687 499 -102 -951 261 386 -828 11 721 -490 -663 731 17
1614 17 -800 179 333 -286 -226 197 -167 -786 205 431 -665 -115 823 96 -887 203 615 -794 -223 745
1634G45j275J59J469q78j302J688o9j655J187R74j940M23J540j241p27J394K30
1651G22j426P48N70j016lJ030o51n65M71O91r74j3O36M4o44J60Q57j018k07J185
1671E97n16j382J585P02k084O34J540j459n68J911o29j773J907M25k001J202J239
1688A330k084r6J930j038j066J724j52j372R55P57j228k94J246l57q06R03M55
1705H07q36l03R65m4j038R5J214r64m97J574n58j054Q63Q28k012L82K068j678
1723a88r05K230m51k087J727N43j679N46J548j568q12K067o73j425J527L52j455
1740g03J30J517j121m45J027J39j312N73Q46j324j04J257J72j448L06J513j563
1757e40l81J566m31j208J255O57j936P11J619j825o24J840k92j692J609M25j541
$$ plain form
1634 745 -530 -371 1098 220 -1082 606 537 -1118 69 1043 -897 -474 1066 -175 -902 492 722
1651 722 -704 44 614 -402 -405 625 -26 -591 -120 571 -403 -416 220 264 -380 -220 637 -381 -588 597
1671 597 81 -1301 284 986 -1098 -464 1076 -383 -951 960 331 -1442 465 890 -1111 91 1330
1688 1330 -754 -850 1080 42 -1024 700 548 -824 131 888 -340 -634 612 255 -551 352 807
1705 807 -29 -332 633 589 -449 -354 860 -104 -601 973 415 -639 224 1052 -960 -578 1490 -188
1723 -188 -1093 1137 686 -1401 326 869 -810 -264 1284 -284 -1096 971 298 -1127 400 752 -703
1740 -703 -573 944 -177 -622 405 544 -768 -195 651 -673 -777 480 652 -796 -490 1023 -540
1757 -540 -921 645 214 -994 261 918 -1018 -307 1312 -513 -1137 703 411 -1281 328 753 -788
1774g88L00J655j418n53J085K6j319J249P06j406l65J606n16j305J301M96j196
1791d42k18J574r65r25J393L75k027R87J451j723k25K048q57j544J304P74k219
1808a239R52J329j506k52J524m49j224R41O91j534J11J657q28o35N72O64j307
1825e33K37J120j000o33J132L31j532O96J332j529o18J897o86j506J642Q16k305
1842a139Q88J505j646p60K500j101j575K017N8j757N94J439j033r96J745l71j358
1859i90J293L96j180L79O28k14j102O28Q97j343O0J402p63r30R47P69j588M41
1877b70J551j457r80K091k37j833J651O65k355P66J611j803l57K147q03j788J756
1894C55O15j746P09J299j412n29J693m91j316O72P13q17n00J345l60o66N52M69
$$ plain form
1774 -788 -488 1167 -251 -804 281 307 -1012 237 943 -463 -828 778 262 -1043 258 754 -442
1791 -442 -660 914 -51 -976 417 792 -1235 -248 1203 -520 -745 1303 446 -1098 206 980 -1239
1808 -1239 -287 1042 -464 -716 808 359 -865 76 767 -767 -656 1001 173 -462 110 774 -533
1825 -533 -296 824 -176 -809 323 654 -878 -182 1150 -379 -997 900 214 -1292 350 1166 -1139
1842 -1139 -251 1254 -392 -1152 1348 247 -1328 689 747 -1010 -416 1023 -10 -1006 739 368 -990
1859 -990 303 699 -481 -102 526 312 -790 -162 735 -608 -548 854 91 -839 108 877 -711 -270
1877 -270 1281 -176 -1156 935 698 -1135 516 1181 -1174 -408 1203 -600 -957 1190 387 -1401 355
1894 355 970 -776 -67 1232 -180 -709 984 493 -823 -151 562 -255 -755 590 230 -436 116 585
1912E85p17l58J110j53j632J225J360k113K80J558j243j023K135n50j793J523
1928A94J083k260K00K026j648o52J782k11j473J267P61j781J76J524j075p44J130
1945B99M09j247K16R61n42q80Q35L88j224N62J004q62q64J436j91j279J145O16
1963G82j554K45J456p68j260J673K71j859J017R29j680O02J075q84r53J502K6
1980F20j368O00Q84j227j68J128k85q25O79O65j027m08J539m77j079J080L26j296
1998f39M45J121q11r78J496l28j391J121Q34j795N43J203j262m15J134K78j341
2015g85Q81M46r22j02R25m31r18J040M63j069K85O59j80q70P42M41j319K90J463
2034A039j478l08J261l01j070R72M93j393K27J419j040p24J716j76j489J104N95
$$ plain form
1912 585 -132 -490 620 467 -1165 60 1420 -693 -413 1145 -98 -1121 1014 464 -1329 194
1928 194 1277 -983 -783 1243 -405 -1057 725 514 -959 308 1069 -712 -536 988 -87 -831 299
1945 299 708 -539 -323 638 96 -784 51 439 -785 -223 781 -81 -945 491 300 -979 166 782
1963 782 -772 -527 929 161 -1099 574 845 -1014 3 932 -748 -146 929 45 -908 594 620
1980 620 -748 -148 736 -491 -659 469 184 -641 38 703 -324 -732 807 330 -749 331 657 -639
1998 -639 -194 927 116 -862 634 306 -1085 36 870 -925 -382 821 -441 -856 278 556 -785
2015 -785 96 542 -380 -482 443 12 -906 134 597 -472 -187 472 292 -578 164 605 -714 -424 1039
2034 1039 -439 -747 514 213 -857 115 608 -785 -558 861 -179 -903 813 637 -852 252 847
2051H47j258j65J560j200l80J138k96j060P04O03n08k33O53J38r10N30J58n19
2069a98k66R62k52r58M08J173j148l50J015l79o59J062J01j337O25J258j618K13
2087c48J531j360o57J349j52j176R01O22j234O9R33o96o66J159k40o08O06L90
2105D23m94j41N45j52m43L9L50l56l16P57M03j253M57M62o47j81Q80j81p72R77
2125C57J57j233O66Q00j002k06J064n73q25J261m0r85O13M34q26J68M74l34j85
2144b15O76k39n02J3M96p7k12J12L87o78j90O05j06m85M35K12m28J89N62o37m47
2165e29J063l40o01P11l6r53M35Q34p12L4P05n27m18L82K66o15N61J16m76j46
2185b46J26K02l73K93m1l46Q2N75J18p08J57L05l68j03Q87l65p47N80L15p94M23
$$ plain form
2051 847 -411 -576 984 -216 -596 542 246 -814 -110 493 -15 -248 405 543 -367 163 321 -198
2069 -198 -464 498 246 -712 -304 869 -279 -629 386 7 -652 410 511 -826 -201 1057 -561 -348
2087 -348 1183 -177 -834 515 363 -813 88 710 -524 -455 478 -218 -884 275 35 -573 33 423
2105 423 -71 -212 333 181 -262 -223 127 -229 -545 212 615 -638 -181 281 -366 -547 333 152 -620 357
2125 357 514 -719 -53 747 -255 -461 603 30 -795 466 426 -559 54 488 -338 -170 304 -30 -215
2144 -215 461 222 -280 -267 229 152 -60 52 439 -239 -429 176 70 -415 20 232 -196 -7 555 -82 -529
2165 -529 534 194 -407 304 268 -685 -250 584 -128 -94 611 84 -334 48 314 -301 260 376 -100 -246
2185 -246 -120 82 -291 2 -39 -385 -303 272 390 -318 -161 144 -224 -327 560 195 -552 28 343 -451 -28
2206b8P50p60n06J037p3p74M53m5n22K54L50l97m1N11l34L12j55K7r1j40K94o5
2228E7l24K70K61m38Q7L1Q8m49M85K64m11j6K28o15J99Q54m06p14P26R7n45K84
2250A3L41o87K30M27n18j19N97l33j82K49p3n1M38j25n55M67n3K40k13k0k61M21
2272B33m51l0M67n6l77K43K15l82o5O78n42j49N15k99l52P71l85m35O80P6o85
2293c30M11K70p70L00M76m08k95Q79o76o2M13k09j1P9J32l88K65Mk53L03k32j63
2315b65N68l45k03N63j51p03Q54j51p59O57L00p75M03K53k45k29O64k76l59K28
2335B9p7n7K89J73q51K88K84j05k17L50j43n5J10L6j20L22o01L37j51J22m0K36
2357A59k75m6M53k67m0J14j64j83M99M3o70L46p7j70o0M49l93K5L48K50m60O31
$$ plain form
2206 -28 722 -38 -544 493 420 -354 99 54 -468 -214 136 -261 -302 209 -125 187 32 59 -32 -172 122 57
2228 57 -267 3 264 -174 -87 -56 32 -417 68 332 -79 -95 133 -482 -283 571 165 -549 177 274 -271 13
2250 13 354 -333 -103 324 -194 -313 284 -49 -231 18 -55 -106 332 207 -348 119 66 306 93 73 -188 233
2272 233 -218 -248 219 163 -214 29 244 -138 -203 475 -67 -216 299 0 -352 419 34 -401 279 355 -330
2293 -330 81 351 -419 -119 357 -51 -346 533 -143 -205 208 -1 -12 67 199 -189 76 80 -173 130 -102 -265
2315 -265 303 -42 -245 318 167 -536 318 167 -592 65 365 -410 -7 246 1 -228 436 160 -199 29
2335 29 -48 -105 184 357 -494 -206 78 -27 -244 106 -37 -92 18 54 -66 256 -345 -8 -159 -37 -77 159
2357 159 -116 -162 291 24 -16 98 -66 -249 250 293 -377 -31 -108 -278 -338 111 -282 -257 91 341 -119 512
2379E12l23j41L7Ml90K15K14k04J90k1l7J79k40k57L55J64l94p2L99o16L07L46
2401B27k37j65L60m18K00L91l46j24K87J0m73N21J49n12J71K11l20k7L61n48J97
2422h5K98k13l05K34J07o4J80j19l71O04n00J83K16j09n59M14L0l17M68j94j89
2443b91K47L93m32O7Q9m21R4M72l23J27K17l48j17L18Q4k94K01K14l44M34l88
2464al24M51j48j66K70J19m13J23J12q2J87J57n27J73P6J57m83K95M2l30O12q3
2486B17o14M33jl15N98N9o19J95J71l19L21J26j74k21M75m56J12K34k26q0M17
2507C33m18m9M20rm95K66K63n76L10L81p45J61L99l80K62J8l67J53K06m9j04L19
2529B99k39n06L84K41j88J38J91o67N21o1m80K95N96n73J75J65m10j04L90q6k92
$$ plain form
2379 512 189 48 85 89 -301 -86 128 -76 114 93 56 235 -5 -262 93 257 -137 -209 190 -426 -119 227
2401 227 -10 -175 185 -233 -33 358 12 -112 175 185 -288 233 382 -130 41 252 -68 -95 266 -282 -85
2422 -85 213 0 -305 -71 36 -28 152 33 -338 266 -234 -51 165 56 -503 -89 -59 -376 92 -102 -291
2443 -291 -44 349 -83 -16 73 -348 -254 218 -105 22 239 -109 -226 92 176 -118 83 297 -47 387 -1
2464 -1 -325 126 -22 -188 82 201 -212 -89 23 -59 128 285 -242 -69 7 164 -319 -24 18 -312 300 217
2486 217 -397 36 35 -280 318 377 -242 -47 124 -195 126 252 78 -143 332 -124 -12 222 -4 -84 333
2507 333 -85 -134 286 277 -218 48 311 -265 45 426 -319 -158 241 -139 123 141 -226 -73 133 84 -20 299
2529 299 60 -446 -62 179 -9 129 320 -347 174 113 -367 -72 524 -49 126 291 -119 -223 167 81 -211
2550b11N75m64j73Q0L09k85K95n8k66j0L22j73l8M2k00J62K84l38J7L61j43J19
2572B07K5l05J26J82m1n08M20j86K76K72l75k86l6L14k52K08o5l37M92N0j03j12
2594c4K39r0l21J40L34n12M62rj76J17m22J55M05k54l64M83j89j69J19K51n42
2615c77M88r6p3J95J72n69J83N6j4m1N5k10Q8M20q9k63K40k42p5mm1p9N28j47
2639A05l31M26L1n74L03O1j29j11L66n75M26K61q6k71k3J94j38K39J33o64L62
2660EJ45j85J18K34l07q9J37l72K52M61m53k18O06l66q8L39j28j49N7l4o5N24
2682D24j96m90K97K00k90k0K18k86J05j38j35K24K01P1k93K21j66rj41L97r06
2703g12Q72l15K3L27m05J4K82R9l40L29m8j10L9L6Kq4k6K76l52K88j94k10O17
$$ plain form
2550 -211 364 -100 -273 -193 116 -169 126 68 -198 -208 114 -59 -97 -55 -255 -93 191 -147 -130 231 88 207
2572 207 232 -73 53 235 194 -314 106 -80 196 468 93 -193 -229 85 -167 41 -24 -361 131 181 78 -34
2594 -34 205 115 -206 -66 268 -244 218 209 33 150 -272 -117 288 34 -330 153 -36 -205 -86 165 -377
2615 -377 111 15 -58 137 309 -260 -77 -21 -35 -76 -21 -231 -143 277 188 -75 165 -77 -152 -156 -197 -276 252 105
2639 105 -226 200 231 -343 -40 21 -108 -219 147 -428 -2 259 173 -98 -121 73 -65 174 307 -357 5
2660 5 150 -35 83 317 10 -79 58 -314 -62 399 -54 -272 334 -32 -120 219 91 -58 -1 -35 -100 424
2682 424 228 -262 35 235 -55 -75 143 -143 -38 -176 -311 -87 114 185 -108 113 -53 -62 -203 194 -712
2703 -712 160 -155 -132 195 -210 -196 86 185 -155 174 126 16 55 91 93 9 -17 259 -93 195 1 -209 408
2726D08m07k69M05P7l14L79j50k10K23j14o8k18M51m28K03K71j97k57P14n17q5
2747a03K54j73j29J00J71j7j76K97l49L00K8k38N2K01k96n6K30o7m8M33l46m0
2769B8q3K5k15L55j10r9M54k00k32j34L03o4J1J30l30M24k12ok50L04k8j55L05
2792B21m34q3L68K1j69l2n8J72r5P5J48j3K5k82L09k02K52o2J32m81K21K0l05
2815b52J54L48j40j13J52k24L9K49k7p6k80L01Q7j96M9k15P5P2j02J61Nk76J94
2838a5L39n22J82K91l81J01K91k33J69J17k58m18M41J39n51M24j85rK40j07k46
2859a91R3J58l23K08K05k31j72J47k33j67O65j02k63M58k37j82J14J05l34O6L83
2880A67r8K21l11k57K80J6n9K50J44m84k12K73M3j61L85j66j98J34O4l19J59K07
$$ plain form
2726 408 1 -268 137 214 -100 279 129 -81 142 28 -40 -258 193 -235 -32 239 42 -215 499 -18 -103
2747 -103 151 -22 -151 -51 120 103 -73 224 -125 175 203 -35 17 218 -78 -134 96 29 -19 414 68 28
2769 28 -55 -30 -245 110 0 -99 355 155 -77 -211 92 28 39 169 -161 263 51 45 -205 99 71 -84 221
2792 221 -213 -296 72 93 -76 -108 -166 6 -89 -14 134 121 146 -136 173 -29 223 161 293 -188 33 53 -252
2815 -252 -98 250 110 -3 149 -75 -36 213 186 110 -170 131 218 22 71 -144 -69 3 -99 62 67 -209 -15
2838 -15 324 -198 -16 275 -106 -5 286 53 222 339 81 -337 104 243 -308 116 -69 -78 162 55 -191
2859 -191 -98 60 -263 -55 150 -81 -253 -106 -339 -506 159 57 -206 252 15 -167 -53 52 -282 -216 167
2880 167 69 290 -21 -278 2 18 -41 209 353 -131 -343 -70 -27 -188 197 31 -167 -33 31 -288 -129 78
2902G8k13M02J1l39j05K91j29L8J43j46J01O3l00n8L03l5l97M18j59k22M17R7
2924B59k12J74R2m97L42P7n36L51j3J07k03J95l08J47M53q04K14K46p0O5J24k56
2946e3r7M24n44M0K28lk08j8N06m28R8K84k65j03J86j16J78J78l56j3K57l46L44
2969A73J3j47j36j75J96j67L62n2l8j2J48m36N05R4l77O5q6L11k59k5J0l41M72
2992I8j77l6K62J24m12K16M0q0j1k41R3N1L08p6n3j9j21J13J84m53J90r5LO9J1
3017a2j3Q0L3N9j78N1j5J1M7j25j67L01K0j18P2j54K7j80L60l79L52K0j62J04
3041C4L65l71j37K39k19k53M11J33k69J39j9J68O5k19k16K96L03o05k4M42l45
3062h2R9lj51j50N31j95o9J95J43o70L88p9M5K1n7j00K38l8j46m9K44lq9J7j44
$$ plain form
2902 78 -135 267 278 -61 -166 125 -4 34 177 31 132 195 -105 -163 140 105 -292 126 -33 -255 162 259
2924 259 47 221 313 -184 158 235 -301 50 37 144 -59 136 -172 -25 428 -376 -162 84 14 79 203 -53
2946 -53 -150 274 -270 -230 -2 -5 -213 -231 275 -153 -55 229 -36 -139 47 -69 109 287 -69 -82 175 -171 173
2969 173 186 39 -97 -272 -76 -243 119 67 29 17 165 -271 234 328 -49 16 -70 241 -18 -43 -33 -374 98
2992 98 -79 -115 147 271 -141 75 115 35 24 -217 -124 -73 235 159 106 87 -34 79 263 -190 0 -95 -92 -23 -12
3017 -12 -25 55 88 147 -31 20 5 16 63 -62 -229 72 92 -26 46 -108 -81 -261 99 -280 72 92 -70 34
3041 34 399 28 -109 130 -89 -342 69 202 -67 72 53 221 286 67 -149 147 450 -155 -179 263 -82
3062 -82 17 14 -137 -287 244 49 -20 175 318 -352 36 -43 2 23 -34 -134 104 66 -80 -129 115 112 23 40 -104
3087a04J7M51o53J97J24q2l44N53J66o64M39l0k50L24J08m46J79J05j28q7L02
3108A77m72q1L17j52j02K75J34l11L92j74o14P57Lm16J77J65j97j20L60j30N0
3129C8j56Q2L1L6l44K30L30k69J00R9j46k12N02j23j66j5L12m17J03K37o10K25
3151a33L05l03N4J95j17L7r4J17j45K37k75k36N05k18m4L57j73l34K02J25k96
3172b34K56L55m24J03J71l76qJ19j42L8M29j99q0J61k62R7P5R4m69L01q5P3J23
3195A16n1j28K04k8m64L56L0k21K22K46m45J31N5P5r1P5k32J1J26Q4j18K08p6
3218H5j98L40j67j72l4K44j40m9K32l56K42R2j21k00L14N2o2j41K34o3l46M28
3240B14l34R6p5J35Qk2l4q5K24m41M49Q6l47k4M46l60j90L37j1k19N55m33j66
$$ plain form
3087 -104 -87 364 -289 -92 32 -50 -394 159 325 -339 100 70 -180 144 252 -194 -15 90 -38 -125 177
3108 177 -295 -376 -59 -211 -313 -38 96 -215 177 3 -611 146 149 -267 -90 75 -122 -242 118 -12 38
3129 38 -118 -36 -5 31 -313 -83 247 -22 78 177 31 -181 321 198 32 17 329 -88 15 252 -358 -133
3151 -133 172 -131 -77 118 1 38 -56 61 -84 153 -122 -358 147 -71 -115 242 69 -265 -63 62 -234
3172 -234 22 377 -47 56 227 -149 -157 -38 -180 -142 287 88 8 169 -93 4 79 173 -296 5 -80 -7 116
3195 116 65 -63 141 113 -351 5 35 -186 36 282 -163 -32 23 98 7 82 -150 -139 -13 71 -47 161 85
3218 85 -113 227 60 -112 -146 98 -42 -91 141 -215 27 119 -2 -202 112 164 102 -39 195 132 -214 214
3240 214 -120 -24 -99 36 44 22 -12 -97 127 -314 135 221 -126 -150 296 -64 -254 83 72 -147 408 -25 -191
3263a91K75R2k42O7J33k62J04K27l80K89l23R7J14Q1l42K53m1j45p0K25j4j23
3285a76M44l51R3o1L25k13J91k49o9j2L20j48j25jk87K75K23k33l21P61k99K7
3307A14l94L86K0j58K51k79J07K49l46O9l7l97L26J42j54j89o9K07L80j93r8P1
3329HJ18k73l3O3J1M62k55j11k26N20l65pK61L1m26R2K5j22l59L67L56J13r4K21
3353C77N61p35n52O74l54J56Q6j69qj07P7M4j67J66K4j47J72l0l80J95K57m57
3375c17M26R6k91M8q6K17q0J98k36j17L43k30l43K66K43N3n5j09j53J39J68m56
3397b76J94l2L07k49J50l8kj04J07j48O6j07P8J32k78J17J57r5j86M21j20m32
3419c38N27j80j87L49O7m00p7M02M9k82L63j79l52K68n1lJ37L3K41k79j34K0P3
$$ plain form
3263 -191 84 176 -66 1 134 -128 -24 203 -177 112 -211 -114 0 81 -261 -8 -49 -194 -264 -39 -53 -176
3285 -176 268 -83 10 -51 274 61 252 3 -66 -78 242 94 -31 -32 -319 -44 179 -54 -375 386 87 114
3307 114 -280 106 126 -32 219 -60 47 296 -50 19 -18 -415 -89 53 -101 -290 -359 -152 228 35 -63 8
3329 8 126 -147 -180 -117 -106 356 101 -10 -236 284 -81 -88 173 204 -222 -130 -105 -227 -586 -219 137 250 156 377
3353 377 938 203 -349 325 -29 127 213 44 36 -71 6 50 -117 49 73 -74 98 68 -312 -117 140 -317
3375 -317 109 205 -86 -38 -124 93 13 211 -25 -142 201 -29 -372 -106 137 190 135 26 -127 12 180 -276
3397 -276 -82 -114 193 -56 94 56 54 -50 57 -91 -25 -132 -54 78 -200 -83 74 -21 -207 214 94 -338
3419 -338 189 9 -178 171 238 -162 -239 163 212 -70 293 114 -238 30 -21 -24 113 146 387 108 -26 -6 67
3442F7j44K45j04n3k33M66j30k47R2Pk76L86J42m07J86L22j81l35M88j72m56L66
3464B9K63k66N6j8Jl04J87K34q2l56J62n8L80k35o1J78K3Q3k64J59k54M61n11
3487a93M49p4j47j73K17K5l33K89j02k81J44K51k48K35K51o77k08M63L19l34J21
3508fK71l16%J94Kj26l8j17L76j65O1k7k52J02J29K0j9K17l32j79J82K38k58j58
3532b01M88n00J43N26m86j35L32lm96L93K16o97M23L22m53k00M93k43k62L17J71
3553A48J1mq4j51p2K49j01m6q1N7j04J50M8K46k92j54K20K18m41K95J39m92K39
3576bJ92j86l63O29n41J5M37l4l92J78J63l55j1J56Mj17L38k54P9J79k3j75OK87
3600B10k41J73p2R1q4j14L0J34q9k08rK4P7R0J2q5P3K10k31q0J56l88K06J9J89
$$ plain form
3442 67 -77 168 64 11 -222 244 114 -133 -41 -34 -310 76 218 -189 -3 319 138 -197 291 119 -337 29
3464 29 292 26 82 64 65 -239 -52 182 100 -256 -94 -152 228 -7 -68 110 133 216 -48 111 -143 318 -193
3487 -193 256 182 35 -138 79 104 -229 60 -42 -323 -179 72 -176 59 310 -367 -575 -112 207 -127 -6
3508 -6 265 -51 -51 143 145 19 -19 -136 240 75 136 109 -143 -41 88 108 89 306 -26 -205 -23 215 -43 -201
3532 -201 287 -213 -70 456 -30 -165 167 164 -332 61 277 -420 3 325 -128 -328 165 -78 -340 -23 148
3553 148 159 155 71 -80 -152 97 -4 -50 -131 -74 -178 -28 20 266 -26 -180 40 258 -183 112 251 -241 -2
3576 -2 190 4 -359 270 -271 -256 181 147 -245 -67 96 -259 -270 -114 -110 -227 111 -143 -64 115 92 -83 -77 210
3600 210 -31 142 70 161 77 -37 -7 127 38 -170 -179 -155 -78 12 24 -61 12 222 -9 -89 67 -321 -115 -96 93
3625I3k78N46n0m65J90K41l36j9K72k14J18m5j52J00q9J61j58j65J54M43m22J35
3647F0J73l5l98K80n9k47K59M01m73k21N37n46J14K40K44l13Q1p5k25j5L85j94
3669b7j33L07p5r1J39M6m27K98N0lp5J12l77K00k0KK67j73m6R9r6j63K07M31o16
3694a64LO16n18N9M20n94j66N08j54k12O05l93m1j22K85l94J1M80j04N0k17N5
3716A3J75k20L06j62j71J7O3J11j44K77n3r3k56L60n99L32J40o5j12N0m4M9K07
3739A81k6l17J06L61l36n29N38n08K24P89o41L78n26N99j84k41N5n07J3J57M34
3760B0K98M34n47r1J15k34K73m46J73Q2M3k19J8K13l32J17K08k2k56L01n7n15
3782d24O09J5m57K46K51m90K70J36j30j49L79j28k87K78R3l88L8J15j12J82k55
$$ plain form
3625 93 -185 361 311 -154 36 277 -59 -78 194 -20 98 53 -99 1 -88 73 -85 -250 -96 347 -75 60
3647 60 233 198 -200 80 21 -226 33 434 -39 -260 277 -269 -155 85 329 16 97 22 -203 -218 167 -27
3669 -27 -160 147 72 -19 120 166 -261 37 87 84 9 121 -256 -56 -76 -74 193 20 -26 73 -23 -186 21 452 -164
3694 -164 -161 455 -63 -4 416 -178 -344 164 10 -202 403 10 -31 -153 132 -262 -251 229 125 175 -42 13
3716 13 188 -32 274 112 -59 -42 21 132 -12 265 212 119 -137 223 -376 -44 96 31 -81 -31 -75 -26 181
3739 181 155 -162 -56 305 -31 -560 -22 -530 -306 483 -158 220 -306 293 109 -132 -77 -584 -571 -414 20
3760 20 318 752 205 114 229 -5 268 -178 -5 77 120 -99 -81 132 -200 -83 125 103 -153 148 91 -424
3782 -424 185 200 -257 -11 240 -250 20 156 26 -123 256 128 -159 119 212 -176 -138 -23 -135 47 -208
3803b08P9K19p6J26q9j36Q1p2L72l76J18lJ28o0R2m50J59K41k18J74j8k05J19
3826cQ8K9k74L24K6k70l8L05l63L58n9j38K72k77Pl65L22L07m34L37k39J84Mk01
3850i8P4L40k78j9K72m68J23J09N8j1m0R0m21K01K97l98j20M72o2m15M08j32M3
3873B5P8k08Q8K1N6j45q2K7Q3j7k99L57k1j60J47M04j05j41j5j35J32j33K36l56
3897a63j79L14Ok57N12j26l3M3M1m72L44K8j00J9J90j48O6k12M13nk35J56l48
3920a46K58m4j67M2o1J35K78l0n59M63K06n46M42m28J35M6K58k36J76j57j5o8
3942a8L54k77k62N03m30r4J12K95l41K79j39o3N2N1J06m21L01O2p4J74k79m6M15
3965B60l44J25N1k90J42K36l82j23N96j65j57J78J1j91M42k67k20mK53k01j01
$$ plain form
3803 -208 -129 90 14 140 51 -85 -4 -76 296 -80 38 35 163 103 195 -255 -96 145 -73 101 83 -122 -3
3826 -3 85 114 -160 164 190 -80 -118 187 -176 182 123 -15 257 -20 -13 -378 -56 251 -183 154 -85 99 103 -98
3850 -98 -24 316 38 19 291 -177 -54 55 113 102 62 152 -269 -68 229 -169 -289 183 121 -294 114 -18 25
3873 25 103 -105 -17 4 60 -85 -167 -140 -57 -74 -373 -16 -37 -197 -50 354 249 108 93 -42 90 -43 193 -163
3897 -163 -342 -28 -22 -279 233 107 74 117 158 -314 30 58 -42 -23 167 19 85 -127 286 281 46 202 -146
3920 -146 112 68 -99 -57 -118 17 295 265 -294 169 375 -171 271 -157 -22 24 282 46 222 65 50 -18
3942 -18 336 59 -203 300 -130 -224 -112 183 -158 121 -18 -81 -29 22 128 -293 8 70 -4 170 -109 -155 260
3965 260 -84 41 92 -198 -56 180 -202 -325 271 106 -51 127 138 -53 389 122 -98 -102 151 -50 -151
3986a51M50k85j98J74j19N8J5j03j80L43J55k44p6K68l12N3R7J45N2j63J53J53
4008B85k83N6j94K76l57K66J0J0j54K66j30n4l8J1k07J64K6J6M2J88n8k24L49
4031B66k16j83J60l3r8J74j89J84l1j79J77K5m8l7J51k6k18L39l27J17K1o0q7
4054a18L72j85j53ML16n5l97K77n0q2K64n20J15J59m2m8K55o6r0Q4j74J23J20
4077A09k69LO7K12Lj19K24n4l04K79m73J95K83j55j33R7J58l21L51J29o08N80
4099B54l09Q2N1Mj44l9K20j16R9j5n8k36M09m14J48O0L72o42L91J36l90J40N5
4122E8m5k17J12m83O06l5n2j35M14l12n1J1J95k7K32j40m38J13K16o0K25j45L3
4145G5P3Q6k70O5K10m74N52k23j10p5M38n15KK09j66O4J81J5PJ5k06j40M97j74
$$ plain form
3986 -151 299 14 -184 -10 -129 -71 -56 -159 -339 4 159 -85 -161 107 -205 -152 -55 90 142 -21 132 285
4008 285 2 58 -136 140 -217 49 59 69 -85 181 51 -3 -41 -30 -237 -73 -47 -31 11 199 141 -83 266
4031 266 50 -133 27 -6 -104 70 -119 65 34 -145 32 57 9 -28 123 97 -121 218 -109 8 29 -31 -118
4054 -118 254 69 -84 -80 236 181 -216 61 11 -71 193 -327 -212 -53 -95 -143 112 46 -44 40 -134 -11 109
4077 109 -160 -157 -90 122 125 6 230 176 -128 151 -322 -127 156 1 -132 -35 123 -198 153 282 -326 254
4099 254 -55 27 78 82 -62 -101 119 3 102 87 29 -207 202 -212 -64 -4 368 -274 117 253 -137 3 58
4122 58 13 -204 -92 -575 31 -4 -56 -191 223 -89 -140 -129 66 39 271 131 -307 -194 22 -38 187 42 75
4145 75 148 234 -36 29 239 -235 317 94 -16 -91 347 -168 -166 43 -123 -59 122 137 144 159 -47 -187 310 136
4169A36Q8n8k70MN03j64n12M98l25Q8Q8J42k89P3K30n05M12n4Q2l01K23J18l34
4192a27J46K07k34k9J05j30L46km16JJ49J45j70P9Q9k18QJ90k16J86j54k34K73
4215fJ24k13J17J03l04R8J09k34J39N61m50P7j52J01J67p0j55k41L28k70PJ94
4237C0o0j42J53L60l54j7p6J28l4K15l66J60K94n5k20J44j44j13J0k7O0K79j04
4260A21j04J73l19j65L16R6j44J09j43R0J77k43L3M04l48j66R8L46n36M2J30n9
4282i2j13J84K6p3K29l37K66m6P1q3J92p4k62P7J58k64k0M00r0Q6q6k29L6J14
4306G0jq6J25k03L01p0k07K7J08k90M3O6L06k77M7N3l06K12M35l90j13J70jj10
4330i1K74l85J32L28r5R0m09K85o1L4n0J10j54J50k11OK7k21K24N3J82o7p3n5
$$ plain form
4169 136 224 166 -104 -100 403 239 -273 225 -100 -12 76 218 -71 2 232 -273 139 85 167 -134 89 207 -127
4192 -127 19 226 -8 -37 68 -62 284 282 -134 -133 16 161 -9 70 159 -59 -51 139 -77 109 -45 -279 -6
4215 -6 118 -95 22 125 -179 -81 28 -206 -67 494 44 121 -31 70 237 167 12 -229 99 -171 -164 30
4237 30 -30 -172 -19 341 -13 -30 -106 22 -12 203 -163 -3 291 236 16 160 16 -97 -87 -114 -54 225 121
4260 121 17 190 -129 -294 22 118 -26 83 -60 30 207 -36 -3 401 53 -113 -15 331 -205 -163 -33 -92
4282 -92 -205 -21 5 -68 161 -176 90 44 115 32 224 150 -112 -35 123 -141 -161 239 149 235 149 -80 -44 70
4306 70 69 -17 108 -95 206 136 -71 -44 64 -226 -183 -117 189 -88 -41 12 -294 -82 353 -37 -150 20 19 -91
4330 -91 183 -202 -70 258 163 253 -156 129 68 102 52 162 8 158 -53 -47 -20 -241 -17 36 218 151 78 23
4354B3j60Q3l7O2L3n4J40j68L49m59K45o0O1n4K1j77M7K04j29J4L09m41L71M7
4378B70m30RO4Q0K76j06q5j34K57m2j15n6o7j37L75j1k43P5oj62K46M3q6J20j06
4403B9J41j72m1O8oK22L2o02M72l51K56q0j5m9K80o4j28n1j05K80q1K0l27L89
4427A17l1K4r2K46l75k31L99k9k7J04K6m32M73j68l01L14j00o9R6M7j21K32l55
4450b53K23p9J63K3R1m98N72k96P7J94l45K62j30q5J03%j55K52Oj82N3R3O2k44
4474i3K1j90J97L10l06j65L36j98M6J01L3n4J60l01j33J34K96Pj24K7n78N13J26
4497A65l26J90l1J07k40J80n6k07K33P6j61l04R0j8L53j31k42M39q0L1j9J4j9
4520D4Qj02n9K07K3j35N1m9P4k00L99r9j71J12l03J93j89K48O7k57J65Jk9R1j19
$$ plain form
4354 23 -137 -54 -91 -29 4 -50 90 -78 271 -188 57 -3 58 4 25 -152 -105 99 -30 -16 293 -148 223 270
4378 270 -160 -151 -87 -7 269 163 78 -56 201 159 44 -12 -79 -216 159 148 -95 -20 -26 -188 58 101 15 135 29
4403 29 170 -2 -43 25 19 241 273 -329 143 -208 48 -32 -47 -96 184 120 -8 -59 -164 116 35 55 -272 117
4427 117 86 110 18 264 -111 -342 57 28 1 105 131 -301 172 4 -297 17 -83 -152 -56 -9 -130 102 -253
4450 -253 -30 -109 54 77 168 -330 242 -54 23 217 -128 134 4 -81 22 22 -133 119 125 -57 -4 89 151 -93
4474 -93 -72 -262 -65 245 -61 -226 110 -88 -42 59 92 38 198 -103 -236 -102 194 201 77 104 -474 39 165
4497 165 -161 29 -2 105 -135 45 -11 -218 15 91 -70 -374 -284 -302 51 -80 -322 117 37 68 49 63 44
4520 44 52 -50 -109 98 121 -14 37 -12 62 -138 261 162 -9 103 -200 -7 -196 52 119 -138 27 28 -1 90 -29
4545b9J7J04l86PK90r5p2L13j50K7M3J29l28P2J39k39K70L0l59J59Q9l7l3L7Q8
4570H6r8J00l2j24J8K18j53J17j04j40K35j48j73L49q6k48J71N0j4O2j61m8K2
4593a01L47k93p2K97m06K89O3j26k7O4R5j31J03p3N3k17K49l54K85J40k67K59
4615A77k76k7K27k43J8J04J66l37L90k65J71k18L45o9k42J85L52o96K17J59J24
4636B62l7o3o1l34L09r6RK55q1k1J13k77n0J76k02o9L27q8j56l0P3J05J57k89
4660f8n1M4l9J23J65q0k56K70k3q9j82L6j85L64p6K66n09M67q3j28P6J9j07J43
4684I7Q7l49L54j34k68J61J25k17K7L11k6l59K19l88R0K50K41m28N8L24k98Q0
4706d3j4J07P8J90m24K41M33o47P4O11m63j17P00j23o21k38J32J77J35m3j89K28
$$ plain form
4545 -29 -12 92 -294 -287 3 -92 -164 149 -1 26 69 198 -130 -58 81 -158 112 142 -217 -58 31 -6 -39 -2 86
4570 86 -12 88 56 -68 -50 168 15 132 28 -112 123 -25 -198 151 65 -183 -12 38 24 86 -75 -123 -101
4593 -101 246 -47 -119 178 -228 61 124 -2 -29 35 130 -1 102 29 82 -135 114 -240 45 185 -82 177
4615 177 -99 -126 101 -142 -124 -20 146 -191 199 -66 105 -113 232 163 -79 106 458 -238 -21 138 262
4636 262 225 162 101 -233 76 -20 -11 244 163 142 255 -22 -72 104 -98 -167 160 72 -84 -114 -41 64 221 -68
4660 -68 -119 -75 -114 9 174 94 -162 108 85 -4 -186 -150 -335 29 -47 219 -290 177 94 -34 42 61 -46 97
4684 97 184 -165 189 55 -213 -52 73 -144 -117 194 168 -191 28 -360 -270 -20 221 -207 -149 175 -123 -43
4706 -43 -57 50 128 318 -106 135 568 -79 -5 606 143 26 726 603 -18 -256 -124 53 188 145 -44 184
4728A84N0k71k0J70p3j51K46k40K12J8n6k95K03N0k07K92L1k54J91o4k18L09j22
4751a5j82M22m11J40oK97k83kr6J84k3j3j90L16L8k95NJ43j13J99j39K95m78M10
4775B03j70k64O32o44K45j8Q9p0j28J01P7k37J45J34J34j24l32J66K2M42l12J6
4797A07ok92N4Q7j3J08M2m04J66J37j46L07rk55M3K17k60J74n1j50Q6J53j19j42
4821a66L74k24J22J76p6k29J16K30k43l4m0j01K34pk57L3J55l25R4K01J21O7k27
4844fJ3k81M97m1l57J11M5J92p4k73J20J44l21M10N4j78j47K4J34r1j11L33m7
4867A50k16L10l30j57L34J0J1J04m62J18N3k9J56j25J16j75J79J57r0j3j27j69
4889a95L81j12k03L4K35j93n1J31j22rK57r5k69R7L82l99L65j81l03L86k71K13
$$ plain form
4728 184 234 -37 -57 113 40 -111 135 -105 107 125 69 -226 -23 27 -180 112 143 -111 80 16 -202 107 -15
4751 -15 -197 225 -186 -46 -52 245 -38 -40 -136 48 25 12 -178 138 176 -119 -114 29 -84 115 -24 271 -207 203
4775 203 33 -231 401 -243 2 -16 73 3 -125 -24 53 -184 -39 95 229 105 -227 -61 -39 403 91 107
4797 107 101 -191 -137 -50 -63 45 87 -317 -151 -14 -160 147 138 -117 -74 143 -117 57 6 -144 -58 95 -24 -166
4821 -166 208 -16 106 282 206 -23 93 323 80 46 6 -95 139 132 -125 -92 63 -262 -168 33 154 221 -6
4844 -6 7 -274 223 182 -175 -64 -19 173 99 -174 -54 90 -231 179 233 55 -92 -68 66 -25 -136 197 150
4867 150 -66 244 -86 -243 91 101 112 216 -246 -128 -75 -104 52 -73 43 -132 47 204 114 101 -26 -195
4889 -195 186 74 -129 -95 140 -53 -104 27 -95 -104 153 58 -211 -114 268 -131 234 53 -250 136 -135 78
4911G8M2j77J04k45L42k23J32K9r7l55M54J91l36L60l51o7j62L43l19J61K81j84
4933Ao9L04m11J83R4o2O0j00j01o7K87Nj64J12l26J33k4J05J35J7j72l3l7m9Q4
4958i5J78l2K7r5k22L31l41J89N4P7J96n7K9j16k93J58rQ3k13L21k02J4k5K68
4982B25k77pL16j51j44r5L8Q3Q9N7l69L22k2j76J75l38L35j47J76j72p4L34j04
5005G4N6ol31L20P9m93L71p8k87J96O2k04L78m4q7j30j3l0o5M53k83m2K2J49j99
5030a32L35r3K1j11j4J27j51J49l04J65K77l80l0K68j81Mp8J77J00j7K63m99L2
5053g2J87l18J50J15j82j08K20J90l28J95j36L66j70j28p2J89k74J96j3J13l52
5074b32J64L65m65J88J55q3o1P0k90K38J33l07J57p4J00N1k16J02P5k26J53MN6
$$ plain form
4911 78 120 -57 47 -198 144 -79 53 82 -15 -370 84 275 -61 299 -52 -119 -281 62 -257 -96 185 1
4933 1 -68 236 -175 8 102 40 100 0 -101 -168 119 124 -40 72 -254 -121 -145 -40 95 112 -60 -93 -130 -179 -95
4958 -95 83 51 78 -17 -239 92 -249 -60 -6 71 267 210 239 123 -170 -12 -21 62 -151 170 -32 -18 -43 225
4982 225 -52 -59 257 106 -38 -133 -95 -12 77 134 -235 87 65 -111 64 -274 61 -86 90 -82 -156 178 74
5005 74 130 124 -207 113 192 -301 70 -8 -295 -99 -37 -241 137 93 6 -124 -137 -167 -232 221 -62 -104 -82 67 -132
5030 -132 203 110 131 20 6 133 -18 131 -173 -8 269 -111 -141 127 -54 -50 -128 49 149 132 395 -104 -72
5053 -72 115 -203 -53 62 -120 -228 -8 182 -146 49 -87 279 109 -19 -91 98 -176 20 7 120 -232
5074 -232 -68 297 -168 20 175 92 31 101 -189 49 182 -125 32 -42 58 109 -107 -5 70 -156 -3 1 57
5097E7Kj48j61K51m2l4k43M83j04n9p9j22N16k10k86K06l4j33J52J1l0J24pj24
5121a4k31K68J35j92M6j48J33K5J13m1k14J74p8L29n20J73LL31j56j99j13L4K12
5144G0L3n5R0j01n6j45j70K80L71j82l23L10j01j66N6J71K49n91L04P8mN1l31
5167a62m9J66m5K25q3p6J03J47j17k29Q2J09M0J79l58p5L13k10m0r9K94k06J67
5190G6N1J38n29K52J17j42Mj84L9r6M21l90K58P2j65k67O51l82j68L57k3j00o3
5213g3K86P4l10p4J10o6j60K52K01j29k72m9J94j47J16N5j55P5P7k37K30NN9k7
5237C5O0Pn2J3Mm3J52j08P3r2l73L65R2j6p8r6J18j46O0m8j46K95q6J54p4K95
5263C65m01JM3O5q0K52P2j45m0j6j79J13J63m41L8L8K99j77olj30L33r0r2k1K07
$$ plain form
5097 57 59 -89 -250 1 -41 -75 -318 165 61 2 -77 -199 317 107 -179 27 -7 -140 12 23 -7 117 110 -14
5121 -14 -245 23 158 -34 12 -136 -3 22 135 94 -120 54 -24 305 -215 -42 -39 292 136 -63 -176 -142 70
5144 70 103 48 138 37 -19 -164 -334 -54 317 135 -188 122 21 -145 -89 82 331 -260 44 122 118 169 -162
5167 -162 -211 -45 -90 135 52 -24 79 226 109 -120 -38 71 111 290 -68 -143 170 -40 -80 -179 115 -91 76
5190 76 127 265 -264 -12 105 -37 -33 -217 -178 -274 147 -243 15 87 -78 -345 306 -76 -244 113 90 -10 -73
5213 -73 213 287 -23 -97 13 -53 -213 39 240 111 -161 -210 -16 -163 -47 8 -147 -72 5 -232 -2 3 62 35
5237 35 95 102 50 63 67 24 176 68 141 49 -324 41 133 117 39 -57 61 -85 -25 -73 -219 76 -10 144 70 365
5263 365 -36 -35 8 73 -7 245 317 172 132 116 -63 50 213 -228 -190 -152 147 -30 -36 -39 -169 164 74 -18 -39 168
5289A68l45n7O9J22L60k66poN2J77j83m06L1J38N9J05q8J26K8j48J44q5R4J06
5313A88rj14Jj29j20J48j5K80r86O99N34p90R04n5j74l83J07j62j32m2K91R0j96
5336f5L1j50J84j59L76j67J27j32k49J4k7L96N7l47N6j3J5K4K6j92J60J06j82
5359a11K17j39Q7J06l1l58J59K56k09KK18k58K20j03o4j12J5k3J17rJ0J27k44
5382a27m6j05M82k40j35K35r9r2K08K0l39M09J09m63K24k4k96K77K82l53P2O2
5404F1L2Om9L4k79J69L65j95q0q4P0R1k56K20m6o0K64j55Q7j16n9J41k70R2Nj56
5430a68J66m5R3R2j83J49j99J92j8j57K7J57j97n5J79k24K4L88m85L72K57l90
5452b5R5M4m03J77L12k13r1K53k21n4K5P6L0n7mj0J97k2J12j2l53J85J29j27k37
$$ plain form
5289 168 -177 -234 -165 -43 317 51 44 38 90 267 84 -322 -291 -153 -94 11 -77 49 77 -71 73 -12 82 188
5313 188 179 65 66 -63 -183 -35 -50 230 -756 -57 477 -313 591 536 362 -21 86 -76 -208 -250 41 131 -65
5336 -65 -34 -184 0 -159 217 50 177 45 -204 -190 -217 179 236 -111 -55 -68 -53 -29 -3 -195 -35 71 -111
5359 -111 106 -33 54 160 129 -229 -70 186 -23 -21 197 -61 159 56 -8 -120 -105 -128 -11 -20 -10 117 -127
5382 -127 -173 -278 204 -36 -171 64 -35 -127 81 101 -238 171 280 -183 41 17 -279 -2 280 -73 -1 61
5404 61 93 99 50 84 -195 -26 339 144 64 -20 50 141 -115 105 59 -1 263 108 195 79 20 161 -109 -17 -12 -168
5430 -168 -2 -47 46 138 -45 104 -95 97 79 -78 -51 106 -91 -146 33 -191 -167 221 -264 108 365 -25
5452 -25 70 114 -289 -112 200 -13 -104 149 -72 -126 -101 -25 5 -52 -56 -66 131 109 221 209 -144 41 170 43 -194
5477a94K90%j52O0l3r2j5J91J4J54l12Q8J6K2l17P9O3O0J91j47J50k30J93K69
5501C48l06j19J59j93N5N7j98K37K4O8k81O3K19m36L43r5J0J11j47J83j58J43
5523H7m1M3J0r8M2qR1j24J9l8l04M49J4J48n01L31k42K93k01n4K74k41J10j72
5547a13R6l13L56K87l95J58k37o2K17j4J01j34L12p3p4r4r1L01l43K63l52J98
5569fL27l22L4K26m12J28L9r2j69J52J10p1o7J52Oq8J4m3J58O0L8l1j32o1oP5
5595A9j02R2M3j78l7M59m5m25M18l05J99k54J68k68K05J63M2l74L61j34k71L76
5617A52m03J22J28n9j02J88J39j73J70k01k52M45J9k18j04K13l54L05m5J21P8
5638A69k58K90q8M6j35j56j21L79J0j10J06l02J50K6k16J71J34j07j57K43P5j42
$$ plain form
5477 -194 96 96 -56 4 -29 -121 -136 55 69 223 -89 -1 15 37 -280 -201 -138 -78 113 -34 116 -114 79 348
5501 348 42 -77 82 -111 -56 1 -197 40 64 132 -149 -86 133 -303 40 -55 -45 66 -81 102 -56 87
5523 87 46 89 99 1 43 35 126 2 21 -17 -321 128 142 290 -211 120 -122 171 -30 -84 190 -51 59 -113
5547 -113 -17 -330 26 313 -82 76 -161 -223 -6 -20 81 -53 259 186 112 18 -73 228 -115 148 -204 -6
5569 -6 321 -1 33 259 -153 -25 14 -78 -247 -95 15 -56 -123 29 35 -53 -39 -82 76 136 174 143 11 -50 -56 19
5595 19 -83 9 52 -126 -163 296 251 -174 244 -61 138 -116 52 -216 -11 152 194 -180 181 47 -224 152
5617 152 -251 -129 -1 -60 -162 26 165 -8 162 -39 -291 154 173 -45 -149 64 -290 15 -30 91 169
5638 169 -89 201 113 159 24 -132 -253 126 136 26 132 -170 -20 6 -210 -39 95 -12 -169 74 149 7
5660Gj96K24j24K80j13L0l8k68K94J7k37r0M0Pn7K90J21n8J96m34K7J70j3j12
5684c7K3JJ34N9k45J49p3J38k80K27l48L11j00k80J88q7K66R9r3j67K59N7k21
$$ plain form
5660 7 -189 35 -89 191 78 108 70 -198 96 113 -124 -214 -174 -167 -224 66 187 129 325 -109 -82 88 75 -37
5684 -37 -14 -13 121 180 -65 84 11 149 -131 96 -252 59 -41 -321 -133 -220 46 145 52 -115 144 201 -20
$$ [...]
8191E0
##END NTUPLES=NMR FID
##END=
