##TITLE=1H_TG-2307-X1
 DMSO, 8 sc, 
 23.11.2020
##JCAMPDX= 6.0         $$ Bruker NMR JCAMP-DX V2.0
##DATA TYPE= NMR SPECTRUM
##DATA CLASS= NTUPLES
##ORIGIN= UXNMR, Bruker Analytische Messtechnik GmbH
##OWNER= root
$$ XWIN-NMR		Version 3.5
$$ Mon Nov 23 12:27:59 2020 Russian Standard Time (UT+4h)  she@DPX200
##.OBSERVE FREQUENCY= 200.1315066352
##.OBSERVE NUCLEUS= ^1H
##.ACQUISITION MODE= SIMULTANEOUS
##.ACQUISITION SCHEME= undefined
##.AVERAGES= 8
##.DIGITISER RES= 18
##SPECTROMETER/DATA SYSTEM= spect
##.PULSE SEQUENCE= zg30
##.SOLVENT NAME= DMSO
##.SHIFT REFERENCE= (INTERNAL, DMSO, 0, 15.9875)
##AUDIT TRAIL= $$ (NUMBER, WHEN, WHO, WHERE, WHAT)
$$ ##TITLE= Audit trail, XWIN-NMR		Version 3.5
$$ ##JCAMPDX= 5.01
$$ ##ORIGIN= Bruker BioSpin GmbH
$$ ##OWNER= she
$$ F:/spectra/data/she/nmr/H-F/1/pdata/1/auditp.txt
$$ ##AUDIT TRAIL=  $$ (NUMBER, WHEN, WHO, WHERE, WHAT)
(   1,<2020-11-23 12:26:34.81 +0400>,<she>,<DPX200>,
      <created by zg, POWCHK disabled, PULCHK disabled
       configuration hash MD5:
       00 E9 B6 7A A2 85 ED C7 34 08 36 98 17 FE 4E 26
       data hash MD5: 16K
       6F EC CE 65 4D 04 EC 88 DA ED 60 AE A3 0D 8A B6>)
(   2,<2020-11-23 12:26:37.32 +0400>,<she>,<DPX200>,
      <Start of raw data processing
       efp BC_mod = 2 LB = 0.24 FT_mod = 6 PKNL = 1 PHC0 = -11052.85 PHC1 = 16.60089 SI = 16K 
       data hash MD5: 16K
       AA 35 E6 8A F6 06 30 B6 E3 01 98 78 19 D4 8A FA>)
(   3,<2020-11-23 12:26:58.42 +0400>,<she>,<DPX200>,
      <pk PHC0 = 1.367713 PHC1 = -0.6000003 
       data hash MD5: 16K
       2F 1A 65 A2 57 86 8F A6 3D E2 8B 08 E9 9D E8 7C>)
(   4,<2020-11-23 12:27:02.12 +0400>,<she>,<DPX200>,
      <abs ABSG = 5 
       data hash MD5: 16K
       B0 DC 86 41 8F F4 B2 73 EE 2F 9E DC 21 61 75 38>)
$$ ##END=
$$ 
$$ hash MD5
$$ 6B 40 72 2C 87 DA E3 94 EA 3D 11 59 8A 86 57 0C
##$RELAX= 
##$RELAX= 
##$RELAX= 
##$RELAX= 
##$RELAX= 
##$RELAX= 
$$ Bruker specific parameters
$$ --------------------------
##$DU= <F:/spectra>
##$EXPNO= 1
##$NAME= <H-F>
##$PROCNO= 1
##$TYPE= <nmr>
##$USER= <she>
##$AMP= (0..31)
100 100 100 100 100 100 100 100 100 100 100 100 100 100 100 100 100 100 
100 100 100 100 100 100 100 100 100 100 100 100 100 100 
##$AQSEQ= 0
##$AQ_mod= 1
##$AUNM= <au_zg>
##$AUTOPOS= <>
##$BF1= 200.13
##$BF2= 200.13
##$BF3= 200.13
##$BF4= 200.13
##$BF5= 200.13
##$BF6= 200.13
##$BF7= 200.13
##$BF8= 200.13
##$BYTORDA= 1
##$CFDGTYP= 0
##$CFRGTYP= 5
##$CHEMSTR= <none>
##$CNST= (0..31)
1 1 145 1 1 1 1 1 1 1 1 1 1 1 1 1 1 1 1 1 1 1 1 1 1 1 1 1 1 1 1 1 
##$CPDPRG= <>
##$CPDPRG1= <>
##$CPDPRG2= <>
##$CPDPRG3= <>
##$CPDPRG4= <mlev>
##$CPDPRG5= <mlev>
##$CPDPRG6= <mlev>
##$CPDPRG7= <mlev>
##$CPDPRG8= <mlev>
##$CPDPRGB= <>
##$CPDPRGT= <>
##$D= (0..31)
0 1.2 0 0 0 0 0 0 0 0.06 0 0.03 0 0 0 0 0.0002 0 0 0 0 0 0 0 0 0 0 0 0 
0 0 0 
##$DATE= 1606119994
##$DBL= (0..7)
120 120 120 120 120 120 120 120 
##$DBP= (0..7)
150 150 150 150 150 150 150 150 
##$DBP07= 0
##$DBPNAM0= <>
##$DBPNAM1= <>
##$DBPNAM2= <>
##$DBPNAM3= <>
##$DBPNAM4= <>
$$ [...]
##$SUBNAM3= <"">
##$SUBNAM4= <"">
##$SUBNAM5= <"">
##$SUBNAM6= <"">
##$SUBNAM7= <"">
##$SUBNAM8= <"">
##$SUBNAM9= <"">
##$SW= 16.9725356469052
##$SWIBOX= (0..15)
0 0 2 0 0 0 0 0 0 0 0 0 0 0 0 0 
##$SW_h= 3396.73913043478
##$TD= 16384
##$TD0= 1
##$TE= 0
##$TE2= 300
##$TE3= 300
##$TEG= 300
##$TL= (0..7)
0 120 120 120 120 120 120 120 
##$TP= (0..7)
150 150 150 150 150 150 150 150 
##$TP07= 0
##$TPNAME0= <>
##$TPNAME1= <>
##$TPNAME2= <>
##$TPNAME3= <>
##$TPNAME4= <>
##$TPNAME5= <>
##$TPNAME6= <>
##$TPNAME7= <>
##$TPOAL= (0..7)
0.5 0.5 0.5 0.5 0.5 0.5 0.5 0.5 
##$TPOFFS= (0..7)
0 0 0 0 0 0 0 0 
##$TUNHIN= 0
##$TUNHOUT= 0
##$TUNXOUT= 0
##$USERA1= <user>
##$USERA2= <user>
##$USERA3= <user>
##$USERA4= <user>
##$USERA5= <user>
##$V9= 5
##$VALIST= <valist>
##$VCLIST= <CCCCCCCCCCCCCCC>
##$VD= 0
##$VDLIST= <DDDDDDDDDDDDDDD>
##$VPLIST= <PPPPPPPPPPPPPPP>
##$VTLIST= <TTTTTTTTTTTTTTT>
##$WBST= 1024
##$WBSW= 4
##$XGAIN= (0..3)
0 0 0 0 
##$XL= 0
##$YL= 0
##$YMAX_a= 379353
##$YMIN_a= -301416
##$ZGOPTNS= <>
##$ZL1= 120
##$ZL2= 120
##$ZL3= 120
##$ZL4= 120
##$ABSF1= 15.98749
##$ABSF2= -0.9851742
##$ABSG= 5
##$ABSL= 3
##$ALPHA= 0
##$AQORDER= 0
##$ASSFAC= 0
##$ASSFACI= 0
##$ASSFACX= 0
##$ASSWID= 0
##$AUNMP= <proc_1d>
##$AZFE= 0.1
##$AZFW= 0.1
##$BCFW= 0
##$BC_mod= 2
##$BYTORDP= 0
##$COROFFS= 0
##$CY= -3
##$DATMOD= 1
##$DC= 0
##$DFILT= <>
##$DTYPP= 0
##$F1P= 0
##$F2P= 0
##$FCOR= 1
##$FTSIZE= 16384
##$FT_mod= 6
##$GAMMA= 0
##$GB= 0
##$INTBC= 1
##$INTSCL= 1.245715e-10
##$ISEN= 128
##$LB= 0.24
##$LEV0= 0
##$LPBIN= 0
##$MAXI= 10000
##$MC2= 0
##$MEAN= 0
##$ME_mod= 0
##$MI= 1.114404
##$NCOEF= 0
##$NC_proc= -6
##$NLEV= 6
##$NOISF1= 3.799351
##$NOISF2= 2.8
##$NSP= 0
##$NTH_PI= 0
##$NZP= 0
##$OFFSET= 15.98749
##$PC= 1
##$PHC0= -11051.48
##$PHC1= 16.00089
##$PH_mod= 1
##$PKNL= yes
##$PPARMOD= 0
##$PSCAL= 0
##$PSIGN= 0
##$REVERSE= no
##$SF= 200.130005427943
##$SI= 16384
##$SIGF1= 3
##$SIGF2= 2
##$SINO= 5.538805
##$SIOLD= 16384
##$SREGLST= <1H.CDCl3>
##$SSB= 0
##$STSI= 16384
##$STSR= 0
##$SW_p= 3396.73913043478
##$SYMM= 0
##$S_DEV= 0
##$TDeff= 16384
##$TDoff= 0
##$TI= <>
##$TILT= no
##$TM1= 0
##$TM2= 0
##$TOPLEV= 0
##$USERP1= <user>
##$USERP2= <user>
##$USERP3= <user>
##$USERP4= <user>
##$USERP5= <user>
##$WDW= 1
##$XDIM= 16384
##$YMAX_p= 331794487
##$YMIN_p= -485978
$$ End of Bruker specific parameters
$$ ---------------------------------
##NTUPLES= NMR SPECTRUM
##VAR_NAME=  FREQUENCY,     SPECTRUM/REAL,   SPECTRUM/IMAG
##SYMBOL=    X,             R,               I
##VAR_TYPE=  INDEPENDENT,   DEPENDENT,       DEPENDENT
##VAR_FORM=  AFFN,          ASDF,            ASDF
##VAR_DIM=   16384,         16384,           16384
##UNITS=     HZ,            ARBITRARY UNITS, ARBITRARY UNITS
##FACTOR=    0.207333158178281, 1,           1
##FIRST=     3199.5764005037, 0,             0
##LAST=      -197.162729931079, 0,           0
##MIN=       -197.162729931079, -485978,     0
##MAX=       3199.5764005037, 331794487,     0
$$ Real data points
##PAGE= N=1
##DATA TABLE= (X++(R..R)), XYDATA
$$ [...]
$$ plain form
7993 11147579 11498203 11826468 12033683 12277035 12448059 12419698 12177687 12081118 12070128 11882563
7983 11882563 11728960 11510724 11248788 11002361 10735948 10678259 10646028 10586620 10487493 10650728
7973 10650728 10659301 10744946 10842168 11082156 11357025 11663688 11924255 12347604 12842715 12800409
7963 12800409 13131888 13494339 13776431 14160959 14608989 14925604 15085826 15248082 15422969
7954 15422969 15338043 15023509 14727809 14274273 13676734 13365783 12985896 12568297 12212816 12037139
7944 12037139 11706177 11278562 11133441 10917755 10700751 10533288 10474828 10350426 10144688 10117832
7934 10117832 10195491 10147292 10120111 10078324 10151789 10074475 10099870 10179448 10071004 10127958 9952011
7923 9952011 9981515 9913254 9746804 9638347 9449096 9222125 8943237 8529036 8307862 8112632
$$ packed form
7993A1147579L50624L28265K07215K43352J71024k8361k42011r6569j0990j87565
7983A1882563j53603k18236k61936k46427k66413n7689l2231n9408r9127J63235
7973A0650728Q573Q5645R7222K39988K74869L06663K60567M23349M95111m2306
7963A2800409L31479L62451K82092L84528M48030L16615J60222J62256J74887
7954A5422969q4926l14534k95700m53536n97539l10951l79887m17599l55481j75677
7944A2037139l30962m27615j45121k15686k17004j67463n8460j24402k05738k6856
7934A0117832P7659m8199k7181m1787P3465p7314K5395P9578j08444N6954j75947
7923I952011K9504o8261j66450j08457j89251k26971k78888m14201k21174j95230
$$ plain form
7913 8112632 7880383 7714558 7484653 7200630 6916890 6679352 6441545 6317507 6133536 5904201
7903 5904201 5795106 5869312 5739018 5377348 5256464 5247344 5079180 4942068 4840752 4721560
7893 4721560 4712881 4588253 4276981 4202424 4384941 4255001 4170663 3848893 3689179 3598366
7883 3598366 3511770 3431732 3296452 3202683 2949494 2816976 2744374 2639363 2599912 2568445 2592682
7872 2592682 2721378 2573611 2422517 2299098 2267501 2278174 2206952 2164494 2069024 2009079 2114220
7861 2114220 2027749 1843189 1664954 1743978 1779317 1723031 1643431 1487840 1447374 1419463 1436027
7850 1436027 1429367 1310031 1176743 1197655 1186707 1066216 1094219 1154188 1096931 1155592 1121108
7839 1121108 1076402 1135964 1074305 910614 878218 995327 984720 953942 806432 789912 858782
$$ packed form
7913H112632k32249j65825k29905k84023k83740k37538k37807j24038j83971k29335
7903E904201j09095P4206j30294l61670j20884r120j68164j37112j01316j19192
7893D721560q679j24628l11272p4557J82517j29940q4338l21770j59714r0813
7883C598366q6596q0038j35280r3769k53189j32518p2602j05011l9451l1467K4237
7872B592682J28696j47767j51094j23419l1597J0673p1222m2458r5470n9945J05141
7861B114220q6471j84560j78235P9024L5339n6286p9600j55591m0466k7911J6564
7850A436027o660j19336j33288K0912j0948j20491K8003N9969n7257N8661l4484
7839A121108m4706N9562o1659j63691l2396J17109j0607l0778j47510j6520O8870
$$ plain form
7828 858782 911314 701797 703593 640114 680641 667400 589669 613036 806247 746163 551064
7817 551064 604266 703724 584254 479825 539391 676065 728260 579776 597925 651813 532131
7806 532131 319548 240866 144742 338713 423995 443916 310204 348565 371182 153765 286431
7795 286431 392632 292200 309476 302436 291174 416912 340468 265455 228296 77510 156305
7784 156305 90207 132955 390241 309863 252307 263751 140984 225456 168727 365360 436819
7773 436819 373737 366429 279856 269378 250071 133152 76593 166795 245084 7455 135632
7762 135632 293111 350818 246276 302731 430090 280725 168103 8933 177237 139840
7752 139840 169889 265348 274741 306408 363143 173647 196985 190071 199692 245406 242850 320756
$$ packed form
7828H58782N2532k09517J796o3479M0527j3241p7731K3367J93211o0084j95099
7817E51064N3202R9458j19470j04429N9566J36674N2195j48484J8149N3888j19682
7806E32131k12583p8682r6124J93971Q5282J9921j33712L8361K2617k17417J32666
7795B86431J06201j00432J7276p040j1262J25738p6444p5013l7159j50786P8795
7784A56305o6098M2748K57286q0378n7556J1444j22767Q4472n6729J96633P1459
7773D36819o3082p308q6573j0478j9307j16919n6559R0202P8289k37629J28177
7762A35632J57479N7707j04542N6455J27359j49365j12622j59170J68304l7397
7752A39840L0049R5459R393L1667N6735j89496K3338o914R621M5714k556P7906
$$ plain form
7740 320756 122428 154724 200657 112419 113067 183619 269045 291175 377730 255844 149494
7729 149494 114500 207681 113172 87313 128607 146791 117371 52559 -19652 -110449 44169
7718 44169 53362 91419 12219 34045 55439 13589 24739 60637 112555 -63422 -128307 -9651
7706 -9651 69700 45240 139711 73927 77731 68447 -20677 -117256 -93114 -25561 -36309 35655
7694 35655 71696 51213 -36531 -149414 -149280 62575 239638 61498 -24919 24074 -2992
7683 -2992 13634 22367 101515 122337 20909 -29567 50110 34970 4622 -15022 -17714 -157840
7671 -157840 -252851 -65910 49522 -60760 -169460 -80209 126579 138084 216815 27482
7661 27482 -122448 -182572 -25819 86995 -33211 -66213 -46991 -43574 -190485 -134160 25574
$$ packed form
7740C20756j98328L2296M5933q8238O48P0552Q5426K2130Q6555j21886j06350
7729A49494l4994R3181r4509k5859M1294J8184k9420o4812p2211r0797J54618
7718D4169R193L8057p9200K1826K1394m1850J1150L5898N1918j75977o4885J18656
7706i651P9351k4460R4471o5784L804r284q9124r6579K4142O7553j0748P1964
7694C5655L6041k0483q7744j12883J34K11855J77063j78140q6417M8993k7066
7683b992J6626Q733P9148K0822j01428n0476P9677j5140l0348j9644k692j40126
7671a57840r5011J86941J15432j10282j08700Q9251K06788J1505P8731j89333
7661B7482j49930o0124J56753J12814j20206l3002J9222L417j46911N6325J59734
$$ plain form
7650 25574 79624 102554 -39412 -13902 3033 -77186 -111567 1046 -54419 -155802 -209899
7639 -209899 -315093 -230734 -41904 15123 -17595 -130628 -125470 -68966 -151786 -171573 -120790
7628 -120790 30103 -14455 -70106 -223022 -212242 -104142 46575 -112904 -273190 -213486
7618 -213486 -306701 -247008 -152928 -28370 -142536 -109704 46970 69743 34571 -63345 -44999
7607 -44999 14257 67239 136126 81440 -92027 -179772 -147571 -71124 -70324 -5559 -35187 -43433
7595 -43433 -55303 -154185 -139397 -184691 -220015 -138186 -64214 -78414 -150927 -154817 -135640 -144588
7583 -144588 -139703 -145577 -170430 -228415 -146326 26317 -79550 -70455 -87313 -78507 -239844 -176474
7571 -176474 -105039 -169926 -285127 -258491 -162905 -100782 -94814 -73898 -77469 -76796 -188831 -62141
$$ packed form
7650B5574N4050K2930j41966K5510J6935q0219l4381J12613n5465j01383n4097
7639b09899j05194Q4359J88830N7027l2718j13033N158N6504q2820j9787N0783
7628a20790J50893m4558n5651j52916J0780J08100J50717j59479j60286N9704
7618b13486r3215N9693R4080J24558j14166L2832J56674K2773l5172r7916J8346
7607d4999N9256N2982O8887n4686j73467q7745L2201P6447Q00O4765k9628q246
7595d3433j1870r8882J4788m5294l5324Q1829P3972j4200p2513l890J9177q948
7583a44588M885n874k4853n7985Q2089J72643j05867R095j6858Q806j61337O3370
7571a76474P1435o4887j15201K6636R5586O2123N968K0916l571O73j12035J26690
$$ plain form
7559 -62141 -22657 -105549 -142092 -206401 -136598 -90602 -176782 -174679 -112043 -311980 -203829 -240036
7547 -240036 -172206 -32392 -46324 -211149 -297191 -274455 -228416 -221198 -125907 -14337 -20215
7536 -20215 -59887 -138381 -133282 -158566 -99776 -100961 -264138 -138298 -127189 -48287 101939 20118
7524 20118 -148870 -246267 -161262 -198058 -245870 -183095 -135094 -80387 -77263 -126108 17897 32136
7512 32136 33759 37380 -46002 -77087 -151133 -175262 -165228 -120058 -152377 -202401 -92745 -75406
7500 -75406 -217439 -278737 -269228 -136669 -111542 -92897 -201075 -346082 -232474 -239287 -135739
7489 -135739 48595 -69933 -62460 -84744 -150494 -248561 -176458 -82742 -260412 -272768 -204013
7478 -204013 -259821 -216714 -302557 -368295 -364913 -196475 -152903 -130253 -216563 -265782 -129712
$$ packed form
7559f2141L9484q2892l6543o4309O9803M5996q6180K103O2636j99937J08151l6207
7547b40036O7830J39814j3932j64825q6042K2736M6039P218R5291J11570n878
7536b0215l9672p8494N099k5284N8790j185j63177J25840J1109P8902J50226q1821
7524B0118j68988r7397Q5005l6796m7812O2775M8001N4707L124m8845J44005J4239
7512C2136J623L621q3382l1085p4046k4129J0034M5170l2319n0024J09656J7339
7500g5406j42033o1298R509J32559K5127J8645j08178j45007J13608o813J03548
7489a35739J84334j18528P473k2284o5750r8067P2103R3716j77670j2356O8755
7478b04013n5808M3107q5843o5738L382J68438M3572K2650q6310m9219J36070
$$ plain form
7467 -129712 -74713 -114124 -193482 -230188 -158028 -174866 -135842 -95228 -223923 -215026 -363105
7456 -363105 -412053 -266653 -282419 -396797 -315698 -282933 -300818 -268669 -211950 -238941 -310759
7445 -310759 -306410 -264837 -326831 -281711 -268577 -284088 -258872 -331248 -368569 -241181 -141518 -271562
7433 -271562 -231560 -97881 -64451 -123220 -147330 -197852 -176817 -173924 -14929 77775 -22443
7422 -22443 -72882 -187996 -189079 -191209 -226040 -239699 -289928 -250061 -128341 -103210 -184855 -242046
7410 -242046 -168525 -174866 -218554 -247766 -96178 -203437 -255487 -190124 -202604 -193817 -184950 -189738
7398 -189738 -379403 -323571 -291089 -354830 -262551 -387874 -370508 -240833 -301670 -266576 -43625
7387 -43625 -199686 -435480 -317833 -336141 -243210 -66512 -152434 -51173 -136612 -195477 -288427
$$ packed form
7467a29712N4999l9411p9358l6706P2160j6838L9024M0614j28695Q897j48079
7456c63105m8948J45400j5766j14378Q1099L2765j7885L2149N6719k6991p1818
7445c10759M349M1573o1994M5120J3134j5511K5216p2376l7321J27388R9663j30044
7433b71562M0002J33679L3430n8769k4110n0522K1035K893J58995R2704j00218
7422b2443n0439j15114j083k130l4831j3659n0229L9867J21720K5131q1645n7191
7410b42046P3521o341m3688k9212J51588j07259n2050O5363j2480Q787Q867m788
7398a89738j89665N5832L2482o3741R2279j25323J7366J29675o0837L5094K22951
7387d3625j56061k35794J17647j8308R2931J76698q5922J01261q5439n8865r2950
$$ plain form
7376 -288427 -213293 -217674 -169199 -231614 -264550 -271783 -304783 -306543 -321802 -125536 -167433 -268379
7364 -268379 -181397 -177027 -272118 -366008 -253233 -117390 -144644 -228165 -224238 -111378 -67957
7353 -67957 -152785 -203637 -123059 -123087 -144636 -161159 -144781 -266870 -278775 -326943 -115729 -83951
7341 -83951 -132565 -141662 -98713 -158232 -152890 -63175 -57177 -43973 -117183 -204140 -382836 -362267
7329 -362267 -250599 -313221 -226717 -239647 -260945 -236131 -167444 -220923 -313723 -321612 -312372 -322992
7317 -322992 -313693 -319483 -290492 -231064 -210636 -213697 -152787 -137590 -166845 -294124 -267880 -59528
7305 -59528 -106029 -299414 -211012 -266157 -383106 -302885 -317480 -272775 -369577 -281805 -172649
7294 -172649 -195972 -272001 -374930 -375735 -320088 -268206 -153976 -177179 -321161 -66767 -77805
$$ packed form
7376b88427P5134m381M8475o2415l2936p233l3000j760j5259J96266m1897j00946
7364b68379Q6982M370r5091r3890J12775J35843k7254q3521L927J12860M3421
7353f7957q4828n0852Q0578k8k1549j6523J6378j22089j1905m8168K11214L1778
7341h3951m8614r097M2949n9519N342Q9715N998J3204p3210q6957j78696K0569
7329c62267J11668o2622Q6504j2930k1298K4814O8687n3479r2800p889R240j0620
7317c22992R299n790K8991N9428K0428l061O0910J5197k9255j27279K6244K08352
7305e9528m6501j93385Q8402n5145j16949Q0221j4595M4705r6802Q7772J09156
7294a72649k3323p6029j02929q05N5647N1882J14230k3203j43982K54394j1038
$$ plain form
7283 -77805 -206044 -129382 -206484 -201396 -238170 -258744 -154638 -274098 -231095 -161284 -47601
7272 -47601 -45972 -152506 -101074 -212661 -98030 -54781 48956 -159992 -155231 -122533 -136041
7261 -136041 -180247 -135008 -17212 -50461 -98715 -197792 -225309 -107013 -102422 -248298 -169922
7250 -169922 -327331 -309761 -254661 -287587 -268646 -208719 -181614 -15788 -83525 -344336 -335316
7239 -335316 -241440 -322223 -462554 -263522 -184013 -99911 -144658 -226465 -266889 -222720 -170236
7228 -170236 -111607 -209478 -123364 -144759 -125805 -115245 -257324 -281243 -312336 -216159 -114705
7217 -114705 -77992 -237758 -283453 -198051 -266707 -261819 -212425 -254548 -154210 -183846 -93632
7206 -93632 -86091 -195120 -287030 -291880 -228084 -67549 -55608 -66769 -255086 -273655 -226365 -167295
$$ packed form
7283g7805j28239P6662p7102N088l6774k0574J04106j19460M3003O9811J13683
7272d7601J629j06534N1432j11587J14631M3249J03737k08948M761L2698j3508
7261a36041m4206M5239J17796l3249m8254r9077k7517J18296M591j45876P8376
7250a69922j57409J7570N5100l2926J8941N9927K7105J65826o7737k60811R020
7239c35316R3876q0783j40331J99032P9509Q4102m4747q1807m0424M4169N2484
7228a70236N8629r7871Q6114k1395J8954J0560j42079k3919l1093R6177J01454
7217a14705L6713j59766m5695Q5402o8656M888M9394m2123J00338k9636R0214
7206i3632P541j09029r1910m850O3796J60535J1941j1161j88317j8569M7290N9070
$$ plain form
7194 -167295 41202 -130264 -166785 -198797 -379893 -405441 -248959 -122686 4471 -189298
7184 -189298 -287737 -182221 -213376 -198876 -282589 -235850 -220835 -223963 -350294 -261138 -228694
7173 -228694 -233194 -174246 -96387 -12939 -22740 -184867 -183161 -188236 -134903 -157247 -182063 -276161
7161 -276161 -370989 -339456 -279914 -233135 -197443 -159264 -211219 -193228 -295557 -400578 -217460
7150 -217460 -203668 -227049 -229375 -330069 -261997 -287903 -382228 -381479 -263952 -261681 -342091 -282630
7138 -282630 -119685 -157729 -131632 -219110 -143160 -236656 -255086 -262257 -149308 -130430 78771
7127 78771 -204 -18795 -107711 -181745 -228774 -95841 -82071 -138016 -151892 -152192 -169058 -221737
7115 -221737 -188378 -149763 -154386 -216226 -135761 -160090 -207851 -173754 -114328 -222589 -119035
$$ packed form
7194a67295K08497j71466l6521l2012j81096k5548J56482J26273J27157j93769
7184a89298r8439J05516l1155J4500q3713M6739J5015l128j26331Q9156L2444
7173b28694m500N8948P7859Q3448r801j62127J706n075N3333k2344k4816r4098
7161b76161r4828L1533N9542M6779L5692L8179n1955J7991j02329j05021J83118
7150b17460J3792k3381k326j00694O8072k5906r4325P49J17527K271q0410N9461
7138b82630J62945l8044K6097q7478P5950r3496j8430p171J12949J8878K09201
7127G8771p8975j8591q8916p4034m7029J32933J3770n5945j3876l00j6866n2679
7115b21737L3359L8615m623o1840Q0465k4329m7761L4097N9426j08261J03554
$$ plain form
7104 -119035 -262376 -272571 -142830 -35844 -160935 -254100 -214640 -106245 -24278 -116489 -88127
7093 -88127 63829 -52783 -27134 -42089 -53466 22094 13952 -25886 -32931 -156300 -230706 -135874
7081 -135874 -298917 -305236 -141402 -101369 5716 19771 -75678 -254585 -418228 -97084 90347
7070 90347 11344 -126688 -336945 -351165 -234282 -217396 -102444 -36567 36992 -89235 -148982
7059 -148982 -32225 -206788 -134588 -152144 -90880 -200678 -232017 -121152 -159998 -193423 -97387
7048 -97387 -157224 -242438 -141948 23927 82751 12541 -230342 -234302 -135104 -109090 -198421
7037 -198421 -179487 -258554 -236969 -129286 -123981 -88339 51344 -100349 -237743 -382553 -401798
7026 -401798 -151735 -94523 -219760 -295778 -167118 -93627 -28257 -94183 -234171 -161548 -58512
$$ packed form
7104a19035j43341j0195J29741J06986j25091r3165L9460J08395Q1967r2211K8362
7093h8127J51956j16612K5649j4955j1377P5560q142l9838p045j23369p4406R4832
7081a35874j63043o319J63834M0033J07085J4055r5449j78907j63643L21144J87431
7070I0347p9003j38032k10257j4220J16883J6886J14952O5877P3559j26227n9747
7059a48982J16757j74563P2200j7556O1264j09798l1339J10865l8846l3425R6036
7048i7387n9837q5214J00490J65875N8824p0210k42883l960R9198K6014q9331
7037a98421J8934p9067K1585J07683N305L5642J39683j51693j37394j44810j9245
7026d01798K50063N7212j25237p6018J28660P3491O5370o5926j39988P2623J03036
$$ plain form
7015 -58512 -160792 -39737 -127325 -223347 -211154 -119459 -208907 -114124 -98705 -62903 -109255
7004 -109255 -91617 -211341 -261560 -258398 -260038 -382789 -332854 -190680 -75534 78799 -27930
6993 -27930 -9271 -27305 43836 -81769 -133166 -113754 -24733 -85985 -174498 -36687 -48373
6982 -48373 5064 109439 -53178 -99279 50140 71367 -23377 -182434 -134426 -40003 28531
6971 28531 11496 53460 -12894 -102337 -113973 -112342 -88115 14263 -47260 21354 -68556 -61341
6959 -61341 -109799 -129994 -60398 -88396 41666 23455 18783 -139488 2748 145173 85960
6948 85960 14345 66243 170431 115196 -68706 -127252 -31022 24491 56675 488 -105136
6937 -105136 -31216 -84235 -161764 -30602 -60795 -39121 -158130 -157841 -24620 -151754 -154523
$$ packed form
7015e8512j02280J21055q7588r6022J2193R1695q9448R4783J5419L5802m6352
7004a09255J7638j19724n0219L162j640j22751M9935J42174J15146J54333j06729
6993b7930J8659j8034P1141j25605n1397J9412Q9021o1252q8513J37811j1686
6982d8373N3437J04375j62617m6101J49419K1227r4744j59057M8008R4423O8534
6971B8531j7035M1964o6354q9443j1636J631K4227J02378o1523O8614q9910P215
6959f1341m8458k0195O9596k7998J30062j8211m672j58271J42236J42425n9213
6948H5960p1615N1898J04188n5235j83902n8546R6230N5513L2184n6187j05624
6937a05136P3920n3019p7529J31162l0193K1674j19009K89J33221j27134k769
$$ plain form
6926 -154523 -98675 -32327 -21825 -50896 -32995 83401 3798 -66549 -110552 -7613 -13194
6915 -13194 62996 -107111 -106631 -174664 -189859 -187419 -203479 -121366 -179633 -69231 -166335 -142667
6903 -142667 -59652 -110213 -139926 -154181 -57722 42633 104886 141544 82679 121567 72695
6892 72695 11805 -1335 -59061 -89225 -24414 -14687 -60880 -87275 156202 276238 158718
6881 158718 33462 -102958 -130834 -138422 26527 -34115 -47186 -58924 -92108 -59892 -29668
6870 -29668 9503 -71569 38179 -5072 -19350 -27977 48561 -12636 22013 -108735 -36589 -14631
6858 -14631 -109191 -198527 -73840 43545 44325 115715 136746 -21044 -115370 -82537 -110217 -80785
6846 -80785 41 -46789 115142 -4434 -195678 1839 -17713 155435 52495 86557 110787
$$ packed form
6926a54523N5848O6348J0502k9071J7901J16396p9603p0347m4003J02939n581
6915a3194P6190j70107M80o8033j5195K440j6060Q2113n8267J10402r7104K3668
6903a42667Q3015n0561k9713j4255R6459J00355O2253L6658n8865L8888m8872
6892G2695o0890j3140n7726l0164O4811R727m6193k6395K43477J20036j17520
6881A58718j25256j36420k7876p588J64949o0642j3071j1738l3184L2216L0224
6870b9668L9171q1072J09748m3251j4278q627P6538o1197L4649j30748P2146K1958
6858a4631r4560q9336J24687J17385P80P1390K1031j57790r4326L2833k7680K9432
6846h0785Q0826m6830J61931j19576j91244J97517j9552J73148j02940L4062K4230
$$ plain form
6835 110787 87298 52465 -2751 -28486 119010 -84690 -178058 -109741 -121692 3076 126506
6824 126506 148683 23511 -30204 33352 34310 42018 101721 48647 -70689 -75302 -125128 345
6812 345 -30184 -74157 96592 -89152 -152587 33143 101522 14152 -18548 49482 99703 -23705
6800 -23705 -71706 -114075 -112611 -262034 -231660 -173369 -102535 44719 17001 104358 93835 -103363
6788 -103363 -26975 100499 -115141 -19677 45643 -25270 82505 163393 170599 66858 -110978
6777 -110978 -24565 112845 2438 -79299 -53802 -1823 -103293 -169635 -175031 -106766 56585
6766 56585 111090 -94063 -76510 20772 -1006 -42881 64090 231492 265950 174488 108113
6755 108113 55812 74828 25663 -69386 62569 -7994 -24063 -153656 -102041 63238 43752
$$ packed form
6835A10787k3489l4833n5216k5735J47496k03700r3368O8317j1951J24768J23430
6824A26506K2177j25172n3715O3556R58P708N9703n3074j19336m613m9826J25473
6812C45l0529m3973J70749j85744o3435J85730O8379q7370l2700O8030N0221j23408
6800b3705m8001m2369J464j49423L0374N8291P0834J47254k7718Q7357j0523j97198
6788a03363P6388J27474k15640R5464O5320p0913J07775Q0888P206j03741j77836
6777a10978Q6413J37410j10407q1737K5497N1979j01470o6342n396O8265J63351
6766E6585N4505k05153J7553R7282k1778m1875J06971J67402L4458r1462o6375
6755A08113n2301J9016m9165r5049J31955p0563j6069j29593N1615J65279j9486
$$ plain form
6744 43752 81143 221208 67793 -115828 -115912 90392 -907 -36268 126936 49942 76448
6733 76448 42471 -4670 -42467 -56812 33328 225599 242833 333095 303056 385961 279147
6722 279147 203815 168685 156299 28679 -107747 -108942 67196 148428 124701 166479 99222
6711 99222 -28571 -1305 94597 207712 262035 295578 356338 302975 349019 286448 403203
6700 403203 466505 396030 316426 404142 114399 52151 135959 101144 134126 255181 244104
6689 244104 326183 227494 320221 394952 261722 131663 149821 250222 241198 326091 479549
6678 479549 430171 275408 355223 302240 339460 364746 356841 402091 355387 343344 293234 247651
6666 247651 337993 434190 373260 309203 296350 345816 446906 435499 387472 385255 397215 307045
$$ packed form
6744D3752L7391J40065j53415j83621q4K06304r1299l5361J63204p6994K6506
6733G6448l3977m7141l7797j4345R0140J92271J7234R0262l0039Q2905j06814
6722B79147p5332l5130j2386j27620j36426j195J76138Q1232k3727M1778o7257
6711I9222j27793K7266R5902J13115N4323L3543O0760n3363M6044o2571J16755
6700D03203O3302p0475p9604Q7716k89743o2248Q3808l4815L2982J21055j1077
6689B44104Q2079r8689R2727P4731j33230j30059J8158J00401r024Q4893J53458
6678D79549m9378j54763P9815n2983L7220K5286p905M5250m6704j2043n0110m5583
6666B47651R0342R6197o0930o4057j2853M9466J01090j1407m8027k217J1960r0170
$$ plain form
6654 307045 410054 393627 419327 534905 575515 445050 389854 358844 473088 599277 636572
6643 636572 577588 605690 515474 428209 463208 507051 431995 509424 560741 491291 493381 513133
6631 513133 570237 588938 687004 809223 806426 749260 565172 594292 898380 850664 868006
6620 868006 794877 757424 868262 885437 980134 869986 869196 917916 927872 881170 1084203 1257423
6608 1257423 1164409 1110462 1120085 1249284 1380524 1382529 1459468 1353957 1363851 1458114 1629080
6597 1629080 1649437 1541343 1594991 1682098 1741193 1879254 1962165 1845529 1910449 2008876 2138195
6586 2138195 2199886 2449145 2496049 2431999 2345387 2521967 2539098 2502697 2681598 2673196 2817691
6575 2817691 2978303 2884942 3164550 3450166 3555337 3523941 3704864 3867522 4052306 4125049
$$ packed form
6654C07045J03009j6427K5700J15578M0610j30465n5196l1010J14244J26189L7295
6643F36572n8984K8102r0216q7265L4999M3843p5056P7429N1317o9450K090J9752
6631E13133N7104J8701R8066J22219k797n7166j84088K9120L04088m7716J7342
6620H68006p3129l7453J10838J7175R4697j10148p90M8720R956m6702K03033J73220
6608A257423r3014n3947R623J29199J31240K005P6939j05511R894R4263J70966
6597A629080K0357j08094N3648Q7107N9095J38061Q2911j16636O4920R8427J29319
6586B138195O1691K49259M6904o4050q6612J76580J7131l6401J78901q402J44495
6575B817691J60612r3361K79608K85616J05171l1396J80923J62658J84784P2743
$$ plain form
6565 4125049 4372892 4498873 4524745 4687251 4807723 5126517 5429420 5704903 5852186 6045439
6555 6045439 6455712 6854837 7214341 7483083 7705230 7971450 8318768 8646430 8898287 9289382
6545 9289382 9833585 10102294 10424928 10804092 10974742 11404172 11829053 12271508 12745231 13300601
6535 13300601 13870782 14531797 15320781 16278232 17322551 18261237 19186377 20319912 21652071
6526 21652071 23111222 24533400 25735132 26922126 27527907 27587964 27109108 25996105 24486838
6517 24486838 22995192 21495563 20098856 18769415 17449329 16160981 14931566 13994043
6509 13994043 12870733 11917901 11154725 10592518 10100770 9397737 8786879 8310693 7730258
6500 7730258 7430860 7047025 6734178 6385214 6016737 5822326 5591339 5316085 5121399 4884537
$$ packed form
6565D125049K47843J25981K5872J62506J20472L18794L02903K75483J47283J93253
6555F045439M10273L99125L59504K68742K22147K66220L47318L27662K51857L91095
6545I289382N44203K68709L22634L79164J70650M29430M24881M42455M73723N55370
6535A3300601N70181O61015P88984R57451J044319R38686R25140J133535J332159
6526B1652071J459151J422178J201732J186994O05781O0057m78856j113003j509267
6517B4486838j491646j499629j396707j329441j320086j288348j229415r37523
6509A3994043j123310r52832p63176n62207m91748p03033o10858m76186n80435
6500G730258k99398l83835l12847l48964l68477j94411k30987k75254j94686k36862
$$ plain form
6490 4884537 4679975 4463968 4277276 4151088 4144405 4219603 3891475 3767036 3813577 3540362
6480 3540362 3408790 3337900 3191105 3105934 3055783 2706482 2636137 2681405 2695683 2614436 2551021
6469 2551021 2493436 2356844 2319049 2266038 2062872 2005619 2000473 2008000 1920723 1832326 1836328 1723239
6457 1723239 1748872 1808805 1856296 1818025 1824408 1642915 1476865 1539523 1586582 1554103 1497380
6446 1497380 1383211 1354476 1108570 1110282 1081749 1224021 1259365 1129129 988028 1004304 919584
6435 919584 963532 1336905 1273999 1148681 1031152 933365 895060 878724 918258 982551 941541
6424 941541 897791 819973 899017 905736 938808 850441 807967 713373 695498 769464 710972 639007
6412 639007 675493 689447 545845 541848 592174 607269 637586 844463 780449 659503 632638
$$ packed form
6490D884537k04562k16007j86692j26188o683P5198l28128j24439M6541k73215
6480C540362j31572p0890j46795q5171n0151l49301p0345M5268J4278q1247o3415
6469B551021n7585j36592l7795n3011k03166n7253n146P527q7277q8397M002j13089
6457A723239K5633N9933M7491l8271O383j81493j66050O2658M7059l2479n6723
6446A497380j14169k8735k45906J712k8533J42272L5344j30236j41101J6276q4720
6435I19584M3948L73373o2906j25318j17529r7787l8305j6336L9534O4293m1010
6424I41541m3750p7818P9044O719L3072q8367m2474r4594j7875P3966n8492p1965
6412F39007L6486J3954j43602l997N0326J5095L0317K06877o4014j20946k6865
$$ plain form
6401 632638 571882 474096 532135 555148 523969 648907 561144 491242 465111 487050 559645
6390 559645 552520 654061 626231 593675 556155 607682 703074 568068 595887 634976 610883
6379 610883 635062 511945 571067 725445 747864 674571 603462 505409 495809 459373 545370
6368 545370 539505 379098 412951 498945 448102 462529 589182 497072 347931 313157 331441
6357 331441 362536 358168 466589 403079 366085 416223 443632 414046 161842 197122 228720
6346 228720 242798 338663 324953 349303 374579 390911 386106 332171 179032 251665 179171 115838
6334 115838 207505 378421 561719 483749 421031 481079 459350 253310 222043 266653 442824
6323 442824 457717 464043 381983 232129 203138 284850 377216 368980 266516 290180 222535 255397
$$ packed form
6401F32638o0756r7786N8039K3013l1179J24938q7763o9902k6131K1939P2595
6390E59645p125J01541k7830l2556l7520N1527R5392j35006K7819L9089k4093
6379F10883K4179j23117N9122J54378K2419p3293p1109r8053r600l6436Q5997
6368E45370n865j60407L3853Q5994n0843J4427J26653r2110j49141l4774J8284
6357C31441L1095m368J08421o3510l6994N0138K7409k9586k52204L5280L1598
6346B28720J4078R5865j3710K4350K5276J6332m805n3935j53139P2633p2494o3333
6334A15838R1667J70916J83298p7970o2718O0048k1729k06040l1267M4610J76171
6323D42824J4893O326q2060j49854k8991Q1712R2366q236j02464K3664o7645L2862
$$ plain form
6311 255397 346131 340208 297237 358111 359365 366408 406976 350579 286456 290509 278057 105942
6299 105942 148508 268385 387540 447052 478537 475297 347758 312046 337350 288309 277396
6288 277396 259650 225238 172054 78276 59489 127541 232887 188788 152888 220236 260209
6277 260209 342515 245908 298328 375192 312710 156504 234146 293967 406049 253052 150320
6266 150320 269355 335160 338536 246109 242167 234568 196350 110796 253557 355897 467807
6255 467807 361492 281364 135666 171007 84467 141686 287458 221665 266003 102411 113863
6244 113863 152068 202823 139234 -30593 64864 90573 60480 167494 124746 157100 116767
6233 116767 130400 118116 212407 357579 287601 302764 323539 372413 343175 155486 139931
$$ packed form
6311B55397R0734n923m2971O0874J254P043M0568n6397o4123M053j2452j72115
6299A05942M2566J19877J19155N9512L1485l240j27539l5712K5304m9041j0913
6288B77396j7746l4412n3184r3778j8787O8052J05346m4099l5900O7348L9973
6277B60209Q2306r6607N2420P6864o2482j56206P7642N9821J12082j52997j02732
6266A50320J19035O5805L376r2427l942p599l8218q5554J42761J02340J11910
6255D67807j06315q0128j45698L5341q6540N7219J45772o5793M4338j63592J1452
6244A13863L8205N0755o3589j69827R5457K5709l0093J07014m2748L2354m0333
6233A16767J3633j2284R4291J45172o9978J5163K0775M8874k9238j87689j5555
$$ plain form
6222 139931 142014 187594 183580 222881 253098 246335 278799 252284 346746 190759 127826 79387
6210 79387 40505 110053 247437 149639 103413 81777 145367 155786 133184 232171 452781
6199 452781 339475 182061 118822 191906 207604 198058 332809 327106 283715 306657 325394
6188 325394 238927 192073 251912 204556 89331 130656 120215 181901 160671 269871 354197
6177 354197 277565 63304 25585 137676 181081 46621 44919 121844 159149 54092 272643
6166 272643 427193 370070 255280 177169 132606 171252 209803 185374 129114 123894 282227
6155 282227 328589 304269 308876 255884 173470 204824 228203 162136 230344 120270 63656 225358
6143 225358 227560 362948 321400 254202 321723 334917 394178 367761 404441 331933 128534
$$ packed form
6222A39931K083M5580m014L9301L0217o763L2464k6515R4462j55987o2933m8439
6210G9387l8882O9548J37384r7798m6226k1636O3590J0419k2602R8987K20610
6199D52781j13306j57414o3239P3084J5698r546J34751n703m3391K2942J8737
6188C25394q6467m6854N9839m7356j15225M1325j0441O1686k1230J09200Q4326
6177C54197p6632k14261l7719J12091M3405j34460j702P6925L7305j05057K18551
6166B72643J54550n7123j14790p8111m4563L8646L8551k4429n6260n220J58333
6155B82227M6362k4320M607n2992q2414L1354K3379o6067O8208j10074n6614J61702
6143B25358K202J35388m1548o7198O7521J3194N9261k6417L6680p2508k03399
$$ plain form
6132 128534 112612 277608 262501 263551 220392 342522 334766 241217 223971 264095 250238 172986
6120 172986 332728 285413 324040 315819 446389 331889 325258 447411 424249 441392 420095
6109 420095 337612 325753 501796 407051 216880 272641 390526 445370 455430 350151 424111
6098 424111 385747 414025 428876 344168 278978 240099 362227 315374 396363 452235 426583
6087 426583 415465 505589 506199 336174 408561 444844 461401 490152 416680 371812 367848 403841
6075 403841 262074 74615 301377 338059 131177 430240 363286 299385 170527 215545
6065 215545 277979 166895 238292 407858 403299 349798 303270 237346 179120 172513 319062
6054 319062 492775 353263 347757 311865 337069 230233 299788 311080 152592 207855 301366
$$ packed form
6132A28534j5922J64996j5107J050m3159J22130p756r3549j7246M0124j3857p7252
6120A72986J59742m7315L8627q221J30570j14500o631J22153k3162J7143k1297
6109D20095q2483j1859J76043r4745j90171N5761J17885N4844J0060j05279P3960
6098D24111l8364K8278J4851q4708o5190l8879J22128m6853Q0989N5872k5652
6087D26583j1118R0124O10j70025P2387L6283J6557K8751p3472m4868l964L5993
6075D03841j41767j87459K26762L6682k06882K99063o6954o3901j28858M5018
6065B15545O2434j11084P1397J69566m559n3501m6528o5924n8226o607J46549
6054C19062J73713j39512n506l5892K5204j06836O9555J1292j58488N5263R3511
$$ plain form
6043 301366 263452 460241 384699 234140 311399 271639 194631 141203 244468 213397 374215
6032 374215 388029 395892 183120 275738 513874 530684 330957 296081 177162 204622 219124
6021 219124 294284 375716 398798 226181 255467 208534 184182 179299 277519 278813 210265 155852
6009 155852 229573 260120 132199 152133 173778 234371 281355 381332 332143 179623 129004
5998 129004 222503 164208 101452 166691 201943 233766 313291 415558 479445 550251 482382
5987 482382 382600 338443 303364 378589 446501 554475 527020 370237 268945 238001 281963
5976 281963 292566 379859 254999 184581 313309 400208 370754 245505 192290 163740 267099
5965 267099 363996 384250 298249 403194 527651 500077 440881 329829 410377 642861 554248
$$ packed form
6043C01366l7914J96789p5542j50559P7259l9760p7008n3428J03265l1071J60818
6032C74215J3814P863k12772R2618K38136J6810j99727l4876j18919K7460J4502
6021B19124P5160Q1432K3082j72617K9286m6933k4352m883R8220J294o8548n4413
6009A55852P3721L0547j27921J9934K1645O0593M6984R9977m9189j52520n0619
5998A29004R3499n8295o2756O5239L5252L1823P9525J02267O3887P0806o7869
5987D82382r9782m4157l5079P5225O7912J07974k7455j56783j01292l0944M3962
5976B81963J0603Q7293j24860p0418J28728Q6899k9454j25249n3215k8550J03359
5965B67099R6897K0254q6001J04945J24457k7574n9196j11052Q0548K32484q8613
$$ plain form
5954 554248 395165 479966 560942 360725 415182 337486 374876 406527 334574 363372 365460
5943 365460 420239 431637 474972 417120 454053 368044 323763 204856 162298 309490 371806
5932 371806 505063 353378 251166 384234 388442 337333 477258 446052 446566 369378 485623
5921 485623 470514 500908 394577 278550 384572 416771 560428 570155 378038 416559 550109
5910 550109 574743 617439 572023 526945 503069 471514 450861 493225 467901 474671 432409 361801
5898 361801 378111 400790 461809 300612 245136 374703 225204 296570 576516 529814 449831
5887 449831 515645 370847 415523 401961 452930 435093 482406 487405 340558 236782 410355
5876 410355 444665 427795 454243 452173 458607 486383 603937 572193 593050 627971 641562 464581
$$ packed form
5954E54248j59083Q4801Q0976k00217N4457p7696L7390L1651p1953K8798K088
5943C65460N4779J1398M3335n7852L6933q6009m4281j18907m2558J47192O2316
5932C71806J33257j51685j02212J33068M208n1109J39925l1206N14p7188J16245
5921D85623j5109L0394j06331j16027J06022L2199J43657R727j92117L8521J33550
5910E50109K4634M2696m5416m5078k3876l1555k0653M2364k5324O770m2262p0608
5898C61801J6310K2679O1019j61197n5476J29567j49499P1366K79946m6702p9983
5887D49831O5814j44798M4676j3562N0969j7837M7313M999j46847j03776J73573
5876D10355L4310j6870K6448k070O434K7776J17554l1744K0857L4921J3591j76981
$$ plain form
5864 464581 458402 462674 365384 326099 365095 426968 476099 437809 546322 538115 502347 554942
5852 554942 487023 509787 454470 474145 506196 631469 540124 584687 579991 639597 603305 502471
5840 502471 463856 448734 498204 593573 615199 598765 538892 504446 475246 509407 443458 371635
5828 371635 302247 262139 382757 326347 417956 477101 642649 520331 495076 508551 533757
5817 533757 513943 478714 688421 493093 355883 454305 617839 649330 702236 739280 626645
5806 626645 651611 577814 510147 405108 431298 622645 665859 530317 599611 673138 675507
5795 675507 544687 623188 680024 605099 536158 457949 580832 613145 555288 630509 571845
5784 571845 551038 554991 536615 640057 697906 721823 668143 720803 611752 651340 596459
$$ packed form
5864D64581o179M272r7290l9285L8996O1873M9131l8290J08513q207l5768N2595
5852E54942o7919K2764n5317J9675L2051J25273r1345M4563m696N9606l6292j00834
5840E02471l8615j5122M9470R5369K1626j6434n9873l4446k9200L4161o5949p1823
5828C71635o9388m0108J20618n6410R1609N9145J65548j22318k5255J3475K5206
5817E33757j9814l5229K09707j95328j37210R8422J63534L1491N2906L7044j12635
5806F26645K4966p3797o7667j05039K6190J91347M3214j35542O9294P3527K369
5795F75507j30820P8501N6836p4925o8941p8209J22883L2313n7857P5221n8664
5784E71845k0807L953j8376J03442N7849K3917n3680N2660j09051L9588n4881
$$ plain form
5773 596459 482131 671836 697140 616280 626559 690023 652567 683160 658590 596603 642877
5762 642877 562195 608358 687013 587087 646063 631586 675815 617393 574732 660936 609588 738094
5750 738094 771047 707669 741592 683574 653794 544311 545479 532107 389713 577099 706759
5739 706759 676748 737363 719935 709211 549867 594124 430975 577203 685730 664104 725541
5728 725541 574306 706057 769687 815757 727309 694260 627358 667571 655912 663179 816169
5717 816169 785719 650364 791762 666944 692230 632251 623876 644414 564262 576896 574943
5706 574943 561160 642092 715038 668213 782755 801379 859696 813021 727600 702255 775552
5695 775552 791352 739340 783491 788900 678391 652077 717520 672970 714376 705794 791922 733343
$$ packed form
5773E96459j14328J89705K5304q0860J0279O3464l7456L0593k4570o1987M6274
5762F42877q0682M6163P8655r9926N8976j4477M4229n8422m2661Q6204n1348J28506
5750G38094L2953o3378L3923n8018k9780j09483J168j3372j42394J87386J29660
5739G06759l0011O0615j7428j0724j59344M4257j63149J46228J08527k1626O1437
5728G25541j51235J31751O3630M6070q8448l3049o6902M0213j1659P267J52990
5717H16169l0450j35355J41398j24818K5286n9979q375K0538q0152J2634j953
5706E74943j3783Q0932P2946m6825J14542J8624N8317m6675q5421k5345P3297
5695G75552J5800n2012M4151N409j10509k6314O5443m4550M1406q582Q6128n8579
$$ plain form
5683 733343 712479 734084 723877 811974 858685 896736 804259 675699 701984 763033 692927
5672 692927 764706 785510 749469 681650 761110 653002 758644 764656 819883 903161 881931
5661 881931 816819 704895 693372 630190 860929 893257 824704 815523 846955 880538 906529
5650 906529 825748 710156 707218 769359 775266 825679 996642 934822 874375 994774 909450
5639 909450 725489 609631 789262 765317 786470 898438 918372 989400 998580 923263 862381
5628 862381 910347 952071 909597 916772 901899 947947 996689 1043239 997879 964931 991099 918151
5616 918151 875930 771645 834492 913905 928630 962996 966797 959166 993290 1000668 987059 863778
5604 863778 907414 1004959 1039621 978056 972181 1071242 1060309 1089259 1097377 920398 1054953 1166520
$$ packed form
5683G33343k0864K1605j0207Q8097M6711L8051r2477j28560K6285O1049p0106
5672F92927P1779K0804l6041o7819P9460j08108J05642O012N5227Q3278k1230
5661H81931o5112j11924j1523o3182K30739L2328o8553r181L1432L3583K5991
5650I06529q0781j15592k938O2141N907N0413J70963o1820o0447J20399q5324
5639I09450j83961j15858J79631k3945K1153J11968J9934P1028R180p5317o0882
5628H62381M7966M1724m2474P175j4873M6048M8742M6550m5360l2948K6168p2948
5616I18151m2221j04285O2847P9413J4725L4366L801p631L4124P378j3609j23281
5604H63778M3636R7545L4662o1565n875R9061j0933K8950Q118j76979J34555J11567
$$ plain form
5592 1166520 1029554 967205 1169536 1134793 1082742 1194895 1177820 959251 1024135 1138723
5582 1138723 1100745 1079455 1124325 1021600 1177395 1248359 1016056 922211 1068058 1167178 1184418
5571 1184418 1299603 1238631 1306231 1193113 1190550 1060348 1088536 1149103 1192270 1134643 1084155
5560 1084155 1077790 1131575 1086898 1050051 1161662 1239125 1301264 1165083 1239283 1296407 1289928
5549 1289928 1165718 1080097 978772 1100432 1103754 1111290 1172849 1148903 1041652 1156835 1303460
5538 1303460 1246187 1335243 1395240 1327427 1287113 1297188 1186261 1325893 1229006 1157868 1159906
5527 1159906 1220515 1211253 1241505 1216810 1284514 1158880 1153810 1228671 1333310 1358901 1317319
5516 1317319 1372106 1418888 1386784 1418098 1460930 1358135 1281083 1325384 1238946 1354844 1464274
$$ packed form
5592A166520j36966o2349K02331l4743n2051J12153j7075k18569O4884J14588
5582A138723l7978k1290M4870j02725J55795P0964k32303r3845J45847R9120J7240
5571A184418J15185o0972O7600j13118k563j30202K8188O0567M3167n7627n0488
5560A084155o365N3785m4677l6847J11611P7463O2139j36181P4200N7124o479
5549A289928j24210q5621j01325J21660L322P536O1559k3946j07251J15183J46625
5538A303460n7273Q9056N9997o7813m0314J0075j10927J39632r6887p1138K038
5527A159906O0609r262L0252k4695O7704j25634n070P4861J04639K5591m1582
5516A317319N4787M6782l2104L1314M2832j02795p7052M4301q6438J15898J09430
$$ plain form
5505 1464274 1434374 1413010 1304102 1444634 1424688 1406186 1422494 1465581 1496779 1458263 1366253
5494 1366253 1370645 1449826 1499668 1377475 1365593 1360791 1524246 1555934 1493327 1638553 1578487
5483 1578487 1589414 1694974 1647698 1594825 1401182 1499429 1551693 1474338 1724018 1721682 1665376
5472 1665376 1715841 1648249 1684602 1672328 1562086 1574681 1551461 1559420 1616791 1683019 1807973
5461 1807973 1715776 1702658 1683044 1675312 1747148 1739500 1809787 1823787 1828619 1731852 1606005 1768808
5449 1768808 1824767 1746263 1674251 1581308 1662704 1778248 1813572 1781392 1790082 1804781 1729846
5438 1729846 1774006 1782928 1787374 1825872 1878983 1931056 1836537 1887948 1923455 1823441 1785348 1927626
5426 1927626 2011205 2014597 1980154 1992558 1981211 2023186 2101495 2094007 2131826 2196605 2152072 2141496
$$ packed form
5505A464274k9900k1364j08908J40532j9946j8502J6308M3087L1198l8516r2010
5494A366253M392P9181M9842j22193j1882m802J63455L1688o2607J45226o0066
5483A578487J0927J05560m7276n2873j93643R8247N2264p7355K49680k336n6306
5472A665376N0465o7592L6353j2274j10242J2595k3220P959N7371O6228J24954
5461A807973r2197j3118j9614p732P1836p648P0287J4000M832r6767j25847J62803
5449A768808N5959p8504p2012r2943Q1396J15544L5324l2180Q690J4699p4935
5438A729846M4160Q922M446L8498N3111N2073r4519N1411L5507j00014l8093J42278
5426A927626Q3579L392l4443J2404j1347M1975P8309p488L7819O4779m4533j0576
$$ plain form
5414 2141496 2096211 1995363 2040213 2088846 2109016 2162250 2055765 2189671 2124037 2085496 2214161
5403 2214161 2291241 2277142 2227814 2285439 2322110 2383787 2305729 2330537 2256916 2401121 2418012
5392 2418012 2471588 2363326 2451297 2399039 2277726 2335071 2392762 2412725 2427929 2402109 2469690
5381 2469690 2372911 2483105 2629918 2574102 2585219 2658078 2771093 2701988 2722613 2827396 2766129
5370 2766129 2729915 2850598 2916583 2889373 2772635 2679095 2774103 2998797 3078986 3068713 2927290
5359 2927290 2849016 2814994 3031748 3072238 3141121 3207843 3225676 3110688 3165585 3245873 3209789
5348 3209789 3205319 3269107 3286992 3266560 3377210 3422707 3297135 3311322 3407686 3414630 3452032
5337 3452032 3650924 3808627 3810505 3795950 3762112 3702049 3834083 3858670 3787722 3837742 3961502
$$ packed form
5414B141496m5285j00848M4850M8633K0170N3234j06485J33906o5634l8541J28665
5403B214161P7080j4099m9328N7625L6671O1677p8058K4808p3621J44205J6891
5392B418012N3576j08262Q7971n2258j21313N7345N7691J9963J5204k5820O7581
5381B469690r6779J10194J46813n5816J1117P2859J13015o9105K0625J04783o1267
5370B766129l6214J20683O5985k7210j16738r3540R5008K24694Q0189j0273j41423
5359B927290p8274l4022K16754M0490O8883O6722J7833j14988N4897Q0288l6084
5348C209789m470O3788J7885k0432J10650M5497j25572J4187R6364O944L7402
5337C452032J98892J57703J878j4555l3838o0063J32034K4587p0948N0020J23760
$$ plain form
5326 3961502 3929551 3968281 3904719 3994002 4124848 4102788 4129641 4105487 4172597 4261225 4293530
5315 4293530 4402571 4426017 4487648 4482630 4580074 4769463 4803286 4899812 4891949 4760297 4732613
5304 4732613 4993275 5158237 5044259 5004851 5063292 5069977 5216803 5129463 5150366 5291373 5574011
5293 5574011 5489017 5490297 5594498 5598252 5685429 5735756 5815421 5984009 5874553 5879292 5971855
5282 5971855 5991516 6025412 6155603 6180402 6277488 6204805 6127728 6263391 6312057 6554024 6531248
5271 6531248 6510438 6644876 6798001 6890344 6822788 6781255 6836798 6722248 6907771 7012344
5261 7012344 6981088 6998017 7102286 7244021 7323216 7248860 7234823 7442106 7502349 7491611 7508906
5250 7508906 7579154 7489928 7474023 7557320 7570549 7471281 7504935 7550982 7792363 7811881 7765346
$$ packed form
5326C961502l1951L8730o3562Q9283J30846k2060K6853k4154O7110Q8628L2305
5315D293530J09041K3446O1631n018R7444J89389L3823R6526p863j31652k7684
5304D732613K60662J64962j13978l9408N8441O685J46826q7340K0903J41007K82638
5293E574011q4994J280J04201L754Q7177N0327P9665J68588j09456M739R2563
5282E971855J9661L3896J30191K4799R7086p2683p7077J35663M8666K41967k2776
5271F531248k0810J34438J53125R2343o7556m1533N5543j14550J85523J04573
5261G012344l1256J6929J04269J41735P9195p4356j4037K07283O0243j0738J7295
5250G508906P0248q9226j5905Q3297J3229r9268L3654M6047K41381J9518m6535
$$ plain form
5239 7765346 7902949 7819180 7850526 7874041 7855815 7912996 8015260 8002550 8099388 8080436 8207732
5228 8207732 8224621 8121391 8116694 8233570 8349598 8297954 8191282 8287714 8323789 8278777 8331257
5217 8331257 8262528 8322963 8511846 8585514 8627833 8574403 8481754 8447776 8481256 8525502 8619660
5206 8619660 8624503 8487328 8634320 8661717 8749333 8755886 8754125 8931346 8949125 8802925 8741472
5195 8741472 8789294 8752933 8867440 9008668 8848536 8866645 9050624 9112403 9172382 9212551 9175882
5184 9175882 9204702 9125102 9099653 9264111 9380773 9374319 9416936 9595954 9723195 9723858 9618823
5173 9618823 9766248 9831366 9748289 9748638 9818489 9853807 9998000 10163516 10169698 10184023 10185243 10204459
5161 10204459 10166231 10382755 10446462 10499690 10575961 10654047 10736015 10835616 10880856 10998835 11160456
$$ packed form
5239G765346J37603q3769L1346K3515j8226N7181J02264j2710R6838j8952J27296
5228H207732J6889j03230m697J16876J16028n1644j06672R6432L6075m5012N2480
5217H331257o8729O0435J88883P3668M2319n3430r2649l3978L3480M4246R4158
5206H619660M843j37175J46992K7397Q7616O553j761J77221J7779j46200o1453
5195H741472M7822l6361J14507J41228j60132J8109J83979O1779N9979M0169l6669
5184I175882K8820p9600k5449J64458J16662o454M2617J79018J27241O63j05035
5173I618823J47425O5118q3077L49O9851L5318J44193J65516O182J4325J220J9216
5161A0204459l8228K16524O3707N3228P6271P8086Q1968R9601M5240J17979J61621
$$ plain form
5150 11160456 11195353 11312416 11376025 11603686 11672596 11789287 11857448 11841899 11908486 12017883
5140 12017883 12216629 12629298 12740787 12749812 12945593 13184092 13413017 13452130 13549596 13711541
5130 13711541 13793888 13852719 14114384 14432650 14727342 14910877 15136934 15186169 15349232 15682234
5120 15682234 15822135 16092355 16465218 16587018 16749714 17008267 17175333 17547166 17741790
5111 17741790 18063625 18495871 18752364 19091954 19311700 19443997 19724388 20093913 20437272
5102 20437272 20721121 20836479 21263235 21626215 21930142 22304606 22507182 22795583 23084382
5093 23084382 23408429 23694369 23995759 24328246 24513894 24859329 25176892 25494566 25642509
5084 25642509 25836344 26304486 26502418 26800662 27173481 27513340 27821961 28057742 28377550
$$ packed form
5150A1160456L4897J17063O3609K27661O8910J16691O8161j5549O6587J09397
5140A2017883J98746M12669J11489R025J95781K38499K28925L9113R7466J61945
5130A3711541Q2347N8831K61665L18266K94692J83535K26057M9235J63063L33002
5120A5682234J39901K70220L72863J21800J62696K58553J67066L71833J94624
5111A7741790L21835M32246K56493L39590K19746J32297K80391L69525L43359
5102B0437272K83849J15358M26756L62980L03927L74464K02576K88401K88799
5093B3084382L24047K85940L01390L32487J85648L45435L17563L17674J47943
5084B5642509J93835M68142J97932K98244L72819L39859L08621K35781L19808
$$ plain form
5075 28377550 28547003 28768885 29110420 29405007 29738347 30076803 30490939 30777805 31185776
5066 31185776 31524754 31823372 32114948 32527945 32860578 33290526 33677727 34061128 34388561
5057 34388561 34840954 35174394 35497429 35857450 36146292 36538271 37121125 37450596 37882585
5048 37882585 38461790 38861389 39199646 39729781 40107721 40450338 40929729 41428368 42032417
5039 42032417 42505685 42998540 43307251 43946830 44539567 45092114 45607745 46187379 46726596
5030 46726596 47408573 48087988 48800515 49449917 49954196 50549284 51191660 51941518 52554421
5021 52554421 53348342 53974509 54840617 55756625 56512765 57370206 58110951 59116132 60055688
5012 60055688 60913317 61844897 62987668 64067488 65359452 66493211 67805022 69146292
$$ packed form
5075B8377550J69453K21882L41535K94587L33340L38456M14136K86866M07971
5066C1185776L38978K98618K91576M12997L32633M29948L87201L83401L27433
5057C4388561M52393L33440L23035L60021K88842L91979N82854L29471M31989
5048C7882585N79205L99599L38257N30135L77940L42617M79391M98639O04049
5039D2032417M73268M92855L08711O39579N92737N52547N15631N79634N39217
5030D6726596O81977O79415P12527O49402N04279N95088O42376P49858O12903
5021E2554421P93921O26167Q66108R16008P56140Q57441P40745J005181R39556
5012F0055688Q57629R31580J142771J079820J291964J133759J311811J341270
$$ plain form
5004 69146292 70416589 71734432 73182149 74691185 76246468 77941493 79637931 81517873
4996 81517873 83365406 85138767 87253736 89419470 91414703 93478526 95820348 98157597
4988 98157597 100675010 103279267 106110114 108863780 111608625 114666846 117547050 120600506
4980 120600506 123604199 126705963 129956138 132882928 135882161 138841917 141606851 144198689
4972 144198689 146923305 149675573 152395620 155188790 157985581 160967891 163847616 167052575
4964 167052575 170510102 173946139 177638780 181590932 185530343 189687694 193957753 198335683
4956 198335683 202908893 207510262 212364316 217102658 221913568 226873625 231912566 237000132
4948 237000132 242097811 247279471 252493869 257894462 263277198 268619911 273916607 279325236
$$ packed form
5004F9146292J270297J317843J447717J509036J555283J695025J696438J879942
4996H1517873J847533J773361K114969K165734J995233K063823K341822K337249
4988I8157597K517413K604257K830847K753666K744845L058221K880204L053456
4980A20600506L003693L101764L250175K926790K999233K959756K764934K591838
4972A44198689K724616K752268K720047K793170K796791K982310K879725L204959
4964A67052575L457527L436037L692641L952152L939411M157351M270059M377930
4956A98335683M573210M601369M854054M738342M810910M960057N038941N087566
4948B37000132N097679N181660N214398N400593N382736N342713N296696N408629
$$ plain form
4940 279325236 284643652 290039145 295252016 300232820 304891832 309511636 313842999 317891791
4932 317891791 321466764 324489891 327053131 329068048 330592311 331492583 331794487 331547456
4924 331547456 330681393 329097224 326835423 324024304 320895389 317254778 313070866 308460697
4916 308460697 303444072 298130275 292591495 286763853 280825406 274742273 268481040 262240694
4908 262240694 256018782 249699224 243415492 237211159 231065301 225063969 219067780 213263466
4900 213263466 207559139 201954201 196550561 191295751 186156712 181151002 176203423 171493803
4892 171493803 166837939 162366969 158079836 153996810 150028275 146017091 142253058 138721191
4884 138721191 135053599 131767335 128465560 125224919 122160070 119178457 116456560 113704656
$$ packed form
4940B79325236N318416N395493N212871M980804M659012M619804M331363M048792
4932C17891791L574973L023127K563240K014917J524263R00272L01904k47031
4924C31547456q66063j584169k261801k811119l128915l640611m183912m610169
4916C08460697n016625n313797n538780n827642n938447o083133o261233o240346
4908B62240694o221912o319558o283732o204333o145858o001332n996189n804314
4900B13263466n704327n604938n403640n254810n139039n005710m947579m709620
4892A71493803m655864m470970m287133m083026l968535m011184l764033l531867
4884A38721191l667592l286264l301775l240641l064849k981613k721897k751904
$$ plain form
4876 113704656 110770623 107970891 105425991 102860061 100436742 98082768 95925715 93805633
4868 93805633 91532253 89501849 87675881 85651828 83771904 81996370 80320040 78606127
4860 78606127 76966355 75362097 73739355 72203381 70741549 69341517 67929675 66648037
4852 66648037 65400819 64121314 62941858 61818067 60679264 59521291 58449210 57355124
4844 57355124 56283437 55276339 54256854 53100155 52143197 51300640 50538208 49574145 48859124
4835 48859124 47936171 46915904 46194524 45381149 44668198 44000496 43274470 42605509 41787715
4826 41787715 41156186 40489347 39655598 39130897 38549970 37839814 37244306 36725677 36064884
4817 36064884 35568105 34944513 34350230 33883622 33293740 32808585 32411280 31973311 31380830
$$ packed form
4876A13704656k934033k799732k544900k565930k423319k353974k157053k120082
4868I3805633k273380k030404j825968k024053j879924j775534j676330j713913
4860G8606127j639772j604258j622742j535974j461832j400032j411842j281638
4852F6648037j247218j279505j179456j123791j138803j157973j072081j094086
4844E7355124j071687j007098j019485j156699r56958q42557p62432r64063p15021
4835D8859124r22953j020267p21380q13375p12951o67702p26026o68961q17794
4826D1787715o31529o66839q33749n24701n80927p10156n95508n18629o60793
4817C6064884m96779o23592n94283m66608n89882m85155l97305m37969n92481
$$ plain form
4808 31380830 30974080 30622218 30229079 29722994 29108685 28636249 28280799 27866723 27568013
4799 27568013 27093105 26636081 26265718 25687086 25377757 25234803 24864478 24531990 24278853
4790 24278853 23943513 23513279 23286805 23020012 22657514 22260646 22046627 21871465 21375392
4781 21375392 21233180 21079682 20813504 20763820 20422954 20115438 19946890 19605438 19358249 19136190
4771 19136190 18907718 18597430 18442699 18230636 17852269 17571588 17667750 17508152 17318125 17167771
4761 17167771 16844755 16573696 16313339 16263835 16038085 15919510 15851002 15666237 15526823 15281822
4751 15281822 15130334 14999100 14888397 14702031 14470001 14386787 14222245 13979771 13903903 13623015
4741 13623015 13582446 13581385 13607766 13479316 13252045 13041840 12965674 12817261 12716628 12543412
$$ packed form
4808C1380830m06750l51862l93139n06085o14309m72436l55450m14076k98710
4799B7568013m74908m57024l70363n78632l09329j42954l70325l32488k53137
4790B4278853l35340m30234k26474k66793l62498l96868k14019j75162m96073
4781B1375392j42212j53498k66178m9684l40866l07516j68548l41452k47189k22059
4771A9136190k28472l10288j54731k12063l78367k80681R6162j59598j90027j50354
4761A7167771l23016k71059k60357m9504k25750j18575o8508j84765j39414k45001
4751A5281822j51488j31234j10703j86366k32030q3214j64542k42474p5868k80888
4741A3623015m0569j061K6381j28450k27271k10205p6166j48413j00633j73216
$$ plain form
4731 12543412 12587050 12527537 12357361 12307432 12100793 11969245 11923158 11756989 11567145 11632489
4721 11632489 11502789 11424395 11329300 11242690 11033761 11004576 10993501 10761290 10731925 10733290 10619349
4710 10619349 10465359 10374053 10468518 10286329 10259172 10139362 10064414 9943671 9830059 9902363
4700 9902363 9891377 9745979 9594933 9512601 9464759 9263670 9148279 9146668 9152890 9119324 9056428
4689 9056428 8982696 8892457 8790846 8840242 8828016 8788887 8668904 8640802 8512660 8412361 8370259
4678 8370259 8274840 8348015 8245303 8160581 8033076 7939706 7920491 7960281 7817825 7670500 7685961
4667 7685961 7781885 7618123 7623125 7488714 7462937 7280539 7160903 7162756 7099296 6965273 7001532
4656 7001532 6953291 6889384 6766656 6973917 7068974 7038758 7040353 6996408 6980528 6724386 6740531
$$ packed form
4731A2543412M3638n9513j70176m9929k06639j31548m6087j66169j89844O5344
4721A1632489j29700p8394r5095q6610k08929k9185j1075k32211k9365J365j13941
4710A0619349j53990r1306R4465j82189k7157j19810p4948j20743j13612P2304
4700I902363j0986j45398j51046q2332m7842k01089j15391j611O222l3566o2896
4689I056428p3732r0239j01611M9396j2226l9129j19983k8102j28142j00299m2102
4678H370259r5419P3175j02712q4722j27505r3370j9215L9790j42456j47325J5461
4667G685961R5924j63762N002j34411k5777j82398j19636J853o3460j34023L6259
4656G001532m8241o3907j22728K07261R5057l0216J595m3945j5880k56142J6145
$$ plain form
4645 6740531 6651059 6603094 6651113 6632648 6564784 6538269 6592028 6609551 6582334 6649148 6466612
4634 6466612 6367560 6428662 6389263 6409131 6325396 6233474 6256036 6122122 6272910 6380408 6396327
4623 6396327 6322613 6079541 6032509 6280400 6234884 6180104 6116292 6090794 6129666 6031212 5928416
4612 5928416 5933201 5935531 5899965 5875030 5843078 5888958 5927174 5844385 5784721 5769259 5726773 5602282
4600 5602282 5625659 5592898 5545692 5517539 5492622 5591829 5514443 5509326 5445498 5375264 5373830 5317611
4588 5317611 5193753 5033839 5062306 5024538 5296516 5313018 5099576 5129382 5138782 5037679 4932377
4577 4932377 4891780 4926590 5143738 5024128 4926019 5024549 5151706 5055205 4855194 4868988 4819756
4566 4819756 4856482 4792431 4696692 4682732 4737048 4945419 4892421 4795602 4767006 4737881 4774977
$$ packed form
4645F740531q9472m7965M8019j8465o7864k6515N3759J7523k7217O6814j82536
4634F466612r9052O1102l9399J9868q3735r1922K2562j33914J50788J07498J5919
4623F396327p3714k43072m7032K47891m5516n4780o3812k5498L8872r8454j02796
4612E928416M785K330l5566k4935l1952M5880L8216q2789n9664j5462m2486j24491
4600E602282K3377l2761m7206k8153k4917R9207p7386n117o3828p0234j434n6219
4588E317611j23858j59914K8467l7768K71978J6502k13442K9806R400j01103j05302
4577D932377m0597L4810K17148j19610r8109R8530J27157r6501k00011J3794m9232
4566D819756L6726o4051r5739j3960N4316K08371n2998r6819k8596k9125L7096
$$ plain form
4555 4774977 4781362 4627404 4550847 4509755 4621110 4621693 4563386 4605615 4597298 4473179 4515659 4571850
4543 4571850 4493975 4460343 4370484 4347158 4383421 4545503 4486340 4450890 4536359 4465954 4380921
4532 4380921 4281355 4272310 4366433 4427197 4307496 4467735 4596129 4412254 4343585 4494039 4403085
4521 4403085 4279431 4242350 4136699 4139842 4132720 4214737 4287640 4182096 4033781 3986371 4186351
4510 4186351 4165564 4040867 4013940 4179172 4264185 4110232 4039859 4034335 4159376 4113186 3993583
4499 3993583 3819080 3838982 3857721 3947018 3894412 3853148 3937047 3843836 3806891 3596290 3742111
4488 3742111 3796479 3769016 3778109 3607315 3631590 3511012 3517735 3518023 3365026 3478146 3483148 3667976
4476 3667976 3543593 3505076 3584852 3508334 3427630 3390018 3396423 3284225 3345705 3412333 3252191
$$ packed form
4555D774977O385j53958p6557m1092J11355N83n8307M2229q317j24119M2480N6191
4543D571850p7875l3632q9859k3326L6263J62082n9163l5450Q5469p0405q5033
4532D380921r9566r045R4123O0764j19701J60239J28394j83875o8669J50454r0954
4521D403085j23654l7081j05651L143p122Q2017P2903j05544j48315m7410J99980
4510D186351k0787j24697k6927J65232Q5013j53953p0373n524J25041m6190j19603
4499C993583j74503J9902J8739Q9297n2606m1264Q3899r3211l6945k10601J45821
4488C742111N4368k7463R093j70794K4275j20578O723K88j52997J13120N002J84828
4476C667976j24383l8517P9776p6518q0704l7612O405j12198O1480O6628j60142
$$ plain form
4465 3252191 3176348 3404166 3413963 3301856 3269783 3340596 3277497 3290963 3050766 3115914 3092821
4454 3092821 3263183 3307653 3173241 3143309 3134837 3146625 3207513 3214484 2976181 2987514 3060196
4443 3060196 3183000 3187137 3326789 3333075 3167000 3061727 3027463 2970701 2900418 3015193 2907699
4432 2907699 2997534 3163991 3133808 3086411 3033115 3121540 3171731 3043271 2861459 2903336 3126302
4421 3126302 3200908 3099017 3050355 3197483 3114728 3072819 3217096 3110968 3075102 3024723 3065840
4410 3065840 3082159 3127955 3031808 3098922 3088159 3250470 3328651 3381139 3287614 3326996 3284782
4399 3284782 3263694 3318236 3218539 3408121 3439485 3509913 3455066 3258763 3179497 3249738 3301756
4388 3301756 3349607 3444503 3487484 3384424 3286048 3240967 3354885 3347870 3249151 3292094 3358916
$$ packed form
4465C252191p5843K27818R797j12107l2073P0813o3099J3466k40197O5148k3093
4454C092821J70362M4470j34412k9932q472J1788O0888O971k38303J1333P2682
4443C060196J22804M137J39652O286j66075j05273l4264n6762p0283J14775j07494
4432B907699Q9835J66457l0183m7397n3296Q8425N0191j28460j81812M1877K22966
4421C126302P4606j01891m8662J47128q2755m1909J44277j06128l5866n0379M1117
4410C065840J6319M5796r6147O7114j0763J62311P8181N2488r3525L9382m2214
4399C284782k1088N4542r9697J89582L1364P0428n4847j96303p9266P0241N2018
4388C301756M7851R4896M2981j03060r8376m5081J13918p015r8719M2943O6822
$$ plain form
4377 3358916 3341431 3428431 3448637 3373268 3291123 3325603 3334156 3227589 3261649 3395951 3406069
4366 3406069 3306839 3261353 3344836 3326720 3196321 3232810 3344667 3559730 3633092 3534881 3455442
4355 3455442 3472884 3513172 3519790 3392925 3401167 3556870 3627740 3716405 3767334 3536120 3339676
4344 3339676 3479615 3614262 3667169 3536442 3452635 3493850 3620386 3598923 3675584 3571046
4334 3571046 3537603 3578567 3505494 3665086 3770192 3787956 3813117 3671279 3691504 3833636 3815620
4323 3815620 3743888 3759404 3714166 3857101 3919363 3975705 3823419 3835349 3869580 3848888 3837776
4312 3837776 3726949 3554593 3609080 3658249 3567730 3604693 3517036 3663277 3687530 3716556 3713455
4301 3713455 3653486 3632605 3749103 3625797 3672344 3768130 3645997 3573498 3639148 3565937 3485777
$$ packed form
4377C358916j7485Q7000K0206p5369q2145L4480Q553j06567L4060J34302J0118
4366C406069r9230m5486Q3483j8116j30399L6489J11857K15063P3362r8211p9439
4355C455442J7442M0288O618j26865Q242J55703P0870Q8665N0929k31214j96444
4344C339676J39939J34647N2907j30727q3807M1215J26536k1463P6661j04538
4334C571046l3443M0964p3073J59592J05106J7764K5161j41838K0225J42132j8016
4323C815620p1732J5516m5238J42935O2262N6342j52286J1930L4231k0692j1112
4312C837776j10827j72356N4487M9169r0519L6963q7657J46241K4253K9026l101
4301C713455n9969k0881J16498j23306M6547R5786j22133p2499O5650p3211q0160
$$ plain form
4290 3485777 3541993 3586985 3476616 3598000 3586281 3634079 3656706 3586079 3594266 3464593 3406036
4279 3406036 3548016 3614377 3510103 3428991 3506197 3487768 3359547 3358295 3438724 3453201 3465274
4268 3465274 3681340 3755498 3645335 3512140 3484320 3532605 3503929 3518367 3496605 3443337 3340240
4257 3340240 3107667 3081338 3223009 3190087 3117025 3116841 3119466 3189911 3196362 3044658 2967882 3058072
4245 3058072 3178993 3249931 3165904 3197650 3194510 3200393 3264555 3235631 3271705 3089836 3053123
4234 3053123 3108788 3035544 2963265 2971002 2866491 2992647 3136273 3086199 3073212 2973253 2969307
4223 2969307 3029378 3030742 2967386 2933385 2930477 3067337 3014100 2999092 2934328 2946678 3125357
4212 3125357 3043783 2978588 2994601 3049164 3130334 3039347 2963793 2974797 3027827 2789137 2737845
$$ packed form
4290C485777N6216M4992j10369J21384j1719M7798K2627p0627Q187j29673n8557
4279C406036J41980O6361j04274q1112P7206j8429j28221j252Q0429J4477J2073
4268C465274K16066P4158j10163j33195k7820M8285k8676J4438k1762n3268j03097
4257C340240k32573k6329J41671l2922p3062j84K625P0445O451j51704p6776R0190
4245C058072J20921P0938q4027L1746l140N883O4162k8924L6074j81869l6713
4234C053123N5665p3244p2279P737j04511J26156J43626n0074j2987r9959l946
4223B969307O0071J364o3356l4001k908J36860n3237j5008o4764J2350J78679
4212C125357q1574o5195J6013N4563Q1170r0987p5554J1004N3030k38690n1292
$$ plain form
4201 2737845 2922837 2813867 2811391 2849836 2914420 2772590 2779558 2830365 2913004 2938809 2766003
4190 2766003 2734049 2730222 2777712 2778377 2885474 2972952 2990123 2764743 2787031 2788971 2873902 2873388
4178 2873388 2725271 2828581 2845788 2814662 2815307 2694497 2803213 2884621 2866579 2822820 2884774
4167 2884774 2920031 3036045 2986189 2869886 2802916 2855475 2863751 2737546 2861808 3014002 2918824
4156 2918824 2877180 2932770 2894534 2875050 2890714 2865284 2878087 2936232 2895004 2813201 2810433 2933716
4144 2933716 3049792 2868593 2794370 2966922 3057002 3242324 3072995 3127363 3157643 3109324
4134 3109324 3013036 3054558 3067382 3138947 3231805 3018348 3130587 3127243 3139632 3159487 3068006
4123 3068006 3145284 3041870 3019253 3110349 3107876 3130724 3155997 3072798 3056269 3138620 3340989
$$ packed form
4201B737845J84992j08970k476L8445O4584j41830O968N0807Q2639K5805j72806
4190B766003l1954l827M7490O65J07097Q7478J7171k25380K2288J940Q4931n14
4178B873388j48117J03310J7207l1126O45j20810J08716Q1408j8042m3759O1954
4167B884774L5257J16014m9856j16303o6970N2559Q276j26205J24262J52194r5178
4156B918824m1644N5590l8236j9484J5664k5430J2803N8145m1228q1803k768J23283
4144B933716J16076j81199p4223J72552R0080J85322j69329N4368L0280m8319
4134C109324r6288M1522J2824P1565R2858k13457J12239l344J2389J9855r1481
4123C068006P7278j03414k2617R1096k473K2848K5273q3199j6529Q2351K02369
$$ plain form
4112 3340989 3140179 2970743 3077843 3167053 3185206 3234622 3151979 3076520 3095737 3110237 3093473
4101 3093473 2980627 2989047 3066293 3140587 3169820 3155110 3183957 3117952 3082040 3040120 3087295
4090 3087295 3290060 3267632 3112829 3150581 3111775 3030008 3027277 3118079 3130987 3151400 3086005
4079 3086005 3052717 3193108 3353009 3274001 3226188 3274710 3182362 3095656 3106447 3148390 3100849
4068 3100849 3208386 3213133 3322013 3467063 3247998 3210887 3300652 3317559 3174057 3210994 3268216
4057 3268216 3249864 3320437 3419138 3517648 3449945 3518343 3597229 3563863 3499589 3636892 3663096
4046 3663096 3627102 3723185 3751247 3755411 3849592 3868570 3918181 3975775 4141719 4116272 4176085
4035 4176085 4233831 4343589 4399928 4493048 4518016 4617582 4572378 4598493 4659836 4752335 4658709
$$ packed form
4112C340989k00810j69436J07100Q9210J8153M9416q2643p5459J9217J4500j6764
4101C093473j12846Q420P7246P4294K9233j4710K8847o6005l5912m1920M7175
4090C087295K02765k2428j54803L7752l8806q1767k731R0802J2908K0413o5395
4079C086005l3288J40391J59901p9008m7813M8522r2348q6706J0791M1943m7541
4068C100849J07537M747J08880J45050k19065l7111Q9765J6907j43502L6937N7222
4057C268216j8352P0573R8701R8510o7703O8398P8886l3366o4274J37303K6204
4046C663096l5994R6083K8062M164R4181J8978M9611N7594J65944k5447N9813
4035D176085N7746J09758N6339R3120K4968R9566m5204K6115O1343R2499r3626
$$ plain form
4024 4658709 4737281 4889620 4824830 4891875 4998080 5007530 5168544 5173659 5201054 5315434 5358166
4013 5358166 5433818 5347533 5432011 5497350 5364797 5409803 5415053 5452425 5577102 5582057 5530405
4002 5530405 5560447 5693251 5722470 5646296 5458327 5635510 5791973 5709462 5746585 5802649 5813979
3991 5813979 5974950 5960079 5972533 6023600 6040312 6007514 6176412 6338682 6362835 6215727 6298334
3980 6298334 6402439 6647312 6681220 6775160 6891515 7007712 7128043 7186321 7226340 7270416
3970 7270416 7354432 7489914 7472418 7453254 7474590 7482241 7684680 7878218 7913018 7920005 7990193
3959 7990193 8041929 7948634 7859198 7694272 7679561 7729249 7764299 7699059 7634069 7763757 7745790
3948 7745790 7697626 7507605 7408732 7377695 7423099 7375418 7335396 7366429 7320224 7318167 7400621
$$ packed form
4024D658709P8572J52339o4790O7045J06205R450J61014N115K7395J14380M2732
4013E358166P5652q6285Q4478O5339j32553M5006N250L7372J24677M955n1652
4002E530405L0042J32804K9219p6174j87969J77183J56463q2511L7123N6064J1330
3991E813979J60971j4871J2454N1067J6712l2798J68898J62270K4153j47108Q2607
3980F298334J04105K44873L3908R3940J16355J16197J20331N8278M0019M4076
3970G270416Q4016J35482j7496j9164K1336P651K02439J93538L4800O987P0188
3959G990193N1736r3295q9436j64926j4711M9688L5050o5240o4990J29688j7967
3948G745790m8164j90021r8873l1037M5404m7681m0022L1033m6205k057Q2454
$$ plain form
3937 7400621 7352551 7371806 7224708 7229002 7310317 7316629 7146158 6999138 7018216 7043518 7030383
3926 7030383 6961999 6942299 6985891 6962598 7157590 7088456 7119824 7139520 6992072 6854849 6854583
3915 6854583 7034126 6970474 6833998 6855656 6940658 6729884 6775496 6724856 6562174 6487135 6213317
3904 6213317 6350896 6417263 6215928 6150294 6051729 5863526 5662235 5661516 5629409 5555131 5280451
3893 5280451 5117138 5093424 4982702 4830113 4949123 4970872 4792957 4710615 4746992 4561579
3883 4561579 4400829 4495336 4420355 4208959 4214130 4262643 4132457 4075612 3933910 4073736 4008459
3872 4008459 3962158 4032110 3860732 3794584 3807331 3836444 3690779 3582217 3410717 3389208 3525955
3861 3525955 3435727 3341503 3315676 3399511 3339728 3314782 3274389 3320511 3271757 3197816 3286528
$$ packed form
3937G400621m8070J9255j47098M294Q1315O312j70471j47020J9078K5302j3135
3926G030383o8384j9700M3592k3293J94992o9134L1368J9696j47448j37223k66
3915F854583J79543o3652j36476K1658Q5002k10774M5612n0640j62682p5039k73818
3904F213317J37579O6367k01335o5634r8565j88203k01291p19l2107p4278k74680
3893E280451j63313k3714j10722j52589J19010K1749j77915q2342L6377j85413
3883D561579j60750R4507p4981k11396N171M8513j30186n6845j41702J39826o5277
3872D008459m6301O9952j71378o6148J2747K9113j45665j08562j71500k1509J36747
3861C525955r0228r4224k5827Q3835n9783k4946m0393M6122m8754p3941Q8712
$$ plain form
3850 3286528 3157158 3250652 3271052 3163025 3152840 3234236 3207216 3236312 3258003 3272802 3263078
3839 3263078 3114530 3074084 3051970 3142453 3147773 3099801 3246159 3115363 3142160 3332318 3348090
3828 3348090 3359555 3416631 3379018 3247034 3353653 3481198 3592623 3476569 3442153 3579762
3818 3579762 3587336 3575426 3609700 3708091 3800433 3762969 3750678 3813609 3792114 3791669 3841931 4028270
3806 4028270 4100730 4148730 4299495 4274258 4359880 4380401 4290649 4349492 4561939 4560255 4609959
3795 4609959 4577052 4660508 4892405 4928444 4861238 4830371 4861503 4983590 5066358 5099660 5111519
3784 5111519 4997761 5057216 5111022 5246188 5167211 5152432 5209521 5265826 5222036 5181155 5179136
3773 5179136 5309536 5317894 5411724 5529934 5518739 5604426 5666380 5854903 5970090 5797051 5925792
$$ packed form
3850C286528j29370R3494K0400j08027j0185Q1396k7020K9096K1691J4799r724
3839C263078j48548m0446k2114R0483N320m7972J46358j30796K6797J90158J5772
3828C348090J1465N7076l7613j31984J06619J27545J11425j16054l4416J37609
3818C579762P574j1910L4274R8391R2342l7464j2291O2931k1495m45N0262J86339
3806D028270P2460M8000J50765k5237Q5622K0521q9752N8843K12447j684M9704
3795D609959l2907Q3456K31897L6039o7206l0867L1132J22087Q2768L3302J1859
3784E111519j13758N9455N3806J35166p8977j4779N7089N6305m3790m0881k019
3773E179136J30400Q358R3830J18210j1195Q5687O1954J88523J15187j73039J28741
$$ plain form
3762 5925792 5980423 6086175 6141868 6255224 6393504 6324307 6429535 6457394 6681888 6669399
3752 6669399 6770653 6827868 6900367 6916242 7006316 7046165 7092689 7008516 6931688 6930822 6921985 7034575
3740 7034575 7118922 6980311 6925129 7058250 6992759 6908376 6682436 6810962 6753633 6600814
3730 6600814 6608875 6668405 6761279 6508326 6573972 6532671 6548227 6381741 6241567 6341065 6364858
3719 6364858 6361544 6363447 6373852 6209590 6194514 6123940 6153206 6225608 6299215 6461605 6485012
3708 6485012 6406676 6370057 6511639 6580142 6568497 6567539 6517829 6547616 6392157 6421127 6399448
3697 6399448 6466988 6336803 6178682 6340145 6319054 6389270 6274710 6172068 6121732 6117249 5989141
3686 5989141 5974570 5929023 5769845 5695656 5696502 5717502 5606134 5481847 5305856 5217736 5042740
$$ packed form
3762E925792N4631J05752N5693J13356J38280o9197J05228K7859K24494j2489
3752F669399J01254N7215P2499J5875R0074L9849M6524q4173p6828q66q837J12590
3740G034575Q4347j38611n5182J33121o5491q4383k25940J28526n7329j52819
3730F600814Q061N9530R2874k52953O5646m1301J5556j66486j40174R9498K3793
3719F364858l314J903J0405j64262j5076p0574K9266P2402P3607J62390K3407
3708F485012p8336l6619J41582O8503j1645r58m9710K9787j55459K8970k1679
3697F399448O7540j30185j58121J61463k1091P0216j14560j02642n0336m483j28108
3686E989141j4571m5547j59178p4189Q46K1000j11368j24287j75991q8120j74996
$$ plain form
3675 5042740 4855004 4810079 4832170 4734595 4674039 4666737 4455194 4269160 4277547 4348287 4406252
3664 4406252 4288081 4216260 4210784 4145436 4033048 4094010 3883843 3750664 3636391 3681743 3691242
3653 3691242 3722342 3713938 3648552 3606193 3588840 3609981 3762692 3686182 3383085 3393993 3422230
3642 3422230 3497985 3414048 3350354 3352193 3313656 3280317 3161820 2979314 3008664 2963808 2912865
3631 2912865 2890964 2908071 2893543 2748342 2636984 2528191 2481116 2487676 2368810 2333372 2317839
3620 2317839 2356972 2210927 2103511 2185041 2220198 2233762 2301040 2270388 2166356 2157521 2182680
3609 2182680 2020043 1963784 1922241 1955386 2031844 2051964 2087790 2076776 2047122 2061752 2148686
3598 2148686 2053775 1957682 1899614 1876619 1879750 1923199 1867435 1879671 1840686 1685613 1763553
$$ packed form
3675E042740j87736m4925K2091r7575o0556p302k11543j86034Q387P0740N7965
3664D406252j18171p1821n476o5348j12388O0962k10167j33179j14273M5352R499
3653C691242L1100q404o5386m2359j7353K1141J52711p6510l03097J0908K8237
3642C422230P5755q3937o3694J839l8537l3339j18497j82506K9350m4856n0943
3631B912865k1901J7107j4528j45201j11358j08793m7075O560j18866l5438j5533
3620B317839L9133j46045j07416Q1530L5157J3564O7278l0652j04032q835K5159
3609B182680j62637n6259m1543L3145P6458K0120L5826j1014k9654J4630Q6934
3598B148686r4911r6093n8068k2995L131M3449n5764J2236l8985j55073P7940
$$ plain form
3587 1763553 1902749 1815625 1685589 1692065 1717280 1670850 1698463 1645032 1713887 1914527 1811223
3576 1811223 1748173 1767895 1724834 1776510 1773941 1745003 1674646 1434418 1461672 1493477 1481383
3565 1481383 1492012 1432788 1473405 1452914 1628122 1725394 1572235 1589141 1788754 1628474 1469071
3554 1469071 1659342 1576106 1499982 1552815 1528989 1351887 1365525 1327824 1454624 1663034 1764878
3543 1764878 1783967 1807578 1741864 1622349 1602581 1667661 1808763 1791922 1655045 1696316 1761353
3532 1761353 1705016 1667441 1773203 1695213 1715436 1719522 1726639 1738378 1594104 1791455 1747110
3521 1747110 1663994 1762235 1826203 1981106 2026814 1845179 1923042 2052938 2082269 1994536 1912303
3510 1912303 1910883 1950596 1896147 1952959 1963134 1898451 1974448 1970780 1961518 2071205 2198765 2142854
$$ packed form
3587A763553J39196q7124j30036O476K5215m6430K7613n3431O8855K00640j03304
3576A811223o3050J9722m3061N1676k569k8938p0357k40228K7254L1805j2094
3565A481383J0629n9224M0617k0491J75208R7272j53159J6906J99613j60280j59403
3554A469071J90271q3236p6124N2833k3826j77102J3638l7701J26800K08410J01844
3543A764878J9089K3611o5714j19515j9768O5080J41102j6841j36877M1271O5037
3532A761353n6337l7575J05762p7990K0223M086P117J1739j44274J97351m4345
3521A747110q3116R8241O3968J54903M5708j81635P7863J29896K9331q7733q2233
3510A912303j420L9713n4449N6812J0175o4683P5997l668r262J09687J27560n5911
$$ plain form
3498 2142854 2092382 2130744 2150934 2147604 2098760 2049737 2153498 2154678 2077777 2183223 2306516
3487 2306516 2335626 2234361 2129352 2029904 2139751 2231184 2363088 2355573 2197659 2199347 2301587
3476 2301587 2350937 2392293 2551983 2657452 2566477 2688934 2698423 2698198 2639570 2808950 2818847
3465 2818847 2856793 2894398 2996424 3025461 2955845 2880799 2904483 3100464 3191802 3248288 3170988
3454 3170988 3092863 3240772 3287833 3290900 3402281 3412831 3489988 3365483 3442790 3640823 3815401
3443 3815401 3909778 3928072 4006191 4052472 4128824 4216532 4295902 4406655 4575991 4615859 4601351
3432 4601351 4674048 4750742 4974994 4968150 5146486 5188680 5368947 5551805 5593624 5662101 5889789
3421 5889789 6135350 6200460 6273388 6493124 6811406 7075299 7249687 7274345 7404646 7889030
$$ packed form
3498B142854n0472L8362K0190l330m8844m9023J03761J180p6901J05446J23293
3487B306516K9110j01265j05009r9448J09847R1433J31904p515j57914J688J02240
3476B301587M9350M1356J59690J05469r0975J22457R489k25n8628J69380R897
3465B818847L7946L7605J02026K9037o9616p5046K3684J95981R1338N6486p7300
3454C170988p8125J47909M7061L067J11381J0550P7157j24505P7307J98033J74578
3443C815401R4377J8294P8119M6281P6352Q7708P9370J10753J69336L9868j4508
3432D601351P2697P6694K24252o844J78336M2194J80267J82858M1819O8477K27688
3421E889789K45561O5110P2928K19736L18282K63893J74388K4658J30301M84384
$$ plain form
3411 7889030 8081624 8249234 8381658 8716306 8966152 9174748 9497182 9800205 10192779 10455751
3401 10455751 10876899 11249954 11631835 12166795 12773507 13318231 13993973 14710243 15252720
3392 15252720 15999153 16832770 17594359 18574523 19825698 21083273 22428617 23850242 25325749
3383 25325749 26869608 28740345 30811071 32919805 35036161 37086794 39115935 41066667
3375 41066667 43034704 45024989 47103671 49572271 51908386 54143507 56218812 57998416
3367 57998416 59299920 60236521 61210891 62592735 63947055 65089306 65998577 66575705 66686854
3358 66686854 65806486 64651963 63233698 62033215 61056485 60143546 59135938 57742952 55998119
3349 55998119 53942046 51499974 49149083 46711204 44747632 42775033 40917478 39020172
$$ packed form
3411G889030J92594J67610J32424L34648K49846K08596L22434L03023L92574K62972
3401A0455751M21148L73055L81881N34960O06712N44724O75742P16270N42477
3392A5252720P46433Q33617P61589R80164J251175J257575J345344J421625J475507
3383B5325749J543859J870737K070726K108734K116356K050633K029141J950732
3375D1066667J968037J990285K078682K468600K336115K235121K075305J779604
3367E7998416J301504R36601R74370J381844J354320J142251R09271N77128J11149
3358F6686854q80368j154523j418265j200483r76730r12939j007608j392986j744833
3349E5998119k056073k442072k350891k437879j963572j972599j857555j897306
$$ plain form
3341 39020172 37032004 35072781 32854906 30809658 28865703 27127244 25472432 23959422
3333 23959422 22561087 21261666 20028780 19037777 18253695 17447728 16720699 15918739 15151579
3324 15151579 14395913 13806345 13363322 12910355 12494507 12181398 11685273 11333345 11009722
3315 11009722 10578487 10287183 10002180 9769702 9429795 9026800 8734497 8581457 8354032
3306 8354032 8169296 8003987 8066105 7905589 7615491 7401696 7172749 6895903 6694664 6589797
3296 6589797 6402664 6349482 6352093 6222892 6094151 6020148 5894718 5853146 5830151 5777895 5615264
3285 5615264 5595116 5405059 5320593 5331942 5269778 5090959 5035370 5213275 5203396 5172591 5135071
3274 5135071 5238562 5186740 5000855 5014939 5015283 5111537 5068456 4983643 5074432 5058654 4910527
$$ packed form
3341C9020172j988168j959223k217875k045248j943955j738459j654812j513010
3333B3959422j398335j299421j232886r91003p84082q05967p27029q01960p67160
3324A5151579p55666n89568m43023m52967m15848l13109m96125l51928l23623
3315A1009722m31235k91304k85003k32478l39907m02995k92303j53040k27425
3306H354032j84736j65309O2118j60516k90098k13795k28947k76846k01239j04867
3296F589797j87133n3182K611j29201j28741p4003j25430m1572k2995n2256j62631
3285E615264k0148j90057q4466J1349o2164j78819n5589J77905r879l0805l7520
3274E135071J03491n1822j85885J4084L44R6254m3081q4813R0789j5778j48127
$$ plain form
3263 4910527 4751126 4681227 4624115 4558786 4377793 4314655 4213179 4178067 4239092 4156412 4179319
3252 4179319 4278051 4132061 3952930 3800822 3792841 3913924 3821366 3700563 3647511 3562333 3423011
3241 3423011 3433648 3551590 3802894 3688408 3462514 3402732 3412949 3457954 3415350 3212889
3231 3212889 3143346 3227558 3334641 3263838 3051828 3090630 3150001 3199032 3064293 3037231 2985032
3220 2985032 3063074 3044435 2941101 2845981 2955768 2950832 3074728 3035220 3008326 3155222 3101125
3209 3101125 3157853 3170956 2977650 3000841 3133379 3088452 2986012 3005959 3010241 2928405 3059506
3198 3059506 3281665 3221546 3060010 3064927 3303823 3394207 3272194 3224489 3180367 3128409 3234399
3187 3234399 3299789 3248868 3389410 3362656 3289966 3276407 3288750 3364993 3385376 3350069 3319944
$$ packed form
3263D910527j59401o9899n7112o5329j80993o3138j01476l5112O1025q2680K2907
3252D179319R8732j45990j79131j52108p981J21083r2558j20803n3052q5178j39322
3241C423011J0637J17942K51304j14486k25894n9782J0217M5005m2604k02461
3231C212889o9543Q4212J07083p0803k12010L8802N9371M9031j34739k7062n2199
3220B985032P8042j8639j03334r5120J09787m936J23896l9508k6894J46896n4097
3209C101125N6728J3103j93306K3191J32538m4927j02440J9947M282q1836J31101
3198C059506K22159o0119j61536M917K38896R0384j22013m7705m4122n1958J05990
3187C234399O5390n0921J40542k6754p2690j3559J2343P6243K0383l5307l0125
$$ plain form
3176 3319944 3414846 3686935 3833008 3615166 3416634 3406201 3483360 3563531 3659372 3591763 3568542
3165 3568542 3475422 3752039 3903987 3903885 4049466 4020462 4018048 3992875 4089148 4133871 4293166
3154 4293166 4274295 4252273 4288796 4411058 4461755 4636815 4549137 4532367 4677687 4734335 4860505
3143 4860505 4946369 5078134 5316780 5309599 5353260 5167921 5357817 5370033 5455807 5573375 5569530
3132 5569530 5754092 5867070 6088558 6023076 6057424 6167953 6306374 6342972 6389357 6608666
3122 6608666 6626609 6799793 6908322 6948470 7100076 7227776 7430491 7501870 7400208 7648780
3112 7648780 7824230 7926753 8286409 8500169 8699014 8822732 9008833 9311109 9494039 9616978
3102 9616978 9783541 10028042 10223408 10410551 10808575 10988789 11212803 11365703 11522301 11727212
$$ packed form
3176C319944R4902K72089J46073k17842j98532j0433P7159Q0171R5841o7609k3221
3165C568542r3120K76617J51948j02J45581k9004k414k5173R6273M4723J59295
3154D293166j8871k2022L6523J22262N0697J75060q7678j6770J45320N6648J26170
3143D860505Q5864J31765K38646p181M3661j85339J89896J2216Q5774J17568l845
3132E569530J84562J12978K21488o5482L4348J10529J38421L6598M6385K19309
3122F608666J7943J73184J08529M0148J51606J27700K02715P1379j01662K48572
3112G648780J75450J02523L59656K13760J98845J23718J86101L02276J82930J22939
3102I616978J66563K44501J95366J87143L98024J80214K24014J52900J56598K04911
$$ plain form
3092 11727212 12091268 12429267 12786472 13067779 13406993 13744853 14099156 14336312 14448520
3083 14448520 14904610 15389904 15877505 16454218 16796500 17229372 17607117 18266635 18822930
3074 18822930 19490969 20073238 20754266 21409395 22018153 22781084 23446999 24307571 25162284
3065 25162284 25918455 26702682 27835623 28924755 29837263 30946793 32161361 33510740 35130110
3056 35130110 36634495 38566554 40448887 42465738 44791723 47357328 50186593 53096170
3048 53096170 56237246 59622056 63463079 67521573 71497243 75848577 80374468 85322313
3040 85322313 90286417 95272000 99761675 103473127 106160619 107007666 106205127 103729009
3032 103729009 100027536 95910852 91577571 87262078 83092671 79010385 75101157 71173958
$$ packed form
3092A1727212L64056L37999L57205K81307L39214L37860L54303K37156J12208
3083A4448520M56090M85294M87601N76713L42282M32872L77745O59518N56295
3074A8822930O68039N82269O81028O55129O08758P62931O65915Q60572Q54713
3065B5162284P56171P84227J132941J089132R12508J109530J214568J349379J619370
3056C5130110J504385J932059J882333K016851K325985K565605K829265K909577
3048E3096170L141076L384810L841023M058494L975670M351334M525891M947845
3040H5322313M964104M985583M489675L711452K687492Q47047q02539k476118
3032A03729009l701473m116684m333281m315493m169407m082286l909228l927199
$$ plain form
3024 71173958 67701192 64469704 61453922 58597432 55929914 53372983 51274505 49367905
3016 49367905 47347439 45527191 43680455 41950387 40674829 39357437 38036224 36780345
3008 36780345 35446380 34400195 33441182 32533213 31656929 30927943 30107339 29341594 28676390
2999 28676390 28031003 27434845 26832184 26264658 25873851 25383353 24903061 24461128 23989608
2990 23989608 23663028 23351515 23161103 22868541 22732558 22570588 22223377 22060411 21955917
2981 21955917 21885391 21838695 21814998 21632425 21643542 21775952 21722905 22024804 22252400 22416048
2971 22416048 22828181 23088228 23447371 24017869 24738751 25551582 26396586 27616125 29012012
2962 29012012 30488158 32283959 34386662 36762150 39307721 41920093 44652078 47536928
$$ packed form
3024G1173958l472766l231488l015782k856490k667518k556931k098478j906600
3016D9367905k020466j820248j846736j730068j275558j317392j321213j255879
3008C6780345j333965j046185r59013r07969q76284p28986q20604p65745o65204
2999B8676390o45387n96158o02661n67526l90807m90498m80292m41933m71520
2990B3989608l26580l11513j90412k92562j35983j61970l47211j62966j04494
2981B1955917p0526m6696k3697j82573J1117J32410n3047L01899K27596J63648
2971B2416048M12133K60047L59143N70498P20882Q12831Q45004J219539J395887
2962B9012012J476146J795801K102703K375488K545571K612372K731985K884850
$$ plain form
2954 47536928 51192063 55505038 60484954 65859064 71521597 76687255 79995725 79898958
2946 79898958 75619041 68963242 62428573 57086234 52680097 49048454 45594630 42439128
2938 42439128 39344618 36457398 33763152 31554232 29780996 28070442 26435832 24828000
2930 24828000 23533190 22440055 21221805 20264132 19434742 18707374 18085906 17320706 16571500
2921 16571500 15863911 15403161 14975149 14447308 14078222 13753916 13259424 12745298 12403654
2912 12403654 12124258 11886926 11543798 11352838 11204514 10821188 10435359 10119266 9940206
2903 9940206 9842482 9667837 9498621 9172895 8819283 8634407 8514148 8423744 8267660 8068547
2893 8068547 7970959 7879849 7654612 7633930 7574717 7458316 7362829 7176867 6974695 6986100 7024708
$$ packed form
2954D7536928L655135M312975M979916N374110N662533N165658L308470r6767
2946G9898958m279917o655799o534669n342339m406137l631643l453824l155502
2938D2439128l094510k887220k694246k208920j773236j710554j634610j607832
2930B4828000j294810j093135j218250r57673q29390p27368o21468p65200p49206
2921A6571500p07589m60750m28012n27841l69086l24306m94492n14126l41644
2912A2403654k79396k37332l43128j90960j48324l83326l85829l16093j79060
2903I940206r7724j74645j69216l25726l53612j84876j20259r0404j56084j99113
2893H068547r7588r1110k25237k0682n9213j16401r5487j85962k02172J1405L8608
$$ plain form
2882 7024708 6894346 6767270 6743907 6443369 6339470 6271802 6158861 6058841 5996619 5899767
2872 5899767 5777699 5810431 5906848 5837022 5776633 5720683 5640177 5422507 5383703 5422520 5385498
2861 5385498 5466179 5477178 5373354 5226859 5203883 5253085 5107356 5141623 5145971 4969835 5031013
2850 5031013 5000683 4920592 4899223 4928352 4752348 4677043 4734731 4765525 4642103 4633488 4673858
2839 4673858 4732667 4701940 4685796 4587702 4643985 4540650 4431522 4486474 4427962 4688169 4695716
2828 4695716 4540267 4576295 4466036 4553721 4498699 4396905 4469919 4494441 4552554 4668481 4747562
2817 4747562 4590495 4548711 4402787 4409694 4532920 4605310 4561484 4593075 4648138 4683905 4521342
2806 4521342 4438027 4548404 4396695 4578436 4561984 4562010 4628682 4652735 4613328 4613550 4513055 4566127
$$ packed form
2882G024708j30362j27076k3363l00538j03899o7668j12941j00020o2222r6852
2872E899767j22068L2732R6417o9826o0389n5950q0506k17670l8804L8817l7022
2861E385498Q0681J0999j03824j46495k2976M9202j45729L4267M348j76136O1178
2850E031013l0330q0091k1369K9129j76004p5305N7688L0794j23422q615M0370
2839D673858N8809l0727j6144r8094N6283j03335j09128N4952n8512K60207P547
2828D695716j55449L6028j10259Q7685n5022j01794P3014K4522N8113J15927P9081
2817D747562j57067m1784j45924O907J23226P2390m3826L1591N5063L5767j62563
2806D521342q3315J10377j51709J81741j6452K6O6672K4053l9407K22j00495N3072
$$ plain form
2794 4566127 4725599 4840313 4867537 4802450 4757805 4806877 4782575 4737273 4842361 4814615 4935578
2783 4935578 5053751 5252934 5390713 5230149 5079747 5071739 5245476 5389155 5271776 5410084
2773 5410084 5490355 5508549 5687426 5702974 5780323 5798302 5854368 5829508 5891214 5904709 6103300
2762 6103300 6172603 6161098 6088088 5971057 6146138 6129324 6161785 6329205 6431542 6553930
2752 6553930 6614693 6765642 6911136 6846317 6757928 6844197 6830930 6818066 6976093 7001244 7115419
2741 7115419 7097112 7305361 7490801 7648150 7605294 7590111 7430234 7612997 7639849 7560320
2731 7560320 7703112 7699199 7719654 7837338 7871067 7865685 7997455 8195349 8120370 8005750 8035386
2720 8035386 7991138 8014762 8018876 7884283 7962643 7867290 7980011 7925930 7853959 7939888 7967846
$$ packed form
2794D566127J59472J14714K7224o5087m4645M9072k4302m5302J05088k7746J20963
2783D935578J18173J99183J37779j60564j50402q008J73737J43679j17379J38308
2773E410084Q0271J8194J78877J5548P7349J7979N6066k4860O1706J3495J98591
2762F103300O9303j1505p3010j17031J75081j6814L2461J67420J02337J22388
2752F553930O0763J50949J45494o4819q8389Q6269j3267j2864J58027K5151J14175
2741G115419j8307K08249J85440J57349m2856j5183j59877J82763K6852p9529
2731G560320J42792l913K0455J17684L3729n382J31770J97894p4979j14620K9636
2720H035386m4248K3624M114j34593P8360r5353J12721n4081p1971Q5929K7958
$$ plain form
2709 7967846 8126278 8199278 8167506 8058324 8028576 7940570 8112105 8207876 8145325 8198988 8328771
2698 8328771 8299772 8245891 8408909 8550376 8634617 8631395 8638425 8743920 8779136 8782005 8694213
2687 8694213 8972753 9075302 9039332 9085394 9138344 9245469 9361215 9390151 9311977 9358611 9544035
2676 9544035 9504020 9469178 9483413 9588988 9522209 9700603 9809561 9954264 10085709 10085977 10235776
2665 10235776 10403745 10427793 10531707 10707707 10947860 10953701 10995575 11369172 11512305 11811376
2655 11811376 12127660 12437328 12552930 12961483 13375164 13519123 13945867 14187431 14511321
2646 14511321 14926412 15269107 15734503 16375607 16915749 17339751 17705577 17956581 18561130
2637 18561130 19168581 19483653 19967351 20388470 20624985 21041913 21352541 22010466 22412601
$$ packed form
2709G967846J58432P3000l1772j09182k9748q8006J71535R5771o2551N3663J29783
2698H328771k8999n3881J63018J41467Q4241l222P030J05495L5216K869q7792
2687H694213K78540J02549l5970M6062N2950J07125J15746K8936p8174M6634J85424
2676I544035m0015l4842J4235J05575o6779J78394J08958J44703J31445K68J49799
2665A0235776J67969K4048J03914J76000K40153N841M1874L73597J43133K99071
2655A1811376L16284L09668J15602M08553M13681J43959M26744K41564L23890
2646A4511321M15091L42695M65396O41104N40142M24002L65826K51004O04549
2637A8561130O07451L15072M83698M21119K36515M16928L10628O57925M02135
$$ plain form
2628 22412601 22611180 23021559 23388285 23735537 23925963 24033722 24339837 24446562 24551053
2619 24551053 24702761 24662795 24600229 24589621 24493191 24478151 24312919 24142492 23968664 23609589
2609 23609589 23411135 23389287 23177273 22652491 22264680 21938085 21658969 21226457 20861430 20681642
2599 20681642 20270192 19980156 19726642 19100231 18725749 18136528 17755046 17560464 17387825
2590 17387825 17021503 16667503 16309554 16024656 15728401 15276867 15052693 14970762 14792628 14568973
2580 14568973 14380875 14203516 13962686 13679250 13573474 13585119 13459637 13482404 13481918 13508608
2570 13508608 13432875 13422382 13443209 13293227 13266084 13252013 13287122 13342266 13491331 13504101 13627722
2559 13627722 13661670 13776376 13640559 13571734 13610051 13737309 13884708 13754834 13758273 13681535
$$ packed form
2628B2412601J98579M10379L66726L47252J90426J07759L06115J06725J04491
2619B4551053J51708l9966o2566j0608r6430j5040j65232j70427j73828l59075
2609B3609589j98454k1848k12014n24782l87811l26595k79116m32512l65027j79788
2599B0681642m11450k90036k53514o26411l74482n89221l81482j94582j72639
2590A7387825l66322l54000l57949k84898k96255m51534k24174q1931j78134k23655
2580A4568973j88098j77359k40830k83436j05776J1645j25482K2767m86K6690
2570A3508608p5733j0493K0827j49982k7143j4071L5109N5144J49065J2770J23621
2559A3627722L3948J14706j35817o8825L8317J27258J47399j29874L439p6738
$$ plain form
2549 13681535 13732675 13678859 13714948 13820376 13889403 13994312 13882056 13796307 13955136 13915904
2539 13915904 13887681 13846921 13851171 13988366 14175164 14194548 14118365 14164607 14108738 14235682 14398323
2528 14398323 14530820 14542783 14722081 14888859 15092565 15040898 15090088 15192021 15408238 15544567
2518 15544567 15747760 15701205 15850772 15980547 16063912 16188860 16416106 16479990 16516798 16456638
2508 16456638 16489225 16584703 16758475 16871324 16752377 16820846 16916326 17052092 17122115 17203653
2498 17203653 17196892 17153485 17014451 16888369 16914220 16831250 16749656 16832381 16858821 16885738 16864718
2487 16864718 16642711 16455393 16446904 16463092 16570584 16542578 16623015 16469846 16508063 16735106
2477 16735106 16946136 16969972 17052231 17378168 17571787 17580413 17628532 17827480 18016190 18355128
$$ packed form
2549A3681535N1140n3816L6089J05428O9027J04909j12256q5749J58829l9232
2539A3915904k8223m0760M250J37195J86798J9384p6183M6242n5869J26944J62641
2528A4398323J32497J1963J79298J66778K03706n1667M9190J01933K16217J36329
2518A5544567K03193m6555J49567J29775Q3365J24948K27246O3884L6808o0160
2508A6456638L2587R5478J73772J12849j18947O8469R5480J35766P0023Q1538
2498A7203653o761m3407j39034j26082K5851q2970q1594Q2725K6440K6917k1020
2487A6864718k22007j87318q489J6188J07492k8006Q0437j53169L8217K27043
2477A6735106K11030K3836Q2259L25937J93619Q626M8119J98948J88710L38938
$$ plain form
2467 18355128 18688175 18910477 19183761 19565978 19892699 20138378 20539019 20974502 21329829
2458 21329829 21621289 22055822 22475103 23046117 23759847 24460637 25002468 25390495 25855630
2449 25855630 26505082 27109337 27795799 28375652 29070289 29730349 30349922 30912641 31499010
2440 31499010 32079015 32709711 33164193 33768111 34378944 35005066 35624153 36171991 36788232
2431 36788232 37509023 38211493 38737469 39275231 39906774 40590504 41011947 41589901 42090414
2422 42090414 42393834 42712776 42959439 43184675 43205364 43098380 42838717 42623879 42101308 41618684
2412 41618684 40944792 40308671 39632231 38949549 38221561 37326236 36616956 35835183 35112854
2403 35112854 34261670 33641728 32802198 31844417 30924888 30264207 29434135 28555700 27843464
$$ packed form
2467A8355128L33047K22302K73284L82217L26721K45679M00641M35483L55327
2458B1329829K91460M34533M19281N71014P13730P00790N41831L88027M65135
2449B5855630O49452O04255O86462N79853O94637O60060O19573N62719N86369
2440C1499010N80005O30696M54482O03918O10833O26122O19087N47838O16241
2431C6788232P20791P02470N25976N37762O31543O83730M21443N77954N00513
2422D2090414L03420L18942K46663K25236K0689j06984k59663k14838n22571m82624
2412D1618684o73892o36121o76440o82682p27988q95325p09280p81773p22329
2403C5112854q51184o19942q39530r57781r19529o60681q30072q78435p12236
$$ plain form
2394 27843464 27012478 26170209 25375568 24675358 23950971 23174370 22529183 22048017 21398554
2385 21398554 20661115 20126544 19689337 19211851 18776736 18360342 17647727 17302984 16902516
2376 16902516 16457056 16240797 15840937 15669748 15420626 14983537 14756830 14446758 14306537
2367 14306537 14123777 13912630 13841062 13831605 13452679 13276171 13180240 13061508 13032404 12939946
2357 12939946 12957945 12848866 12635529 12595002 12483923 12643029 12628599 12536299 12545992 12413698
2347 12413698 12259785 12289831 12175390 11957160 11857141 11840849 11738773 11411339 11290214 11191988
2337 11191988 11120890 11017285 10738063 10477150 10375350 10181474 10004107 9963404 9819426 9566482
2327 9566482 9390305 9219340 9263648 9156032 8904827 8901280 8850039 8675799 8757095 8581739
$$ packed form
2394B7843464q30986q42269p94641p00210p24387p76601o45187m81166o49463
2385B1398554p37439n34571m37207m77486m35115m16394p12615l44743m00468
2376A6902516m45460k16259l99860j71189k49122m37089k26707l10072j40221
2367A4306537j82760k11147p1568r457l78926j76508r5931j18732k9104r2458
2357A2939946J7999j09079k13337m0527j11079J59106j4430r2300R693j32294
2347A2413698j53913L0046j14441k18230j00019j6292j02076l27434j21125r8226
2337A1191988p1098j03605k79222k60913j01800j93876j77367m0703j43978k52944
2327I566482j76177j70965M4308j07616k51205l547n1241j74240Q1296j75356
$$ plain form
2317 8581739 8430284 8390066 8321621 8315418 8279026 8187017 8161824 8163602 8098996 8012481 7970065 7874239
2305 7874239 8033202 7912922 7651679 7701099 7808261 7702089 7682914 7783019 7797985 7806661
2295 7806661 7699805 7735903 7669715 7595292 7627807 7683289 7678408 7628014 7738979 7778145 7770985
2284 7770985 7797021 7923112 8009957 7910682 7785047 7849527 8051992 8037291 7896129 7974167 8018509
2273 8018509 8250223 8131937 8221850 8481416 8505519 8716335 8695513 8698875 8900479 8980518 8908383
2262 8908383 8937105 9056905 9181713 9358935 9685469 9799429 9874546 9838603 9872302 9941118
2252 9941118 10169592 10460870 10626443 10661283 10674042 10919951 11099150 11196838 11372373 11577158
2242 11577158 11933545 12339861 12520703 12548013 12689971 12925916 13235411 13602242 13868916 14031314
$$ packed form
2317H581739j51455m0218o8445o203l6392r2009k5193J778o4606q6515m2416r5826
2305G874239J58963j20280k61243M9420J07162j06172j9175J00105J4966Q676
2295G806661j06856L6098o6188p4423L2515N5482m881n0394J10965L9166p160
2284G770985K6036J26091Q6845r9275j25635O4480K02465j4701j41162P8038M4342
2273H018509K31714j18286Q9913K59566K4103K10816k0822L362K01604Q0039p2135
2262H908383K8722J19800J24808J77222L26534J13960P5117l5943L3699O8816
2252I941118K28474K91278J65573L4840J2759K45909J79199R7688J75535K04785
2242A1577158L56387M06316J80842K7310J41958K35945L09495L66831K66674J62398
$$ plain form
2232 14031314 14379517 14704524 15121732 15342123 15537668 16048138 16467969 16807430 17396635
2223 17396635 17815381 18254022 18677083 19143937 19711621 20270371 20870995 21399529 22027700
2214 22027700 22769751 23549724 24337862 25127321 25947028 26969779 27966470 29068306 30068367
2205 30068367 31129078 32299089 33660482 35020377 36420267 37761032 39250640 40805087
2197 40805087 42097612 43595985 45165264 46815429 48459112 50003716 51500370 52999436
2189 52999436 54389087 55640068 56754726 57743939 58584839 59297894 60029815 60474443 60855863
2180 60855863 61067651 61290370 61334161 61248933 61128813 60676465 60173812 59559908 58770994 57764790
2170 57764790 56662235 55437862 54231903 52997742 51617706 50280826 48946885 47819336
$$ packed form
2232A4031314L48203L25007M17208K20391J95545N10470M19831L39461N89205
2223A7396635M18746M38641M23061M66854N67684N58750O00624N28534O28171
2214B2027700P42051P79973P88138P89459Q19707J022751R96691J101836J000061
2205C0068367J060711J170011J361393J359895J399890J340765J489608J554447
2197D0805087J292525J498373J569279J650165J643683J544604J496654J499066
2189E2999436J389651J250981J114658R89213Q40900P13055P31921M44628L81420
2180F0855863K11788K22719M3791q5228j20120m52348n02653o13904p88914j006204
2170E7764790j102555j224373j205959j234161j380036j336880j333941j127549
$$ plain form
2162 47819336 46287386 44810943 43491282 42088228 40872426 39662056 38515112 37528841
2154 37528841 36259523 34861345 34030891 33192925 32325757 31490943 30620085 29768229 28971663
2145 28971663 28227094 27424627 26896161 26398970 25755018 25106955 24667601 24110379 23724568
2136 23724568 23296833 22973729 22674089 22230823 21881448 21548320 21157010 20912591 20578902
2127 20578902 20299812 20051756 19594712 19551507 19405564 19223317 18886533 18733183 18600920 18344863
2117 18344863 17987559 17804657 17593951 17460946 17186905 16926106 16949653 16965248 16693094 16446045
2107 16446045 16246564 16105342 15924449 15857297 15842969 15650058 15461822 15334222 15252984 15261074
2097 15261074 15257268 15201138 15118026 15021990 15086791 14938457 14780075 14683779 14650010 14601211 14534268
$$ packed form
2162D7819336j531950j476443j319661j403054j215802j210370j146944r86271
2154C7528841j269318j398178q30454q37966q67168q34814q70858q51856p96566
2145B8971663p44569q02467n28466m97191o43952o48063m39354n57222l85811
2136B3724568m27735l23104k99640m43266l49375l33128l91310k44419l33689
2127B0578902k79090k48056m57044m3205j45943j82247l36784j53350j32263k56057
2117A8344863l57304j82902k10706j33005k74041k60799K3547J5595k72154k47049
2107A6446045j99481j41222j80893o7152j4328j92911j88236j27600q1238Q090
2097A5261074l806n6130q3112r6036O4801j48334j58382r6296l3769m8799o6943
$$ plain form
2086 14534268 14419653 14329993 14183560 14104754 14144667 14066110 13830046 13606360 13552489 13622191
2076 13622191 13509455 13414631 13475690 13560943 13591798 13571551 13571402 13543428 13695664 13669853 13695331
2065 13695331 13644247 13756903 13850404 13999101 14275595 14337354 14566145 14666184 14880685 15309579
2055 15309579 15494345 15726299 15919579 16306908 16737764 17045334 17273733 17600059 18014366
2046 18014366 18420693 18890683 19386143 19861736 20271843 20744700 21291266 21837412 22409010
2037 22409010 22855632 23374783 23931617 24458489 25124899 25542739 25928138 26211778 26688206
$$ packed form
2086A4534268j14615q9660j46433p8806L9913p8557k36064k23686n3871O9702
2076A3622191j12736r4824O1059Q5253L0855k0247j49k7974J52236k5811K5478
2065A3695331n1084J12656R3501J48697K76494O1759K28791J00039K14501M28894
2055A5309579J84766K31954J93280L87329M30856L07570K28399L26326M14307
2046A8014366M06327M69990M95460M75593M10107M72857N46566N46146N71598
2037B2409010M46622N19151N56834N26872O66410M17840L85399K83640M76428
$$ [...]
##END NTUPLES=NMR SPECTRUM
##END=
