##TITLE=1H_TG-2307-Ic3
 CDCl3
 8 sc, 
 6.7.2023
##JCAMPDX= 6.0         $$ Bruker NMR JCAMP-DX V2.0
##DATA TYPE= NMR SPECTRUM
##DATA CLASS= NTUPLES
##ORIGIN= UXNMR, Bruker Analytische Messtechnik GmbH
##OWNER= root
$$ XWIN-NMR		Version 3.5
$$ Thu Jul  6 15:01:06 2023 Russian Standard Time (UT+4h)  she@DPX200
##.OBSERVE FREQUENCY= 200.13135
##.OBSERVE NUCLEUS= ^1H
##.ACQUISITION MODE= SIMULTANEOUS
##.ACQUISITION SCHEME= undefined
##.AVERAGES= 8
##.DIGITISER RES= 18
##SPECTROMETER/DATA SYSTEM= spect
##.PULSE SEQUENCE= zg30
##.SOLVENT NAME= CDCl3
##.SHIFT REFERENCE= (INTERNAL, CDCl3, 0, 15.7447)
##AUDIT TRAIL= $$ (NUMBER, WHEN, WHO, WHERE, WHAT)
$$ ##TITLE= Audit trail, XWIN-NMR		Version 3.5
$$ ##JCAMPDX= 5.01
$$ ##ORIGIN= Bruker BioSpin GmbH
$$ ##OWNER= she
$$ F:/spectra/data/she/nmr/H-F/1/pdata/1/auditp.txt
$$ ##AUDIT TRAIL=  $$ (NUMBER, WHEN, WHO, WHERE, WHAT)
(   1,<2023-07-06 15:00:00.31 +0400>,<she>,<DPX200>,
      <created by zg, POWCHK disabled, PULCHK disabled
       configuration hash MD5:
       00 E9 B6 7A A2 85 ED C7 34 08 36 98 17 FE 4E 26
       data hash MD5: 16K
       3E DF C9 91 F6 36 AF D5 2D BD CD B4 3B DF 47 C7>)
(   2,<2023-07-06 15:00:02.70 +0400>,<she>,<DPX200>,
      <Start of raw data processing
       efp BC_mod = 2 LB = 0.24 FT_mod = 6 PKNL = 1 PHC0 = -20789.96 PHC1 = 11.85272 SI = 16K 
       data hash MD5: 16K
       A8 1E 40 C7 8F FA 59 6B A9 EE F5 91 4C 3A C4 E4>)
(   3,<2023-07-06 15:00:18.87 +0400>,<she>,<DPX200>,
      <pk PHC0 = 1.31656 PHC1 = 1.4 
       data hash MD5: 16K
       56 1E 15 ED ED B4 BA 6A 1A 8C 22 05 7F 8B A0 C2>)
(   4,<2023-07-06 15:00:22.18 +0400>,<she>,<DPX200>,
      <abs ABSG = 5 
       data hash MD5: 16K
       3C FA E9 38 F3 1C 00 6B D0 CF D9 45 40 B5 58 F0>)
$$ ##END=
$$ 
$$ hash MD5
$$ E6 A0 A7 A3 13 D4 04 1E 47 1B 31 37 E0 78 08 BC
##$RELAX= 
##$RELAX= 
##$RELAX= 
##$RELAX= 
##$RELAX= 
##$RELAX= 
$$ Bruker specific parameters
$$ --------------------------
##$DU= <F:/spectra>
##$EXPNO= 1
##$NAME= <H-F>
##$PROCNO= 1
##$TYPE= <nmr>
##$USER= <she>
##$AMP= (0..31)
100 100 100 100 100 100 100 100 100 100 100 100 100 100 100 100 100 100 
100 100 100 100 100 100 100 100 100 100 100 100 100 100 
##$AQSEQ= 0
##$AQ_mod= 1
##$AUNM= <au_zg>
##$AUTOPOS= <>
##$BF1= 200.13
##$BF2= 200.13
##$BF3= 200.13
##$BF4= 200.13
##$BF5= 200.13
##$BF6= 200.13
##$BF7= 200.13
##$BF8= 200.13
##$BYTORDA= 1
##$CFDGTYP= 0
##$CFRGTYP= 5
##$CHEMSTR= <none>
##$CNST= (0..31)
1 1 145 1 1 1 1 1 1 1 1 1 1 1 1 1 1 1 1 1 1 1 1 1 1 1 1 1 1 1 1 1 
##$CPDPRG= <>
##$CPDPRG1= <>
##$CPDPRG2= <>
##$CPDPRG3= <>
##$CPDPRG4= <mlev>
##$CPDPRG5= <mlev>
##$CPDPRG6= <mlev>
##$CPDPRG7= <mlev>
##$CPDPRG8= <mlev>
##$CPDPRGB= <>
##$CPDPRGT= <>
##$D= (0..31)
0 1.2 0 0 0 0 0 0 0 0.06 0 0.03 0 0 0 0 0.0002 0 0 0 0 0 0 0 0 0 0 0 0 
0 0 0 
##$DATE= 1688641199
##$DBL= (0..7)
120 120 120 120 120 120 120 120 
##$DBP= (0..7)
150 150 150 150 150 150 150 150 
##$DBP07= 0
##$DBPNAM0= <>
##$DBPNAM1= <>
##$DBPNAM2= <>
##$DBPNAM3= <>
##$DBPNAM4= <>
$$ [...]
##$SUBNAM3= <"">
##$SUBNAM4= <"">
##$SUBNAM5= <"">
##$SUBNAM6= <"">
##$SUBNAM7= <"">
##$SUBNAM8= <"">
##$SUBNAM9= <"">
##$SW= 18.05172834244
##$SWIBOX= (0..15)
0 0 2 0 0 0 0 0 0 0 0 0 0 0 0 0 
##$SW_h= 3612.71676300578
##$TD= 16384
##$TD0= 1
##$TE= 0
##$TE2= 300
##$TE3= 300
##$TEG= 300
##$TL= (0..7)
0 120 120 120 120 120 120 120 
##$TP= (0..7)
150 150 150 150 150 150 150 150 
##$TP07= 0
##$TPNAME0= <>
##$TPNAME1= <>
##$TPNAME2= <>
##$TPNAME3= <>
##$TPNAME4= <>
##$TPNAME5= <>
##$TPNAME6= <>
##$TPNAME7= <>
##$TPOAL= (0..7)
0.5 0.5 0.5 0.5 0.5 0.5 0.5 0.5 
##$TPOFFS= (0..7)
0 0 0 0 0 0 0 0 
##$TUNHIN= 0
##$TUNHOUT= 0
##$TUNXOUT= 0
##$USERA1= <user>
##$USERA2= <user>
##$USERA3= <user>
##$USERA4= <user>
##$USERA5= <user>
##$V9= 5
##$VALIST= <valist>
##$VCLIST= <CCCCCCCCCCCCCCC>
##$VD= 0
##$VDLIST= <DDDDDDDDDDDDDDD>
##$VPLIST= <PPPPPPPPPPPPPPP>
##$VTLIST= <TTTTTTTTTTTTTTT>
##$WBST= 1024
##$WBSW= 4
##$XGAIN= (0..3)
0 0 0 0 
##$XL= 0
##$YL= 0
##$YMAX_a= 133409
##$YMIN_a= -102382
##$ZGOPTNS= <>
##$ZL1= 120
##$ZL2= 120
##$ZL3= 120
##$ZL4= 120
##$ABSF1= 15.75681
##$ABSF2= -2.295039
##$ABSG= 5
##$ABSL= 3
##$ALPHA= 0
##$AQORDER= 0
##$ASSFAC= 0
##$ASSFACI= 0
##$ASSFACX= 0
##$ASSWID= 0
##$AUNMP= <proc_1d>
##$AZFE= 0.1
##$AZFW= 0.1
##$BCFW= 0
##$BC_mod= 2
##$BYTORDP= 0
##$COROFFS= 0
##$CY= -3
##$DATMOD= 1
##$DC= 0
##$DFILT= <>
##$DTYPP= 0
##$F1P= 0
##$F2P= 0
##$FCOR= 1
##$FTSIZE= 16384
##$FT_mod= 6
##$GAMMA= 0
##$GB= 0
##$INTBC= 1
##$INTSCL= 3.70164e-10
##$ISEN= 128
##$LB= 0.24
##$LEV0= 0
##$LPBIN= 0
##$MAXI= 10000
##$MC2= 0
##$MEAN= 0
##$ME_mod= 0
##$MI= 1.114404
##$NCOEF= 0
##$NC_proc= -8
##$NLEV= 6
##$NOISF1= 3.799351
##$NOISF2= 2.8
##$NSP= 0
##$NTH_PI= 0
##$NZP= 0
##$OFFSET= 15.74469
##$PC= 1
##$PHC0= -20788.64
##$PHC1= 13.25272
##$PH_mod= 1
##$PKNL= yes
##$PPARMOD= 0
##$PSCAL= 0
##$PSIGN= 0
##$REVERSE= no
##$SF= 200.130005374776
##$SI= 16384
##$SIGF1= 3
##$SIGF2= 2
##$SINO= 5.538805
##$SIOLD= 16384
##$SREGLST= <1H.CDCl3>
##$SSB= 0
##$STSI= 16384
##$STSR= 0
##$SW_p= 3612.71676300578
##$SYMM= 0
##$S_DEV= 0
##$TDeff= 16384
##$TDoff= 0
##$TI= <>
##$TILT= no
##$TM1= 0
##$TM2= 0
##$TOPLEV= 0
##$USERP1= <user>
##$USERP2= <user>
##$USERP3= <user>
##$USERP4= <user>
##$USERP5= <user>
##$WDW= 1
##$XDIM= 16384
##$YMAX_p= 372597367
##$YMIN_p= -1877486
$$ End of Bruker specific parameters
$$ ---------------------------------
##NTUPLES= NMR SPECTRUM
##VAR_NAME=  FREQUENCY,     SPECTRUM/REAL,   SPECTRUM/IMAG
##SYMBOL=    X,             R,               I
##VAR_TYPE=  INDEPENDENT,   DEPENDENT,       DEPENDENT
##VAR_FORM=  AFFN,          ASDF,            ASDF
##VAR_DIM=   16384,         16384,           16384
##UNITS=     HZ,            ARBITRARY UNITS, ARBITRARY UNITS
##FACTOR=    0.220516191357247, 1,           1
##FIRST=     3150.98488259781, 0,            0
##LAST=      -461.731880407965, 0,           0
##MIN=       -461.731880407965, -1877486,    0
##MAX=       3150.98488259781, 372597367,    0
$$ Real data points
##PAGE= N=1
##DATA TABLE= (X++(R..R)), XYDATA
$$ [...]
$$ plain form
5706 3700407 3604527 3749400 3608621 3537967 3488138 3670167 3842002 3636926 3584089 3649576
5696 3649576 3289890 3250495 3546232 3686360 3557553 3614794 3445805 3285860 3370662 3149819
5686 3149819 3293719 3381924 3303262 3118503 3262427 3338953 3141848 3192592 3449719 3326872
5676 3326872 3444545 3504626 3276535 3349264 3370099 3371462 3365873 3261791 3400780 3350410 3346024
5665 3346024 3371319 3662185 3591445 3656201 3686098 3773337 3637263 3772372 3823147 3593411 3714677
5654 3714677 4011263 3806800 3783586 3885498 3950331 3996591 4249142 4419580 4331506 4332730 4145006
5643 4145006 4319272 4469636 4625494 4801755 4683723 4723232 4617019 4684338 4791848 4880005
5633 4880005 5280503 5436126 5383689 5567020 5934750 5930229 6241744 6614792 6907479 7453316
$$ packed form
5706C700407r5880J44873j40779p0654m9829J82029J71835k05076n2837O5487
5696C649576l59686l9395K95737J40128j28807N7241j68989j59945Q4802k20843
5686C149819J43900Q8205p8662j84759J43924P6526j97105N0744K57127j22847
5676C326872J17673O0081k28091P2729K0835J363n589j04082J38989n0370m386
5665C346024K5295K90866p0740O4756K9897Q7239j36074J35109N0775k29736J21266
5654C714677K96586k04463k3214J01912O4833M6260K52551J70438q8074J224j87724
5643D145006J74266J50364J55858J76261j18032L9509j06213O7319J07510Q8157
5633D880005M00498J55623n2437J83331L67730m521L11515L73048K92687N45837
$$ plain form
5623 7453316 7816792 8103634 8506856 8977055 9520162 10035904 10548657 10972859 11210030 11347777
5613 11347777 11113346 10848727 10607994 10294397 10145764 9810004 9334201 9302978 9280424 9223200
5603 9223200 9439594 9539890 9888072 9999947 10084923 10424317 10680436 10813197 10857228 10533601
5593 10533601 10524060 10426525 9824546 9671061 9154137 8401870 8010577 7399421 7268936 7100402
5583 7100402 6591438 6294105 5984672 5671426 5494321 5682610 5500089 5031186 4808440 5026105
5573 5026105 4997781 4737703 4823647 4853403 4756592 4719022 4801911 4874309 4863680 4466392 4450456
5562 4450456 4524308 4743749 4668013 4615494 4564708 4835518 4835318 4701692 4604253 4735067 4943276
5551 4943276 4822973 4827431 4761924 4773402 4791771 4718579 4747806 4758776 4660368 4750699 5086653
$$ packed form
5623G453316L63476K86842M03222M70199N43107N15742N12753M24202K37171J37747
5613A1347777k34431k64619k40733l13597j48633l35760m75803l1223k2554n7224
5603I223200K16394J00296L48182J11875Q4976L39394K56119J32761M4031l23627
5593A0533601r541r7535o01979j53485n16924p52267l91293o11156j30485j68534
5583G100402n08964k97333l09433l13246j77105J88289j82521m68903k22746K17665
5573E026105k8324k60078Q5944K9756r6811l7570Q2889P2398j0629l97288j5936
5562D450456P3852K19441p5736n2519n0786K70810k00j33626r7439J30814K08209
5551D943276j20303M458o5507J1478J8369p3192K9227J0970r8408R0331L35954
$$ plain form
5540 5086653 5204704 5043322 5302966 5407247 5741124 5781795 5727908 5708640 6159973 6322740
5530 6322740 6119149 6195156 6206323 6202312 5932249 5743390 5843662 5736118 5584059 5405555
5520 5405555 5081364 5087459 5114472 5143236 5202461 5330337 5086434 5094820 4976649 5337076 5567411
5509 5567411 5689293 5816102 6038215 6071381 6147087 6173008 5757665 5871473 5719486 5592469
5499 5592469 5440691 5509671 5627616 5666322 5796299 6031395 6237492 6173678 6217446 6483540
5489 6483540 6540629 6679110 6938008 6998328 7008758 6940537 6834403 6885853 6806327 6839708 7019535
5478 7019535 7234228 7641337 8111089 8646530 9049622 9115396 8385256 7588045 7212023 6639903
5468 6639903 6362719 5970993 5737147 5757328 5950193 5748978 5525382 5561638 5703629 5731415
$$ packed form
5540E086653J18051j61382K59644J04281L33877M0671n3887j9268M51333J62767
5530F322740k03591P6007J1167m011k70063j88859J00272j07544j52059j78504
5520E405555l24191O095K7013K8764N9225J27876k43903Q386j18171L60427K30335
5509E567411J21882J26809K22113L3166P5706K5921m15343J13808j51987j27017
5499E592469j51778O8980J17945L8706J29977K35096K06097o3814M3768K66094
5489F483540N7089J38481K58898O0320J0430o8221j06134N1450p9526L3381J79827
5478G019535K14693M07109M69752N35441M03092O5774p30140p97211l76022n72120
5468F639903k77184l91726k33846K0181J92865k01215k23596L6256J41991K7786
$$ plain form
5458 5731415 5805139 6050304 6259577 6402159 6296928 6423018 6331471 6519742 6710763 6681094
5448 6681094 7073815 7322766 7838312 8455059 8946884 9366804 9913038 9725662 8914363 8195873
5438 8195873 7717101 7404140 6953398 6420432 6186995 5856045 5813806 5601998 5384623 5231017
5428 5231017 5212504 5269228 5255179 5240791 5114074 5116777 5207194 5426306 5416475 5528241 5276901
5417 5276901 5368004 5574556 5687793 5728315 5844677 6005822 6269776 6337761 6099537 5996021
5407 5996021 5882786 5678184 5578548 5601438 5555933 5627209 5709316 5781843 5992237 6111555 6125798
5396 6125798 6113056 6255946 6486225 6625976 6508895 6239630 6183461 6297016 6334053 6433520
5386 6433520 6525206 6570644 6599774 6561197 6403067 6396615 6168155 6001233 5781961 5633226 5472915
$$ packed form
5458E731415P3724K45165K09273J42582j05231J26090r1547J88271J91021k9669
5448F681094L92721K48951N15546O16747M91825M19920N46234j87376q11299p18490
5438H195873m78772l12961m50742n32966k33437l30950m2239k11808k17375j53606
5428E231017j8513N6724j4049j4388j26717K703R0417K19112r831J11766k51340
5417E276901R1103K06552J13237M0522J16362J61145K63954O7985k38224j03516
5407E996021j13235k04602r9636K2890m5505P1276Q2107P2527K10394J19318J4243
5396F125798j2742J42890K30279J39751j17081k69265n6169J13555L7037R9467
5386F433520R1686M5438K9130l8577j58130o452k28460j66922k19272j48735j60311
$$ plain form
5375 5472915 5071498 4974279 5041687 4922309 4762356 4667690 4706642 4705238 4887204 4899242 4676340
5364 4676340 4639427 4540609 4482129 4468252 4587350 4560867 4514067 4453442 4449379 4541905 4308094
5353 4308094 4270123 4332500 4572444 4392038 4302533 4564706 4457587 4648900 4848881 4619827
5343 4619827 4623921 4713256 4657665 4736868 4938051 4800525 4463966 4549561 4489848 4653644 4755841
5332 4755841 4740255 4756363 4863080 4937311 4771659 4812616 4898975 5100605 5093305 4896467 4906481
5321 4906481 4895386 5009602 5012259 5158642 5307537 5505064 5484380 5504283 5467443 5193436 5205534
5310 5205534 5210474 4976415 4642254 4426448 4330979 4333197 4210249 4151336 4234674 4260889 4084774
5299 4084774 3994437 4189714 4275841 4044002 4061065 4195176 4163696 4213133 4029255 4090488 4247883
$$ packed form
5375E472915m01417r7219O7408j19378j59953r4666L8952j404J81966J2038k22902
5364D676340l6913r8818n8480j3877J19098k6483m6800o0625m063R2526k33811
5353D308094l7971O2377K39944j80406q9505K62173j07119J91313J99981k29054
5343D619827M094Q9335n5591P9203K01183j37526l36559Q5595n9713J63796J02197
5332D755841j5586J6108J06717P4231j65652M0957Q6359K01630p300j96838J0014
5321D906481j1095J14216K657J46383J48895J97527k0684J9903l6840k74007J2098
5310E205534M940k34059l34161k15806r5469K218j22948n8913Q3338K6215j76115
5299D084774r0337J95277Q6127k31839J7063J34111l1480M9437j83878O1233J57395
$$ plain form
5288 4247883 4232376 4280350 4374980 4428362 4421054 4351388 4240784 4014057 3876421 3995774 3868076
5277 3868076 3594488 3627674 3578049 3424752 3336029 3066170 2876572 2796729 2823077 2834547 2823931
5266 2823931 2830673 2845440 2980450 2948977 2670482 2479917 2514534 2464097 2551047 2547477 2766015
5255 2766015 2726673 2644643 2660834 2513595 2533505 2501706 2063099 1933760 2113573 2054711 2165040
5244 2165040 2171210 2145657 2302448 2371011 2365338 2241524 2341339 2425852 2531766 2760690 2511383
5233 2511383 2360803 2555355 2599806 2555191 2605612 2918023 2881952 2748465 2688008 2541416
5223 2541416 2625893 2376976 2293923 2031624 2019143 1930063 1808084 1731198 1700273 1882245 1967056
5212 1967056 1981901 1979212 1928641 1915549 1892795 1983877 1888069 1631766 1647015 1680276 1636827
$$ packed form
5288D247883j5507M7974R4630N3382p308o9666j10604k26727j37636J19353j27698
5277C868076k73588L3186m9625j53297q8723k69859j89598p9843K6348J1470j0616
5266B823931O742J4767J35010l1473k78495j90565L4617n0437Q6950l570K18538
5255B766015l9342q2030J6191j47239J9910l1799m38607j29339J79813n8862J10329
5244B165040O170k5553J56791O8563n673j23814R9815Q4513J05914K28924k49307
5233B511383j50580J94552M4451m4615N0421L12411l6071j33487o0457j46592
5223B541416Q4477k48917q3053k62299j2481q9080j21979p6886l0925J81972Q4811
5212A967056J4845k689n0571j3092k2754R1082r5808k56303J5249L3261m3449
$$ plain form
5201 1636827 1824285 1908682 1879026 1765284 1847024 1785011 1763458 1681008 1810460 1795820 1878782
5190 1878782 2057286 1987491 1757390 1788460 1896573 1833835 1869840 1544661 1664838 1594430
5180 1594430 1541450 1586439 1604485 1807490 1913811 1766754 2010076 2046343 2041672 2052499 1907216
5169 1907216 1889010 1995654 2102058 1926899 1787070 1745627 1707901 1823862 1763292 1620116
5159 1620116 1758688 1891719 2070911 2072843 1697145 1688047 1777835 1957070 2119106 1949702
5149 1949702 2086186 1879374 1911878 1790514 1747702 1978682 1886312 1907976 1870837 1994543
5139 1994543 1884603 1883849 2025244 2171768 2142738 2060176 2076598 2021454 1942345 1742352 1797996
5128 1797996 2124253 2022656 2117363 2173634 2164123 2109856 2122781 2165813 2034559 2133624 2423999
$$ packed form
5201A636827J87458Q4397k9656j13742Q1740o2013k1553q2450J29452j4640Q2962
5190A878782J78504o9795k30101L1070J08113o2738L6005l25179J20177p0408
5180A594430n2980M4989J8046K03005J06321j47057K43322L6267m671J0827j45283
5169A907216j8206J06644J06404j75159j39829m1443l7726J15961o0570j43176
5159A620116J38572J33031J79192J932l75698r098Q9788J79235J62036j69404
5149A949702J36484k06812L2504j21364m2812K30980r2370K1664l7139J23706
5139A994543j09940p54J41395J46524k9030q2562J6422n5144p9109j99993N5644
5128A797996L26257j01597R4707N6271r511n4267J2925M3032j31254R9065K90375
$$ plain form
5117 2423999 2604977 2569561 2593516 2375541 2446671 2467080 2342901 2374145 2533407 2749487
5107 2749487 2886448 2778802 2541227 2546305 2641165 2728435 2832524 2836364 2775200 3011016 2848452
5096 2848452 2881150 3077221 2842331 2862322 3004785 3170914 2933992 2910475 3010595 2993810
5086 2993810 3015301 2846788 2907833 3011921 2973420 2840522 2842271 2965653 2781824 2668560
5076 2668560 2603420 2550956 2665091 2620775 2689959 2791089 2884752 2941094 3085191 3141765 3153295
5065 3153295 3143594 3049925 3164570 3395738 3393842 3352294 3293543 3535755 3660397 3746009 3676357
5054 3676357 3652398 3784193 3839870 4113209 4127397 3998866 3841833 3677048 3560187 3920040
5044 3920040 3790124 3787209 4024610 3988151 3850726 4071424 4235614 4325383 4346325 4270769 4145431
$$ packed form
5117B423999J80978l5416K3955k17975P1130K0409j24179L1244J59262K16080
5107B749487J36961j07646k37575N078R4860Q7270J04089L840o1164K35816j62564
5096B848452L2698J96071k34890J9991J42463J66129k36922k3517J00120j6785
5086B993810K1491j68513O1045J04088l8501j32898J749J23382j83829j13264
5076B668560o5140n2464J14135m4316O9184J01130R3663N6342J44097N6574J1530
5065C153295r701r3669J14645K31168j896m1548n8751K42212J24642Q5612o9652
5054C676357k3959J31795N5677K73339J4188j28531j57033j64785j16861L59853
5044C920040j29916k915K37401l6459j37425K20698J64190Q9769K0942p5556j25338
$$ plain form
5033 4145431 4035768 4031726 4246066 4090710 3902432 3915343 4090480 4163096 4260016 4292633 4089424
5022 4089424 4234004 4360740 4212368 4175366 4299952 4225544 4266742 4511706 4672701 4332216
5012 4332216 4283874 4491746 4596847 4556358 4730735 4747929 4628096 4824312 5000747 4965471
5002 4965471 5047277 4856149 5019705 5295700 5496278 5631104 5807380 5942297 6185595 6419468
4992 6419468 6197694 6368481 6601477 6495788 6508706 6787947 7180182 7530159 7961365 8147527
4982 8147527 8175392 8589413 9083874 9527082 9640704 10184983 10762449 10903520 11529562 12063705
4972 12063705 12599133 12902449 13213040 13396363 13529545 13744142 13413000 13242637 13664089
4963 13664089 13568413 13543326 13891537 14011559 14037104 14224427 14410380 14495792 14673327 14907664
$$ packed form
5033D145431j09663m042K14340j55356j88278J2911J75137P2616R6920L2617k03209
5022D089424J44580J26736j48372l7002J24586p4408M1198K44964J60995l40485
5012D332216m8342K07872J05101m0489J74377J7194j19833J96216J76435l5276
5002D965471Q1806j91128J63556K75995K00578J34826J76276J34917K43298K33873
4992F419468k21774J70787K32996j05689J2918K79241L92235L49977M31206J86162
4982H147527K7865M14021M94461M43208J13622N44279N77466J41071O26042N34143
4972A2063705N35428L03316L10591J83323J33182K14597l31142j70363M21452
4963A3664089r5676k5087L48211J20022K5545J87323J85953Q5412J77535K34337
$$ plain form
4953 14907664 15140304 15094899 14935248 14739216 14546357 14488738 14425495 14114028 13729950 13690741
4943 13690741 13661730 13526848 13373938 13412639 13665262 13705069 13819956 14177611 14556447 14890112
4933 14890112 15419323 16108790 17090151 17633478 18427804 19033086 19964749 20970725 21919207
4924 21919207 23019037 23674184 24168256 24899680 25373501 25611989 26310892 26857945 27201846
4915 27201846 27304268 27501007 27588287 27570549 27424052 27077889 26734932 26081001 25389998 24721273
4905 24721273 24236382 23727015 23385639 22857254 22679715 22304112 21970656 21535890 21274678
4896 21274678 20689859 19986264 19546851 19029495 18294589 17580219 17110515 16578783 16196193
4887 16196193 15932280 15679749 15260116 15039925 15146755 15371871 15470495 15550064 15561596 15901194
$$ packed form
4953A4907664K32640m5405j59651j96032j92859n7619o3243l11467l84078l9209
4943A3690741k9011j34882j52910L8701K52623L9807J14887L57655L78836L33665
4933A4890112N29211O89467R81361N43327P94326O05282R31663J005976R48482
4924B1919207J099830O55147M94072P31424M73821K38488O98903N47053L43901
4915B7201846J02422J96739Q7280j7738j46497l46163l42957o53931o91003o68725
4905B4721273m84891n09367l41376n28385j77539l75603l33456m34766k61212
4896B1274678n84819p03595m39413n17356p34906p14370m69704n31732l82590
4887A6196193k63913k52531m19633k20191J06830K25116R8624P9569J1532L39598
$$ plain form
4877 15901194 16572509 17015551 17386303 18423043 19201435 19999007 20722384 21222490 21505101
4868 21505101 21671349 21618497 21365344 20806090 20730460 20516176 20229418 20072976 20231066 20116616
4858 20116616 19914602 19845290 19624478 19483416 18711577 17900902 16980720 15953548 15122146
4849 15122146 14290192 13440952 12552801 12106227 11472477 10876666 10570356 10227529 9659582
4840 9659582 9661378 9690407 9230930 8965081 8730728 8711089 8639277 8248975 8372433 8241918
4830 8241918 8215862 8194156 7954070 8041315 8002062 8202170 8076604 7982249 8015397 7937642 7931763
4819 7931763 8042111 8150120 8110978 8184410 8248720 8444816 8447622 8316147 8493002 8583723 8881336
4808 8881336 9040983 9180206 9414214 9484549 9520310 9695533 9972679 10275755 10571652 10779622
$$ packed form
4877A5901194O71315M43042L70752J036740P78392P97572P23377N00106K82611
4868B1505101J66248n2852k53153n59254p5630k14284k86758j56442J58090j14450
4858B0116616k02014o9312k20812j41062p71839q10675r20182j027172q31402
4849A5122146q31954q49240q88151m46574o33750n95811l06310l42827n67947
4840I659582J796K9029m59477k65849k34353j9639p1812l90302J23458j30515
4830H241918k6056k1706k40086Q7245l9253K00108j25566r4355L3148p7755n879
4819G931763J10348J08009l9142P3432O4310J96096K806j31475J76855R0721K97613
4808H881336J59647J39223K34008P0335L5761J75223K77146L03076K95897K07970
$$ plain form
4798 10779622 10861593 11342515 11605748 11996027 12492497 12981782 13226935 13679457 14530939 15244298
4788 15244298 16003375 17125988 18852722 20689318 23194291 25387537 27051645 27672940
4780 27672940 27418571 25851957 24239635 23299253 22726582 22469696 22480405 22940353 23319428
4771 23319428 23804134 24172048 24540018 24881018 25209353 25198330 25221338 25450495 25479477 25536571
4761 25536571 26048682 26301903 26769851 26999883 26848679 26848725 26600062 25852218 25480058 24749505
4751 24749505 24263613 23677529 23303370 23312294 23230087 23272638 23513205 23669710 23734095 23981941
4741 23981941 24234638 24411127 24460212 24255572 23725896 23180020 22750475 22512539 22164631 21747968
4731 21747968 21580130 21404736 21379792 21389574 21628142 21984909 22190385 22525460 23111648 23898402
$$ packed form
4798A0779622Q1971M80922K63233L90279M96470M89285K45153M52522Q51482P13359
4788A5244298P59077J122613J726734J836596K504973K193246J664108O21295
4780B7672940k54369j566614j612322r40382n72671k56886J0709M59948L79075
4771B3319428M84706L67914L67970L41000L28335j1023K3008K29157K8982N7094
4761B5536571N12111K53221M67948K30032j51204M6k48663p47844l72160p30553
4751B4749505m85892n86084l74159Q924q2207M2551K40567J56505O4385K47846
4741B3981941K52697J76489M9085k04640n29676n45876m29545k37936l47908m16663
4731B1747968j67838j75394k4944R782K38568L56767K05476L35075N86188P86754
$$ plain form
4721 23898402 24801522 25831802 27078904 28299765 29185483 29947777 30622332 30769983 30833015
4712 30833015 30515146 30581890 31255585 32050876 32993795 33951338 34276638 33682929 32945850 31264189
4702 31264189 28910618 26874833 25094922 23561598 22440383 21162371 20067527 19296416
4694 19296416 18511938 17973776 17831660 17508442 17350657 17111752 17095886 17012255 16834751 16468122
4684 16468122 16158697 15855435 15289502 14631134 14246409 13866495 13175687 12797023 12408890
4675 12408890 11996174 11628364 11363038 11539585 11670544 11702585 11354039 11392378 11386595 11625444
4665 11625444 11737451 11983432 12287633 12535847 12536409 12334965 12081493 11627502 11330165 10643227
4655 10643227 9975926 9657152 9020831 8602166 8233936 7974127 7391959 7193852 7085669
$$ packed form
4721B3898402R03120J030280J247102J220861Q85718P62294O74555J47651O3032
4712C0833015l17869O6744O73695P95291R42919R57543L25300n93709p37079j681661
4702C1264189k353571k035785j779911j533324j121215j278012j094844p71111
4694A9296416p84478n38162j42116l23218j57785k38905j5866q3631j77504l66629
4684A6468122l09425l03262n65933o58368l84725l79914o90808l78664l88133
4675A2408890m12716l67810k65326J76547J30959L2041l48546L8339n783K38849
4665A1625444J12007K45981L04201K48214N62k01444k53472m53991k97337o86938
4655A0643227o67301l18774o36321m18665l68230k59809n82168j98107j08183
$$ plain form
4646 7085669 6700277 6615458 6564687 6414343 6178100 6121454 6038069 5836051 5515617 5402434
4636 5402434 5548406 5418077 5290879 5213311 5069308 4983624 5030515 4871962 4804052 4889107
4626 4889107 4675892 4541899 4341749 4485541 4575261 4396316 4241568 4405509 4161910 4235611
4616 4235611 4205832 4276318 4050694 3966587 4015801 4001683 3895024 3974746 4123021 4167494 3801674
4605 3801674 3752193 3877980 3873477 3819784 3700780 3816879 3677563 3414225 3380228 3405756 3581882
4594 3581882 3606113 3702284 3633824 3439606 3325553 3457772 3460014 3355743 3274893 3490984 3516902
4583 3516902 3408947 3346441 3360653 3225129 3166989 3145916 3132623 3317012 3246617 3042468 3220375
4572 3220375 3466748 3213443 3395528 3357094 3009626 2997368 3182560 3116936 3117352 3147602 3258766
$$ packed form
4646G085669l85392q4819n0771j50344k36243n6646q3385k02018l20434j13183
4636E402434J45972j30329j27198p7568j44003q5684M6891j58553o7910Q5055
4626D889107k13215j33993k00150J43792Q9720j78945j54748J63941k43599P3701
4616D235611k9779P0486k25624q4107M9214j4118j06659P9722J48275M4473l65820
4605C801674m9481J25787m503n3693j19004J16099j39316k63338l3997K5528J76126
4594C581882K4231R6171o8460j94218j14053J32219K242j04271q0850K16091K5918
4583C516902j07955o2506J4212j35524n8140k1073j3293J84389p0395k04149J77907
4572C220375K46373k53305J82085l8434l47468j2258J85192o5624M16L0250J11164
$$ plain form
4561 3258766 3231964 3315939 3396551 3230927 3113343 3122729 3237896 3398513 3351008 3269966 3012528
4550 3012528 3184108 3277947 3295460 3206572 3220826 3428686 3380550 3155528 3038227 3041955 2988476
4539 2988476 3021996 2996814 3147489 3202685 3183840 3030063 2889586 3025031 2993908 3230487
4529 3230487 2877485 2827938 2946447 2987933 2956286 2684898 2711190 2641260 2801047 3217970
4519 3217970 3156707 3051561 2963926 3041629 3104242 3044436 2796124 2636724 2831030 2749333 2761632
4508 2761632 2917474 3006290 2940462 2987272 3109183 2999378 2955475 2887333 2868489 3121526 3163876
4497 3163876 3029252 3137554 3375450 3438305 3342896 3406474 3555176 3620857 3492809 3534082
4487 3534082 3273626 2999105 2981500 2904207 2978499 2912918 2980261 3090294 2981131 3076844 2915402
$$ packed form
4561C258766k6802Q3975Q0612j65624j17584R386J15167J60617m7505q1042k57438
4550C012528J71580R3839J7513q8888J4254K07860m8136k25022j17301L728n3479
4539B988476L3520k5182J50675N5196j8845j53777j40477J35445l1123K36579
4529C230487l53002m9547J18509M1486l1647k71388K6292o9930J59787M16923
4519C217970o1263j05146q7635P7703O2613n9806k48312j59400J94306q1697J2299
4508B761632J55842Q8816o5828M6810J21911j09805m3903o8142j8844K53037M2350
4497C163876j34624J08302K37896O2855r5409O3578J48702O5681j28048M1273
4487C534082k60456k74521j7605p7293P4292o5581O7343J10033j09163R5713j61442
$$ plain form
4476 2915402 2985885 3155094 3180258 3196496 2854896 3071489 3306005 3346323 3279591 3089400
4466 3089400 2696346 2950530 2919874 3149956 3064218 2920225 2851898 2677037 3022623 3205376
4456 3205376 3029070 2853436 2914928 3069646 2924193 3082256 3078802 3126572 3054710 3092408 3265907
4445 3265907 3122153 3330350 3356833 3452042 3681863 3712308 3638299 3738102 3531744 3376486
4435 3376486 3090274 3006832 3138188 2987912 2913063 2850602 2893578 3056032 2877500 2617614
4425 2617614 2610084 2686952 2797382 2792779 2702163 2709523 2919741 2763977 2728758 2792718 2760803
4414 2760803 3011190 3082689 2966422 3090170 2992818 3143079 3079643 2943786 2932238 2890793
4404 2890793 2977407 2886710 3085794 3055625 2918464 2790987 2975653 2982950 2956172 3234839 3341525
$$ packed form
4476B915402P0483J69209K5164J6238l41600K16593K34516M0318o6732j90191
4466C089400l93054K54184l0656K30082q5738j43993o8327j74861L45586J82753
4456C205376j76306j75634O1492J54718j45453J58063l454M7770p1862L7698J73499
4445C265907j43754K08197K6483R5209K29821L0445p4009R9803k06358j55258
4435C376486k86212q3442J31356j50276p4849o2461M2976J62454j78532k59886
4425B617614p530P6868J10430m603r0616P360K10218j55764l5219O3960l1915
4414B760803K50387P1499j16267J23748r7352J50261o3436j35857j1548m1445
4404B890793Q6614r0697J99084l0169j37161j27477J84666P297k6778K78667J06686
$$ plain form
4393 3341525 3193470 3320836 3213007 3211270 2932460 2879750 2934959 2882008 2731844 2941924
4383 2941924 3045905 2857080 2940782 2903284 2959229 3065074 2887404 2896427 3064757 3062746 3050774
4372 3050774 3044207 3122154 3068799 2996330 2932307 3123851 3247552 3233353 3299859 3255285 3148755
4361 3148755 3232139 3331211 3274474 3099766 3009240 3194620 3244966 3294190 3408720 3352564 3375561
4350 3375561 3256188 3212709 3353263 3587020 3536569 3288578 3381838 3608285 3827947 3781243
4340 3781243 3723672 3671956 3550132 3627980 3556088 3510806 3495378 3703659 3766429 3794500 3826194
4329 3826194 3765122 3683802 3896654 4120146 4101788 3966511 3926021 4127893 4025104 3991316
4319 3991316 3991572 4142871 4045967 4028989 4272225 4307375 4312820 4245655 4289576 4445079 4375894
$$ packed form
4393C341525j48055J27366j07829j737k78810n2710N5209n2951j50164K10080
4383B941924J03981j88825Q3702l7498N5945J05845j77670R023J68330k011j1972
4372C050774o567P7947n3355p2469o4023J91544J23701j4199O6506m4574j06530
4361C148755Q3384R9072n6737j74708r0526J85380N0346M9224J14530n6156K2997
4350C375561j19373m3479J40554K33757n0451k47991R3260K26447K19662m6704
4340C781243n7571n1716j21824P7848p1892m5282j5428K08281O2770K8071L1694
4329C826194o1072q1320K12852K23492j8358j35277m0490K01872j02789l3788
4319C991316K56J51299r6904j6978K43236L5150N445o7165M3921J55503o9185
$$ plain form
4308 4375894 4160197 4533058 4690916 4697349 4628233 4460012 4747042 4749241 4977489 4717243
4298 4717243 4610965 4796692 4643150 4519107 4964626 4967827 4912521 5005375 4778562 4777299 4826118
4287 4826118 5092597 5284711 5449607 5110880 4995583 5129652 5232150 5074255 5100945 5284066
4277 5284066 5351421 5620908 5807207 5839097 5990490 5896613 6131415 6403428 6362425 6564802
4267 6564802 6751247 6742915 6700488 6692440 6811034 6984994 7327987 7584364 7713483 7837139
4257 7837139 8242220 8281965 8429598 8438708 8387039 8376174 8193565 8084772 7895532 7942362 8126277
4246 8126277 8297183 8310010 8385275 8571193 8446242 8393068 8609497 9047076 9346948 9726534
4236 9726534 10080492 10223816 10414948 10460504 10774975 10775163 10819437 10993209 10790295 10804141 11015558
$$ packed form
4308D375894k15697L72861J57858O433o9116j68221K87030K199K28248k60246
4298D717243j06278J85727j53542j24043M45519L201n5306R2854k26813j263M8819
4287D826118K66479J92114J64896l38727j15297J34069J02498j57895K6690J83121
4277E284066O7355K69487J86299L1890J51393r3877K34802K72013m1003K02377
4267F564802J86445q332m2427q048J18594J73960L42993K56377J29119J23656
4257G837139M05081L9745J47633R110n1669j0865j82609j08793j89240M6830J83915
4246H126277J70906J2827P5265J85918j24951n3174K16429M37579K99872L79586
4236I726534L53958J43324J91132M5556L14471J88M4274J73772k02914J3846K11417
$$ plain form
4225 11015558 10877402 10999789 11302965 11650556 11855863 12373628 12771358 12970451 13310320
4216 13310320 13809038 14167374 14675876 15234525 15482393 15841512 16240684 16612291 16648604 16721148
4206 16721148 16897750 16853260 17041759 17331767 17566675 17718515 17866773 18429707 18842205 19214480
4196 19214480 19877079 20175735 20686587 21394798 21974286 22770048 23495847 24460722 25258757
4187 25258757 26315287 27615609 28892662 30353341 31719137 32845055 33624839 34598399
4179 34598399 35175210 35877440 36823060 37984956 39358522 41161155 43319168 46016179 49201908
4170 49201908 52837477 56768523 60576188 64292013 66881210 69152951 71143801 72721070
4162 72721070 74591616 77614489 81465194 87177217 95133011 105573303 119280147 136039800
$$ packed form
4225A1015558j38156J22387L03176L47591K05307N17765L97730J99093L39869
4216A3310320M98718L58336N08502N58649K47868L59119L99172L71607L6313P2544
4206A6721148J76602m4490J88499K90008K34908J51840J48258N62934M12498L72275
4196A9214480O62599K98656N10852P08211N79488P95762P25799R64875P98035
4187B5258757J056530J300322J277053J460679J365796J125918P79784R73560
4179C4598399N76811P02230R45620J161896J373566J802633K158013K697011L185729
4170D9201908L635569L931046L807665L715825K589197K271741J990850J577269
4162G2721070J870546L022873L850705N712023P955794J0440292J3706844J6759653
$$ plain form
4154 136039800 154318112 171769540 183385454 183803732 172080488 153458065 134172769
4147 134172769 117170162 103169660 91800769 82800129 75293545 69278403 64423054 60537462
4139 60537462 57354863 55159415 53123644 51587001 50524079 49933427 49043145 48557519 48644285
4130 48644285 48931873 49349796 50390183 51971928 54223650 57141360 60265267 62816228
4122 62816228 64559392 64628468 62602591 59319150 55971891 53242154 51047654 49363808
4114 49363808 47957637 47411107 47053817 46351675 46078756 46083875 46005744 45850299 45578498 45443017
4104 45443017 45368604 45348281 45770258 46092280 46326314 46628306 46935906 47440934 47783078 48290181
4094 48290181 48490042 48693159 48458167 48393956 48091366 47730045 47166591 46624218 46341970 45780670
$$ packed form
4154A36039800J8278312J7451428J1615914M18278j1723244j8622423j9285296
4147A34172769j7002607j4000502j1368891r000640p506584o015142m855349l885592
4139F0537462l182599k195448k035771j536643j062922n90652q90282m85626Q6766
4130D8644285K87588M17923J040387J581745K251722K917710L123907K550961
4122F2816228J743164O9076k025877l283441l347259k729737k194500j683846
4114D9363808j406171n46530l57290p02142k72919N119p8131j55445k71801j35481
4104D5443017p4413k0323M21977L22022K34034L01992L07600N05028L42144N07103
4094D8290181J99861K03117k34992o4211l02590l61321n63454n42373k82248n61300
$$ plain form
4084 45780670 45328866 45085477 44931925 44721640 44157035 43376669 42453291 41701572 40758134
4075 40758134 39821404 38788470 37834823 36846586 35948659 35041325 34070562 33430867 32829956
4066 32829956 31944292 31171195 30374028 29149960 28045925 27188038 26144339 25128588 24206586
4057 24206586 23173124 22495221 21720170 20900514 20510155 19680705 18837474 18337703 17949871
4048 17949871 17356954 16802273 16299560 15729271 15122115 14553657 14034818 13725348 13365783
4039 13365783 12904521 12446668 12222248 11993536 11607783 11207463 10915997 10759701 10502007
4030 10502007 10067045 9682869 9655198 9183662 8780141 9028311 8768104 8388951 8276972 7965668
4020 7965668 8138551 8074899 8395448 8344997 8113701 7893925 7561110 7234745 7042889 6841308
$$ packed form
4084D5780670m51804k43389j53552k10285n64605p80366r23378p51719r43438
4075D0758134r36730j032934r53647r88237q97927r07334r70763o39695o00911
4066C2829956q85664p73097p97167j224068j104035q57887j043699j015751r22002
4057B4206586j033462o77903p75051q19656l90359q29450q43231m99771l87832
4048A7949871n92917n54681n02713n70289o07156n68458n18839l09470l59565
4039A3365783m61262m57853k24420k28712l85753m00320k91466j56296k57694
4030A0502007m34962l84176k7671m71536m03521K48170k60207l79153j11979l11304
4020G965668J72883o3652L20549n0451k31296k19776l32815l26365j91856k01581
$$ plain form
4010 6841308 6653151 6371178 6378258 6467925 6338592 6191414 5945969 5896127 5724514 5967622
4000 5967622 5901850 5617483 5590217 5466840 5254049 5215767 5177879 5303712 5251030 5113499
3990 5113499 5166759 4906805 4889525 4925214 5090552 5117881 5051891 5132835 5141330 5082623 5282142
3979 5282142 5075497 4983057 4966835 4865153 4811664 4516443 4304191 4319063 4172053 4295071
3969 4295071 4559761 4409091 4351352 4264890 4272446 4240219 4198566 4163843 4082340 4107287 3969992
3958 3969992 4085267 4186689 4215769 4346638 4435611 4412032 4242922 4234336 4413894 4367341 4136192
3947 4136192 4331164 4430211 4386238 4190636 3980510 4111470 4372539 4405727 4211921 3994073
3937 3994073 4066660 4081644 4052667 4044310 4234300 4219973 4387024 4358434 4210865 3981994 3895040
$$ packed form
4010F841308j88157k81973P080Q9667j29333j47178k45445m9842j71613K43108
4000E967622o5772k84367k7266j23377k12791l8282l7888J25833n2682j37531
3990E113499N3260k59954j7280L5689J65338K7329o5990Q0944Q495n8707J99519
3979E282142k06645r2440j6222j01682n3489k95221k12252J4872j47010J23018
3969D295071K64690j50670n7739q6462P556l2227m1653l4723q1503K4947j37295
3958C969992J15275J01422K9080J30869Q8973k3579j69110q586J79558m6553k31149
3947D136192J94972R9047m3973j95602k10126J30960K61069L3188j93806k17848
3937C994073P2587J4984k8977q357J89990j4327J67051k8590j47569k28871q6954
$$ plain form
3926 3895040 4011455 3915391 3920146 4029145 4044116 3827331 4047641 3967252 3986336 3876787 3738972
3915 3738972 3685658 3738232 3796858 3955308 3904409 3793117 3769126 3792609 3636569 3534340 3733472
3904 3733472 3891588 3830713 3764514 3745243 3699029 3753694 3699988 3511737 3463991 3841291 3924867
3893 3924867 3824237 3829152 3680362 3843573 3945779 4019826 4111373 4107135 4082095 4178098 4406404
3882 4406404 4415819 4457822 4296431 4100005 4126522 4341001 4565127 4632298 4340879 4308814 4410370
3871 4410370 4536236 4722310 4816384 4915732 4573658 4660336 4886912 5012859 5498523 5597710
3861 5597710 5630918 5483483 5445434 5391200 5236253 5283751 5351635 5352954 5114987 5122177 5148295
3850 5148295 5050414 5161609 4990743 5014326 5012754 5011953 4868824 5162629 5189481 5105845 5194581
$$ packed form
3926C895040J16415r6064M755J08999J4971k16785K20310q0389J9084j09549j37815
3915C738972n3314N2574N8626J58450n0899j11292k3991K3483j56040j02229J99132
3904C733472J58116o0875o6199j9271m6214N4665n3706j88251m7746L77300Q3576
3893C924867j00630M915j48790J63211J02206P4047R1547m238k5040R6003K28306
3882D406404R415M2003j61391j96426K6517K14479K24126O7171k91419l2065J01556
3871D410370J25866J86074R4074R9348l42074Q6678K26576J25947M85664R9187
3861E597710L3208j47435l8049n4234j54947M7498O7884J319k37967P190K6118
3850E148295r7881J11195j70866K3583j572q01j43129K93805K6852q3636Q8736
$$ plain form
3839 5194581 5214570 5194003 5067313 5196009 5299763 5005290 5156352 5111947 5156863 5162194 5125130
3828 5125130 5168764 5184859 5149519 5018580 5347701 5285728 5219878 5333825 5291655 5297250 5190895
3817 5190895 5296571 5403308 5456559 5465180 5488310 5539083 5471698 5684195 5843228 5815782 5940021
3806 5940021 5976598 5760090 5860425 5759750 5808929 5955077 6208695 6286673 6310824 6556707
3796 6556707 6480647 6432693 6410845 6573694 6703714 6775138 6815118 6838042 6871037 6815558 6728435
3785 6728435 6553860 6571337 6721962 6632710 6748489 6786476 6777761 6800580 6550047 6796859 6937253
3774 6937253 6888788 6741441 6584211 6782039 6957050 6689675 6962643 6831625 6686087 6822018
3764 6822018 6998241 6901553 6913724 7107277 6997693 7296444 7361653 7368693 7332679 7442030 7556459
$$ packed form
3839E194581J9989k0567j26690J28696J03754k94473J51062m4405M4916N331l7064
3828E125130M3634J6095l5340j30939L29121o1973o5850J13947m2170N595j06355
3817E190895J05676J06737N3251Q621K3130N0773o7385K12497J59033k7446J24239
3806E940021L6577k16508J00335j00675M9179J46148K53618P7978K4151K45883
3796F556707p6060m7954k1848J62849J30020P1424L9980K2924L2995n5479q7123
3785F728435j74575J7477J50625q9252J15779L7987q715K2819k50533K46812J40394
3774F937253m8465j47347j57230J97828J75011k67375K72968j31018j45538J35931
3764F822018J76223r6688J2171J93553j09584K98751O5209P040l6014J09351J14429
$$ plain form
3753 7556459 7358564 7676311 7814572 7942641 8073731 8102980 8301313 8497443 8488586 8551775
3743 8551775 8608109 8601579 8748820 8964112 9225179 9366156 9490983 9943989 10114509 10296460
3733 10296460 10553983 10777140 11063156 11330284 11675533 11980809 12339356 12917253 13083682
3724 13083682 13468666 13770972 14184599 14270812 14580206 14928034 15274368 15750223 15976975 16552100
3714 16552100 16573017 16679023 17036639 17370892 17588705 17735574 17994206 17969970 18243102 18343694
3704 18343694 18550520 18780925 18936982 19011772 19246339 19509268 19618051 19602295 19817692 20008172
3694 20008172 20185739 20707830 20736283 21112957 21348212 21824744 22343185 22921298 23490088 24278650
3684 24278650 24791260 25614501 26559773 27614654 28539782 29543297 30819546 32336934 33723533
$$ packed form
3753G556459j97895L17747J38261J28069J31090K9249J98333J96130q857O3189
3743H551775N6334o530J47241K15292K61067J40977J24827M53006J70520J81951
3733A0296460K57523K23157K86016K67128L45249L05276L58547N77897J66429
3724A3083682L84984L02306M13627Q6213L09394L47828L46334M75855K26752N75125
3714A6552100K0917J06006L57616L34253K17813J46869K58632k4236K73132J00592
3704A8343694K06826K30405J56057P4790K34567K62929J08783j5756K15397J90480
3694B0008172J77567N22091K8453L76674K35255M76532N18441N78113N68790P88562
3684B4278650N12610Q23241R45272J054881R25128J003515J276249J517388J386599
$$ plain form
3675 33723533 35158771 37003962 38806941 40625594 42755996 44753083 47011557 49209772
3667 49209772 51226303 53286217 55413047 57206698 59385130 61445640 63078212 64762335
3659 64762335 66619781 68025817 69565794 70802780 71762562 72634371 73411781 74101302 74437783
3650 74437783 74771047 75082481 75003745 74655038 74557473 74334245 73683637 73042392 72202727 71274111
3640 71274111 70109844 68616182 67058397 65476831 63561292 61562753 60044815 58083462
3632 58083462 56226306 54413977 52599552 50910359 49358416 47797201 46380128 44784211
3624 44784211 43165605 41657047 40244294 38607437 37117552 35724431 34454963 33075819
3616 33075819 31653872 30803848 30019358 29027858 28215680 27297088 26427880 25791219 25349277
$$ packed form
3675C3723533J435238J845191J802979J818653K130402J997087K258474K198215
3667D9209772K016531K059914K126830J793651K178432K060510J632572J684123
3659F4762335J857446J406036J539977J236986R59782Q71809P77410O89521L36481
3650G4437783L33264L11434p8736l48707r7565k23228o50608o41245q39665r28616
3640G1274111j164267j493662j557785j581566j915539j998539j517938j961353
3632E8083462j857156j812329j814425j689193j551943j561215j417073j595917
3624D4784211j618606j508558j412753j636857j489885j393121j269468j379144
3616C3075819j421947q50024p84490r91500q12178r18592q69208o36661m41942
$$ plain form
3607 25349277 24948637 24279417 23706092 23564161 23371710 23199796 23114412 22877608 22921719 23076776
3597 23076776 22472810 22324244 22152559 22227326 22375451 22392205 22382299 22274346 22263173 22203008
3587 22203008 22482685 22725542 22673055 22774492 22805680 22870024 22805900 22775410 22590499 22556945
3577 22556945 22597052 22443779 22229298 22095800 21760844 21667326 21929894 21640994 21324780 21124924
3567 21124924 20789778 20681225 20501509 20205658 19830636 19730413 19702137 19368243 19362176 19223370
3557 19223370 19193018 19239948 19225761 19008313 18962105 18924477 19258588 19433632 19593746 19600543 19585624
3546 19585624 19885890 20229381 20538228 20807576 21013287 21453833 22118458 22574183 22921237
3537 22921237 23570934 24274394 25052952 25776176 26535462 27358356 28298088 29442626 30549444
$$ packed form
3607B5349277m00640o69220n73325j41931j92451j71914q5384k36804M4111J55057
3597B3076776o03966j48566j71685P4767J48125J6754r906j07953j1173o0165
3587B2203008K79677K42857n2487J01437L1188O4344o4124l0490j84911l3554
3577B2556945M0107j53273k14481j33498l34956r3518K62568k88900l16214j99856
3567B1124924l35146j08553j79716k95851l75022j00223k8276l33894o067j38806
3557A9223370l0352M6930j4187k17448m6208l7628L34111J75044J60114O797j4919
3546A9585624L00266L43491L08847K69348K05711M40546O64625M55725L47054
3537B2921237O49697P03460P78558P23224P59286Q22894R39732J144538J106818
$$ plain form
3528 30549444 31145719 31941055 32640038 33043113 33550237 33874866 34007901 33979567 33667208 33165637
3518 33165637 32861527 32335759 32024068 31612165 31102722 30830693 30488729 30185470 29926038
3509 29926038 29482967 29620636 29643810 29850424 29976748 30118612 30557404 30795245 31232324 31669493
3499 31669493 31934175 32511273 33118412 33768432 34408246 35096183 35521669 36198258 37199727
3490 37199727 38399223 39802105 40977946 42450283 43814444 45411994 47238568 49264291
3482 49264291 51380734 53507470 55948863 58217773 60669978 63103819 65711135 68218146
3474 68218146 70559248 72650288 74568213 76298695 77593125 78979617 80145229 80966386
3466 80966386 81800941 82395985 82431599 82781498 83411815 84173898 85155740 86365233 87685796
$$ packed form
3528C0549444N96275P95336O98983M03075N07124L24629J33035k8334l12359n01571
3518C3165637l04110n25768l11691m11903n09443k72029l41964l03259k59432
3509B9926038m43071J37669K3174K06614J26324J41864M38792K37841M37079M37169
3499C1669493K64682N77098O07139O50020O39814O87937M25486O76589J001469
3490C7199727J199496J402882J175841J472337J364161J597550J826574K025723
3482D9264291K116443K126736K441393K268910K452205K433841K607316K507011
3474F8218146K341102K091040J917925J730482J294430J386492J165612Q21157
3466H0966386Q34555N95044L5614L49899O30317P62083R81842J209493J320563
$$ plain form
3457 87685796 89272515 91203672 93537778 95790258 98264265 100516734 102811350 104761936
3449 104761936 106626092 108343466 109479216 110536202 111017849 111389395 111751076 111837687 111920733
3440 111920733 111870033 111881539 111644794 111749878 111629945 111108825 110531186 109429638 107950662
3431 107950662 105980968 103638057 101304976 98566245 95806733 92975568 90229806 87432381
3423 87432381 84704046 82300876 79670379 77449712 74980657 72736549 70828897 68844073
3415 68844073 66749505 64902999 63023553 61234635 59725568 58405873 57155417 56172456
3407 56172456 55304080 54574250 53845033 53257662 52859148 52552997 52434671 52162120 51958688
3398 51958688 51991903 51804542 51514147 51262112 50477671 49960689 49581315 48939994 48142542 47369472
$$ packed form
3457H7685796J586719J931157K334106K252480K474007K252469K294616J950586
3449A04761936J864156J717374J135750J056986M81647L71546L61681Q6611Q3046
3440A11920733n0700J1506k36745J05084j19933n21120n77639j101548j478976
3431A07950662j969694k342911k333081k738731k759512k831165k745762k797425
3423H7432381k728335k403170k630497k220667k469055k244108j907652j984824
3415F8844073k094568j846506j879446j788918j509067j319695j250456r82961
3407E6172456q68376p29830p29217n87371l98514l06151j18326k72551k03432
3398E1958688L3215j87361k90395k52035p84441n16982l79374o41321p97452p73070
$$ plain form
3388 47369472 46480630 45697521 44842473 44024741 43156531 42127848 41498246 41080909 40644045
3379 40644045 40352966 40127519 40121269 40062188 39753045 39887338 39998586 40163724 40408824 40564037
3369 40564037 40951893 41203353 41476714 41650314 41842115 41757122 41924242 42206862 42236352 42514260
3359 42514260 42645134 42673477 42811990 42946607 42983856 43343447 43725332 44243428 44648646 45158844
3349 45158844 45799811 46239288 46876766 47563238 48156619 48721542 49131302 49610939 50119280
3340 50119280 50716575 51290959 51830483 52477284 53172825 53901074 54658050 55076157 55593752
3331 55593752 56407350 57331753 58100985 58987836 60075228 61080053 62423122 63980994 65673080
3322 65673080 67504953 69532019 71650980 74270604 76990327 79452950 82822745 86462313
$$ packed form
3388D7369472q88842p83109q55048q17732q68210j028683o29602m17337m36864
3379D0644045k91079k25447o250n9081l09143J34293J11248J65138K45100J55213
3369D0564037L87856K51460K73361J73600J91801q4993J67120K82620K9490K77908
3359D2514260J30874K8343J38513J34617L7249L59591L81885N18096M05218N10198
3349D5158844O40967M39477O37478O86472N93381N64923M09760M79637N08341
3340E0119280N97295N74384N39524O46801O95541P28249P56976M18107N17595
3331E5593752Q13598R24403P69232Q86851J087392J004825J343069J557872J692086
3322F5673080J831873K027066K118961K619624K719723K462623L369795L639568
$$ plain form
3314 86462313 90370022 94671648 99171298 104000934 109152070 114720463 120488530 126318292
3306 126318292 131884532 137114599 142372495 147385490 151682784 155602478 159155489 162656740
3298 162656740 166309401 169679818 173401223 176791605 180137651 183575809 186685780 188955220
3290 188955220 190365468 190481885 189255088 187167071 184299559 180643569 175962721 171391965
3282 171391965 166609079 161753986 157227234 152791379 148606380 144579294 140158870 135511910
3274 135511910 130605980 125476389 119701465 113939196 108117061 102636688 97421426 91956636
3266 91956636 87241708 82761887 78597098 74978525 71538802 68263086 65556454 62931862
3258 62931862 60604919 58604640 56598454 55046233 53717670 52284642 51212410 50050765
$$ packed form
3314H6462313L907709M301626M499650M829636N151136N568393N768067N829762
3306A26318292N566240N230067N257896N012995M297294L919694L553011L501251
3298A62656740L652661L370417L721405L390382L346046L438158L109971K269440
3290A88955220J410248J16417j226797k088017k867512l655990m680848m570756
3282A71391965m782886m855093m526752m435855m184999m027086m420424m646960
3274A35511910m905930n129591n774924n762269n822135n480373n215262n464790
3266I1956636m714928m479821m164789l618573l439723l275716k706632k624592
3258F2931862k326943k000279k006186j552221j328563j433028j072232j161645
$$ plain form
3250 50050765 48972524 48360723 47804615 47457332 46987056 46836758 46718344 45624454 44240510
3241 44240510 42939080 41870914 40680347 39523766 38537740 37993885 37319794 36446106 36047399
3232 36047399 35514766 35191256 34877675 34286959 33645478 33195910 33044114 32921640 32393154
3223 32393154 32306648 32351203 32302180 32474557 32474760 32783054 33524411 33969703 34866847 35707633
3213 35707633 36670971 37469278 36893730 35158361 33685292 32731837 31833719 31282346 31093595
3204 31093595 30761978 30609371 30603801 30399216 30138236 30343295 30522533 30458984 30484527 30879826
3194 30879826 30844960 30891552 31003351 31250977 31745077 32192880 32502246 33219737 33735291 34405007
3184 34405007 35327201 35803158 36498811 36959298 37108597 36533023 35872438 35347046 35019510
$$ packed form
3250E0050765j078241o11801n56108l47283m70276j50298j18414j093890j383944
3241D4240510j301430j068166j190567j156581r86026n43855o74091q73688l98707
3232C6047399n32633l23510l13581n90716o41481m49568j51796j22474n28486
3223C2393154q6506M4555m9023J72377K03L08294P41357M45292Q97144Q40786
3213C5707633R63338P98307n75548j735369j473069r53455q98118n51373j88751
3204C1093595l31617j52607n570k04585k60980K05059J79238o3549K5543L95299
3194C0879826l4866M6592J11799K47626M94100M47803L09366P17491N15554O69716
3184C4405007R22194M75957O95653M60487J49299n75574o60585n25392l27536
$$ plain form
3175 35019510 34744849 34527719 34616827 34931334 35296389 35921776 36584936 37264384 37919141 38805330
3165 38805330 39659003 40567308 41601265 42553218 43731146 44581847 45647973 46977969 48330858
3156 48330858 50126453 51944320 53905203 56025188 58130358 60290199 62494920 64555208
3148 64555208 66643202 69100232 71308166 73189752 75396778 77348693 79295974 80745820
3140 80745820 82455792 83944206 85412456 87083737 88770344 90357944 91666916 92825733
3132 92825733 93823916 94302098 94534835 94123258 93286334 92020323 90513729 88586217 86584985
3123 86584985 84355030 82108032 80182384 78018787 75971265 74107498 72062444 70071558
3115 70071558 67768616 65150889 62788003 60273207 57801412 55087720 52435456 49961387
$$ packed form
3175C5019510k74661k17130Q9108L14507L65055O25387O63160O79448O54757Q86189
3165C8805330Q53673R08305J033957R51953J177928Q50701J066126J329996J352889
3156D8330858J795595J817867J960883K119985K105170K159841K204721K060288
3148F4555208K087994K457030K207934J881586K207026J951915J947281J449846
3140H0745820J709972J488414J468250J671281J686607J587600J308972J158817
3132I2825733R98183M78182K32737m11577q36924j266011j506594j927512k001232
3123H6584985k229955k246998j925648k163597k047522j863767k045054j990886
3115G0071558k302942k617727k362886k514796k471795k713692k652264k474069
$$ plain form
3107 49961387 47465597 45023852 43017586 41197263 39378676 37887030 36382331 34916148
3099 34916148 33526630 32500134 31629907 30613998 29656393 28862785 28077101 27320737 26665288
3090 26665288 26022746 25421857 24804451 24619906 24277402 24023609 23585704 23157746 22690068
3081 22690068 22467621 22416628 22677286 22492897 22313260 22090451 21893084 21671217 21382737 21388620
3071 21388620 20811224 20653660 20518040 19987580 19906125 19676889 19139483 18860498 18978870 18755548
3061 18755548 18582834 18682975 18273848 17976421 17793188 17346479 16909192 16643833 16283900
3052 16283900 16074409 15822499 15455516 14986073 14560731 14538444 14309259 14234814 14114742 14037176
3042 14037176 13669634 13444937 13365829 13311397 13222810 13183732 12995873 12743797 13005007 13062119
$$ packed form
3107D9961387k495790k441745k006266j820323j818587j491646j504699j466183
3099C4916148j389518j026496q70227j015909r57605p93608p85684p56364o55449
3090B6665288o42542o00889o17406j84545l42504k53793m37905m27958m67678
3081B2690068k22447n0993K60658j84389j79637k22809j97367k21867k88480N883
3071B1388620n77396j57564j35620n30460q1455k29236n37406k78985J18372k23322
3061A8755548j72714J00141m09127k97427j83233m46709m37287k65359l59933
3052A6283900k09491k51910l66983m69443m25342k2287k29185p4445j20072p7566
3042A4037176l67542k24697p9108n4432q8587l9078j87859k52076K61210N7112
$$ plain form
3032 13062119 12942459 12983363 12979535 12884058 13046075 13158840 13135112 13167797 13313922 13013206
3022 13013206 12903687 12820766 12891531 12883294 12934429 12893922 12937138 13118311 13032454 13021594 12942978
3011 12942978 13090518 13151050 13081048 13158179 13246832 13245969 13304318 13320994 13300133 13417002 13504925
3000 13504925 13387518 13414117 13373373 13517478 13618678 13478786 13700367 13981717 13948803 14035797
2990 14035797 14177061 14200629 14491961 14791271 14921993 14918363 15057953 15265406 15385051 15498214
2980 15498214 15821958 16276286 16423024 16563674 17006881 17314438 17709250 17717114 18046819 18564820
2970 18564820 18774461 18856459 19048706 19383166 19814350 20229178 20433903 20723925 20939522 21306847
2960 21306847 21490802 21849071 22250037 22773631 23335005 23701400 24013916 24550356 25087463
$$ packed form
3032A3062119j19660M0904l828r5477J62017J12765k3728L2685J46125l00716
3022A3013206j09519q2921P0765q237N1135m0507M3216J81173q5857j0860p8616
3011A2942978J47540O0532p0002P7131Q8653q63N8349J6676k0861J16869Q7923
3000A3504925j17407K6599m0744J44105J01200j39892K21581K81350l2914Q6994
2990A4035797J41264K3568K91332K99310J30722l630J39590K07453J19645J13163
2980A5498214L23744M54328J46738J40650M43207L07557L94812P864L29705N18001
2970A8564820K09641Q1998J92247L34460M31184M14828K04725K90022K15597L67325
2960B1306847J83955L58269M00966N23594N61374L66395L12516N36440N37107
$$ plain form
2951 25087463 25636314 25964961 26496914 27058815 27438945 27958918 28651731 29226721 29811164
2942 29811164 30639940 31477208 32249303 33233564 33948685 34835817 35830740 36849452 37847089
2933 37847089 38797469 39762958 40867466 42176959 43300381 44496597 45720236 47153751
2925 47153751 48578007 50114811 51719664 53448056 54870231 56611292 58470323 60301555
2917 60301555 62167230 63873530 65934034 68123026 70423923 72721231 75341614 77917716
2909 77917716 80595618 83412926 86671347 89901002 93573989 97422757 101290000 105967075
2901 105967075 110870986 116301412 121950817 127873498 134010311 140896316 148283909 156519366
2893 156519366 165557318 175894088 187361256 200629258 215906498 233367130 253164328
$$ packed form
2951B5087463N48851L28647N31953N61901L80130N19973O92813N74990N84443
2942B9811164Q28776Q37268P72095R84261P15121Q87132R94923J018712R97637
2933C7847089R50380R65489J104508J309493J123422J196216J223639J433515
2925D7153751J424256J536804J604853J728392J422175J741061J859031J831232
2917F0301555J865675J706300K060504K188992K300897K297308K620383K576102
2909G7917716K677902K817308L258421L229655L672987L848768L867243M677075
2901A05967075M903911N430426N649405N922681O136813O886005P387593Q235457
2893A56519366R037952J0336770J1467168J3268002J5277240J7460632J9797198
$$ plain form
2886 253164328 275093091 298220977 321181981 342462180 359236170 369320134 372597367
2879 372597367 369799634 364273467 358524798 355117413 354385293 355670574 356996471 355547377
2871 355547377 348807154 334935907 314866682 291175250 266361911 242242670 220304074
2864 220304074 200826720 183766342 169085873 156019866 144617079 134934601 126278654
2857 126278654 118773513 112175905 106177671 100978702 96299706 91995504 88316542 84792490
2849 84792490 81596532 78310924 75160476 72086295 69385238 66665187 64183875 61689771
2841 61689771 59178003 56959474 54979446 52994973 51041091 49180142 47507079 45914141
2833 45914141 44371273 42799784 41263212 39798293 38636543 37709096 36617338 35483244
$$ packed form
2886B53164328K1928763K3127886K2961004K1280199J6773990J0083964L277233
2879C72597367k797733n526167n748669l407385p32120J285281J325897j449094
2871C55547377o740223j3871247k0069225k3691432k4813339k4119241k1938596
2864B20304074j9477354j7060378j4680469j3066007j1402787r682478q655947
2857A26278654p505141o597608n998234n198969m678996m304202l678962l524052
2849H4792490l195958l285608l150448l074181k701057k720051k481312k494104
2841F1689771k511768k218529j980028j984473j953882j860949j673063j592938
2833D5914141j542868j571489j536572j464919j161750r27447j091758j134094
$$ plain form
2825 35483244 34561023 33616238 32584760 31628413 30673244 29929398 29154406 28461639 28025900
2816 28025900 27277832 26679622 26039789 25591165 25079334 24466823 23804168 23284908 22719817
2807 22719817 22183438 21480340 21058488 20404026 19972242 19841570 19617240 19091341 18561945
2798 18561945 18395153 18159263 17929407 17761628 17618645 17401470 17071503 16706391 16497206
2789 16497206 16402424 16381459 16101179 16005462 15725886 15385726 15373390 15264373 15096079 14768974
2779 14768974 14483885 14181430 14110465 14176824 13844603 13658398 13436679 13157609 13094313 13135710
2769 13135710 12909496 12836860 12938883 12790692 12512992 12569300 12389746 12391602 12503248 12129330
2759 12129330 12170971 12202611 12129834 11881910 11961763 11921973 11929552 12073899 12226023 12604140 12886687
$$ packed form
2825C5483244r22221r44785j031478r56347r55169p43846p74992o92767m35739
2816B8025900p48068n98210o39833m48624n11831o12511o62655n19260n65091
2807B2719817n36379p03098m21852o54462m31784j30672k24330n25899n29396
2798A8561945j66792k35890k29856j67779j42983k17175l29967l65112k09185
2789A6497206r4782k0965k80280r5717k79576l40160j2336j09017j68294l27105
2779A4768974k85089l02455p0965O6359l32221j86205k21719k79070o3296M1397
2769A3135710k26214p2636J02023j48191k77700N6308j79554J856J11646l73918
2759A2129330M1641L1640p2777k47924P9853l9790P579J44347J52124L78117K82547
$$ plain form
2748 12886687 13030472 13433792 13883487 14636052 15221282 15631864 16593230 17132484 17843217
2739 17843217 18026011 18069333 17660595 17000107 15982737 15035584 14172814 13572508 12915057
2730 12915057 12362804 11734470 11134237 10904580 10635221 10381572 10150680 9936039 9746765
2721 9746765 9467873 9260330 9307959 9131556 9042240 8751176 8435257 8148765 8064263 8043449
2711 8043449 7856825 7706356 7314803 7288241 7093729 6918116 6638962 6445095 6410830 6389394
2701 6389394 6093305 5862889 5884431 5806770 5688065 5643446 5350302 5179433 5100499 4938304
2691 4938304 4831611 4901139 4633955 4602251 4599688 4352437 4231546 4195344 4115224 3927524 4004479
2680 4004479 3692342 3717716 3638853 3620896 3816489 3771073 3762422 3508890 3479866 3586328 3569129
$$ packed form
2748A2886687J43785M03320M49695P52565N85230M10582R61366N39254P10733
2739A7843217J82794M3322m08738o60488j017370r47153q62770o00306o57451
2730A2915057n52253o28334o00233k29657k69359k53649k30892k14641j89274
2721I746765k78892k07543M7629j76403q9316k91064l15919k86492q4502k0814
2711H043449j86624j50469l91553k6562j94512j75613k79154j93867l4265k1436
2701F389394k96089k30416K1542p7661j18705m4619k93144j70869p8934j62195
2691D938304j06693O9528k67184l1704k563k47251j20891l6202q0120j87700P6955
2680D004479l12137K5374p8863j7957J95593m5416q651k53532k9024J06462j7199
$$ plain form
2669 3569129 3405914 3064233 3148446 3283543 3357237 3429765 3510665 3260283 3308876 3175927
2659 3175927 3122154 3016327 2943945 3180794 3232558 3043393 2959579 2903501 3100757 3016754 3091417
2648 3091417 3147236 3009088 3003519 3096658 2930053 2644240 2702492 2692699 2614176 2717079 2631162
2637 2631162 2626092 2415865 2277437 2171571 2268144 2408995 2335890 2457281 2546361 2571450 2524690
2626 2524690 2593188 2488165 2393023 2379587 2410138 2446237 2456709 2188461 2179715 2419022 2505127
2615 2505127 2266077 2587343 2602058 2456206 2545132 2461669 2657559 2642574 2675053 2644293 2670533
2604 2670533 2650780 2596085 2722230 3079761 3301653 3224431 3188627 3145010 3155967 3175838 3445108
2593 3445108 3514040 3231573 3429847 3330805 3167390 3305601 3240780 3048090 3186213 3113052
$$ packed form
2669C569129j63215l41681Q4213J35097P3694P2528Q0900k50382M8593j32949
2659C175927n3773j05827p2382K36849N1764j89165q3814n6078J97256q4003P4663
2648C091417N5819j38148n569R3139j66605k85813N8252r793p8523J02903q5917
2637B631162n070k10227j38428j05866R6573J40851p3105J21391Q9080K5089m6760
2626B524690O8498j05023r5142j3436L0551L6099J0472k68248q746K39307Q6105
2615B505127k39050L21266J4715j45852Q8926q3463J95890j4985L2479l0760K6240
2604B670533j9753n4695J26145L57531K21892p7222l5804m3617J0957J9871K69270
2593C445108O8932k82467J98274r9042j63415J38211o4821j92690J38123p3161
$$ plain form
2583 3113052 3055023 2727627 2525237 2466640 2034009 2235013 2177716 2315532 2135075 1988271
2573 1988271 1896429 1829353 1806832 1891832 1597517 1478444 1845110 1850377 1695116 1623461 1573500
2562 1573500 1586492 1600159 1442258 1548359 1569660 1455942 1449927 1498556 1413547 1108086 1051914
2551 1051914 1531391 1371712 1217253 1072709 1039482 1096750 1021922 1221842 1143671 1098585
2541 1098585 1083231 870201 1104361 1019139 944511 1100242 1092294 1229774 1321868 1047986 875999
2530 875999 972734 997805 1042390 1063683 1277105 1032477 920415 1059829 1140206 1098767 932874
2519 932874 908825 1092166 995206 713371 611562 849564 1012403 923519 844308 799274 692051
2508 692051 864011 876616 1168877 1183804 1145055 1319360 1125769 1010885 851833 1028140
$$ packed form
2583C113052n8029l27396k02390n8597m32631K01004n7297J37816j80457j46804
2573A988271r1842o7076k2521Q5000k94315j19073L66666N267j55261p1655m9961
2562A573500J2992J3667j57901J06101K1301j13718o015M8629q5009l05461n6172
2551A051914M79477j59679j54459j44544l3227N7268p4828J99920p8171m5086
2541A098585j5354k13030K34160q5222p4628J55731p948J37480R2094k73882j71987
2530H75999R6735K5071M4585K1293K13422k44628j12062J39414Q0377m1439j65893
2519I32874k4049J83341r6960k81835j01809K38002J62839q8884p9211m5034j07223
2508F92051J71960J2605K92261J4927l8749J74305j93591j14884j59052J76307
$$ plain form
2498 1028140 880934 986302 999737 769030 761538 618979 393093 506017 557437 689440
2488 689440 806953 1024377 748281 755238 788266 836484 992003 889481 902507 1005721 1087129
2477 1087129 930679 695907 754268 1042134 1042982 737798 637156 750047 643898 870397
2467 870397 758686 839593 718591 792317 861786 868595 941005 980454 830382 964625 781493
2456 781493 578971 540746 702099 672048 643550 799117 548576 524923 545966 569820 504995
2445 504995 537715 673792 633567 577366 404146 314341 431213 732738 554766 601409 720575
2434 720575 565880 682774 437599 482315 635029 751107 611348 531220 729852 691858
2424 691858 621748 490945 157690 243774 501067 644554 706645 553442 507129 641301
$$ packed form
2498A028140j47206J05368J3435k30707p492j42559k25886J12924N1420J32003
2488F89440J17513K17424k76096O957L3028M8218J55519j02522J3026J03214Q1408
2477A087129j56450k34772N8361K87866Q48l05184j00642J12891j06149K26499
2467H70397j11711Q0907j21002P3726O9469O809P2410L9449j50072J34243j83132
2456G81493k02522l8225J61353l0051k8498J55567k50541k3653K1043K3854o4825
2445E04995L2720J36077m0225n6201j73220q9805J16872L01525j77972M6643J19166
2434G20575j54695J16894k45175M4716J52714J16078j39759q0128J98632l7994
2424F91858p0110j30803l33255Q6084K57293J43487O2091j53203m6313J34172
$$ plain form
2414 641301 547524 543478 452739 310681 461682 422120 398973 506288 490884 531544 471170
2403 471170 641318 786530 667663 585518 327260 407037 393082 448594 462303 412157 276578
2392 276578 248486 400100 281647 706343 621850 458382 267631 337881 383771 486777
2382 486777 666445 615977 531378 458285 409019 505575 551417 458647 435809 552884 448243
2371 448243 547162 580281 631377 556487 597811 678023 745543 669001 719927 696864 797410
2360 797410 726801 747948 957737 834851 662740 474186 423358 482123 752952 672055 626773
2349 626773 637619 596153 529279 415274 450770 573230 464379 594088 468648 532774 595216
2338 595216 647310 603846 280908 373152 547679 468401 183213 343348 576926 420160
$$ packed form
2414F41301r3777m046r0739j42058J51001l9562k3147J07315j5404M0660o0374
2403D71170J70148J45212j18867q2145k58258P9777j3955N5512J3709n0146j35579
2392B76578k8092J51614j18453M24696q4493j63468j90751P0250M5890J03006
2382D86777J79668n0468q4599p3093m9266R6556M5842r2770k2838J17075j04641
2371D48243R8919L3119N1096p4890M1324Q0212O7520p6542N0926k3063J00546
2360G97410p0609K1147K09789j22886j72111j88554n0828N8765K70829q0897m5282
2349F26773J0846m1466o6874j14005L5496J22460j08851J29709j25440O4126O2442
2338E95216N2094m3464l22938R2244J74527p9278k85188J60135K33578j56766
$$ plain form
2328 420160 529049 542221 525989 300969 352199 333905 384792 363240 271397 512792 335911
2317 335911 390771 512212 460858 584807 639790 523433 580562 362975 258763 352018 292929
2306 292929 423264 355605 434427 593932 384747 469358 590445 507036 440693 305152 297665
2295 297665 458756 297723 143032 415242 354448 473395 557875 429314 524763 652959
2285 652959 535796 556608 535378 504439 427696 481842 350770 414880 359687 229761 336842
2274 336842 626827 397962 391651 260346 376825 373618 322166 348663 425525 383720 345405
2263 345405 409456 544137 597411 520975 407034 426252 393804 348192 426306 449856 421494
2252 421494 279470 516592 540524 528004 714009 630208 435197 623390 518167 523090 605921
$$ packed form
2328D20160J08889J3172j6232k25020N1230j8294N0887k1552r1843K41395j76881
2317C35911N4860J21441n1354J23949N4983j16357N7129k17587j04212R3255n9089
2306B92929J30335o7659P8822J59505k09185Q4611J21087q3409o6343j35541p487
2295B97665J61091j61033j54691K72210o0794J18947Q4480j28561R5449J28196
2285F52959j17163K0812k1230l0939p6743N4146j31072O4110n5193j29926J07081
2274C36842K89985k28865o311j31305J16479l207n1452K6497P6862m1805l8315
2263C45405O4051J34681N3274p6436j13941J9218l2448m5612P8114K3550k8362
2252D21494j42024K37122K3932j2520J86005q3801j95011J88193j05223M923Q2831
$$ plain form
2241 605921 494610 373820 452646 455856 330463 86339 294801 474539 548876 619193 751595
2230 751595 648770 661184 597912 680900 790509 820152 590674 287214 298724 393572 492227
2219 492227 913585 789176 904400 701585 594187 665886 724183 528426 608129 616226 441233
2208 441233 494062 594127 537847 470092 560888 719983 786019 807625 875151 947375 862454
2197 862454 653756 788793 781042 879228 894882 1030153 1022670 873758 745456 848993 824499
2186 824499 1013652 764090 841444 1169115 1151264 1142165 1147463 1371483 1141168 1155842 1308209
2175 1308209 1322557 1199195 989393 1127802 1214980 1347355 1411704 1322155 1434232 1631690
2165 1631690 1523928 1479014 1462202 1616812 1487931 1624592 1866569 1796218 1838931 1764626
$$ packed form
2241F05921j11311j20790P8826L210j25393k44124K08462J79738P4337P0317J32402
2230G51595j02825J2414o3272Q2988J09609K9643k29478l03460J1510R4848R8655
2219D92227M21358j24409J15224k02815j07398P1699N8297j95757P9703Q097j74993
2208D41233N2829J00065n6280o7755R0796J59095O6036K1606O7526P2224q4921
2197H62454k08698J35037p751R8186J5654J35271p483j48912j28302J03537k4494
2186H24499J89153k49562P7354L27671j7851r099N298K24020k30315J4674J52367
2175A308209J4348j23362k09802J38409Q7178J32375O4349q9549J12077J97458
2165A631690j07762m4914j6812J54610j28881J36661K41977p0351M2713p4305
$$ plain form
2155 1764626 1729255 1563163 1668113 1910104 2246061 2266745 2220466 2391772 2372176 2384647
2145 2384647 2261582 2374411 2576418 2910475 2696812 2659269 2680413 2899989 3217776 3126058
2135 3126058 3080857 3245486 3451570 3375643 3640170 3730043 3826636 3964793 4240289 4441285
2125 4441285 4591339 4893105 5188187 5332871 5563551 5644703 5777837 6205574 6323639 6580467
2115 6580467 7139319 7563119 8001085 8941293 9930552 10752814 11386931 11723586 12299401 13370898
2105 13370898 14612164 15943675 17809414 19929995 22877712 26920831 32654923 41273102
2097 41273102 52843973 64389487 75549994 75658893 61097852 47130316 36627634
2090 36627634 29134945 24037372 20263787 17100620 14742644 13172835 11714114 10611694
$$ packed form
2155A764626l5371j66092J04950K41991L35957K0684m6279J71306j9596J2471
2145B384647j23065J12829K02007L34057k13663l7543K1144K19576L17787r1718
2135C126058m5201J64629K06084p5927K64527Q9873R6593J38157K75496K00996
2125D441285J50054L01766K95082J44684K30680Q1152J33134M27737J18065K56828
2115F580467N58852M23800M37966R40208R89259Q22262O34117L36655N75815J071497
2105A3370898J241266J331511J865739K120581K947717M043119N734092Q618179
2097D1273102J1570871J1545514J1160507J08899j4561041j3967536j0502682
2090C6627634p492689n097573l773585l163167k357976j569809j458721j102420
$$ plain form
2082 10611694 9912995 9568866 9540843 9222467 8303413 7431398 6698157 6105090 5892746 5633045
2072 5633045 5449507 5080994 4963797 4751611 4212731 4192950 4112804 3848025 3523796 3214966
2062 3214966 3164982 3186657 3175329 3090602 2752886 2674304 2524133 2612883 2521010 2320608 2181909
2051 2181909 1948085 2087012 2231809 2013563 1919047 1717648 1600184 1452102 1475337 1504363
2041 1504363 1434392 1529534 1336822 1277408 1158627 1159996 1298344 1396416 1199056 1038732 1163058
2030 1163058 1077475 1054233 966796 1057622 1030805 1089709 1208766 1255054 1100035 1057372 950988
2019 950988 811361 807662 815504 1064518 1021517 909981 723550 822311 692995 650195 698184
2008 698184 594054 512517 476400 780058 720129 411691 642169 699118 592965 679166 550156
$$ packed form
2082A0611694o98699l44129k8023l18376r19054q72015p33241n93067k12344k59701
2072E633045j83538l68513j17197k12186n38880j9781q0146k64779l24229l08830
2062C214966m9984K1675j1328q4727l37716p8582j50171Q8750r1873k00402j38699
2051B181909k33824J38927J44797k18246r4516k01399j17464j48082K3235K9026
2041A504363o9971R5142j92712n9414j18781J369J38348R8072j97360j60324J24326
2030A163058q5583k3242q7437R0826k6817N8904J19057M6288j55019m2663j06384
2019I50988j39627l699P842K49014m3001j11536j86431R8761j29316m2800M7989
2008F98184j04130q1537l6117L03658n9929l08438K30478N6949j06153Q6201j29010
$$ plain form
1997 550156 578797 582215 744902 575739 538149 597900 602261 721530 635523 760759 676402
1986 676402 506826 604695 600513 476586 437889 496547 417030 435819 559435 563823 502604
1975 502604 119013 11534 368351 243924 241775 402961 411280 307394 309382 347203 487065
1964 487065 370766 299259 236690 254119 388550 364752 254860 253690 234347 425059 534099
1953 534099 546155 394851 316790 515971 416708 238880 466534 520209 358605 333932 160281
1942 160281 406718 414022 329128 466375 430525 284375 312791 470189 177701 87832 287939
1931 287939 92149 111997 242845 281390 110230 -194934 -11578 202509 -24079 42119
1921 42119 159139 215163 143461 170355 57947 146330 320853 138727 -39569 102075 59972
$$ packed form
1997E50156K8641L418J62687j69163l7590N9751M361J19269q6007J25236q4357
1986F76402j69576R7869m182j23927l8697N8658p9517J8789J23616M388o1219
1975E02604l83591j07479L56817j24427k149J61186Q319j03886J988L7821J39862
1964D87065j16299p1507o2569J7429J34431k3798j09892j170j9343J90712J09040
1953E34099J2056j51304p8061J99181r9263j77828K27654N3675j61604k4673j73651
1942A60281K46437P304q4894J37247l5850j46150K8416J57398k92488q9869K00107
1931B87939j95790J9848J30848L8545j71160l05164J83356K14087k26588O6198
1921D2119J17020N6024p1702K6894j12408Q8383J74523j82126j78296J41644m2103
$$ plain form
1910 59972 98033 -52478 125085 264517 99649 119281 192856 162877 261768 126196 27098
1899 27098 33058 -23202 -165257 -384398 54833 86334 5798 75493 174029 -217 -55054
1888 -55054 301307 306640 251663 120258 -71765 -66379 27348 18315 19818 72226 158334 361094
1876 361094 493294 434103 166129 37417 324494 269112 290509 321730 344253 394743 254643
1865 254643 215570 262426 255096 108813 62988 31384 176998 18528 107493 280414 272183
1854 272183 110347 220813 298704 236655 227381 205518 185923 253175 422473 264756 209359
1843 209359 156343 215585 111709 42894 132611 84801 61135 225271 75509 56994 348490
1832 348490 142946 -7123 221791 145357 263440 526187 391932 473304 614215 469680
$$ packed form
1910E9972L8061j50511J77563J39432j64868J9632P3575k9979R8891j35572r9098
1899B7098N960n6260j42055k19141M39231L1501q0536O9695R8536j74246n4837
1888e5054L56361N333n4977j31405j92023N386R3727r033J503N2408Q6108K02760
1876C61094J32200n9191k67974j28712K87077n5382K1397L1221K2523N0490j40100
1865B54643l9073M6856p330j46283m5825l1604J45614j58470Q8965J72921q231
1854B72183j61836J10466P7891o2049r274k1863j9595O7252J69298j57717n5397
1843B09359n3016N9242j03876o8815Q9717m7810k3666J64136j49762j8515K91496
1832C48490k05544j50069K28914p6434J18083K62747j34255Q1372J40911j44535
$$ plain form
1822 469680 389698 330874 318200 487065 418427 384923 112328 310986 335681 263809 214698
1811 214698 38001 -82529 136484 287413 -22250 -3533 -119904 -128066 -72760 -25410 -101201
1800 -101201 24418 92174 97085 367071 219081 179253 276480 27138 97472 124416 -63986
1789 -63986 244074 444816 331901 199010 28647 105889 87830 298953 516593 136260
1779 136260 165472 187361 187105 172561 287145 151355 -53350 -3040 -95032 -91620 140098
1768 140098 165882 -39528 9529 130557 80037 254357 73893 -66438 -83159 -114461 253391
1757 253391 116383 -180144 -88795 -60988 -88602 -315971 -160493 75956 -6039 -117066
1747 -117066 -238226 -248118 -7543 46328 142980 227406 81296 -30311 -112776 48046 -65595
$$ packed form
1822D69680p9982n8824j2674J68865o8638l3504k72595J98658K4695p1872m9111
1811B14698j76697j20530K19013J50929l09663J8717j16371q162N5306M7350p5791
1800a01201J25619O7756M911K69986j47990l9828R7227k49342P0334K6944j88402
1789f3986L08060K00742j12915j32891j70363P7242j8059K11123K17640l80333
1779A36260K9212K1889k56j4544J14584j35790k04705N0310r1992L412K31718
1768A40098K5784k05410M9057J21028n0520J74320j80464j40331j6721l1302L67852
1757B53391j37008k96527R1349K7807k7614k27369J55478K36449q1995j11027
1747a17066j21160r892K40575N3871R6652Q4426j46110j11607q2465J60822j13641
$$ plain form
1736 -65595 -63258 -184785 -83854 28675 208150 -6716 -48044 -225955 -161283 -69095 -64544
1725 -64544 -40768 109442 221741 78139 -36584 -123245 -62486 46840 88281 207478 7512
1714 7512 -11284 -22469 -123373 110047 96069 -42327 262995 172621 42508 43384 -129068
1703 -129068 -130948 -268867 -150422 -34669 160287 70764 138117 35925 92754 37416 -5728
1692 -5728 136806 259227 115935 -105584 87883 -57730 123050 241658 230872 262690
1682 262690 142277 273020 475178 474418 229843 280960 372232 242070 23008 196500 228598
1671 228598 116144 228286 219390 219955 169953 -59924 128559 79548 -28349 140437 293812
1660 293812 268946 257157 365082 306313 70386 71768 984 -177165 -91217 121722 161457
$$ packed form
1736f5595K337j21527J00931J12529J79475k14866m1328j77911O4672R2188M551
1725f4544K3776J50210J12299j43602j14723q6661O0759J09326M1441J19197j99966
1714G512j8796j1185j00904K33420j3978j38396L05322r0374j30113Q76j72452
1703a29068j880j37919J18445J15753J94956q9523O7353j02192N6829n5338m3144
1692e728J42534J22421j43292k21519J93467j45613J80780J18608j0786L1818
1682B62690j20413J30743K02158p60k44575N1117R1272j30162k19062J73492L2098
1671B28598j12454J12142q896N65n0002k29877J88483m9011j07897J68786J53375
1660B93812k4866j1789J07925n8769k35927J382p0784j78149Q5948K12939L9735
$$ plain form
1649 161457 252131 265683 125212 119344 150114 63803 -5263 121178 298723 158588 -27429
1638 -27429 -36928 -60491 -40325 -8996 71793 -248358 -210305 -42118 -76754 -157351 45249
1627 45249 63918 185444 293644 80341 58123 302991 242695 281547 371695 322037 300127
1616 300127 82437 276434 304509 185107 211939 133326 185056 249715 151782 142868 -25516
1605 -25516 74417 -20636 -109001 -108453 -110930 -42922 -172302 -86486 167799 171791 211768 297450
1593 297450 189129 -66996 -141664 -50348 127934 163234 173613 47550 48063 116729 -58032
1582 -58032 -39903 186093 216413 147506 37719 -132929 178256 37152 -30449 97572 258009
1571 258009 249983 196698 -137662 -260060 -252224 -94163 143402 -17748 -47326 82734 61296
$$ packed form
1649A61457R0674J3552j40471n868L0770q6311o9066J26441J77545j40135j86017
1638b7429r499k3563K0166L1329Q0789l20151L8053J68187l4636q0597K02600
1627D5249J8669J21526J08200k13303k2218K44868o0296L8852R0148m9658k1910
1616C00127k17690J93997K8075j19402K6832p8613N1730O4659r7933q914j68384
1605b5516R9933r5053q8365N48k477O8008j29380Q5816K54285L992L9977Q5682
1593B97450j08321k56125p4668R1316J78282L5300J0379j26063N13O8666j74761
1582e8032J8129K25996L0320o8907j09787j70648L11185j41104o7601J28021J60437
1571B58009q026n3285l34360j22398P836J58061K37565j61150k9578J30060k1438
$$ plain form
1560 61296 -111999 -131233 54991 108588 207335 161284 54447 -18596 279683 221201 -209976
1549 -209976 -110161 159768 274957 310640 184741 -151432 -35005 -38704 -105777 -211336 -68172
1538 -68172 -104032 -111803 -278790 -165918 -1643 -22746 -162773 -56819 -70005 120685 202744
1527 202744 3760 -28917 56274 135550 20914 220105 69708 223733 215404 233793 214551
1516 214551 72404 159596 226000 226783 45272 -46306 -148329 -26348 323248 208663 151527
1505 151527 206056 152335 100546 57193 51205 -154868 -63088 410248 462460 261525 159067
1494 159067 191904 72826 -60831 -46558 -66210 52935 194048 -36846 31069 -58645 -83700
1483 -83700 -1174 116195 47585 101934 132469 4896 -27203 73053 143148 -128230 -44690
$$ packed form
1560F1296j73295j9234J86224N3597R8747m6051j06837p3043K98279n8482m31177
1549b09976R9815K69929J15189L5683j25899l36173J16427l699o7073j05559J43164
1538f8172l5860p771j66987J12872J64275k1103j40027J05954j3186J90690Q2059
1527B02744j98984l2677Q5191P9276j14636J99191j50397J54025q329J8389j9242
1516B14551j42147Q7192O6404P83j81511r1578j02023J21981L49596j14585n7136
1505A51527N4529n3721n1789m3353n988k06073R1780M73336N2212k00935j02458
1494A59067L2837j19078j33657J4273j9652J19145J41113k30894O7915q9714k5055
1483h3700Q2526J17369o8610N4349L0535j27573l2099J00256P0095k71378Q3540
$$ plain form
1472 -44690 36560 21392 -20745 -74468 -31187 7895 71669 199054 -138630 -213402 -72164
1461 -72164 134358 19722 -126849 84449 94802 -189328 -228179 -70010 78451 161278
1451 161278 69624 60355 35576 177304 90150 154797 52456 -33917 38257 -89512 -45265
1440 -45265 -170223 50843 203707 97318 -64831 169193 39997 -59031 148 -12015
1430 -12015 -42549 31043 194324 -29589 -240444 -243783 -151750 15429 -125084 -109422 -37715
1419 -37715 37075 -126955 -173583 84611 360879 200051 -22361 -10248 -51220 131994 148243
1408 148243 132749 59546 295355 434398 375467 210265 183819 64893 113082 62691 -43807
1397 -43807 -40931 -132469 143723 135820 32393 57127 -123636 -139047 -50506 -206640 -336874
$$ packed form
1472d4690Q1250j5168m2137n3723M3281L9082O3774J27385l37684p4772J41238
1461g2164K06522j14636j46571K11298J0353k84130l8851J58169J48461Q2827
1451A61278r1654r269k4779J41728q7154O4647j02341q6373P2174j27769M4247
1440d5265j24958K21066J52864j06389j62149K34024j29196r9028N9179j2163
1430a2015l0534P3592J63281k23913k10855l339R2033J67179j40513J5662P1707
1419c7715P4790j64030m6628K58194K76268j60828k22412J2113m0972J83214J6249
1408A48243j5494p3203K35809J39043n8931j65202k6446j18926M8189n0391j06498
1397d3807K876r1538K76192p903j03427K4734j80763j5411Q8541j56134j30234
$$ plain form
1386 -336874 -87851 -40888 -190873 -259982 64284 97245 35533 61253 87839 103718 310339
1375 310339 223199 70696 -85222 -263600 -262572 -197422 4528 -97246 -196033 -100781 -138472
1364 -138472 -122553 138530 99341 101555 115482 80636 -61160 -85269 -39651 -161389 102484
1353 102484 -120456 -240294 -66484 -62543 244364 7938 -98838 -197719 -148135 -267248
1343 -267248 -182346 -32649 -91108 182891 75080 -55374 -233677 -171410 -252500 -298650 -77639
1332 -77639 -55489 -198822 -12601 14842 46359 -56653 -22577 95329 73948 69471 14770
1321 14770 96497 54407 123743 186081 -47726 -204214 -66245 -224743 -1924 175643 -86407
1310 -86407 -4220 -80245 -20943 -112409 -231599 -137612 84363 101822 -222503 -377406 -312682
$$ packed form
1386c36874K49023M6963j49985o9109L24266L2961o1712K5720K6586J5879K06621
1375C10339q7140j52503j55918j78378J028O5150K01950j01774r8787R5252l7691
1364a38472J5919K61083l9189K214J3927l4846j41796k4109M5618j21738K63873
1353A02484k22940j19838J73810L941L06907k36426j06776r8881M9584j19113
1343b67248Q4902J49697n8459K73999j07811j30454j78303O2267q1090m6150K21011
1332g7639K2150j43333J86221K7443L1517j03012L4076J17906k1381m477n4701
1321A4770Q1727m2090O9336O2338k33807j56488J37969j58498K22819J77567k62050
1310h6407Q2187p6025N9302r1466j19190R3987K21975J7459l24325j54903O4724
$$ plain form
1299 -312682 -201146 -55538 184582 323212 253081 156038 157700 24676 22035 113824 152860
1288 152860 -4536 5267 -86685 -29107 175174 215954 55330 -23404 18822 -167751 -96611
1277 -96611 177836 46045 100219 -61256 -120116 -210515 -94064 -263166 -259861 -130666 -163005
1266 -163005 38959 -76055 -67459 99541 150532 63485 -51561 -100924 -80452 -60561 -275665
1255 -275665 -189030 101835 -139427 -7835 14509 -24625 -16751 -171816 -280978 -172542 84713
1244 84713 -36960 20079 165076 103847 66104 5770 149387 87773 130447 -62506 -103159
1233 -103159 -254961 -130818 -184993 -56411 74859 24015 39955 -42861 -11596 -193852 -265592
1222 -265592 -53753 26860 -171159 -262994 -133545 -20558 -24395 46399 -6025 -47888 -46085
$$ packed form
1299c12682J11536J45608K40120J38630p0131r7043J662j33024k641R1789L9036
1288A52860j57396R803r1952N7578K04281M0780j60624p8734M2226j86573P1140
1277i6611K74447j31791N4174j61475n8860r0399J16451j69102L305J29195l2339
1266a63005K01964j15014Q596J67000N0991q7047j15046m9363K0472J9891k15104
1255b75665Q6635K90865k41262J31592K2344l9134P874j55065j09162J08436K57255
1244H4713j21673N7039J44997o1229l7743o0334J43617o1614M2674j92953m0653
1233a03159j51802J24143n4175J28582J31270n0844J5940q2816L1265j82256p1740
1222b65592K11839Q0613j98019r1835J29449J12987l837P0794n2424m1863J803
$$ plain form
1211 -46085 69142 62621 98202 26826 114704 337246 199221 -33780 32465 -373225 -240802
1200 -240802 -96257 -1380 -81571 -62847 -110451 -91145 -27255 -40582 1983 -101792 -41408
1189 -41408 -42008 42173 -156238 23032 -5705 -53243 106280 210425 8532 -153903 -24878
1178 -24878 185391 96937 57073 358 -155970 -130265 -229503 -144048 -139446 126829 179956
1167 179956 120838 195472 155352 135623 198037 225157 362848 542361 144571 -176728 121748
1156 121748 148181 -143997 5316 95383 85949 176674 306274 230896 159930 219583 270220
1145 270220 199009 127584 204162 145629 -36339 -55218 73259 189211 73918 128039 84135
1134 84135 -18087 53445 60017 47864 -60992 101301 -16773 -74192 89230 -143582 -11415
$$ packed form
1211d6085J15227o521L5581p1376Q7878K22542j38025k33001O6245m05690J32423
1200b40802J44545R4877q0191J8724m7604J9306O3890j3327M2565j03775O0384
1189d1408o00Q4181j98411J79270k8737m7538J59523J04145k01893j62435J29025
1178b4878K10269q8454l9864n6715j56328K5705r9238Q5455M602K66275N3127
1167A79956n9118P4634m0120j9729O2414K7120J37691J79513l97790l21299K98476
1156A21748K6433k92178J49313R0067r434R0725J29600p5378p0966N9653N0637
1145B70220p1211p1425P6578n8533j81968j8879J28477J15952j15293N4121m3904
1134H4135j02222P1532O572j2153j08856J62293j18074n7419J63422k32812J32167
$$ plain form
1123 -11415 156804 137193 60864 86516 -56423 -32566 28617 -114101 -92758 -220358 -22505
1112 -22505 138730 57761 7132 16084 -73474 -32307 -26835 -5366 62282 23023 -121083 -10375
1100 -10375 110618 653 120263 182578 60401 109570 87863 -22840 86088 134612 119157
1089 119157 -47056 313430 197396 175646 35215 -140113 47681 -76382 -96856 -191740
1079 -191740 -175797 -96015 -127965 -162294 -2561 185760 247234 -72233 -100676 153544 307549
1068 307549 354743 56508 33952 -36499 415 217159 207163 -45690 -56189 -133585 -183763
1057 -183763 -126233 111248 -168670 12476 72941 -185858 49779 95714 88657 23178 6896
1046 6896 -928 35924 134720 22118 -117723 15741 -174327 -27949 220 57817 -91703
$$ packed form
1123a1415J68219j9611p6329K5652j42939K3857O1183j42718K1343j27600J97853
1112b2505J61235q0969n0629Q952q9558M1167N472K1469O7648l9259j44106J10708
1100a0375J20993j09965J19610O2315j22177M9169k1707j10703J08928M8524j5455
1089A19157j66213L60486j16034k1750j40431j75328J87794j24063k0474r4884
1079a91740J5943P9782l1950l4329J59733J88321O1474l19467k8443K54220J54005
1068C07549M7194k98235k2556p0451L6914K16744r996k52853j0499p7396n0178
1057a83763N7530K37481k79918J81146O0465k58799K35637M5935p057o5479j6282
1046F896p824L6852R8796j12602j39841J33464j90068J46378K8169N7597j49520
$$ plain form
1035 -91703 -60629 177803 178775 180015 122527 90582 48307 1654 68006 57394 -89364 -28257
1023 -28257 163668 36711 -18809 13326 195203 94530 165065 13397 37856 -69777 -21861
1012 -21861 -10618 193093 -47513 -298185 -52453 41177 140932 47977 -99585 -92266 154450
1001 154450 96388 132711 122534 24461 39825 -123179 54866 196458 185082 276577 233118
990 233118 27394 54537 -37416 -258382 -312279 -207453 12337 -38667 -94742 -225950 -118824
979 -118824 -170674 -10669 13235 -195550 -196353 -51304 18305 42271 -22981 17065 -1136 101371
967 101371 182358 128548 216970 -67120 -72445 -49309 -61019 -204507 -458537 -167454 -57789
956 -57789 122003 56616 -27524 59132 93247 145653 -112630 -171786 90610 75680 -38411
$$ packed form
1035i1703L1074K38432R72J240n7488l1945m2275m6653O6352j0612j46758O1107
1023b8257J91925j26957n5520L2135J81877j00673P0535j51668K4459j07633M7916
1012b1861J1243K03711k40606k50672K45732R3630R9755r2955j47562P319K46716
1001A54450n8062L6323j0177r8073J5364j63004J78045J41592j1376R1495m3459
990B33118k05724K7143r1953k20966n3897J04826K19790n1004n6075j31208J07126
979a18824n1850J60005K3904k08785q03J45049O9609K3966o5252M0046j8201J02507
967A01371Q0987n3810Q8422k84090n325K3136j1710j43488k54030K91083J09665
956e7789J79792o5387q4140Q6656L4115N2406k58283n9156K62396j4930j14091
$$ plain form
945 -38411 -45937 49017 -107753 -75490 111681 93573 208037 174950 -52920 -170947 -116332
934 -116332 -68596 -89258 -14828 -239019 -259226 -66276 24662 -188975 -334394 -301347 -133335
923 -133335 102138 84638 41065 132253 -22224 160646 315644 325452 -39819 -134227 -111894
912 -111894 -18632 106852 104308 66179 79556 352843 329187 7104 -41503 -89711 -65472
901 -65472 111139 182882 205527 42956 24144 -149690 -71052 -93542 -180700 -10871 86482
890 86482 -124386 -171258 -145206 -183144 -200404 -129253 -212968 -269925 -428943 -318809 152689
879 152689 -4693 -110261 124819 -88997 -168687 -80689 32310 77726 92706 83554 -63573
868 -63573 -139539 -210712 -194174 -216549 -305525 -216458 -76841 -76657 -197257 -105126 -149022 -67557
$$ packed form
945c8411p526R4954j56770L2263J87171j8108J14464l3087k27870j18027N4615
934a16332M7736k0662P4430k24191k0207J92950R0938k13637j45419L3047J68012
923a33335K35473j7500m3573R1188j54477J82870J54998R808l65271r4408K2333
912a11894R3262J25484k544l8129J3377K73287k3656l22083m8607m8208K4239
901f5472J76611P1743K2645j62571j8812j73834P8638k2490q7158J69829R7353
890H6482k10868m6872K6052l7938j7260P1151q3715n6957j59018J10134M71498
879A52689j57382j05568K35080k13816p9690Q7998J12999M5416J4980r152j47127
868f3573p5966p1173J6538k2375q8976Q9067J39617J84j20600R2131m3896Q1465
$$ plain form
856 -67557 111832 -185452 -326946 -182213 -90860 -189985 -126330 -230670 -335064 96695 8522
845 8522 -220061 -204071 73115 155753 46582 146098 24380 106974 170333 71079 -114241
834 -114241 -119235 -201935 -150634 -52453 -111172 26138 85139 49237 -194322 -293614 -218832 -223049
822 -223049 -209718 -56082 65260 -101419 -135439 89882 128149 78270 -175424 -193361 -96171
811 -96171 28602 -190511 -226290 -29835 15309 40632 79400 -151475 -141480 -208975 27575
800 27575 121984 67629 -144222 -246497 -120531 57265 -22522 -115141 -259843 -224359 -58948
789 -58948 -296538 -355383 -106610 66861 92005 171875 313240 288272 103160 261472 118383
778 118383 65032 108773 -6973 -82361 110388 64115 -78486 -51411 69693 146538 329560
$$ packed form
856f7557J79389k97284j41494J44733R1353r9125O3655j04340j04394M31759q8173
845H522k28583J5990K77186Q2638j09171R9516j21718Q2594O3359r9254j85320
834a14241m994q2700N1301R8181n8719J37310N9001l5902k43559r9292P4782m217
822b23049J3331J53636J21342j66679l4020K25321L8267m9879k53694j7937R7190
811i6171J24773k19113l5779J96455M5144K5323L8768k30875R995o7495K36550
800B7575R4409n4355k11851j02275J25966J77796p9787r2619j44702L5484J65411
789e8948k37590n8845K48773J73471K5144P9870J41365k4968j85112J58312j43089
778A18383n3351M3741j15746p5388J92749m6273j42601K7075J21104P6845J83022
$$ plain form
767 329560 128066 62542 185806 -113986 -277290 -38430 -90058 132769 36979 77867 -35359
756 -35359 48178 191140 177 -103999 -6130 -9832 -9824 -3230 -53333 -190685 -156068 -172174
744 -172174 -411012 -289134 -169033 129094 246887 92305 275555 154342 -49183 195973
734 195973 168857 27252 69853 17402 125038 -71169 -160525 -106118 -46736 71421 95403
723 95403 -1864 35770 157240 116922 98530 280977 304310 157151 -113497 -214605 -41646
712 -41646 5564 -87950 -158715 -29338 -95326 128621 -8565 -89305 -213781 -164764 -168243
701 -168243 -154233 212983 249480 -37826 -9063 -70156 -84843 -60811 -144517 -111552 42870
690 42870 -72441 41169 204130 37260 45344 -167312 -317786 -160105 86770 162992 164757
$$ packed form
767C29560k01494o5524J23264k99792j63304K38860n1628K22827r5790M0888j13226
756c5359Q3537J42962j90963j04176R7869l702QO594n0103j37352L4617j6106
744a72174k38838J21878J20101K98127J17793j54582J83250j21213k03525K45156
734A95973k7116j41605M2601n2451J07636j96207q9356N4407N9382J18157K3982
723I5403r7267L7634J21470m0318j8392J82447K3333j47159k70648j01108J72959
712d1646M7210r3514p0765J29377o5988K23947j37186q0740j24476M9017l479
701a68243J4010L67216L6497k87306K8763o1093j4687K4032q3706L2965J54422
690D2870j15311J13610J62961j66870Q084k12656j50474J57681K46875P6222J765
$$ plain form
679 164757 95625 -53507 47864 -73039 137795 84565 -69766 -16348 -76075 64851 40364
668 40364 -64404 5951 -36913 -177806 75484 -10592 119867 253451 65984 -9793 -18264
657 -18264 -9239 -7576 -174881 -204338 -144773 -404043 -378253 -50366 -88889 -114436 -84255 -41463
645 -41463 67069 101366 73669 -159078 -43648 -39321 -124876 -258317 -124382 -130247 -318439
634 -318439 -207119 -160613 -201731 -60901 -42097 13491 -26552 -243937 -109048 -98824 -16231
623 -16231 84959 83998 21445 -8601 10431 42369 -5909 163626 239874 144473 30366 24018
611 24018 -258558 -240013 -109762 -25927 -25181 21947 -47518 -111711 -101889 -133758 149111 204062
599 204062 29788 -146258 -121124 -59444 -31536 -163836 -235929 -168167 -310291 -308324 -285080
$$ packed form
679A64757o9132j49132J01371j20903K10834n3230j54331N3418n9727J40926k4487
668D0364j04768P0355m2864j40893K53290q6076J30459J33584j87467p5777q471
657a8264R025J663j67305k9457N9565k59270K5790L27887l8523k5547L0181M2792
645d1463J08532L4297k7697k32747J15430M327q5555j33441J33935n865j88192
634c18439J11320M6506m1118J40830J8804N5588m0043k17385J34889J0224Q2593
623a6231J01190r61o2553l0046J9032L1938m8278J69535P6248r5401j14107o348
611B4018k82576J8545J30251Q3835P46M7128o9465o4193R822l1869K82869N4951
599B04062j74274j76046K5134O1680K7908j32300p2093O7762j42124J967K3244
$$ plain form
588 -285080 -419362 -199223 -241750 -149719 -96816 -108177 -46297 37215 -123335 -156328 -143898
577 -143898 -219471 -120572 78078 129166 126255 -145521 -191413 119478 96554 -78584 -121986
566 -121986 -122156 -167462 145634 -55606 -210200 -222379 -178976 98289 138724 76878 -22497
555 -22497 -173456 -171722 -145151 -232739 -248897 -380354 -432416 -327747 -307462 -250952 -156083 -124507
543 -124507 -107459 -199599 -149071 -130366 -264523 -118017 1741 60950 184503 -34515 34120
532 34120 84351 15440 16933 118633 149509 125013 109806 162688 153722 101804 123559 49645
520 49645 127895 33358 69195 283025 169969 42037 24767 -244826 -229279 -169406 12417
509 12417 -22940 -320228 -254894 -86117 -159836 -47222 63276 14805 14584 74297 -92272
$$ packed form
588b85080j34282K20139m2527R2031N2903j1361O1880Q3512j60550l2993J2430
577a43898p5573R8899J98650N1088k911k71776m5892L10891k2924j75138m3402
566a21986j70m5306L13096k01240j54594j2179M3403K77265M0435o1846r9375
555b2497j50959J734K6571q7588j6158j31457n2062J04669K0285N6510R4869L1576
543a24507J7048r2140N0528J8705j34157J46506J19758N9209J23553k19018O8635
532C4120N0231o8911J493J01700L0876k4496j5207N2882q966n1918K1755p3914
520D9645P8250r4537L5837K13830j13056j27932j7270k69593J5547N9873J81823
509A2417l5357k97288O5334J68777p3719J12614J10498m8471k21N9713j66569
$$ plain form
498 -92272 -97577 -198322 -434902 -210295 -163696 -189669 -173265 -378199 -11526 61714 67731
487 67731 189396 63263 97465 16286 -241807 -216714 -54442 65482 65455 71319 57483 -17122
475 -17122 8100 -18668 -278427 -232978 -192317 -66068 -48192 -28850 -57931 -88938 -232831
464 -232831 -331127 -54119 72198 -304823 -352756 -133559 -41719 -111934 -114768 -62479 -199531
453 -199531 -59838 -195863 -178016 -246651 -166156 -190546 -227475 -234537 -23880 -147421 -118376
442 -118376 -67464 -18219 -114755 89077 37123 -44963 133407 114154 -92507 -163494 -48090
431 -48090 222662 31106 -72690 -282994 -377266 -243302 -183770 -176657 -144756 -165994 -111397
420 -111397 551 162357 73359 73841 22355 -17227 -53100 56084 -29038 -160222 -18013
$$ packed form
498i2272n305j00745k36580K24607M6599k5973J6404k04934L66673P3240O017
487F7731J21665j26133L4202q1179k58093K5093J62272J19924k7N864j3836p4605
475a7122K5222k6768k59759M5449M0661J26249J7876J9342k9081l1007j43893
464b32831r8296K77008J26317l77021m7933K19197R1840p0215k834N2289j37052
453a99531J39693j36025J7847o8635Q0495k4390l6929p062K10657j23541K9045
442a18376N0912M9245r6536K03832n1954q2086J78370j9253k06661p0987J15404
431d8090K70752j91556j03796k10304r4272J33964N9532P113L1901k1238N4597
420a11397J11948J61806q8998M82n1486l9582l5873J09184q5122j31184J42209
$$ plain form
409 -18013 -120819 -34692 10843 126844 -49580 111033 32705 -127803 -116632 -7643 -20152
398 -20152 86616 -52658 6128 34390 7587 36754 115978 34426 -146443 -152953 2230
387 2230 -96699 -107398 -127207 -234244 -313188 -198250 -367197 -177966 -40470 -38011 -35160 -103719
375 -103719 -23751 -31133 118000 -57064 -218223 -115231 -170137 -179076 27034 -22721 92423
364 92423 65747 163443 406465 282054 151023 -90925 -73401 8531 196368 144527 -97275
353 -97275 -210857 -137473 -124697 100161 78974 75934 127713 -143203 -151152 -201261 -106454 24226
341 24226 53901 -212561 -287218 -150563 -161391 -132740 -161143 -102498 -96540 -117880 57991 60803
329 60803 -6404 83618 108749 -377988 -333887 -136463 65616 183736 73590 -166969 -61115
$$ packed form
409a8013j02806Q6127M5535J16001j76424J60613p8328j60508J1171J08989j2509
398b0152J06768j39274N8786K8262k6803K9167P9224q1552j80869o510J55183
387B230r8929j0699j9809j07037p8944J14938j68947J89231J37496K459K851o8559
375a03719P9968p382J49133j75064j61159J02992n4906q939K06110m9755J15144
364I2423k6676R7696K43022j24411j31031k41948J7524Q1932J87837n1841k41802
353i7275j13582P3384J2776K24858k1187l040N1779k70916p949n0109R4807J30680
341B4226K9675k66462p4657J36655j0828K8651k8403N8645N958k1340J75871K812
329F0803o7207R0022K5131m86737M4101J97424K02079J18120j10146k40559J05854
$$ plain form
318 -61115 -30666 -93870 -138172 31531 131171 -42387 -25306 -58054 -49854 89127 -51710
307 -51710 -47887 146646 -39430 -261401 -108850 -65750 -223123 -179229 -53815 33175 -165305
296 -165305 -150092 -24214 45851 -138463 -247033 -236003 -93474 9499 -29623 100654 26970
285 26970 210220 -35 -162309 -193664 -315564 -170577 -101834 17293 -745 -57484 -139844
274 -139844 -60994 -303360 -89260 34507 -127611 -118695 -48656 -93567 -18059 174111 99640
263 99640 -21873 -207582 -65380 324493 230568 6607 -39961 -1395 67269 -87318 -191594
252 -191594 -238902 -78932 24980 -97647 -133980 -84366 27725 29245 -182166 -259608 -44185
241 -44185 185870 -32840 5639 -96846 -187533 -323327 -137744 100717 17906 -39663 -241372
$$ packed form
318f1115L0449o3204m4302J69703R9640j73558J7081l2748Q200J38981j40837
307e1710L823J94533j86076k21971J52551M3100j57373M3894J25414Q6990j98480
296a65305J5213J25878P0065j84314j08570J1030J42529J02973l9122J30277p3684
285B6970J83250k10255j62274l1355j21900J44987O8743J19127j8038n6739q2360
274a39844P8850k42366K14100J23767j62118Q916P0039m4911P5508J92170p4471
263I9640j21513j85709J42202L89873r3925k23961m6568L8566O8664j54587j04276
252a91594m7308J59970J03912j22627l6333M9614J12091J520k11411p7442K15423
241d4185K30055k18710L8479j02485r0687j35794J85583K38461q2811n7569k01709
$$ plain form
230 -241372 -71477 4991 -65991 67171 2771 -2828 -164771 -131924 60139 58633 -40521
219 -40521 93996 -122057 -261861 -228638 -123992 64230 -226951 -95399 34581 103603
209 103603 132667 10300 -262236 -203206 -77193 64107 6241 -268534 -254090 -110651 8831
198 8831 86161 32603 -138718 -185214 -65482 48577 213651 214487 90956 -149651 -164242
187 -164242 -42366 -42939 -56211 -70474 78340 32428 -130423 -121519 43612 210158 172469
176 172469 -3035 -147603 -85936 -226405 -265840 -353199 -333377 -248558 -205001 -182820 -425175
165 -425175 -200230 -54551 -69854 69136 26729 174579 213749 -5697 -230503 -211080 -176909
154 -176909 12989 112751 72448 -227853 -358408 -376663 -262622 -172349 -223861 -26297 -138353
$$ packed form
230b41372J69895P6468p0982J33162o4400n599j61943L2847J92063j506r9154
219d0521J34517k16053j39804L3223J04646J88222k91181J31552J29980O9022
209A03603K9064j22367k72536N9030J26013J41300n7866k74775J4444J43439J19482
198H831P7330n3558j71321m6496J19732J14059J65074Q36j23531k40607j4591
187a64242J21876n73j3272j4263J48814m5912j62851Q904J65131J66546l7689
176A72469j75504j44568O1667j40469l9435q7359J9822Q4819M3557K2181k42355
165d25175K24945J45679j5303J38990m2407J47850L9170k19446k24806J9423L4171
154a76909J89898R9762m0303l00301j30555j8255J14041R0273n1512J97564j12056
$$ plain form
143 -138353 -287962 -251982 -180741 -71723 -51185 -53328 -26543 2753 -125056 -83585 -29708
132 -29708 -76334 -36292 15124 -42352 -173993 -116383 35702 -10180 -16348 -84318 -241794 -109509
120 -109509 -103702 -291599 -58686 -165173 -288561 -333665 -202275 79308 -259390 -231877 -19145
109 -19145 -82101 -129106 -38052 -208797 -120545 -175280 -144274 -80866 -93127 -103879 -16228 -7244
97 -7244 -12115 -45257 88880 -26897 -124012 -77732 15662 -99988 -25838 -91462 -119135 -10257
85 -10257 -133173 -163399 -66356 -31221 20265 -76763 17980 36695 -13089 -96750 -162080 -71429
73 -71429 13936 15616 -46092 37959 24066 43220 -121118 -105868 -161824 -103642 -19932 -43399
61 -43399 -9114 -96935 -130775 -271960 -130766 -173742 -182033 -166579 -211439 -55656 -142079 -161243
$$ packed form
143a38353j49609L5980P1241J09018K0538k143K6785K9296j27809M1471N3877
132b9708m6626M0042N1416n7476j31641N7610J52085m5882o168o7970j57476J32285
120a09509N807j87897K32913j06487j23388m5104J31390K81583l38698K7513K12732
109a9145o2956m7005R1054j70745Q8252n4735L1006O3408j2261j0752Q7651Q984
97g244m871l3142J34137j15777r7115M6280R3394j15650P4150o5624k7673J08878
85a0257j22916l0226R7043L5135N1486r7028R4743J8715m9784q3661o5330R0651
73g1429Q5365J680o1708Q4051j3893J9154j64338J5250n5956N8182Q3710k3467
61d3399L4285q7821l3840j41185J41194m2976q291J5454m4860J55783q6423j9164
$$ plain form
49 -161243 -22381 -50933 -75714 -60587 -115398 -43641 -102243 -127511 -32656 121446 -14624
38 -14624 -149192 -127426 -144243 -278784 -199802 -249434 -163494 -32699 -45650 -79928 -84387 -116290
26 -116290 -50767 -59780 -67954 -216436 -155627 -153343 -189002 -186292 -291705 -52751 24323 -129768
14 -129768 -41401 -72681 -121045 -193915 -271290 -180599 -100638 -78407 -15109 34914 -40713 -18274
2 -18274 -132695 -239869
0 -239869
$$ packed form
49a61243J38862k8552k4781J5127n4811P1757n8602k5268R4855J54102j36070
38a4624j34568K1766j6817j34541P8982m9632Q5940J30795j2951l4278m459l1903
26a16290O5523r013q174j48482O0809K284l5659K710j05413K38954P7074j54091
14a29768Q8367l1280m8364p2870p7375R0691P9961K2231O3298N0023p5627K2439
2a8274j14421j07174
0b39869
$$ Imaginary data points
##PAGE= N=2
##DATA TABLE= (X++(I..I)), XYDATA
$$ plain form
16383 -2561278 -2477173 -2394633 -2348977 -2344281 -2372265 -2349922 -2311027 -2414925 -2375567 -2318778 -2279799
16372 -2279799 -2124893 -2095648 -2093647 -2095333 -1984761 -2043961 -1876796 -1805593 -1852653 -1709540 -1710245
16361 -1710245 -1719106 -1757144 -1636391 -1631089 -1455544 -1340834 -1490216 -1455776 -1242268 -1369438
16351 -1369438 -1474309 -1227737 -1192926 -1214250 -1191734 -1199994 -1269018 -1086473 -975191 -1099117
16341 -1099117 -1163831 -1127787 -1106290 -980251 -945075 -1125014 -993564 -847509 -743100 -577090
16331 -577090 -707341 -625865 -705611 -617661 -582903 -586620 -490205 -367641 -410018 -367470 -307129
16320 -307129 -579118 -482055 -412587 -403644 -232220 -149652 -189654 -92665 -57022 133659 237883
16309 237883 73031 81955 2838 -100883 38853 153987 240317 411211 384158 318362 452081
$$ packed form
16383b561278Q4105Q2540M5656M696k7984K2343L8895j03898L9358N6789L8979
16372b279799J54906K9245K001j686J10572n9200J67165P1203m7060J43113p05
16361a710245q861l8038J20753N302J75545J14710j49382L4440K13508j27170
16351a369438j04871K46572L4811k1324K2516q260o9024J82545J11282j23926
16341a099117o4714L6044K1497J26039L5176j79939J31450J46055J04409J66010
16331e77090j30251Q1476p9746Q7950L4758l717R6415J22564m2377M2548O0341
16320c07129k71989R7063O9468Q943J71424Q2568m0002R6989L5643J90681J04224
16309B37883j64852Q924p9117j03721J39736J15134Q6330J70894k7053o5796J33719
$$ plain form
16298 452081 483006 435316 564240 431253 285210 396258 668067 489933 602467 703483
16288 703483 541079 573125 701217 726375 748326 823348 865065 873043 791475 901386 699698
16277 699698 660151 931145 991417 1122984 1154429 1131580 1358229 1305100 1149403 1007709
16267 1007709 1084935 1143945 1068159 1307963 1407503 1369441 1218119 1268855 1428956 1410064 1446964
16256 1446964 1323843 1399237 1420604 1289695 1547619 1630742 1662547 1379400 1389540 1446929
16246 1446929 1349145 1346742 1375739 1595415 1709433 1598138 1483136 1673499 1835496 1685630
16236 1685630 1765812 1895793 1833308 1900967 1808694 1778678 1659517 1757934 1917024 2005380 2094917
16225 2094917 2252922 2199978 2242008 2024945 2106122 2276242 2251141 2194080 2254832 2180087 2143093
$$ packed form
16298D52081L0925m7690J28924j32987j46043J11048K71809j78134J12534J01016
16288G03483j62404L2046J28092K5158K1951P5022M1717P978q1568J09911k01688
16277F99698l9547K70994O0272J31567L1445k2849K26649n3129j55697j41694
16267A007709P7226N9010p5786K39804R9540l8062j51322N0736J60101j8892L6900
16256A446964j23121P5394K1367j30909K57924Q3123L1805k83147J0140N7389
16246A446929r7784k403K8997K19676J14018j11295j15002J90363J61997j49866
16236A685630Q0182J29981o2485O7659r2273l0016j19161R8417J59090Q8356Q9537
16225B094917J58005n2944M2030k17063Q1177J70120k5101n7061O0752p4745l6994
$$ plain form
16214 2143093 2184551 2096055 2035886 2226959 2213687 2188204 2147765 2226826 2305346 2228793 2195901
16203 2195901 2358960 2362182 2361781 2364471 2294910 2342892 2342245 2232164 2324847 2291229 2517137 2588112
16191 2588112 2403652 2503029 2506268 2538825 2482554 2423002 2300605 2373643 2626997 2854305 2578948
$$ packed form
16214B143093M1458q8496o0169J91073j3272k5483m0439P9061P8520p6553l2892
16203B195901J63059L222m01K690o9561M7982o47j10081R2683l3618K25908P0975
16191B588112j84460R9377L239L2557n6271n9552j22397P3038K53354K27308k75357
$$ [...]
##END NTUPLES=NMR SPECTRUM
##END=
