##TITLE=1H_TG-2307-Ic
 CDCl3
 8 sc, 
 5.7.2023
##JCAMPDX= 6.0         $$ Bruker NMR JCAMP-DX V2.0
##DATA TYPE= NMR SPECTRUM
##DATA CLASS= NTUPLES
##ORIGIN= UXNMR, Bruker Analytische Messtechnik GmbH
##OWNER= root
$$ XWIN-NMR		Version 3.5
$$ Wed Jul  5 14:23:47 2023 Russian Standard Time (UT+4h)  she@DPX200
##.OBSERVE FREQUENCY= 200.13135
##.OBSERVE NUCLEUS= ^1H
##.ACQUISITION MODE= SIMULTANEOUS
##.ACQUISITION SCHEME= undefined
##.AVERAGES= 8
##.DIGITISER RES= 18
##SPECTROMETER/DATA SYSTEM= spect
##.PULSE SEQUENCE= zg30
##.SOLVENT NAME= CDCl3
##.SHIFT REFERENCE= (INTERNAL, CDCl3, 0, 15.8427)
##AUDIT TRAIL= $$ (NUMBER, WHEN, WHO, WHERE, WHAT)
$$ ##TITLE= Audit trail, XWIN-NMR		Version 3.5
$$ ##JCAMPDX= 5.01
$$ ##ORIGIN= Bruker BioSpin GmbH
$$ ##OWNER= she
$$ F:/spectra/data/she/nmr/H-F/1/pdata/1/auditp.txt
$$ ##AUDIT TRAIL=  $$ (NUMBER, WHEN, WHO, WHERE, WHAT)
(   1,<2023-07-05 14:22:05.75 +0400>,<she>,<DPX200>,
      <created by zg, POWCHK disabled, PULCHK disabled
       configuration hash MD5:
       00 E9 B6 7A A2 85 ED C7 34 08 36 98 17 FE 4E 26
       data hash MD5: 16K
       90 77 C6 F2 19 B3 6A 99 FB C7 AC 44 E7 21 07 1B>)
(   2,<2023-07-05 14:22:08.87 +0400>,<she>,<DPX200>,
      <Start of raw data processing
       efp BC_mod = 2 LB = 0.24 FT_mod = 6 PKNL = 1 PHC0 = -20626.66 PHC1 = 9.25272 SI = 16K 
       data hash MD5: 16K
       3A 75 D0 A5 2E 6E B0 A8 24 A5 7E F0 64 21 BC D8>)
(   3,<2023-07-05 14:22:31.14 +0400>,<she>,<DPX200>,
      <pk PHC0 = -159.2271 PHC1 = 1.4 
       data hash MD5: 16K
       18 9F 56 09 6E A4 53 FA D3 06 F7 A4 2A AC EC D3>)
(   4,<2023-07-05 14:22:34.20 +0400>,<she>,<DPX200>,
      <abs ABSG = 5 
       data hash MD5: 16K
       A8 62 4A 0C A3 8B 17 41 61 B7 CB 2F 7A B2 7F 29>)
$$ ##END=
$$ 
$$ hash MD5
$$ 06 F6 37 C5 88 22 3D 2B 35 B2 A8 5C F4 60 99 20
##$RELAX= 
##$RELAX= 
##$RELAX= 
##$RELAX= 
##$RELAX= 
##$RELAX= 
$$ Bruker specific parameters
$$ --------------------------
##$DU= <F:/spectra>
##$EXPNO= 1
##$NAME= <H-F>
##$PROCNO= 1
##$TYPE= <nmr>
##$USER= <she>
##$AMP= (0..31)
100 100 100 100 100 100 100 100 100 100 100 100 100 100 100 100 100 100 
100 100 100 100 100 100 100 100 100 100 100 100 100 100 
##$AQSEQ= 0
##$AQ_mod= 1
##$AUNM= <au_zg>
##$AUTOPOS= <>
##$BF1= 200.13
##$BF2= 200.13
##$BF3= 200.13
##$BF4= 200.13
##$BF5= 200.13
##$BF6= 200.13
##$BF7= 200.13
##$BF8= 200.13
##$BYTORDA= 1
##$CFDGTYP= 0
##$CFRGTYP= 5
##$CHEMSTR= <none>
##$CNST= (0..31)
1 1 145 1 1 1 1 1 1 1 1 1 1 1 1 1 1 1 1 1 1 1 1 1 1 1 1 1 1 1 1 1 
##$CPDPRG= <>
##$CPDPRG1= <>
##$CPDPRG2= <>
##$CPDPRG3= <>
##$CPDPRG4= <mlev>
##$CPDPRG5= <mlev>
##$CPDPRG6= <mlev>
##$CPDPRG7= <mlev>
##$CPDPRG8= <mlev>
##$CPDPRGB= <>
##$CPDPRGT= <>
##$D= (0..31)
0 1.2 0 0 0 0 0 0 0 0.06 0 0.03 0 0 0 0 0.0002 0 0 0 0 0 0 0 0 0 0 0 0 
0 0 0 
##$DATE= 1688552525
##$DBL= (0..7)
120 120 120 120 120 120 120 120 
##$DBP= (0..7)
150 150 150 150 150 150 150 150 
##$DBP07= 0
##$DBPNAM0= <>
##$DBPNAM1= <>
##$DBPNAM2= <>
##$DBPNAM3= <>
##$DBPNAM4= <>
$$ [...]
##$SUBNAM3= <"">
##$SUBNAM4= <"">
##$SUBNAM5= <"">
##$SUBNAM6= <"">
##$SUBNAM7= <"">
##$SUBNAM8= <"">
##$SUBNAM9= <"">
##$SW= 18.05172834244
##$SWIBOX= (0..15)
0 0 2 0 0 0 0 0 0 0 0 0 0 0 0 0 
##$SW_h= 3612.71676300578
##$TD= 16384
##$TD0= 1
##$TE= 0
##$TE2= 300
##$TE3= 300
##$TEG= 300
##$TL= (0..7)
0 120 120 120 120 120 120 120 
##$TP= (0..7)
150 150 150 150 150 150 150 150 
##$TP07= 0
##$TPNAME0= <>
##$TPNAME1= <>
##$TPNAME2= <>
##$TPNAME3= <>
##$TPNAME4= <>
##$TPNAME5= <>
##$TPNAME6= <>
##$TPNAME7= <>
##$TPOAL= (0..7)
0.5 0.5 0.5 0.5 0.5 0.5 0.5 0.5 
##$TPOFFS= (0..7)
0 0 0 0 0 0 0 0 
##$TUNHIN= 0
##$TUNHOUT= 0
##$TUNXOUT= 0
##$USERA1= <user>
##$USERA2= <user>
##$USERA3= <user>
##$USERA4= <user>
##$USERA5= <user>
##$V9= 5
##$VALIST= <valist>
##$VCLIST= <CCCCCCCCCCCCCCC>
##$VD= 0
##$VDLIST= <DDDDDDDDDDDDDDD>
##$VPLIST= <PPPPPPPPPPPPPPP>
##$VTLIST= <TTTTTTTTTTTTTTT>
##$WBST= 1024
##$WBSW= 4
##$XGAIN= (0..3)
0 0 0 0 
##$XL= 0
##$YL= 0
##$YMAX_a= 725381
##$YMIN_a= -592864
##$ZGOPTNS= <>
##$ZL1= 120
##$ZL2= 120
##$ZL3= 120
##$ZL4= 120
##$ABSF1= 15.71604
##$ABSF2= -2.33581
##$ABSG= 5
##$ABSL= 3
##$ALPHA= 0
##$AQORDER= 0
##$ASSFAC= 0
##$ASSFACI= 0
##$ASSFACX= 0
##$ASSWID= 0
##$AUNMP= <proc_1d>
##$AZFE= 0.1
##$AZFW= 0.1
##$BCFW= 0
##$BC_mod= 2
##$BYTORDP= 0
##$COROFFS= 0
##$CY= -3
##$DATMOD= 1
##$DC= 0
##$DFILT= <>
##$DTYPP= 0
##$F1P= 0
##$F2P= 0
##$FCOR= 1
##$FTSIZE= 16384
##$FT_mod= 6
##$GAMMA= 0
##$GB= 0
##$INTBC= 1
##$INTSCL= 3.70164e-10
##$ISEN= 128
##$LB= 0.24
##$LEV0= 0
##$LPBIN= 0
##$MAXI= 10000
##$MC2= 0
##$MEAN= 0
##$ME_mod= 0
##$MI= 1.114404
##$NCOEF= 0
##$NC_proc= -6
##$NLEV= 6
##$NOISF1= 3.799351
##$NOISF2= 2.8
##$NSP= 0
##$NTH_PI= 0
##$NZP= 0
##$OFFSET= 15.84275
##$PC= 1
##$PHC0= -20785.89
##$PHC1= 10.65272
##$PH_mod= 1
##$PKNL= yes
##$PPARMOD= 0
##$PSCAL= 0
##$PSIGN= 0
##$REVERSE= no
##$SF= 200.12998574938
##$SI= 16384
##$SIGF1= 3
##$SIGF2= 2
##$SINO= 5.538805
##$SIOLD= 16384
##$SREGLST= <1H.CDCl3>
##$SSB= 0
##$STSI= 16384
##$STSR= 0
##$SW_p= 3612.71676300578
##$SYMM= 0
##$S_DEV= 0
##$TDeff= 16384
##$TDoff= 0
##$TI= <>
##$TILT= no
##$TM1= 0
##$TM2= 0
##$TOPLEV= 0
##$USERP1= <user>
##$USERP2= <user>
##$USERP3= <user>
##$USERP4= <user>
##$USERP5= <user>
##$WDW= 1
##$XDIM= 16384
##$YMAX_p= 298831951
##$YMIN_p= -309111
$$ End of Bruker specific parameters
$$ ---------------------------------
##NTUPLES= NMR SPECTRUM
##VAR_NAME=  FREQUENCY,     SPECTRUM/REAL,   SPECTRUM/IMAG
##SYMBOL=    X,             R,               I
##VAR_TYPE=  INDEPENDENT,   DEPENDENT,       DEPENDENT
##VAR_FORM=  AFFN,          ASDF,            ASDF
##VAR_DIM=   16384,         16384,           16384
##UNITS=     HZ,            ARBITRARY UNITS, ARBITRARY UNITS
##FACTOR=    0.220516191357247, 1,           1
##FIRST=     3170.60925080685, 0,            0
##LAST=      -442.107512198933, 0,           0
##MIN=       -442.107512198933, -309111,     0
##MAX=       3170.60925080685, 298831951,    0
$$ Real data points
##PAGE= N=1
##DATA TABLE= (X++(R..R)), XYDATA
$$ [...]
$$ plain form
5620 4107215 4014064 3958794 3933727 3944326 3883580 3848972 3832970 3775060 3739840 3674496 3635528
5609 3635528 3607004 3591185 3550746 3527007 3525863 3445619 3440225 3420266 3397683 3348849 3378932 3369204
5597 3369204 3381009 3359590 3339164 3344629 3357046 3400403 3338517 3249438 3289579 3318874 3336215 3244830
5585 3244830 3219683 3248175 3259790 3296796 3262016 3257553 3269428 3271228 3215407 3228367 3266874 3265990
5573 3265990 3261236 3278969 3376765 3311718 3256248 3298450 3224252 3293194 3341446 3286196 3337558 3398924
5561 3398924 3382987 3424773 3499203 3569193 3588118 3543705 3543649 3543948 3634027 3680368 3714788 3787619
5549 3787619 3810791 3936248 3994752 3980564 4028032 4096158 4174989 4204488 4306053 4357059 4428618
5538 4428618 4444367 4545898 4602103 4605856 4715491 4756434 4836910 5012152 5103692 5203402 5362545
$$ packed form
5620D107215r3151n5270k5067J0599o0746l4608j6002n7910l5220o5344l8968
5609C635528k8524j5819m0439k3739j144q0244n394j9959k2583m8834L0083r728
5597C369204J1805k1419k0426N465J2417M3357o1886q9079M0141K9295J7341r1385
5585C244830k5147K8492J1615L7006l4780m463J1875J800n5821J2960L8507q84
5573C265990m754J7733R7796o5047n5470M2202p4198O8942M8252n5250N1362O1366
5561C398924j5937M1786P4430O9990J8925m4413n6K99R0079M6341L4420P2831
5549C787619K3172J25457N8504j4188M7468O8126P8831K9499J01565N1006P1559
5538D428618J5749J01531N6205L753J09635M0943Q0476J75242R1540R9710J59143
$$ plain form
5527 5362545 5353737 5426726 5481304 5646058 5690011 5736819 5784305 5913495 5926918 5973340 6043957
5516 6043957 6094944 6150676 6245387 6393271 6485469 6531183 6536782 6605571 6760380 6884367 6961774
5505 6961774 7024600 7036078 7074023 7124237 7251934 7258868 7326882 7360291 7466644 7534010 7569924
5494 7569924 7522735 7490905 7568322 7551269 7529706 7462927 7444465 7420554 7351684 7272221 7218492
5483 7218492 7126705 7137547 7069268 7038515 7019601 6939051 6913674 6811152 6739463 6650075 6585568
5472 6585568 6461072 6324002 6287502 6279567 6231397 6120181 6001992 5902180 5865595 5802977 5747224
5461 5747224 5719613 5690932 5671994 5586342 5561050 5498036 5334299 5284668 5288894 5188469 5092311
5450 5092311 5118484 5074767 4895758 4797583 4844753 4795201 4762289 4736189 4673770 4698019 4670972
$$ packed form
5527E362545q808P2989N4578J64754M3953M6808M7486J29190J3423M6422P0617
5516F043957N0987N5732R4711J47884R2198M5714N599O8789J54809J23987P7407
5505F961774O2826J1478L7945N0214J27697O934O8014L3409J06353O7366L5914
5494G569924m7189l1830P7417j7053k1563o6779j8462k3911o8870p9463n3729
5483G218492r1787J0842o8279l0753j8914q0550k5377j02522p1689q9388o4507
5472F585568j24496j37070l6500p935m8170j11216j18189r9812l6585o2618n5753
5461E747224k7611k8681j8938q5652k5292o3014j63737m9631M226j00425r6158
5450E092311K6173m3717j79009r8175M7170m9552l2912k6100o2419K4249k7047
$$ plain form
5439 4670972 4647405 4605672 4595701 4580027 4605075 4592094 4612911 4664603 4625911 4710573 4708757 4673772
5427 4673772 4703875 4780031 4840886 4792917 4822224 4855518 4913018 4989398 4989143 5012232 5026120 5069195
5415 5069195 5115265 5218493 5213083 5216998 5218944 5240058 5258915 5245624 5262016 5219870 5249323 5187640
5403 5187640 5176514 5180984 5218308 5304264 5345558 5375879 5381100 5404252 5472147 5472258 5454121 5456940
5391 5456940 5485681 5566537 5635195 5653653 5736666 5767039 5841029 5902192 6025342 6107936 6113086
5380 6113086 6265283 6418069 6547589 6738397 6899671 6959698 6977361 7022849 7076910 7154076
5370 7154076 7255250 7315366 7440074 7515930 7554140 7625867 7631921 7699802 7783345 7841320 8022732
5359 8022732 8091568 8150547 8157231 8207288 8196720 8200392 8232351 8161200 8176614 8243007 8328991 8548125
$$ packed form
5439D670972k3567m1733r971j5674K5048j2981K0817N1692l8692Q4662j816l4985
5427D673772L0103P6156O0855m7969K9307L3294N7500P6380k55K3089J3888M3075
5415E069195M6070J03228n410L915J946K1114J8857j3291J6392m2146K9453o1683
5403E187640j1126M470L7324Q5956M1294L0321N221K3152O7895J11j8137K819
5391E456940K8741Q0856O8658J8458Q3013L0373P3990O1163J23150Q2594N150
5380F113086J52197J52786J29520J90808J61274O0027J7663M5488N4061P7166
5370G154076J01174O0116J24708P5856L8210P1727O054O7881Q3543N7975J81412
5359H022732O8836N8979O684N0057j0568L672L1959p1151J5414O6393Q5984K19134
$$ plain form
5347 8548125 8836308 9132534 9570837 10026113 10179037 9998058 9859241 9826366 9801661 9865716
5337 9865716 10168453 10407004 10462436 10415708 10405803 10474180 10490463 10518098 10612824 10695373 10790087
5326 10790087 10786592 10796380 10770432 10554919 10242464 9875046 9400764 9078509 8868792 8703562
5316 8703562 8537107 8559468 8760860 9028917 9207783 9049209 8825009 8588107 8448465 8371657
5306 8371657 8354897 8493266 8630024 8625818 8557767 8551665 8538914 8536398 8500705 8523436 8650626
5295 8650626 8719389 8783980 8893417 8896463 8607742 8360748 7957512 7527133 7182727 6931942
5285 6931942 6815355 6771480 6688409 6713544 6725354 6661334 6642721 6628890 6555962 6504062 6482606
5274 6482606 6563760 6653981 6736448 6769063 6707747 6612865 6638002 6591643 6610733 6618376 6595737 6646874
$$ packed form
5347H548125K88183K96226M38303M55276J52924j80979j38817l2875k4705O4055
5337I865716L02737K38551N5432m6728r905O8377J6283K7635R4726Q2549R4714
5326A0790087l495R788k5948k15513l12455l67418m74282l22255k09717j65230
5316H703562j66455K2361K01392K68057J78866j58574k24200k36902j39642p6808
5306H371657j6760J38369J36758m206o8051o102j2751k516l5693K2731J27190
5295H650626O8763O4591J09437L046k88721k46994m03236m30379l44406k50785
5285F931942j16587m3875q3071K5135J1810o4020j8613j3831p2928n1900k1456
5274F482606Q1154R0221Q2467L2615o1316r4882K5137m6359J9090P643k2639N1137
$$ plain form
5262 6646874 6573150 6559312 6474861 6433822 6319598 6145517 5952753 5856488 5715001 5613131
5252 5613131 5616931 5621194 5472601 5435378 5429450 5364355 5339688 5288267 5336242 5394436 5422770 5452085
5240 5452085 5473993 5436625 5453680 5381496 5304685 5306305 5336925 5425018 5366319 5334877 5371072 5373396
5228 5373396 5316760 5262813 5310728 5378515 5418137 5412249 5351575 5419848 5496888 5504759 5489291 5548358
5216 5548358 5586153 5602951 5614329 5617246 5593304 5624296 5686644 5641795 5643036 5550301 5485653 5398836
5204 5398836 5281509 5227532 5144245 5047067 5036212 5043101 5038361 5088758 5143075 5217356 5156721 5108064
5192 5108064 5098087 5138454 5121846 5122725 5150356 5122684 5071336 4957298 4947258 5022623 4971165 4825418
5180 4825418 4754137 4607033 4532681 4488806 4387087 4243979 4164652 4044723 3947351 3861787 3785720
$$ packed form
5262F646874p3724j3838q4451m1039j14224j74081j92764r6265j41487j01870
5252E613131L800M263j48593l7223n928o5095k4667n1421M7975N8194K8334K9315
5240E452085K1908l7368J7055p2184p6811J620L0620Q8093n8699l1442L6195K324
5228E373396n6636n3947M7915O7787L9622n888o0674O8273P7040P871j5468N9067
5216E548358L7795J6798J1378K917k3942L0992O2348m4849J241r2735o4648q6817
5204E398836j17327n3977q3287r7178j0855O889m740N0397N4317P4281o0635m8657
5192E108064r977M0367j6608Q79K7631k7672n1348j14038j0040P5365n1458j45747
5180D825418p1281j47104p4352m3875j01719j43108p9327j19929r7372q5564p6067
$$ plain form
5169 3785720 3746208 3669091 3646711 3593496 3537314 3470738 3406738 3433075 3373628 3309291 3269442
5158 3269442 3150269 3094338 3071803 2972121 2942848 2827094 2842942 2807384 2682138 2725590 2781211
5147 2781211 2643466 2599230 2578419 2494874 2486642 2417611 2351875 2386591 2474108 2408677 2394702
5136 2394702 2400757 2384776 2344039 2387132 2389535 2386029 2418257 2401478 2440163 2480114 2492726 2515884
5124 2515884 2578368 2566001 2541747 2559340 2567116 2656423 2742785 2719028 2731698 2853907 2906469
5113 2906469 2957366 2999488 3048398 3091944 3183320 3214198 3202929 3234019 3305128 3394290 3487595
5102 3487595 3607289 3672602 3739551 3875892 4021021 4156845 4214931 4257430 4437127 4605056
5092 4605056 4703264 4821904 4957043 5082723 5141220 5283396 5440711 5516154 5705827 5937168
$$ packed form
5169C785720l9512p7117k2380n3215n6182o6576o4000K6337n9447o4337l9849
5158C269442j19173n5931k2535r9682k9273j15754J5848l5558j25246M3452N5621
5147B781211j37745m4236k0811q3545q232o9031o5736L4716Q7517o5431j3975
5136B394702O055j5981m0737M3093K403l506L2228j6779L8685L9951J2612K3158
5124B515884O2484j2367k4254J7593P776Q9307Q6362k3757J2670J22209N2562
5113B906469N0897M2122M8910M3546R1376L0878j1269L1090P1109Q9162R3305
5102C487595J19694O5313O6949J36341J45129J35824N8086M2499J79697J67929
5092D605056R8208J18640J35139J25680N8497J42176J57315P5443J89673K31341
$$ plain form
5082 5937168 6077043 6266300 6414886 6621722 6800524 7007937 7159133 7332288 7453180 7552558
5072 7552558 7749983 7935142 8113102 8429157 8811599 9213230 9694209 10270719 10866510 11368837
5062 11368837 11684680 11893607 12028379 12073741 12260213 12489700 12796939 13021057 13182019 13227415
5052 13227415 13287552 13395357 13511580 13591902 13671041 13752512 13692465 13573800 13397084 13072553
5042 13072553 12692775 12141689 11604995 11171359 10949068 10864611 10857029 10785639 10630749 10405118
5032 10405118 10178917 10020975 9928249 9930128 9907327 9874956 9667728 9433816 9148531 8830987
5022 8830987 8547997 8201451 7852242 7583477 7395131 7086058 6768741 6435696 6083237 5795213
5012 5795213 5448670 5140514 4924043 4697429 4509777 4407564 4305090 4129316 4108909 4028723
$$ packed form
5082E937168J39875J89257J48586K06836J78802K07413J51196J73155J20892R9378
5072G552558J97425J85159J77960L16055L82442M01631M80979N76510N95791N02327
5062A1368837L15843K08927J34772M5362J86472K29487L07239K24118J60962M5396
5052A3227415O0137J07805J16223Q0322P9139Q1471o0047j18665j76716l24531
5042A3072553l79778n51086n36694m33636k22291q4457p582p1390j54890k25631
5032A0405118k26201j57942r2726J879k2801l2371k07228k33912k85285l17544
5022H830987k82990l46546l49209k68765j88346l09073l17317l33045l52459k88024
5012E795213l46543l08156k16471k26614j87652j02213j02474j75774k0407q0186
$$ plain form
5002 4028723 3968965 3963056 3936165 3873774 3883762 3864863 3782352 3731546 3655604 3665191 3666659 3651224
4990 3651224 3588257 3535917 3486437 3534667 3503622 3488972 3552987 3520371 3513086 3473978 3469901 3455958
4978 3455958 3429445 3420869 3360424 3417247 3386327 3379294 3312724 3231235 3271942 3277355 3264015 3258353
4966 3258353 3214787 3147858 3133142 3114592 3082629 3072091 3101292 3085081 3037744 3009360 3106052
4955 3106052 3160348 3173548 3120007 3090120 3160235 3168206 3120306 3080025 3149477 3208499 3209444 3151081
4943 3151081 3090205 3085792 3125989 3223982 3219146 3133109 3222328 3259204 3221152 3238182 3233697 3175849
4931 3175849 3139357 3173917 3176686 3074521 3111685 3187227 3205027 3198639 3152503 3152582 3181192 3219777
4919 3219777 3151713 3170079 3203307 3194190 3195443 3144523 3134023 3144081 3152718 3152872 3223716 3219178 3172434
$$ packed form
5002D028723n9758n909k6891o2391R988j8899q2511n0806p5942R587J468j5435
4990C651224o2967n2340m9480M8230l1045j4650O4015l2616p285l9108m077j3943
4978C455958k6513q576o0445N6823l0920p033o6570q1489M0707N413j3340n662
4966C258353m3566o6929j4716j8550l1963j0538K9201j6211m7337k8384R6692
4955C106052N4296J3200n3541k9887P0115P971m7900m0281O9452N9022R45n8363
4943C151081o0876m413M0197R7993m836q6037Q9219L6876l8052J7030m485n7848
4931C175849l6492L4560K769j02165L7164P5542J7800o388m6136P9K8610L8585
4919C219777o8064J8366L3228r117J253n0920j0500J0058Q637J54P0844m538m6744
$$ plain form
4906 3172434 3146585 3127435 3131271 3196271 3214622 3219635 3199525 3169888 3193857 3193127 3107734 3125989
4894 3125989 3158343 3147664 3136257 3182326 3218323 3159531 3091431 3102973 3101696 3110531 3126173 3076834
4882 3076834 3116522 3146410 3171896 3135681 3128413 3131842 3071827 3111907 3165152 3152070 3180828 3254708
4870 3254708 3273117 3328919 3362191 3405882 3433255 3392094 3436541 3439155 3514854 3665606 3622072
4859 3622072 3623476 3660758 3696506 3725848 3746517 3849501 3851200 3911274 3997394 4054008 4162949
4848 4162949 4163753 4112335 4172274 4226104 4300877 4380928 4444703 4483445 4509170 4531321 4612417 4692311
4836 4692311 4748660 4774626 4823129 4947120 5039965 5086090 5149477 5178207 5267038 5379868 5461582
4825 5461582 5572494 5706598 5782787 5870473 6023693 6159603 6253511 6410017 6478348 6664106
$$ packed form
4906C172434k5849j9150L836O5000J8351N013k0110k9637K3969p30q5393J8255
4894C125989L2354j0679j1407M6069L5997n8792o8100J1542j277Q835J5642m9339
4882C076834L9688K9888K5486l6215p268L429o0015M0080N3245j3082K8758P3880
4870C254708J8409N5802L3272M3691K7373m1161M4447K614P5699J50752m3534
4859C622072J404L7282L5748K9342K0669J02984J699O0074Q6120N6614J08941
4848D162949Q04n1418N9939N3830P4773Q0051O3775L8742K5725K2151Q1096P9894
4836D692311N6349K5966M8503J23991R2845M6125O3387K8730Q8831J12830Q1714
4825E461582J10912J34104P6189Q7686J53220J35910R3908J56506O8331J85758
$$ plain form
4815 6664106 6799099 6916651 7050108 7228287 7341446 7462972 7631396 7798898 7972874 8135948
4805 8135948 8316230 8483388 8601000 8730402 9015603 9243544 9386999 9615042 9907242 10120406
4795 10120406 10343497 10551541 10766615 11053531 11344296 11628676 11904806 12120359 12295210
4786 12295210 12568367 12758233 12936833 13161867 13375910 13631564 13838214 14086448 14345303
4777 14345303 14557740 14728968 15014897 15287733 15514189 15744131 16011766 16164521 16373802
4768 16373802 16574980 16754219 16888151 17053725 17236721 17409184 17558863 17736648 17995187
4759 17995187 18195611 18487381 18772709 18967460 19198987 19489267 19707813 19923077 20176514
4750 20176514 20436699 20722507 20891030 21218613 21593402 21891961 22145931 22524360 22899976
$$ packed form
4815F664106J34993J17552J33457J78179J13159J21526J68424J67502J73976J63074
4805H135948J80282J67158J17612J29402K85201K27941J43455K28043K92200K13164
4795A0120406K23091K08044K15074K86916K90765K84380K76130K15553J74851
4786A2295210K73157J89866J78600K25034K14043K55654K06650K48234K58855
4777A4345303K12437J71228K85929K72836K26456K29942K67635J52755K09281
4768A6373802K01178J79239J33932J65574J82996J72463J49679J77785K58539
4759A7995187K00424K91770K85328J94751K31527K90280K18546K15264K53437
4750B0176514K60185K85808J68523L27583L74789K98559K53970L78429L75616
$$ plain form
4741 22899976 23344287 23842709 24238458 24712865 25211428 25710783 26269938 26812679 27347229
4732 27347229 27841527 28324301 28790605 29219640 29610431 30053332 30543797 31047736 31542825
4723 31542825 31989370 32475950 32983787 33599183 34109729 34470471 34778834 34980798 35081497
4714 35081497 35139556 35280101 35437938 35593628 35731268 35809213 35916966 36110746 36365171 36553088
4704 36553088 36721894 36700253 36458484 36147591 35951121 35864484 35826943 35983679 36206859 36619753
4694 36619753 37218938 38174965 39661773 41404279 42596714 43137527 42876154 42262649 41931610
4685 41931610 42101671 42841923 43539742 44248064 44653228 44697513 44737797 45070407 45505694 46180785
4675 46180785 47066609 47841341 47999937 47462254 46152041 44369931 42645436 41201677 40114515
$$ packed form
4741B2899976M44311M98422L95749M74407M98563M99355N59155N42741N34550
4732B7347229M94298M82774M66304M29035L90791M42901M90465N03939M95089
4723C1542825M46545M86580N07837O15396N10546L60742L08363K01964J00699
4714C5081497N8059J40545J57837J55690J37640P7945J07753J93780K54425J87917
4704C6553088J68806k1641k41769l10893j96470q6637l7541J56736K23180M12894
4694C6619753N99185R56027J486808J742506J192435N40813k61373o13505l31039
4685D1931610J70061P40252O97819P08322M05164M4285M0284L32610M35287O75091
4675D6180785Q85824P74732J58596n37683j310213j782110j724495j443759j087162
$$ plain form
4666 40114515 39497916 39042307 38735574 38447063 38178432 37937204 37610235 37243285 36838283
4657 36838283 36487975 36111296 35732101 35273699 34859451 34400193 33960113 33554187 33085065
4648 33085065 32660289 32196571 31750068 31296834 30919244 30543950 30208150 29939654 29658325
4639 29658325 29475948 29344765 29244881 29106365 29028383 28965949 29015935 29162759 29103209 29075652
4629 29075652 29097638 29006587 28907048 28776921 28734567 28654111 28588399 28577606 28559697 28528208 28588932
4618 28588932 28627261 28733041 28933887 29086208 29090385 29033297 29003401 28971724 28968470 29040528 29250403
4607 29250403 29624739 30112322 30632011 31282080 32276006 33706787 35193671 36235563 36852323
4598 36852323 37306043 37281503 36776700 36400830 36543383 36859794 36957135 37150244 37434092 37279293
$$ packed form
4666D0114515o16599m55609l06733k88511k68631k41228l26969l66950m05002
4657C6838283l50308l76679l79195m58402m14248m59258m40080m05926m69122
4648C3085065m24776m63718m46503m53234l77590l75294l35800k68496k81329
4639B9658325j82377j31183r9884j38516p7982o2434M9986J46824n9550k7557
4629B9075652K1986r1051r9539j30127m2354q0456o5712j0793j7909l1489O0724
4618B8588932L8329J05780K00846J52321M177n7088k9896l1677l254P2058K09875
4607B9250403L74336M87583N19689O50069R93926J430781J486884J041892O16760
4598C6852323M53720k4540n04803l75870J42553L16411R7341J93109K83848j54799
$$ plain form
4588 37279293 36875508 36670204 36607420 36643441 36833860 37139570 37310615 37113542 36575520 35559063
4578 35559063 33778173 31794664 29749829 27776634 26147809 24778145 23759706 22918748
4570 22918748 22146117 21440942 20842021 20311221 19818924 19435015 19122257 18794042 18562521
4561 18562521 18380150 18219758 18096401 17950269 17867420 17766276 17585414 17456363 17335507 17136530
4551 17136530 16950342 16699841 16491244 16400646 16202880 15946943 15766273 15548632 15370372 15134574
4541 15134574 14801585 14410085 14193852 13914105 13580412 13355253 13076553 12854156 12555563
4532 12555563 12296234 12093386 11887598 11714920 11436721 11135170 10895577 10643113 10363343
4523 10363343 10142208 10002718 9860450 9733813 9612650 9436832 9308894 9141483 9037323
$$ packed form
4588C7279293m03785k05304o2784L6021J90419L05710J71045j97073n38022j016457
4578C5559063j780890j983509k044835j973195j628825j369664j018439q40958
4570B2918748p72631p05175n98921n30800m92297l83909l12758l28215k31521
4561A8562521j82371j60392j23357j46132q2849j01144j80862j29051j20856j98977
4551A7136530j86188k50501k08597r0598j97766k55937j80670k17641j78260k35798
4541A5134574l32989l91500k16233k79747l33693k25159k78700k22397k98593
4532A2555563k59329k02848k05788j72678k78199l01551k39593k52464k79770
4523A0363343k21135j39490j42268j26637j21163j75818j27938j67411j04160
$$ plain form
4514 9037323 8949258 8933008 8826007 8777291 8863121 8844219 8774140 8718934 8809611 8833489 8873067
4503 8873067 8885264 8841533 8796727 8706950 8697466 8718082 8626983 8525462 8437087 8338560 8195812
4492 8195812 8124258 7976964 7824985 7667032 7427090 7220508 6997854 6806667 6685400 6612423
4482 6612423 6490931 6330097 6137495 6026484 5910224 5809481 5745134 5655466 5597963 5518545
4472 5518545 5477951 5336006 5316713 5243755 5184834 5160122 5070361 4959952 4895792 4872728 4873391
4461 4873391 4879345 4810456 4755190 4724919 4707053 4706251 4667506 4663210 4667368 4643899 4594298 4585097 4505693
4448 4505693 4468554 4470974 4443094 4413977 4401064 4368830 4397702 4393912 4340973 4308805 4283740 4311598
4436 4311598 4246035 4234317 4247120 4275316 4294287 4272941 4269619 4314225 4327407 4309352 4311873 4324180
$$ packed form
4514I037323q8065j6250j07001m8716Q5830j8902p0079n5206R0677K3878L9578
4503H873067J2197m3731m4806q9777r484K0616r1099j01521q8375r8527j42748
4492H195812p1554j47294j51979j57953k39942k06582k22654j91187j21267p2977
4482F612423j21492j60834j92602j11011j16260j00743o4347q9668n7503p9418
4472E518545m0594j41945j9293p2958n8921k4712q9761j10409o4160k3064O63
4461D873391N954o8889n5266l0271j7866q02l8745m296M158k3469m9601r201p9404
4448D505693l7139K420k7880k9117j2913l2234K8872l790n2939l2168k5065K7858
4436D311598o5563j1718J2803K8196J8971k1346l322M4606J3182j8055K521J2307
$$ plain form
4424 4324180 4303470 4282670 4300042 4297291 4365257 4395957 4434538 4442807 4449510 4495472 4395597 4404822
4412 4404822 4412041 4367043 4488257 4551495 4605457 4698331 4719854 4793561 4814000 4804951 4820913 4825988
4400 4825988 4865040 4858688 4872055 4837958 4843935 4870359 4847874 4847277 4901968 4873180 4815612 4802602
4388 4802602 4657605 4568105 4477271 4389967 4259277 4103468 3969721 3842489 3873554 3805297
4378 3805297 3695138 3680997 3674602 3714086 3755338 3723054 3603668 3603261 3547084 3608475 3585261 3592966
4366 3592966 3546341 3520715 3480124 3495419 3496007 3533280 3558040 3487910 3448517 3421784 3393642 3351226
4354 3351226 3315470 3379408 3391595 3357142 3378395 3425550 3407732 3447527 3433389 3482601 3505837
4343 3505837 3463792 3499031 3510097 3497675 3476341 3521453 3596968 3539139 3513230 3538610 3589029
$$ packed form
4424D324180k0710k0800J7372k751O7966L0700L8581Q269O703M5962r9875R225
4412D404822P219m4998J21214O3238N3962R2874K1523P3707K0439r049J5962N075
4400D825988L9052o352J3367l4097N977K6424k2485n97N4691k8788n7568j3010
4388D802602j44997q9500r0834q7304j30690j55809j33747j27232L1065o8257
4378C805297j10159j4141o395L9484M1252l2284j19386m07n6177O1391k3214P705
4366C592966m6625k5626m0591J5295N88L7273K4760p0130l9393k6733k8142m2416
4354C351226l5756O3938J2187l4453K1253M7155j7818L9795j4138M9212K3236
4343C505837m2045L5239J1066j2422k1334M5112P5515n7829k5909K5380N0419
$$ plain form
4332 3589029 3683314 3645764 3624752 3654844 3628595 3610699 3618387 3560852 3548455 3497078 3476739 3472682
4320 3472682 3443122 3448856 3506077 3501463 3467578 3456985 3471819 3493137 3538292 3510863 3486130 3502399
4308 3502399 3478271 3484649 3537177 3524665 3498846 3496581 3596764 3593839 3570610 3573966 3604874 3548118
4296 3548118 3586292 3630662 3628429 3618293 3661197 3689417 3690829 3719103 3760416 3752765 3793026 3870029
4284 3870029 3924206 3918736 3874228 3835579 3882109 3928292 3941659 3969033 4065351 4025186 4061460 4102030
4272 4102030 4093925 4118790 4190191 4192046 4308232 4380157 4388036 4385595 4475898 4501071 4526016 4587372
4260 4587372 4608045 4677698 4671868 4638183 4653110 4687347 4677454 4712432 4766656 4796528 4765809 4728099
4248 4728099 4724812 4774959 4829953 4853490 4853107 4932346 4858812 4811169 4781028 4731011 4744328 4776069
$$ packed form
4332C589029R4285l7550k1012L0092k6249j7896P688n7535j2397n1377k0339m057
4320C472682k9560N734N7221m614l3885j0593J4834K1318M5155k7429k4733J6269
4308C502399k4128O378N2528j2512k5819k265J00183k925k3229L356L0908n6756
4296C548118L8174M4370k233j0136M2904K8220J412K8274M1313p651M0261P7003
4284C870029N4177n470m4508l8649M6530M6183J3367K7374R6318m0165L6274M0570
4272D102030q105K4865P1401J855J16186P1925P879k441R0303K5173K4945O1356
4260D587372K0673O9653n830l3685J4927L4237r893L4978N4224K9872l0719l7710
4248D728099l287N0147N4994K3537l83P9239p3534m7643l0141n0017J3317L1741
$$ plain form
4236 4776069 4813678 4799383 4757008 4703989 4703708 4779190 4797762 4809193 4819078 4785482 4779228 4815537
4224 4815537 4793978 4833464 4782402 4696029 4793411 4829617 4838839 4882679 4852874 4929187 4915703 4881608
4212 4881608 4894238 4947177 4966414 4941849 4851723 4904552 4989026 4974867 4980315 5042849 5082957 5144517
4200 5144517 5190536 5257605 5235812 5238161 5257538 5238956 5273696 5340813 5360990 5478954 5519886
4189 5519886 5568316 5629897 5740004 5778969 5838570 5907356 5981009 5988983 6113222 6237313 6293597
4178 6293597 6369417 6510204 6577596 6654215 6731721 6726125 6885929 7018698 7175850 7205835 7256310
4167 7256310 7385918 7474134 7615036 7694682 7813240 7945272 8080954 8296308 8414881 8468755
4157 8468755 8615296 8707362 8795746 8937348 9103794 9265291 9346424 9476867 9569934 9664291
$$ packed form
4236D776069L7609j4295m2375n3019k81P5482J8572J1431R885l3596o254L6309
4224D815537k1559L9486n1062q6373R7382L6206R222M3840k9805P6313j3484l4095
4212D881608J2630N2939J9237k4565r0126N2829Q4474j4159N448O2534M0108O1560
4200E144517M6019O7069k1793K349J9377j8582L4740O7117K0177J17964M0932
4189E519886M8430O1581J10107L8965N9601O8786P3653P974J24239J24091N6284
4178F293597P5820J40787O7392P6619P7506n596J59804J32769J57152K9985N0475
4167G256310J29608Q8216J40902P9646J18558J32032J35682K15354J18573N3874
4157H468755J46541R2066Q8384J41602J66446J61497Q1133J30443R3067R4357
$$ plain form
4147 9664291 9765378 9893794 10036440 10151292 10263554 10403217 10488592 10672821 10775767 10904377
4137 10904377 10998880 11198920 11365111 11519126 11688672 11933705 12255052 12468046 12716317 12998742
4127 12998742 13369975 13689466 13911542 14205267 14613654 15020245 15372478 15746382 16229752
4118 16229752 16744229 17090363 17415245 17821304 18335890 18804679 19198331 19693863 20172935
4109 20172935 20620929 21189070 21665663 22238671 22813756 23397519 23934653 24482458 25162363
4100 25162363 25816035 26505835 27115990 27764497 28503224 29271668 30032281 30874802 31813350
4091 31813350 32779140 33898626 35144155 36448473 37767024 39161153 40403972 41678171
4083 41678171 42857416 43947404 45017989 46238619 47557714 48887377 50258141 51625537
$$ packed form
4147I664291J01087J28416J42646J14852J12262J39663Q5375J84229J02946J28610
4137A0904377R4503K00040J66191J54015J69546K45033L21347K12994K48271K82425
4127A2998742L71233L19491K22076K93725M08387M06591L52233L73904M83370
4118A6229752N14477L46134L24882M06059N14586M68789L93652M95532M79072
4109B0172935M47994N68141M76593N73008N75085N83763N37134N47805O79905
4100B5162363O53672O89800O10155O48507P38727P68444P60613Q42521R38548
4091C1813350R65790J119486J245529J304318J318551J394129J242819J274199
4083D1678171J179245J089988J070585J220630J319095J329663J370764J367396
$$ plain form
4075 51625537 52957577 54313870 55749455 57150514 58225782 58856447 59099130 59256607 59556938
4066 59556938 60244744 61308510 62627619 64338652 66595733 69412177 72874272 76810753
4058 76810753 81261536 85150846 87330858 87816668 87422555 87412978 88156698 89679867 91504944
4049 91504944 92977226 93769491 94066364 94278560 94430472 94671296 95289518 96059642 96505997
4040 96505997 95978517 93952250 90363299 85725337 80861915 76361091 72572423 69553567
4032 69553567 67126336 65335908 64031825 63114306 62501966 61986145 61497926 60869481 60258295
4023 60258295 59851070 59612555 59626764 59776976 60099924 60500398 60891904 61280317 61738698 62305800
4013 62305800 63043814 63697781 64498173 65212794 65890650 66407937 66954144 67675899 68764998
$$ packed form
4075E1625537J332040J356293J435585J401059J075268O30665K42683J57477L00331
4066E9556938O87806J063766J319109J711033K257081K816444L462095L936481
4058G6810753M450783L889310K180012M85810l94113r577P43720J523169J825077
4049I1504944J472282P92265K96873K12196J51912K40824O18222P70124M46355
4040I6505997n27480k026267l588951m637962m863422m500824l788668l018856
4032F9553567k427231j790428j304083r17519o12340n15821m88219o28445o11186
4023F0258295m07225k38515J4209J50212L22948M00474L91506L88413M58381N67102
4013F2305800P38014O53967Q00392P14621O77856N17287N46207P21755J089099
$$ plain form
4004 68764998 70210120 71942574 72928563 73543268 74424215 75492386 76704101 78085892 79777116
3995 79777116 81713743 83513913 84895798 86300228 88431931 91335713 94744974 97606922
3987 97606922 97689402 95042065 93789670 94062945 95409627 96942311 98454483 100505705 103795112
3978 103795112 107399846 112652947 121191749 135561148 153265033 152472744 140767215 133332764
3970 133332764 129601010 130545762 134275109 143621440 146216914 140934148 139511039 138129326
3962 138129326 135385176 134078044 135926340 140177181 144636312 149431091 145740612 134735660
3954 134735660 120001588 102489403 89907878 80756739 73931035 68524668 64443973 61054837
3946 61054837 58034379 55207268 52753473 50467497 48416636 46405168 44544889 42761316
$$ packed form
4004F8764998J445122J732454R85989O14705Q80947J068171J211715J381791J691224
3995G9777116J936627J800170J381885J404430K131703K903782L409261K861948
3987I7606922Q2480k647337j252395K73275J346682J532684J512172K051222L289407
3978A03795112L604734N253101Q538802J4369399J7703885p92289j1705529p434451
3970A33332764l731754R44752L729347R346331K595474n282766j423109j381713
3962A38129326k744150j307132J848296M250841M459131M794779l690479j1004952
3954A34735660j4734072j7512185j2581525r151139o825704n406367m080695l389136
3946F1054837l020458k827111k453795k285976k050861k011468j860279j783573
$$ plain form
3938 42761316 41095524 39489666 38067411 36753975 35546152 34418677 33259290 32076667
3930 32076667 31042765 29970559 28902012 27869877 26912251 25947419 25131314 24210356 23277998
3921 23277998 22590964 21831953 21126368 20535402 19937081 19300321 18737328 18111214 17642532
3912 17642532 17198678 16695357 16212022 15726293 15264617 14726289 14251448 13850058 13374679
3903 13374679 12934983 12516101 12194102 11877892 11569514 11250294 10785032 10415070 10147117
3894 10147117 9765931 9531583 9231673 9062677 8875721 8584234 8338111 8104408 7854616
3885 7854616 7645999 7391119 7250193 7118557 6996351 6775260 6625440 6441732 6251631 6094067
3875 6094067 6014458 5918566 5749752 5654107 5542306 5485614 5373152 5237348 5147107 5060597 5007804
$$ packed form
3938D2761316j665792j605858j422255j313436j207823j127475j159387j182623
3930C2076667j033902j072206j068547j032135r57626r64832q16105r20958r32358
3921B3277998o87034p59011p05585n90966n98321o36760n62993o26114m68682
3912A7642532m43854n03321m83335m85729m61676n38328m74841m01390m75379
3903A3374679m39696m18882l21999l16210l08378l19220m65262l69962k67953
3894A0147117l81186k34348k99910j68996j86956k91487k46123k33703k49792
3885G854616k08617k54880j40926j31636j22206k21091j49820j83708j90101j57564
3875F094067p9609r5892j68814r5645j11801n6692j12462j35804r0241q6510n2793
$$ plain form
3864 5007804 4918811 4872328 4774805 4675720 4582711 4559128 4425252 4357543 4279281 4271770 4260078
3853 4260078 4215776 4105118 4002498 4067310 4095126 4076308 4022228 3955589 3885449 3857080 3859896
3842 3859896 3839017 3928504 3867462 3874665 3944583 3944036 3888261 3849918 3891290 3947111 3946230 3954239 3999497
3829 3999497 3962547 3932390 3938787 3930993 3900848 3875580 3848654 3917959 3930520 3898193 3858898 3765440
3817 3765440 3711737 3707217 3723845 3752355 3741682 3775184 3757152 3715931 3673461 3673844 3670968 3701028
3805 3701028 3720761 3640005 3649597 3676792 3674327 3620406 3618564 3566437 3516236 3514333 3550177 3577201
3793 3577201 3614217 3563439 3542242 3509715 3451942 3467863 3471148 3511097 3535052 3566098 3593755 3585821
3781 3585821 3531414 3605952 3595587 3595163 3630581 3654509 3664664 3680456 3722158 3725677 3745974 3774798
$$ packed form
3864E007804q8993m6483r7523r9085r3009k3583j33876o7709p8262p511j1692
3853D260078m4302j10658j02620O4812K7816j8818n4080o6639p0140k8369K816
3842C859896k0879Q9487o1042P203O9918n47n5775l8343M1372N5821q81Q009M5258
3829C999497l6950l0157O397p794l0145k5268k6926O9305J2561l2327l9295r3458
3817C765440n3703m520J6628K8510j0673L3502j8032m1221m2470L83k876L0060
3805C701028J9733q0756R592K7195k465n3921j842n2127n0201j903L5844K7024
3793C577201L7016n0778k1197l2527n7773J5921L285L9949K3955L1046K7657p934
3781C585821n4407P4538j0365m24L5418K3928J0155J5792M1702L519K0297K8824
$$ plain form
3769 3774798 3775147 3824235 3820965 3874717 3939458 4036799 4008042 4025097 4031618 3977456 4002683 3984643
3757 3984643 4022802 4078682 4017698 4117617 4140769 4181901 4209767 4241895 4205029 4276881 4296957
3746 4296957 4213496 4220864 4267134 4252074 4347860 4361597 4375612 4496293 4459888 4466346 4400897 4387351
3734 4387351 4442164 4387465 4400484 4461849 4511427 4583712 4569299 4563808 4612224 4540749 4593570 4616135
3722 4616135 4632849 4686903 4656074 4682344 4671340 4683565 4689478 4713385 4666603 4747446 4699434 4700380
3710 4700380 4768456 4858437 4914319 4867021 4835967 4863378 4913471 4981471 5006450 5034841 5060031
3699 5060031 5082833 5160563 5167357 5154886 5244551 5255324 5310978 5359226 5416520 5472040 5541439 5565620
3687 5565620 5711344 5827296 5918844 5967093 5938384 6013293 6100225 6157995 6120152 6168094 6182503
$$ packed form
3769C774798L49M9088l270N3752O4741R7341k8757J7055O521n4162K5227j8040
3757C984643L8159N5880o0984R9919K3152M1132K7866L2128l6866P1852K0076
3746D296957q3461P368M6270j5060R5786J3737J4015J20681l6405O458o5449j3546
3734D387351N4813n4699J3019O1365M9578P2285j4413n491M8416p1475N2821K2565
3722D616135J6714N4054l0829K6270j1004J2225N913K3907m6782Q0843m8012R46
3710D700380O8076Q9981N5882m7298l1054K7411N0093O8000K4979K8391K5190
3699E060031K2802P7730O794j2471Q9665J0773N5654M8248N7294N5520O9399K4181
3687E565620J45724J15952R1548M8249k8709P4909Q6932N7770l7843M7942J4409
$$ plain form
3676 6182503 6286300 6337367 6362919 6388893 6395708 6448847 6503428 6501961 6526204 6528181 6549231 6593128
3664 6593128 6531972 6559843 6586023 6600449 6578848 6581179 6641984 6698580 6722777 6712460 6686456 6780445
3652 6780445 6844134 6867053 6921881 6962111 6990439 7087116 7131947 7111964 7203898 7245876 7276746
3641 7276746 7373616 7433853 7505244 7515178 7598630 7663606 7731049 7823927 7908750 7994964 8014396 8125481
3629 8125481 8220416 8190410 8284030 8445881 8480182 8511070 8646400 8710624 8806671 8925029 8995995
3618 8995995 9120873 9266130 9324813 9424749 9546693 9630552 9779889 9875419 9976150 10094879
3608 10094879 10255229 10364640 10476166 10586911 10728806 10855532 11045797 11246496 11381892
3599 11381892 11528345 11631962 11769769 11965501 12130441 12316195 12586207 12806254 12955813
$$ packed form
3676F182503J03797N1067K5552K5974O815N3139N4581j467K4243J977K1050M3897
3664F593128o1156K7871K6180J4426k1601K331O0805N6596K4197j0317k6004R3989
3652F780445O3689K2919N4828M0230K8328R6677M4831j9983R1934M1978L0870
3641G276746R6870O0237P1391R934Q3452O4976O7443R2878Q4823Q6214J9432J11085
3629H125481R4935l0006R3620J61851L4301L0888J35330O4224R6047J18358P0966
3618H995995J24878J45257N8683R9936J21944Q3859J49337R5530J00731J18729
3608A0094879J60350J09411J11526J10745J41895J26726J90265K00699J35396
3599A1381892J46453J03617J37807J95732J64940J85754K70012K20047J49559
$$ plain form
3590 12955813 13196088 13383508 13665073 13887073 14077040 14309038 14602261 14925370 15128029
3581 15128029 15383044 15703519 16014988 16319247 16636449 17011937 17367488 17712944 18088623
3572 18088623 18504274 18909640 19378930 19796665 20186488 20686771 21111495 21582514 22077331
3563 22077331 22579099 23136805 23674170 24260331 24900347 25539817 26199810 26932162 27660059
3554 27660059 28364087 29166067 29940485 30725544 31609875 32561547 33575289 34465526 35419553
3545 35419553 36449928 37473830 38553117 39634785 40752675 41949666 43152031 44405338
3537 44405338 45624860 46984292 48336605 49661292 51060132 52433539 53920854 55367763
3529 55367763 56871668 58395229 59840983 61333901 62770630 64164716 65521784 66853624
$$ packed form
3590A2955813K40275J87420K81565K22000J89967K31998K93223L23109K02659
3581A5128029K55015L20475L11469L04259L17202L75488L55551L45456L75679
3572A8088623M15651M05366M69290M17735L89823N00283M24724M71019M94817
3563B2077331N01768N57706N37365N86161O40016O39470O59993P32352P27897
3554B7660059P04028Q01980P74418P85059Q84331R51672J013742Q90237R54027
3545C5419553J030375J023902J079287J081668J117890J196991J202365J253307
3537D4405338J219522J359432J352313J324687J398840J373407J487315J446909
3529E5367763J503905J523561J445754J492918J436729J394086J357068J331840
$$ plain form
3521 66853624 68050646 69106940 70113332 70975808 71745174 72506064 73127040 73588558 73853741
3512 73853741 74025683 74079715 74029889 73891802 73512773 72977428 72232557 71431332 70573740 69641784
3502 69641784 68554043 67385528 66190030 64909384 63628283 62374159 60993393 59639104
3494 59639104 58271194 56888515 55499954 54147259 52908113 51703933 50535220 49407389
3486 49407389 48336624 47439894 46530339 45727394 45016550 44364532 43824206 43402678 43047337
3477 43047337 42860985 42661500 42474328 42370795 42390991 42523195 42625710 42788426 43001434 43213792
3467 43213792 43409914 43718783 44006782 44360684 44719468 45059255 45449215 45792349 46131388
3458 46131388 46475689 46841984 47177386 47490827 47650426 47836028 48037430 48175458 48262916 48305424
$$ packed form
3521F6853624J197022J056294J006392Q62476P69366P60890O20976M61518K65183
3512G3853741J71942N4032m9826j38087l79029n35345p44871q01225q57592r31956
3502F9641784j087741j168515j195498j280646j281101j254124j380766j354289
3494E9639104j367910j382679j388561j352695j239146j204180j168713j127831
3486D9407389j070765q96730r09555q02945p10844o52018n40326m21528l55341
3477D3047337j86352j99485j87172j03533K0196J32204J02515J62716K13008K12358
3467D3213792J96122L08869K87999L53902L58784L39787L89960L43134L39039
3458D6131388L44301L66295L35402L13441J59599J85602K01402J38028Q7458M2508
$$ plain form
3448 48305424 48257064 48210582 48149365 47954424 47791781 47526601 47331020 46961434 46623831 46246928
3438 46246928 45866404 45401257 44860411 44286639 43603088 43047687 42462406 41779373 41119102
3429 41119102 40482713 39903721 39298232 38649175 38022621 37477622 36989293 36430129 35880090
3420 35880090 35379288 34942158 34519547 34202554 33830372 33469709 33205085 32900633 32669633
3411 32669633 32602872 32545927 32461606 32433919 32438229 32493624 32641990 32815931 33059383 33282280 33503202
3400 33503202 33738267 34150159 34531420 34909558 35281543 35710341 36169034 36578547 37111444
3391 37111444 37630066 38129281 38578392 39153761 39693365 40217813 40643363 41167501 41662786
3382 41662786 42197765 42717025 43220883 43687630 44135492 44550534 45066130 45592346 46002784
$$ packed form
3448D8305424m8360m6482o1217j94941j62643k65180j95581l69586l37603l76903
3438D6246928l80524m65147n40846n73772o83551n55401n85281o83033o60271
3429D1119102o36389n78992o05489o49057o26554n44999m88329n59164n50039
3420C5880090n00802m37130m22611l16993l72182l60663k64624l04452k31000
3411C2669633o6761n6945q4321k7687M310N5395J48366J73941K43452K22897K20922
3400C3503202K35065M11892L81261L78138L71985M28798M58693M09513N32897
3391C7111444N18622M99215M49111N75369N39604N24448M25550N24138M95285
3382D1662786N34979N19260N03858M66747M47862M15042N15596N26216M10438
$$ plain form
3373 46002784 46383753 46798809 47149992 47544185 47974789 48411983 48896052 49418972 49955223
3364 49955223 50587279 51276963 51906551 52694316 53506655 54374676 55279957 56234481 57328438
3355 57328438 58414749 59614476 60952878 62297837 63785006 65224936 66791067 68355774
3347 68355774 70110497 71809581 73534198 75392724 77295199 79191970 81149562 83153556
3339 83153556 85169413 87226990 89315152 91486110 93622111 95824217 98051922 100242863
3331 100242863 102373947 104439920 106626291 108634430 110488679 112294013 114022398 115546624
3323 115546624 116976677 118210522 119262229 120191916 120816968 121270393 121561151 121732145 121687632
3314 121687632 121464325 121103951 120646018 120063256 119439676 118724227 117987092 117236125 116367319
$$ packed form
3373D6002784L80969M15056L51183L94193M30604M37194M84069N22920N36251
3364D9955223O32056O89684O29588P87765Q12339Q68021R05281R54524J093957
3355E7328438J086311J199727J338402J344959J487169J439930J566131J564707
3347F8355774J754723J699084J724617J858526J902475J896771J957592K003994
3339H3153556K015857K057577K088162K170958K136001K202106K227705K190941
3331A00242863K131084K065973K186371K008139J854249J805334J728385J524226
3323A15546624J430053J233845J051707R29687O25052M53425K90758J70994m4513
3314A21687632k23307l60374m57933n82762o23580p15449p37135p50967q68806
$$ plain form
3305 116367319 115443935 114530011 113554939 112491295 111327747 110217969 109034051 107801138
3297 107801138 106560605 105257065 104022103 102794008 101463933 100261990 99118914 97962390
3289 97962390 96831711 95731890 94663168 93709886 92867762 91977187 91245908 90594359 90072701
3280 90072701 89628137 89227373 88927213 88691041 88566150 88605893 88673846 88802267 88980860 89285581
3270 89285581 89594408 90013515 90556918 91110247 91730840 92400889 93014792 93617794 94421496
3261 94421496 95252891 96153826 97054347 98107407 99204549 100455287 101747848 103062726 104452344
3252 104452344 105952436 107419022 108924027 110325669 111889643 113423994 114808242 116171676
3244 116171676 117483620 118799135 120039469 121235097 122297068 123255712 124208787 125115794
$$ packed form
3305A16367319r23384r13924r75072j063644j163548j109778j183918j232913
3297A07801138j240533j303540j234962j228095j330075j201943j143076j156524
3289I7962390j130679j099821j068722r53282q42124q90575p31279o51549n21658
3280I0072701m44564m00764l00160k36172j24891L9743O7953J28421J78593L04721
3270H9285581L08827M19107N43403N53329O20593O70049O13903O03002Q03702
3261I4421496Q31395R00935R00521J053060J097142J250738J292561J314878J389618
3252A04452344J500092J466586J505005J401642J563974J534351J384248J363434
3244A16171676J311944J315515J240334J195628J061971R58644R53075R07007
$$ plain form
3236 125115794 125921654 126723231 127432773 128069369 128694631 129386469 130017422 130690978 131454567
3227 131454567 132314580 133275224 134313406 135545813 136938006 138350903 139859584 141539562
3219 141539562 143424031 145351426 147394030 149535916 151813891 154099551 156329311 158601580
3211 158601580 160863967 163055953 165232576 167300265 169293537 171200075 173089175 174865586
3203 174865586 176640787 178246020 179681392 181011547 182230746 183290632 184067975 184673375
3195 184673375 185098204 185341577 185463616 185428507 185323077 185018771 184640219 184154276 183485197
3186 183485197 182755712 181899807 180960283 179842149 178551536 177229870 175831054 174355588
3178 174355588 172919711 171315960 169750046 168046870 166217974 164393716 162512571 160499431
$$ packed form
3236A25115794Q05860Q01577P09542O36596O25262O91838O30953O73556P63589
3227A31454567Q60013R60644J038182J232407J392193J412897J508681J679978
3219A41539562J884469J927395K042604K141886K277975K285660K229760K272269
3211A58601580K262387K191986K176623K067689J993272J906538J889100J776411
3203A74865586J775201J605233J435372J330155J219199J059886P77343O05400
3195A84673375M24829K43373J22039l5109j05430l04306l78552m85943o69079
3186A83485197p29485q55905r39524j118134j290613j321666j398816j475466
3178A74355588j435877j603751j565914j703176j828896j824258j881145k013140
$$ plain form
3170 160499431 158324766 156020204 153561554 151125334 148534440 145834541 143108622 140359224
3162 140359224 137622439 134755217 131863158 128890741 125816081 122701150 119465333 116205846
3154 116205846 112916310 109720874 106589289 103422249 100360415 97373873 94612237 92040530
3146 92040530 89692673 87239778 84653398 82044704 79548737 77234336 75176171 73357503
3138 73357503 71574596 69781675 68038242 66426882 65042873 63726208 62619683 61781194
3130 61781194 61106021 60469154 59391191 57848740 56309626 54965161 53870108 52963302 52324540
3121 52324540 51826912 51311074 50814135 50321289 49884212 49455205 49155826 49033258 49005113 49064885
3111 49064885 49012334 48667124 48258805 47761541 47191787 46642224 46221248 46010904 45891110 45911648
$$ packed form
3170A60499431k174665k304562k458650k436220k590894k699899k725919k749398
3162A40359224k736785k867222k892059k972417l074660l114931l235817l259487
3154A16205846l289536l195436l131585l167040l061834k986542k761636k571707
3146I2040530k347857k452895k586380k608694k495967k314401k058165j818668
3138G3357503j782907j792921j743433j611360j384009j316665j106525q38489
3130F1781194o75173o36867j077963j542451j539114j344465j095053r06806o38762
3121E2324540m97628n15838m96939m92846m37077m29007k99379j22568k8145N9772
3111D9064885n2551l45210m08319m97264n69754n49563m20976k10344j19794K0538
$$ plain form
3101 45911648 46157066 46378005 46888589 47822696 48865956 49174702 48837522 48542650 48477757
3092 48477757 48603080 48935013 49599668 50193305 50457668 50732386 51112227 51445954 51760808
3083 51760808 52176630 52882071 53821271 54723230 55581827 56042311 56094286 55930385 55612076 55428458
3073 55428458 55510276 55781316 56182575 56762890 57562532 58417242 59363250 60539082 61787278
3064 61787278 62774342 63400607 64167585 65095984 66123670 67321238 68599015 69949003 71212837
3055 71212837 72384037 73651522 74881777 76137689 77444692 78787453 80183616 81515843
3047 81515843 82796220 83862395 84769510 85548943 86070041 86548236 87152159 87746852 88202534
3038 88202534 88614093 89029397 89298455 89436943 89609333 89549962 89427609 89157258 88814347 88465050
$$ packed form
3101D5911648K45418K20939N10584R34107J043260L08746l37180k94872o4893
3092D8477757J25323L31933O64655N93637K64363K74718L79841L33727L14854
3083E1760808M15822P05441R39200R01959Q58597M60484N1975j63901l18309j83618
3073E5428458Q1818K71040M01259N80315P99642Q54710R46008J175832J248196
3064F1787278R87064O26265P66978R28399J027686J197568J277777J349988J263834
3055G1212837J171200J267485J230255J255912J307003J342761J396163J332227
3047H1515843J280377J066175R07115P79433N21098M78195O03923N94693M55682
3038H8202534M11559M15304K69058J38488J72390n9371j22353k70351l42911l49297
$$ plain form
3028 88465050 88084082 87573851 87017926 86329373 85629739 84859102 84127414 83295613 82426442
3019 82426442 81574160 80622102 79813967 79081847 78297106 77480681 76802576 76075594 75379866
3010 75379866 74604007 73850028 73058675 72139280 71137232 70119987 69077875 68028360 66871710
3001 66871710 65732486 64522807 63214281 62008720 60663519 59273986 57904105 56392634
2993 56392634 54876470 53400860 51734815 50149079 48527573 46926003 45357705 43818465
2985 43818465 42296735 40794421 39381920 38075915 36776240 35555916 34492428 33428685
2977 33428685 32532400 31603058 30777350 29969200 29190197 28425004 27821274 27216390 26647832
2968 26647832 25997505 25436008 24930629 24448769 23938776 23435552 22957752 22583598 22158265
$$ packed form
3028H8465050l80968n10231n55925o88553o99634p70637p31688q31801q69171
3019H2426442q52282r52058q08135p32120p84741q16425o78105p26982o95728
3010G5379866p75859p53979p91353r19395j002048j017245j042112j049515j156650
3001F6871710j139224j209679j308526j205561j345201j389533j369881j511471
2993E6392634j516164j475610j666045j585736j621506j601570j568298j539240
2985D3818465j521730j502314j412501j306005j299675j220324j063488j063743
2977C3428685q96285r29342q25708q08150p79003p65193o03730o04884n68558
2968B6647832o50327n61497n05379m81860n09993n03224m77800l74154m25333
$$ plain form
2959 22158265 21759650 21369814 21060066 20744077 20418464 20138921 19837599 19587461 19393598
2950 19393598 19219429 18948840 18726545 18520149 18287834 18132552 17989069 17799660 17630056
2941 17630056 17472576 17333500 17140530 16960725 16796110 16598151 16459774 16302497 16101878
2932 16101878 15952885 15753021 15719538 15611061 15501535 15345034 15276102 15239762 15172826 15139997
2922 15139997 15104697 15030608 15008933 15012662 15023958 15068523 15080849 15104217 15214130 15304835 15327778
2911 15327778 15394950 15514890 15590042 15647901 15711673 15842221 15865466 15968913 16142591 16301442
2901 16301442 16381807 16495968 16635795 16761242 16905958 17059068 17198750 17381094 17593276 17793294
2891 17793294 18017728 18160384 18384182 18588794 18820792 19119712 19358260 19558228 19876952
$$ packed form
2959B2158265l98615l89836l09748l15989l25613k79543l01322k50138j93863
2950A9393598j74169k70589k22295k06396k32315j55282j43483j89409j69604
2941A7630056j57480j39076j92970j79805j64615j97959j38377j57277k00619
2932A6101878j48993j99864l3483j08477j09526j56501o8932l6340o6936l2829
2922A5139997l5300p4089k1675L729J1296M4565J2326K3368J09913R0705K2943
2911A5327778O7172J19940P5152N7859O3772J30548K3245J03447J73678J58851
2901A6301442Q0365J14161J39827J25447J44716J53110J39682J82344K12182K00018
2891A7793294K24434J42656K23798K04612K31998K98920K38548J99968L18724
$$ plain form
2882 19876952 20123083 20334769 20728925 21090807 21432808 21807843 22169716 22447792 22857432
2873 22857432 23348071 23750006 24228652 24819319 25388665 25881467 26442723 27057901 27694593
2864 27694593 28320678 29035701 29811318 30610023 31361528 32216397 33131261 34100685 35062882
2855 35062882 36039669 37086282 38224699 39322925 40474923 41701808 42851885 44125773
2847 44125773 45377486 46713070 48048073 49536487 51041504 52511184 54091813 55810677
2839 55810677 57568858 59317045 61155894 63141673 65184997 67337213 69515696 71778919
2831 71778919 74162390 76635481 79334897 82105553 85029963 88031313 91259394 94532173
2823 94532173 98001927 101636711 105286358 108916542 112679760 116498454 120427659 124548885
$$ packed form
2882A9876952K46131K11686L94156L61882L42001L75035L61873K78076M09640
2873B2857432M90639M01935M78646N90667N69346M92802N61256O15178O36692
2864B7694593O26085P15023P75617P98705P51505Q54869R14864R69424R62197
2855C5062882R76787J046613J138417J098226J151998J226885J150077J273888
2847D4125773J251713J335584J335003J488414J505017J469680J580629J718864
2839E5810677J758181J748187J838849J985779K043324K152216K178483K263223
2831G1778919K383471K473091K699416K770656K924410L001350L228081L272779
2823I4532173L469754L634784L649647L630184L763218L818694L929205M121226
$$ plain form
2815 124548885 128722258 133165445 137819816 142579020 147336274 152248525 157292513 162284974
2807 162284974 167181305 172089720 176976381 181956270 187174494 192796088 198962951 205652394
2799 205652394 212987126 220870809 229150962 237700325 246135738 254028604 261048472 267010182
2791 267010182 272055913 276517816 280843448 284769865 288337792 291313067 293604861 295313654
2783 295313654 296655813 297681553 298413938 298831951 298643503 297646899 295721282 292737671 288868312
2774 288868312 284182142 278771344 272731126 266412868 260290771 254553554 249376426 244669405
2766 244669405 240458870 236479129 232646885 228980290 225663717 222557229 219567865 216612472
2758 216612472 213237974 208813023 203199130 196238001 188320767 179969332 171896834 164562495
$$ packed form
2815A24548885M173373M443187M654371M759204M757254M912251N043988M992461
2807A62284974M896331M908415M886661M979889N218224N621594O166863O689443
2799B05652394P334732P883683Q280153Q549363Q435413P892866P019868N961710
2791B67010182N045731M461903M325632L926417L567927K975275K291794J708793
2783B95313654J342159J025740P32385M18013j88448r96604j925617k983611l869359
2774B88868312m686170n410798o040218o318258o122097n737217n177128m707021
2766B44669405m210535l979741l832244l666595l316573l106488k989364k955393
2758B16612472l374498m424951n613893o961129p917234q351435q072498p334339
$$ plain form
2750 164562495 157901248 151926744 146379231 141230556 136360902 131836868 127601550 123569024
2742 123569024 119843896 116139804 112339448 108182083 103675475 98753939 93582907 88469191
2734 88469191 83432890 78747275 74432549 70471417 66833703 63570792 60546653 57634614
2726 57634614 54970710 52453133 50137352 48052801 46041956 44128808 42369367 40771951
2718 40771951 39351439 37861970 36529571 35343383 34153934 33011818 31940879 30947452
2710 30947452 29946434 28987118 28101142 27299524 26422624 25632440 24978287 24302489 23615891
2701 23615891 22991769 22454590 21845061 21249627 20778737 20306415 19833182 19338374 18934503
2692 18934503 18588468 18195256 17797998 17431951 17096819 16677742 16331805 16083239 15800185
$$ packed form
2750A64562495o661247n974504n547513n148675m869654m524034m235318m032526
2742A23569024l725128l704092l800356m157365m506608m921536n171032n113716
2734H8469191n036301m685615m314726l961132l637714l262911l024139k912039
2726E7634614k663904k517577k315781k084551k010845j913148j759441j597416
2718D0771951j420512j489469j332399j186188j189449j142116j070939r93427
2710C0947452j001018r59316q85976q01618q76900p90184o54153o75798o86598
2701B3615891o24122n37179o09529n95434m70890m72322m73233m94808m03871
2692A8934503l46035l93212l97258l66047l35132m19077l45937k48566k83054
$$ plain form
2683 15800185 15535285 15300313 15102124 14809332 14609523 14378136 14164477 13948799 13779253
2674 13779253 13622408 13424786 13313829 13236554 13035002 12886731 12787477 12641829 12579478 12399475
2664 12399475 12313194 12294992 12227247 12181140 12087864 11985798 11911795 11888942 11846795 11782590 11701717
2653 11701717 11694081 11690758 11692435 11751208 11826594 11869751 11861908 11961805 12032314 12037488 12029240 12009581
2641 12009581 11973224 11884975 11819713 11756109 11680253 11628070 11493670 11427233 11293398 11139680 10963466
2630 10963466 10770035 10589453 10315256 10001198 9681468 9326375 9062804 8755951 8488437
2621 8488437 8324179 8044159 7809221 7651230 7416958 7175001 6990096 6850024 6713561 6568341
2611 6568341 6422146 6321391 6133445 5952156 5806315 5631125 5520459 5397930 5249872 5164251
$$ packed form
2683A5800185k64900k34972j98189k92792j99809k31387k13659k15678j69546
2674A3779253j56845j97622j10957p7275k01552j48271r9254j45648o2351j80003
2664A2399475q6281j8202o7745m6107r3276j02066p4003k2853m2147o4205q0873
2653A1701717p636l323J677N8773P5386M3157p843R9897P0509N174q248j9659
2641A2009581l6357q8249o5262o3604p5856n2183j34400o6437j33835j53718j76214
2630A0963466j93431j80582k74197l14058l19730l55093k63571l06853k67514
2621H488437j64258k80020k34938j57991k34272k41957j84905j40072j36463j45220
2611F568341j46195j00755j87946j81289j45841j75190j10666j22529j48058q5621
$$ plain form
2601 5164251 5085988 4918215 4804601 4674774 4613123 4431727 4355623 4276424 4070955 3975589
2591 3975589 3920052 3898512 3804449 3719704 3654223 3570466 3481183 3395103 3354017 3288541 3241053
2580 3241053 3173529 3134295 3012089 2898109 2832910 2824177 2780195 2705640 2699335 2581099 2539614
2569 2539614 2524586 2454222 2455435 2437140 2373687 2302111 2290025 2339415 2245496 2205177 2219487 2151280
2557 2151280 2086177 2095435 2052894 2060160 2039521 1995938 2000487 1978158 1940799 1893299 1918804 1885072
2545 1885072 1810385 1800956 1859783 1953443 1915469 1924517 1971435 1929701 1943014 1952057 1942703 1952141
2533 1952141 1984751 2026851 2005134 2009408 2050722 2050508 2010253 2055189 2138204 2143209 2087218 2047540
2521 2047540 2046930 2062039 2102124 2130751 2172090 2240437 2314355 2304694 2274310 2313477 2369952 2452446
$$ packed form
2601E164251p8263j67773j13614j29827o1651j81396p6104p9199k05469r5366
2591C975589n5537k1540r4063q4745o5481q3757q9283q6080m1086o5476m7488
2580C241053o7524l9234j22206j13980o5199q733m3982p4555o305j18236m1485
2569B539614j5028p0364J213j8295o3453p1576j2086M9390r3919m0319J4310o8207
2557B151280o5103R258m2541P266k0639m3583M549k2329l7359m7500K5505l3732
2545A885072p4687r429N8827R3660l7974R048M6918m1734J3313R043r354R438
2533A952141L2610M2100k1717M274M1314k14m0255M4936Q3015N005n5991l9678
2521B047540o10J5109M0085K8627M1339O8347P3918r661l0384L9167N6475Q2494
$$ plain form
2509 2452446 2481832 2508868 2493263 2457355 2502043 2519460 2535894 2531139 2575970 2598436 2602664 2588614
2497 2588614 2540140 2505163 2538689 2513041 2547398 2554678 2453786 2417868 2356814 2319489 2344280
2486 2344280 2337198 2303507 2211180 2160397 2189669 2120353 2120328 2048618 1987288 1975369 1952967 1928804
2474 1928804 1881309 1910366 1835319 1777256 1743133 1683395 1602107 1577929 1587621 1566567 1523356 1564752
2462 1564752 1469639 1423228 1394228 1408254 1332607 1275811 1243027 1202791 1141116 1123866 1037468
2451 1037468 1045501 1189883 1077159 1015826 977932 937101 913915 919671 878700 902593 905932 824755
2439 824755 791587 774851 742523 808220 808258 799275 734674 789126 759175 679096 657632 675521
2427 675521 688330 690915 692203 736386 690861 656199 682565 666933 635015 562870 580723 582274
$$ packed form
2509B452446K9386K7036j5605l5908M4688J7417J6434m755M4831K2466M228j4050
2497B588614m8474l4977L3526k5648L4357P280j00892l5918o1054l7325K4791
2486B344280p082l3691r2327n0783K9272o9316k5p1710o1330j1919k2402k4163
2474A928804m7495K9057p5047n8063l4123n9738q1288k4178R692k1054m3211M1396
2462A564752r5113m6411k9000J4026p5647n6796l2784m0236o1675j7250q6398
2451A037468Q033J44382j12724o1333l7894m0831k3186N756m0971K3893L339q1177
2439H24755l3168j6736l2328O5697L8q983o4601N4452k9951q0079k1464J7889
2427F75521J2809K585J288M4183m5525l4662K6366j5632l1918p2145J7853J551
$$ plain form
2415 582274 583617 602980 553109 576963 602149 595836 589276 587479 555535 534360 575140 541080
2403 541080 587315 637237 583644 519206 513715 468289 509499 555279 470936 455485 538164 550847
2391 550847 495232 523663 523970 505169 496510 534613 537677 511747 394487 416652 451123 392502
2379 392502 398488 397700 437224 476566 414980 401153 534129 524030 444674 424607 320557 316414
2367 316414 378595 389475 362584 370122 422833 431977 421291 395572 382629 332723 381304 396322
2355 396322 364072 352347 374625 366266 360427 379466 381856 305804 281407 349016 285557 257846
2343 257846 263252 269968 209385 230112 267735 241811 239599 197746 169422 152377 221399 217081
2331 217081 190705 174715 184068 217880 195180 157264 194141 238963 159916 240318 212981 125605
$$ packed form
2415E82274J343J9363m9871K3854K5186o313o560j797l1944k1175M0780l4060
2403E41080M6235M9922n3593o4438n491m5426M1210M5780q4343j5451Q2679J2683
2391E50847n5615K8431L07j8801q659L8103L064k5930j17260K2165L4471n8621
2379C92502N986p88L9524L9342o1586j3827J32976j0099p9356k0067j04050m143
2367C16414O2181J0880k6891P538N2711R144j0686k5719j2943m9906M8581J5018
2355C96322l2250j1725K2278q359n839J9039K390p6052k4397O7609o3459k7711
2343B57846N406O716o0583K0727L7623k5924k212m1853k8324j7045O9022m318
2331B17081k6376j5990R353L3812k2700l7916L6877M4822p9047Q0402k7337q7376
$$ plain form
2319 125605 148754 187161 234364 229636 193269 171315 159754 92111 143642 119998 160926 133917
2307 133917 161860 71731 130674 112271 86679 169136 234856 244200 214586 197764 140221 205987
2295 205987 263578 225432 184617 235573 255492 241830 162715 95357 93623 77302 109038 192023
2283 192023 249264 196946 139951 185807 177977 172396 222654 267785 199841 174792 188253 186220
2271 186220 225451 216905 163774 142212 176287 168556 161269 197523 165746 93242 84925 124915
2259 124915 130783 145246 163978 157534 55749 43945 48303 95566 120980 104141 118787 164736
2247 164736 182994 164347 142787 107358 112201 135502 127261 147650 138466 90340 115374 149428
2235 149428 134418 165700 161779 91619 32577 -9803 -63650 -40821 3839 50338 29793 19203
$$ packed form
2319A25605K3149L8407M7203m728l6367k1954j1561o7643N1531k3644M0928k7009
2307A33917K7943r0129N8943j8403k5592Q2457O5720R344k9614j6822n7543O5766
2295B05987N7591l8146m0815N0956J9919j3662p9115o7358j734j6321L1736Q2985
2283A92023N7241n2318n6995M5856p830n581N0258M5131o7944k5049J3461k033
2271A86220L9231q546n3131k1562L4075p731p287L6254l1777p2504q317L9990
2259A24915N868J4463J8732o444j01785j1804M358M7263K5414j6839J4646M5949
2247A64736J8258j8647k1560l5429M843K3301q241K0389r184m8126K5034L4054
2235A49428j5010L1282l921p0160n9042m2380n3847K2829M4660M6499k0545j0590
$$ plain form
2223 19203 76572 163819 102986 33095 11932 -293 20117 26750 -56950 -70282 -10056 28785
2211 28785 37967 46269 309 -5276 -9681 -50271 -57890 -33470 22325 42327 71928 5868 54169
2198 54169 56314 86157 13942 48381 85938 12315 118187 110611 36384 15832 111772 88612
2186 88612 16362 20223 -9048 38653 18702 18363 -46093 -60802 -1412 22042 81072 62446
2174 62446 -88 -32410 -50 -31328 -28910 -50466 -70076 -65042 -24061 -20877 1665 -9971
2162 -9971 -21285 24539 11515 -13965 -20507 6933 16211 -9519 25953 12006 35691 54426
2150 54426 40482 61226 -14291 37859 39087 -4479 1535 54049 -18920 -5897 -22371 -57395
2138 -57395 2053 -43522 -27022 -42149 46214 87948 41080 6803 -33113 -7933 2006 69458
$$ packed form
2223A9203N7369Q7247o0833o9891k1163j2225K0410O633q3700j3332O0226L8841
2211B8785R182Q302m5960n585m405m0590p619K4420N5795K0002K9601o6060M8301
2198E4169K145K9843p2215L4439L7557p3623J05872p576p4227k0552R5940k3160
2186H8612p2250L861k9271M7701j9951l39o4456j4709N9390K3454N9030j8626
2174F2446o2534l2322L2360l1278K418k1556j9610N034M0981L184K2542j1636
2162i971j1314M5824j3024k5480o542K7440R278k5730L5472j3947K3685J8735
2150E4426j3944K0744p5517N2150J228m3566O014N2514p2969J3023j6474l5024
2138e7395N9448m5575J6500j5127Q8363M1734m6868l4277l9916K5180R939O7452
$$ plain form
2126 69458 71107 67579 121731 97213 26394 61863 48191 24782 88072 107185 152145 126568
2114 126568 120037 173458 52741 51426 97576 148246 69285 77991 74964 52720 48138 71325
2102 71325 68447 51504 118523 99979 115286 74028 87580 11512 23594 33220 91075 87489
2090 87489 64073 161870 194604 193423 127778 112842 103404 130037 126386 145511 172325 210394
2078 210394 170687 274763 264157 241849 294841 321275 370270 307825 265526 225002 257835
2067 257835 266472 314644 335128 331897 326161 279957 376695 423621 389445 417795 402463 441292
2055 441292 484672 503340 475191 517214 491513 512225 608336 687144 677418 698084 704789 674391
2043 674391 778042 843552 893669 1028702 1079484 1106154 1155249 1235239 1279904 1278100 1355718
$$ packed form
2126F9458J649l528N4152k4518p0819L5469j3672k3409O3290J9113M4960k5577
2114A26568o531N3421j20717j315M6150N0670p8961Q706l027k2244m582K3187
2102G1325k878j6943O7019j8544J5307m1258J3552p6068J2082R626N7855l586
2090H7489k3416R7797L2734j181o5645j4936r438K6633l651J9125K6814L8069
2078B10394l9707J04076j0606k2308N2992K6434M8995o2445m2299m0524L2833
2067B57835Q637M8172K0484l231n736m6204R6738M6926l4176K8350j5332L8829
2055D41292M3380J8668k8149M2023k5701K0712R6111P8808r726K0666O705l0398
2043F74391J03651O5510N0117J35033N0782K6670M9095P9990M4665j804P7618
$$ plain form
2032 1355718 1401156 1469781 1530923 1632609 1662360 1776362 1944449 2041049 2132611 2001521 1884287
2021 1884287 1810072 1924322 2057559 2083849 2136234 2292909 2447259 2787423 3244815 3971681
2011 3971681 4044941 3517103 3114688 2977546 3016737 3232337 3577640 3462371 3371238 3133950
2001 3133950 3067872 3071571 3136612 3311455 3255982 2860676 2308956 1833984 1561479 1352584
1991 1352584 1177104 1066486 1000870 859480 845634 867594 754552 691560 622426 563783 483214
1980 483214 396452 408399 336697 276826 340036 307046 322800 246613 217678 275493 250630 207340
1968 207340 144225 167667 171000 193463 262567 215542 174783 140852 92729 127246 120437 147140
1956 147140 80410 55958 122455 156554 170581 94785 193895 161038 110871 68152 41846 42661
$$ packed form
2032A355718M5438O8625O1142J01686K9751J14002J68087R6600R1562j31090j17234
2021A884287p4215J14250J33237K6290N2385J56675J54350L40164M57392P26866
2011C971681P3260n27838m02415j37142L9191K15600L45303j15269r1133k37288
2001C133950o6078L699O5041J74843n5473l95306n51720m74972k72505k08895
1991A352584j75480j10618o5616j41390j3846K1960j13042o2992o9134n8643q0569
1980D83214q6762J1947p1702n9871O3210l2990J5754p6187k8935N7815k4863m3290
1968B07340o3115K3442L333K2463O9104m7025m0759l3931m8123L4517o809K6703
1956A47140o6730k4452O6497L4099J4027p5796R9110l2857n0167m2719k6306Q15
$$ plain form
1944 42661 36181 -8926 22116 110489 111820 48407 15634 34002 25881 58826 -4283 10346
1932 10346 75786 88568 69404 56894 55976 81054 39336 27422 67634 44020 -22893 28585
1920 28585 59410 135286 73065 39497 135249 86136 21940 -56446 -32971 5081 21239 5987
1908 5987 64913 118683 66704 -5567 -1683 17145 87807 8055 -32517 45420 14930 -9630
1896 -9630 24909 67196 83093 53269 57746 48101 2021 -4904 13579 66838 24995 -1247 -21838
1883 -21838 65528 112053 77954 70843 34951 -30168 2119 11535 -5969 -39351 -39208 -9110 -41364
1870 -41364 -31123 5811 30102 61177 64015 18601 -20438 -30063 -34068 -72301 -59680 -71961
1858 -71961 20267 28557 -22708 -28327 -5442 16743 -13336 -29005 -28777 10679 48700 -10945 -46762
$$ packed form
1944D2661o480m5107L1042Q8373J331o3413l2773J8368q121L2945o3109J4629
1932A0346O5440J2782j9164j2510r18K5078m1718j1914M0212k3614o6913N1478
1920B8585L0825P5876o2221l3568R5752m9113o4196p8386K3475L8052J6158j5252
1908E987N8926N3770n1979p2271L884J8828P0662p9752m0572P7937l0490k4560
1896i630L4539M2287J5897k9824M477r645m6080o925J8483N3259m1843k6242k0591
1883b1838Q7366M6525l4099p111l5892o5119L2287R416j7504l3382J43L0098l2254
1870d1364J0241L6934K4291L1075K838m5414l9039r625m005l8233J2621j2281
1858g1961R2228Q290n1265n619K2885K2185l0079j5669K28L9456L8021n9645l5817
$$ plain form
1845 -46762 -36297 -43662 -15470 -27094 25117 -6840 -29443 7972 40664 20106 -42479 -7495
1833 -7495 6176 -4424 14867 16678 -34318 -56399 -77818 -116319 -67988 -56162 -98164 -130004
1821 -130004 -141330 -129309 -107450 -93418 -53537 -71667 11073 15489 25576 -7217 -65950 -67310
1809 -67310 -52241 -14979 -44370 -61454 -45663 -30947 -29823 -9696 -130729 -113570 -66781 -64063
1797 -64063 -57967 -31964 -58609 -5979 -35409 -48838 -70669 -36208 -37797 -95029 -73459 -90464
1785 -90464 -71724 -46413 -2365 -3378 -36654 -8814 -3233 -28515 -43546 -56948 25495 17883
1773 17883 -29070 -89562 -75170 -25502 -12999 -20618 -1344 8502 22629 -15134 -33124 -45581
1761 -45581 -26412 -47935 -23205 -25713 -72018 -49199 5471 -7022 -63456 -88357 -70609 -8882
$$ packed form
1845d6762J0465p365K8192j1624N2211l1957k2603L7415L2692k0558o2585L4984
1833g495J3671j0600J9291J811n0996k2081k1419l8501M8331J1826m2002l1840
1821a30004j1326J2021K1859J4032L9881j8130Q2740M416J0087l2793n8733j360
1809f7310J5069L7262k9391j7084J5791J4716J124K0127j21033J7159M6789K718
1797f4063O096K6003k6645N2630k9430j3429k1831L4461j589n7232K1570j7005
1785i0464J8740K5311M4048j013l3276K7840N581k5282j5031j3402Q2443p612
1773A7883m6953o0492J4392M9668J2503p619J9274R846J4127l7763j7990j2457
1761d5581J9169k1523K4730k508m6305K2819N4670j2493n6434k4901J7748O1727
$$ plain form
1749 -8882 57031 12717 13747 79527 63973 29642 -43620 -11946 16505 43844 -12656 -28678
1737 -28678 -68818 -83804 -4020 27721 18000 -8048 -57566 20818 -3507 -38112 -120890 -58017
1725 -58017 16167 22108 61794 62107 17527 34086 88986 -16689 -86975 -66655 15504 -41172
1713 -41172 -5538 -17116 -105681 -11414 -27483 -105390 -6255 -13786 -20773 212 -48954 -110816
1701 -110816 -140822 -81616 -34775 -8571 -62735 -50136 -54403 -90995 -51036 -66812 -40278 -22783
1689 -22783 -18848 -35480 -22913 -29675 -62194 -54156 -45997 -21204 -30856 -46345 -5305 -20539 -55617
1676 -55617 -67769 -67318 -74619 -71960 -110181 -94765 -53903 -52137 -49701 -44930 -57757 -78714 -21813
1663 -21813 -67607 -49369 -76530 -73705 -84686 -90799 -99492 -129954 -58791 6175 -7573 6086
$$ packed form
1749h882O5913m4314J030O5780j5554l4331p3262L1674K8451K7339n6500j6022
1737b8678m0140j4986P9784L1741r721k6048m9518P8384k4325l4605q2778O2873
1725e8017P4184N941L9686L13m4580J6559N4900j05675p0286K0320Q2159n6676
1713d1172L5634j1578q8565R4267j6069p7907R9135p531o987K0985m9166o1862
1701a10816l0006N9206M6841K6204n4164J2599m267l6592L9959j5776K6534J7495
1689b2783L935j6632J2567o762l2519Q038Q159K4793r652j5489M1040j5234l5078
1676e5617j2152M51p301K659l8221J5416M0862J766K436M771j2827k0957N6901
1663b1813m5794J8238k7161K825j0981o113q693l0462P1163O4966j3748J3659
$$ plain form
1651 6086 8066 -75390 -125134 -95720 -78545 -57317 -40999 -97673 6762 4041 -51703 -90579
1639 -90579 -114106 -136306 -161228 -140572 -58471 32394 28684 -26240 -70982 -80304 -64047 -27197
1627 -27197 -20039 -18916 -23422 -24307 59258 20209 18048 -494 -37064 -27461 -27334 -47870 -105519 -55685
1613 -55685 -42630 -59839 -54064 -72442 -96241 2374 21097 -94895 -39582 -64287 -70139 -78285
1601 -78285 -95430 -34521 -75498 -62459 -45088 -43611 -29951 -78921 -74152 -31568 745 -46435
1589 -46435 -38683 -66491 -154072 -123279 -59732 -38012 -54293 -62382 -59980 -26112 -19573 -33136 -88449
1576 -88449 -84370 -24043 -65810 -72202 -82800 -8196 -59243 -106315 -103116 -88479 -21460 -52921
1564 -52921 -33736 19907 -6703 -76677 -25579 21000 8706 -21713 -59345 -141121 -112886 -45390
$$ packed form
1651F086J980q3456m9744K9414J7175K1228J6318n6674J04435k721n5744l8876
1639i0579k3527k2200k4922K0656Q2101R0865l710n4924m4742r322J6257L6850
1627b7197P158J123m506q85Q3565l9049k161j8542l6570R603J27k0536n7649M9834
1613e5685J3055j7209N775j8378k3799R8615J8723j15992N5313k4705n852q146
1601g8285j7145O0909m0977J3039J7371J477J3660m8970M769M2584L2313m7180
1589d6435P752k7808q7581L0793O3547K1720j6281q089K402L3868O539j3563n5313
1576h8449M079O0327m1767o392j0598P4604n1047m7072L199J4637O7019l1461
1564e2921J9185N3643k6610o9974N1098M6579j2294l0419l7632q1776K8235O7496
$$ plain form
1552 -45390 -67160 -55429 -18646 -11376 -28205 13461 -10921 -76644 -40513 -32791 -45135 -109628
1540 -109628 -136535 -79312 -71777 -73470 -53859 -130144 -81515 -111714 -48572 -80223 -116734 -160958
1528 -160958 -100361 -60334 -64668 -18171 7 -37171 -41600 -14699 -66344 -41010 -24939 -57936
1516 -57936 -76934 -115391 -120298 -7220 9231 -92514 -26738 51194 -1329 -70517 -78695 -59473
1504 -59473 -87585 -60034 22034 41727 23188 -1126 -58778 -64054 -57749 -23322 -34068 -72563
1492 -72563 -84795 -32384 -20507 -57789 -17969 -33128 -70247 -63840 -45498 -13697 -20565 -78217
1480 -78217 -85992 -66080 -86201 -56469 -28734 -62827 -65777 8808 -66725 -63635 -114118 -81114
1468 -81114 24598 54932 1652 2140 -13244 -25038 -17692 -26779 -75277 -74474 -12740 -33387 -36990
$$ packed form
1552d5390k1770J1731L6783P270j6829M1666k4382o5723L6131P722j2344o4493
1540a09628k6907N7223P535j693J9611p6285M8629l0199O3142l1651l6511m4224
1528a60958O0597M0027m334M6497J8178l7178m429K6901n1645K5334J6071l2997
1516e7936j8998l8457m907J13078J6451j01745O5776P7932n2523o9188q178J9222
1504e9473k8112K7551Q2068J9693j8539k4314n7652n276O305L4427j0746l8495
1492g2563j2232N2411J1877l7282L9820j5159l7119O407J8342L1801o868n7652
1480g8217p775J9912k0121K9732K7735l4093k950P4585p5533L090n0483L3004
1468h1114J05712L0334n3280M88j5384j1794P346r087m8498Q03O1734k0647l603
$$ plain form
1455 -36990 -71595 -76222 -7147 27132 -109041 -89654 -118932 -105366 -72403 -37880 -44069 -105543
1443 -105543 -23013 -115234 -109514 -121853 -99182 -100849 -27466 -25349 -18166 -4778 -59416 -23663
1431 -23663 -47507 -54746 -47123 -76253 -29122 4678 60440 64140 7920 -7404 -18545 8090
1419 8090 -32238 -62797 -64649 -80720 -53102 -66859 -104069 -18926 15038 -10013 -40506 -82821
1407 -82821 -59544 -41477 -72002 -15021 27773 37817 10052 -28161 -35796 -48769 -30779 -153
1395 -153 -8507 -13681 32828 -9045 -69758 -67933 -125373 -67888 -46747 -29651 20256 87173 -30993
1382 -30993 -125097 -128395 -74337 -47148 -85545 -53328 -39698 -81002 -30890 55358 24214 23778
1370 23778 -26702 1277 -69227 -567 -2045 -37338 -62668 -85885 8646 -23693 -51879 -11715
$$ packed form
1455c6990l4605m627O9075L4279j36173J9387k9278J3566L2963L4523o189o1474
1443a05543Q2530r2221N720j2339K2671j667P3383K117P183J3388n4638L5753
1431b3663k3844p239P623k9130M7131L3800N5762L700n6220j5324j1141K6635
1419H090m0328l0559j852j6071K7618j3757l7210Q5143L3964k5051l0493m2315
1407h2821K3277J8067l0525N6981M2794J0044k7765l8213p635j2973J7990L0626
1395a53q354n174M6509m1873o0713J825n7440N7485K1141J7096M9907O6917j18166
1382c0993r4104l298N4058K7189l8397L2217J3630m1304N0112Q6248l1144m36
1370B3778n0480K7979p0504O8660j478l5293k5330k3217R4531l2339k8186M0164
$$ plain form
1358 -11715 -15354 -28130 -23486 -33600 -35630 -62495 -75054 -76763 -100890 -66049 -97375 -124544 -52782
1345 -52782 -44740 26648 -4229 -67721 -38876 -7761 -20425 -71738 -108185 -82915 -92616 -72537
1333 -72537 -100437 -57359 -39270 -46059 -106507 -108223 -54882 4227 -29594 13950 -2165 -91885
1321 -91885 -67076 -125931 -135492 -114346 -26281 67353 -53693 -97838 -93706 -153632 -163768 -134574
1309 -134574 -42006 -19283 -11226 -28999 -42851 -77682 -88008 -124828 -89179 -66753 -14050 -2532
1297 -2532 -11079 11486 -516 906 -23614 -54896 -51091 -98591 -82544 -79884 -90195 -84956 -34224
1284 -34224 55544 -8055 -6193 61601 71612 8609 -5001 -13911 -56000 -67082 4795 -26103
1272 -26103 -36053 -64040 -106940 -41626 -58581 6999 77929 39916 -65599 -125889 -15664 -12107
$$ packed form
1358a1715l639j2776M644j0114k030k6865j2559j709k4127L4841l1326k7169P1762
1345e2782Q042P1388l0877o3492K8845L1115j2664n1313l6447K5270r701K0079
1333g2537k7900M3078J8089o789o0448j716N3341N9109l3821M3544j6115q9720
1321i1885K4809n8855r561K1146Q8065R3634j21046m4145M132n9926j0136K9194
1309a34574R2568K2723Q057j7773j3852l4831j0326l6820L5649K2426N2703J1518
1297b532q547K2565j2002J422k4520l1282L805m7500J6047K660j0311N239N0732
1284c4224Q9768o3599J862O7794J0011o3003j3610q910m2089j1082P1877l0898
1272b6103r950k7987m2900O5314j6955O5580P0930l8013j05515o0290J10225L557
$$ plain form
1260 -12107 -76908 -51366 -31068 -64838 -25137 -39973 -45967 -23064 -40037 -20566 19469 23356
1248 23356 -13240 -35536 -57078 -76045 -90154 -45151 -18183 -21597 -16534 -104943 -57080 -29171
1236 -29171 -60071 -37130 -76680 -84581 -66241 3721 -26623 -11222 -65140 -61944 -69410 -26080
1224 -26080 -44242 -53238 -53757 -80753 -65768 -68795 -51024 -32132 -128332 -33962 9007 2448 16210
1211 16210 6514 38210 29531 7238 -49617 -83897 -44269 28022 -8530 9167 -1316 -20477
1199 -20477 -16667 -61141 -74109 -77241 -115701 -94398 -64017 -17001 -39843 -39401 -1819 -24241 39139
1186 39139 -7446 -38651 9261 -36434 -46553 -53222 -4734 54793 78074 -9534 -46074 55989
1174 55989 50438 -19118 -41596 -106064 -106052 -123858 -36779 -24166 -67203 -48561 -61553 -76846 -69286
$$ packed form
1260a2107o4801K5542K0298l3770L9701j4836n994K2903j6973J9471M0035L887
1248B3356l6596k2296k1542j8967j4109M5003K6968l414N063q8409M7863K7909
1236b9171l0900K2941l9550p901J8340O9962l0344J5401n3918L196p466M3330
1224b6080j8162q996n19k6996J4985l027J7771J8892r6200R4370M2969o559J3762
1211A6210r696L1696q679k2293n6855l4280L9628P2291l6552J7697j0483j9161
1199b0477L810m4474j2968l132l8460K1303L0381M7016k2842M42L7582k2422O3380
1186C9139m6585l1205M7912m5695j0119o669M8488N9527K3281q7608l6540J02063
1174E5989n551o9556k2478o4468J2j7806Q7079J2613m3037J8642j2992j5293P560
$$ plain form
1161 -69286 -110197 -65388 -59432 -62802 2040 23548 -114427 -93341 30583 60064 54873 43779
1149 43779 13115 -77740 -44837 -4156 -66349 -60622 12237 -1052 -56983 -81207 -71567 -71789 -49658
1136 -49658 -72279 15191 -35410 -51401 -88980 -116610 7184 38575 60019 75566 -26159
1125 -26159 -27012 -1097 -4861 25475 35305 -2130 -12562 7633 -10556 -97884 -81156 -45266 -702
1112 -702 -13992 -59167 -63072 -12093 18362 64973 44711 93138 59612 16295 14202 -72783 -51523
1099 -51523 -59348 43088 -6217 14403 75136 32537 15979 12419 -32277 -50070 -42165 13146
1087 13146 -11693 -3412 -29603 -73366 7382 13110 -33020 -42230 -79772 -57217 -43751 11574
1075 11574 3208 -28651 -68697 -56042 -58999 -44254 -16668 -45374 -49468 16510 31998 -4569
$$ packed form
1161f9286m0911M4809N956l370O4842K1508j37975K1086J23924K9481n191j1094
1149D3779l0664r0855L2903M0681o2193N727P2859j3289n5931k4224R640k22K2131
1136d9658k2621Q7470n0601j5991l7579k7630J23794L1391K1444J5547j01725
1125b6159q53K5915l764L0336R830l7435j0432K0195j8189q7328J6728L5890M4564
1112g02j3290m5175l905N0979L0455M6611k0262M8427l3526m3317k093q6985K1260
1099e1523p825J02436m9305K0620O0733m2599j6558l560m4696j7793P905N5311
1087A3146k4839Q281k6191m3763Q0748N728m6130r210l7542K2555J3466N5325
1075A1574q366l1859m0046J2655k957J4745K7586k8706m094O5978J5488l6567
$$ plain form
1063 -4569 1427 2920 -19602 -8319 -11668 21434 -26779 -79302 -81102 -63642 -75473 -126910 -166188
1050 -166188 -54318 12706 13617 -57703 -60261 -17644 -18722 -74137 -131584 -47131 50077 60807
1038 60807 24524 -7314 -24399 27216 -63443 5232 -36073 11220 40670 28035 2796 7097
1026 7097 -28407 -37006 -61459 -102408 -53887 -18050 55807 27142 25673 25977 -7144 45904 -8903
1013 -8903 2899 28099 13960 -70794 -117937 -69463 -2693 -10931 -24095 -32374 -6382 9195
1001 9195 20942 -9162 -41350 -48782 -67960 -36580 -15111 21290 14356 32407 17201 31068
989 31068 112875 70810 86937 54648 -38706 -121952 -63405 -43227 -70466 -11579 -57596 -25202
977 -25202 22093 -122 5610 14622 16766 21946 35920 67498 63614 -8953 -2705 -27539 -45300
$$ packed form
1063d569N996J493k2522J1283l349L3102m8213n2523j800J7460j1831n1437l9278
1050a66188J11870O7024R11p1320k558M2617j078n5415n7447Q4453R7208J0730
1038F0807l6283l1838j7085N1615r0659O8675m1305M7293K9450j2635k5239M301
1026G097l5504q599k4453m0949M8521L5837P3857k8665j469L04l3121N3048n4807
1013h903J1802K5200j4139q4754m7143M8474O6770q238j3164q279K5992J5577
1001I195J1747l0104l2188p432j9178L1380K1469L6401o934J8051j5206J3867
989C1068Q1807m2065J6127l2289r3354q3246N8547K0178k7239N8887m6017L2394
977b5202M7295k2215N732R012K144N180J3974L1578l884p2567O248k4834j7761
$$ plain form
964 -45300 47095 -32710 -59903 8953 46813 38573 40773 93366 74343 56921 39024 34084 39321
951 39321 54924 41959 37315 -25609 -52602 10322 -20055 2888 42731 27820 27511 22946 52327
938 52327 88801 14135 6621 -55666 -39195 -9250 22203 18790 47109 19720 -5663 26376
926 26376 54569 49782 22824 -402 -83576 -84870 -72693 -43829 -12990 -10686 21127 52232 30383
913 30383 -65616 21299 66978 82886 87107 114425 37967 26732 34116 43597 63081 50041 37049
900 37049 43303 7561 28376 3912 -34023 -27557 6537 21737 17804 10216 -9062 35470 -23104
887 -23104 -23616 -30783 -15630 11141 58512 77682 81028 8688 12791 17237 43150 50319 33370
874 33370 33967 -22699 25694 27427 30231 -26866 -44727 -24158 -37791 5800 -81 -40938 -114610
$$ packed form
964d5300R2395p9805k7193O8856L7860q240K200N2593j9023j7422j7897m940N237
951C9321J5603j2965m644o2924k6993O2924l0377K2943L9843j4911l09m565K9381
938E2327L6474p4666p514o2287J6471K9945L1453l413K8319k7389k5383L2039
926B6376K8193m787k6958k3226q3174j294J2177K8864L0839K304L1813L1105k1849
913C0383r5999Q6915M5679J5908M221K7318p6458j1235P384R481J9484j3040j2992
900C7049O254l5742K0815k4464l7935O466L4094J5200l933p588j9278M4532n8574
887b3104n12p167J5153K6771M7371J9170L346p2340M103M446K5913P169j6949
874C3370N97n6666M8393J733K804n7097j7861K0569j3633M3591n881m0857p3672
$$ plain form
861 -114610 17785 19641 -5138 -40837 -15911 25895 12700 -24497 -28747 58860 -11975 2445
849 2445 11652 -37317 -49743 -12335 6516 -34505 29632 13138 17958 36264 45374 57938 5986
836 5986 -5497 25945 581 21251 39952 79546 34885 6676 -28108 -35876 -52200 -54355 -65661
823 -65661 -21120 725 8843 56826 42201 45717 -5677 24897 70736 97497 33320 62136
811 62136 44205 -22747 -32825 -32607 30519 23431 74947 59798 -46632 2973 -58684 -53567 3431
798 3431 -33262 33945 5327 6844 16687 -3201 -32858 -35171 -13984 7880 45118 2851 -40768
785 -40768 43608 69144 31462 106420 64452 33593 31116 69022 37656 47402 77795 19297
773 19297 77126 87114 26125 20332 -42577 -42176 11697 33242 -9518 -14750 55520 8526 -11852
$$ packed form
861a14610J32395J856k4779l5699K4926M1806j3195l7197m250Q7607p0835J4420
849B445R207m8969j2426L7408J8851m1021O4137j6494M820J8306R110J2564n1952
836E986j1483L1442k5364K0670J8701L9594m4661k8209l4784p768j6324k155j1306
823f5661M4541K1845Q118M7983j4625L516n1394L0574M5839K6761o4177K8816
811F2136j7931o6952j0078K18O3126p088N1516j5149j06430M9605o1657N117N6998
798C431l6693O7207k8618J517R843j9888k9657k313K1187K1864L7238m2267m3619
785d0768Q4376K5536l7682P4958m1968l0859k477L7906l1366R746L0393n8498
773A9297N7829R988o0989n793o2909M01N3873K1545m2760n232P0270m6994k0378
$$ plain form
760 -11852 13281 23341 62388 122451 75544 8039 -41462 -73941 -95910 -85862 -79608 -26787
748 -26787 4052 -30614 -14033 23780 14381 6443 32178 40966 99269 55954 10663 29766 59868
735 59868 44674 34813 -16706 -34253 -12004 8482 -6162 13159 -2104 63566 77805 46676
723 46676 40824 753 78438 113501 13625 -56988 16512 26132 19141 79898 22294 7349 6626
710 6626 -10073 -23455 -33938 11421 90700 33391 40041 79981 54540 80021 68463 50837
698 50837 7905 -8020 -21879 -40176 -103137 -60418 8551 -3507 49158 98837 -10788 27204
686 27204 75163 87206 91523 45357 45229 -5491 -34660 7462 14498 -30874 30352 100334 116356
673 116356 37276 19692 50621 61560 40026 5027 38109 31646 10832 38107 86483 75897
$$ packed form
760a1852K5133J0060L9047O0063m6907o7505m9501l2479k1969J0048O254N2821
748b6787L0839l4666J6581L7813r399p938K5735Q788N8303m3315m5291J9103L0102
735E9868j5194r861n1519j7547K2249K0486j4644J9321j5263O5670J4239l1129
723D6676n852m0071P7685L5063r9876p0613P3500R620o991O0757n7604j4945p23
710F626j6699j3382j0483M5359P9279n7309O650L9940k5441K5481j1558j7626
698E0837m2932j5925j3859j8297o2961M2719O8969j2058N2665M9679j09625L7992
686B7204M7959J2043M317m6166j28n0720k9169M2122P036m5372O1226O9982J6022
673A16356p9080j7584L0929J0939k1534l4999L3082o463k0814K7275M8376j0586
$$ plain form
661 75897 86943 49221 22089 60642 59114 20238 -11936 -5200 35715 113714 87544 24919
649 24919 75476 -9201 -39271 16305 6096 22982 26579 40728 28632 -31331 13498 29215
637 29215 49809 -41799 -52266 15705 61314 35903 17295 14284 18925 30555 23349 23199 -74312
624 -74312 -45830 -32719 -62856 -10936 77919 59489 25367 -13479 -48598 55591 111426 93927
612 93927 134025 79596 35798 58648 66949 29656 24093 42224 -12455 -51889 -27429 -56518
600 -56518 -39078 -11965 42995 68737 46393 63705 20421 12988 36593 65108 29133 33887
588 33887 92862 72079 60724 54663 70156 156019 124846 84552 83411 31958 9115 60709
576 60709 103599 26693 53465 71617 -429 26416 56730 116301 111516 78291 29554 -2050
$$ packed form
661G5897J1046l7722k7132L8553j528l8876l2174O736M0915P7999k6170o2625
649B4919N0557q4677l0070N5576j0209J6886L597J4149j2096n9963M4829J5717
637B9215K0594r1608j0467O7971M5609k5411j8608l011M641J1630p206j50r7511
624g4312K8482J3111l0137N1920Q8855j8430l4122l8846l5119J04189N5835j7499
612I3927M0098n4429m3798K2850Q301l7293n563J8131n4679l9434K4460k9089
600e6518J7440K7113N4960K5742k2344J7312m3284p433K3605K8515l5975M754
588C3887N8975k0783j1355o061J5493Q5863l1173m0294j141n1453k2843N1594
576F0709M2890p6906K6772J8152p2046K6845L0314N9571m785l3225m8737l1604
$$ plain form
564 -2050 24307 10599 385 -685 8345 15854 30720 115097 64710 48165 55697 27663 12525
551 12525 17146 75924 69368 61847 45853 20622 8829 28856 27187 38591 71435 37588 32125
538 32125 40807 20299 72938 136024 76228 110504 112389 59611 58540 39058 71157 65314 109284
525 109284 59624 52194 133927 83291 67229 107382 103376 94142 -16604 -9903 35698 64270
513 64270 -9111 15739 -30689 7760 52277 47133 10454 42968 31677 80933 149206 77438
501 77438 40909 73572 149071 108020 119220 122902 81473 35544 107783 111692 119056 39006 -40984
488 -40984 75 24755 61753 88745 -6265 56509 130342 83568 65274 70649 92621 26718
476 26718 153118 146950 135864 115326 133965 142763 91735 95684 108396 121751 110021 52769
$$ packed form
564b050K6357j3708j0214j070R030P509J4866Q4377n0387j6545P532k8034j5138
551A2525M621N8778o556p521j5994k5231j1793K0027j669J1404L2844l3847n463
538C2125Q682k0508N2639O3086n9796L4276J885n2778j071j9482L2099n843M3970
525A09284m9660p430Q1733n0636j6062M0153m006r234j10746O701M5601K8572
513F4270p3381K4850m6428L8449M4517n144l6679L2514j1291M9256O8273p1768
501G7438l6529L2663P5499m1051J1200L682m1429m5929P2239L909P364q0050p9990
488d0984M1059K4680L6998K6992r5010O2774P3833m6774j8294N375K1972o5903
476B6718J26400o168j1086k0538J8639Q798n1028L949J2712J3355j1730n7252
$$ plain form
464 52769 -4146 32219 22400 51600 29269 90596 10157 24408 35511 33771 31003 -18310 -17511
451 -17511 21074 25601 43786 37259 22596 36891 79402 108363 104777 104154 103723 68868 71693 102891
437 102891 135300 80259 45508 125032 93701 95552 124379 83350 77240 96024 138020 152744
425 152744 107391 39060 69458 32825 28955 25153 149193 113737 159366 163959 95887 73251
413 73251 87003 93376 -14208 45062 113545 113257 84445 94969 85782 141533 131400 76595 36179
400 36179 -8571 2285 47051 45058 61787 65369 22342 35465 78636 52796 169824 172970
388 172970 92206 39976 90001 140068 82790 31157 76596 55440 72711 120103 110706 58801
376 58801 61077 90085 111340 54904 44457 32136 81311 155152 122468 56953 34288 54872
$$ packed form
464E2769n6915L6365r819K9200k2331O1327q0439J4251J1103j740k768m9313P99
451a7511L8585M527J8185o527j4663J4295M2511K8961l586o23m31l4855K825L1198
437A02891L2409n5041l4751P9524l1331J851K8827m1029o110J8784M1996J4724
425A52744m5353o8331L0398l6633l870l802J24040l5456M5629M593o8072k2636
413G3251J3752O373j07584N9270O8483k88k8812J0524r187N5751j0133n4805m0416
400C6179m4750J0856M4766j993J6729L582m3027J3123M3171k5840J17028L146
388A72970q0764n2230N0025N0067n7278n1633M5439k1156J7271M7392r397n1905
376E8801K276K9008K1255n6436j0447j2321M9175P3841l2684o5515k2665K0584
$$ plain form
364 54872 100795 153668 166666 136577 97755 85071 118596 108667 49912 21704 25565 47435
352 47435 98348 81365 117191 94448 18497 37708 76656 87794 81887 50349 84040 64032
340 64032 102605 173472 134498 158250 64199 86704 112374 71936 24663 1125 -16132 52658
328 52658 111087 36628 2176 -10969 -49635 -6451 77295 95471 102126 142663 142219 186645 170035
315 170035 148212 145665 138857 73391 38711 88267 83736 70352 40153 29385 50116 118650
303 118650 130446 101236 122659 182701 101025 23052 97826 77983 68060 52607 100227 173534
291 173534 89692 13076 19728 77640 34944 26634 57904 60801 45447 92458 99312 112203 113366
278 113366 97360 127343 177539 198273 107834 79883 69728 105590 66525 45520 76766 69911
$$ packed form
364E4872M5923N2873J2998l0089l8822j2684L3525r929n8755k8208L861K1870
352D7435N0913j6983L5826k2743p5951J9211L8948J1138n907l1538L3691k0008
340F4032L8573P0867l8974K3752r4051K2505K5670m0438m7273k3538j7257O8790
328E2658N8429p4459l4452j3145l8666M3184Q3746J8176O655M0537m44M4426j6610
315A70035k1823k547o808o5466l4680M9556m531j3384l0199j0768K0731O8534
303A18650J1796k9210K1423O0042q1676p7973P4774j9843r923j5453M7620P3307
291A73534q3842p6616O652N7912m2696q310L1270K897j5354M7011O854J2891J163
278A13366j6006K9983N0196K0734r0439k7951j0155L5862l9065k1005L1246o855
$$ plain form
266 69911 59568 -1051 -43104 5624 24286 48246 41533 41099 102207 86394 1111 107863
254 107863 88520 105550 84014 49603 69279 97071 72060 120219 143312 111334 155426 85782
242 85782 113231 100812 185516 119083 84621 121973 67066 117723 77953 104420 151489 136290
230 136290 155636 144022 130029 73555 53134 43147 16669 17358 9999 20821 36527 88316 72143
217 72143 115299 110436 100948 128821 90125 50056 61541 97982 48623 51085 132000 149995 8856
204 8856 36699 114045 73665 18839 90267 29405 92601 99981 82187 99399 31333 25920 44314
191 44314 92545 134206 108812 103644 123446 147470 137836 94385 40748 13702 133363 153502
179 153502 115455 81746 115665 128319 67241 70172 95257 104097 92171 109147 117820 110696 140696
$$ packed form
266F9911j0343o0619m2053M8728J8662K3960o713m34O1108j5813q5283J06752
254A07863j9343J7030k1536l4411J9676K7792k5011M8159K3093l1978M4092o9644
242H5782K7449j2419Q4704o6433l4462L7352n4907N0657l9770K6467M7069j5199
230A36290J9346j1614j3993n6474k0421r987k6478O89p359J0822J5706N1789j6173
217G2143M3156m863r488K7873l8696m0069J1485L6441m9359K462Q0915J7995j41139
204H856K7843P7346m0380n4826P1428o0862O3196P380j7794J7212o8066n413J8394
191D4314M8231M1661k5394n168J9802K4024r634m3451n3637k7046J19661K0139
179A53502l8047l3709L3919J2654o1078K931K5085Q840j1926J6976Q673p124L0000
$$ plain form
166 140696 127231 67030 52149 109063 147464 133267 111662 78054 43119 58494 45946 86643
154 86643 93949 46662 88642 154096 123622 123940 67635 67094 74359 112780 97958 26597 54401
141 54401 59760 43500 45987 78526 116127 132930 148556 116263 94460 103422 49939 66393 68604
128 68604 63645 123039 113360 57810 88959 49801 35257 57479 64566 62926 56504 80638 86879
115 86879 46173 5460 18265 113525 147124 117197 115195 106815 105499 52451 68827 60753 63323
102 63323 76032 66884 51601 62044 78477 100267 50807 58631 113914 125735 146524 112040
90 112040 158683 144226 121064 65426 89661 55753 87802 138202 116786 131363 141769 83928
78 83928 77192 77054 118939 87999 43159 120067 130276 64228 7832 29798 43271 76786 37583
$$ packed form
166A40696j3465o0201j4881N6914L8401j4197k1605l3608l4935J5375j2548M0697
154H6643P306m7287M1980O5454l0474L18n6305n41P265L8421j4822p1361K7804
141E4401N359j6260K487L2539L7601J6803J5626l2293k1803Q962n3483J6454K211
128F8604m959N9394r679n5550L1149l9158j4544K2222P087j640o422K4134O241
115H6879m0706m0713J2805R5260L3599k9927k002q380j316n3048J6376q074K570
102F3323J2709r148j5283J0443J6433K1790m9460P824N5283J1821K0789l4484
90A12040M6643j4457k3162n5638K4235l3908L2049N0400k1416J4577J0406n7841
78H3928o736j38M1885l0940m4840P6908J0209o6048n6396K1966J3473L3515l9203
$$ plain form
65 37583 26059 75387 87483 80912 55277 132478 144442 51648 72561 94718 103979 83214 90925
52 90925 137975 140608 111194 98115 104901 139921 83485 102883 100428 56102 88837 95293 98484
39 98484 113870 188366 191211 161024 168890 138272 87635 65421 100930 112580 78208 90112 75187
26 75187 12844 54974 74829 80388 72278 47028 59953 57175 91916 117611 71263 94232 100346
13 100346 62521 39769 98861 97691 89769 127545 104691 50558 100396 105254 108619 98456 81005
0 81005
$$ packed form
65C7583j1524M9328J2096o571k5635P7201J1964r2794K0913K2157R261k0765P711
52I0925M7050K633k9414j3079O786L5020n6436J9398k455m4326L2735O456L191
39I8484J5386P4496K845l0187P866l0618n0637k2214L5509J1650l4372J1904j4925
26G5187o2343M2130J9855N559q110k5250J2925k778L4741K5695m6348K2969O114
13A00346l7825k2752N9092j170p922L7776k2854n4133M9838M858L365j0163j7451
0H1005
$$ Imaginary data points
##PAGE= N=2
##DATA TABLE= (X++(I..I)), XYDATA
$$ plain form
16383 -3479168 -3456246 -3405072 -3367823 -3347465 -3230858 -3183021 -3124546 -3109911 -3039921 -2975798 -2940810
16372 -2940810 -2952454 -2871690 -2833017 -2792891 -2752542 -2712859 -2665740 -2637040 -2581299 -2494453 -2479087
16361 -2479087 -2430515 -2342029 -2303741 -2244087 -2255668 -2214994 -2173983 -2156301 -2045207 -1965280 -1944428
16350 -1944428 -1929422 -1885569 -1840192 -1802469 -1761651 -1731012 -1651113 -1582288 -1545234 -1514710 -1493439
16339 -1493439 -1497511 -1414580 -1360382 -1343181 -1336128 -1290637 -1260855 -1199526 -1101923 -1008471 -1038047 -1025212
16327 -1025212 -972372 -939377 -893516 -832126 -803768 -779993 -762724 -694864 -606763 -550156 -524997
16316 -524997 -483799 -462352 -404671 -319756 -314407 -255206 -269637 -226981 -209436 -157673 -134868 -86774
16304 -86774 -42222 25728 39782 98835 122017 191218 220104 289758 332783 333568 394849 404214
$$ packed form
16383c479168K2922N1174L7249K0358J16607M7837N8475J4635O9990O4123L4988
16372b940810j1644Q0764L8673M0126M0349L9683M7119K8700N5741Q6846J5366
16361b479087M8572Q8486L8288N9654j1581M0674M1011J7682J11094P9927K0852
16350a944428J5006M3853M5377L7723M0818L0639P9899O8825L7054L0524K1271
16339a493439m072Q2931N4198J7201P053M5491K9782O1329R7603R3452k9576J2835
16327a025212N2840L2995M5861O1390K8358K3775J7269O7860Q8101N6607K5159
16316e24997M1198K1447N7681Q4915N349N9201j4431M2656J7545N1763K2805M8094
16304h6774M4552O7950J4054N9053K3182O9201K8886O9654M3025P85O1281R365
$$ plain form
16292 404214 474381 545590 577716 611329 646854 640525 632861 623111 619342 691342 757213 781595
16280 781595 881437 887751 869599 902221 958188 1010543 1020442 1034639 1103627 1154933 1160353 1213389
16268 1213389 1235492 1237961 1289038 1258951 1318191 1395956 1428426 1425917 1523933 1565303 1569459 1582142
16256 1582142 1577345 1544180 1599773 1614972 1683428 1711009 1755397 1793621 1730525 1773261 1804142
16245 1804142 1857068 1826804 1864137 1921520 1912171 1948013 1981007 2046116 2062867 2032575 2023624 2028368
16233 2028368 2111187 2156468 2162385 2243088 2218664 2240090 2326424 2377501 2315047 2357703 2445749
16222 2445749 2441354 2459700 2493869 2485430 2465581 2491379 2524955 2528571 2559715 2568558 2573091 2665074
16210 2665074 2656983 2641404 2661680 2744215 2749946 2738459 2722959 2709507 2749991 2738300 2833446 2916708
$$ packed form
16292D04214P0167P1209L2126L3613L5525o329p664r750l769P2000O5871K4382
16280G81595R9842O314j8152L2622N5967N2355R899J4197O8988N1306N420N3036
16268A213389K2103K469N1077l0087N9240P7765L2470k509R8016M1370M156J2683
16256A582142m797l3165N5593J5199O8456K7581M4388L8224o3096M2736L0881
16245A804142N2926l0264L7333N7383r349L5842L2994O5109J6751l0292q951M744
16233B028368Q2819M5281N917Q0703k4424K1426Q6334N1077o2454M2656Q8046
16222B445749m395J8346L4169q439j9849K5798L3576L616L1144Q843M533R1983
16210B665074q091j5579K0276Q2535N731j1487j5500j3452M0484j1691R5146Q3262
$$ plain form
16198 2916708 2912830 2895337 2907575 2919990 2937919 2923568 2966997 2942265 2967668 2997316 2986960
16187 2986960 3028691 3038950 3092754 3048937 3023823 3049410 3103905 3068364 3142255 3160491 3126376
16176 3126376 3068978 3150242 3201326 3259166 3257922 3250919 3260327 3218536 3273910 3307643 3343093 3381263
16164 3381263 3313382 3270525 3296580 3390709 3388905 3304393 3329714 3336583 3392982 3353987 3334004 3341185
16152 3341185 3338782 3360563 3391235 3408895 3419126 3465475 3463583 3476359 3476040 3482242 3462829 3469162
16140 3469162 3475166 3467074 3423477 3460825 3488643 3522022 3529586 3511125 3571620 3643982 3576225 3549688
16128 3549688 3605023 3570912 3571535 3563824 3624874 3579682 3549518 3581590 3579647 3589904 3626611 3546058
16116 3546058 3580746 3622864 3615308 3643745 3550287 3559436 3621844 3640412 3607181 3601267 3614496 3594218
$$ packed form
16198B916708l878j7493J2238J2415J7929j4351M3429k4732K5403K9648j0356
16187B986960M1731J0259N3804m3817k5114K5587N4495l5541P3891J8236l4115
16176C126376n7398Q1264N1084N7840j244p003R408m1791N5374L3733L5450L8170
16164C381263o7881m2857K6055R4129j804q4512K5321O869N6399l8995j9983P181
16152C341185k403K1781L0672J7660J0231M6349j892J2776l19O202j9413O333
16140C469162O004q092m3597L7348K7818L3379P564j8461O0495P2362o7757k6537
16128C549688N5335l4111O23p711O1050m5192l0164L2072j943J0257L6707q0553
16116C546058L4688M2118p556K8437r3458R149O2408J8568l3231n914J3229k0278
$$ plain form
16104 3594218 3642330 3739683 3732510 3715689 3714259 3756912 3772026 3751739 3818223 3738321 3787647 3765360
16092 3765360 3737939 3765877 3749662 3724559 3715468 3810298 3793367 3723242 3717064 3724408 3775384 3768943
16080 3768943 3766176 3739615 3768163 3815760 3770592 3761344 3830967 3813735 3802300 3800177 3783252 3802190
16068 3802190 3752861 3761087 3835711 3777005 3754324 3814316 3788089 3783007 3816797 3808188 3776215 3863425
16056 3863425 3905647 3878007 3821162 3815300 3819036 3821358 3813742 3800952 3892247 3881200 3834310 3800740
16044 3800740 3864001 3857287 3831643 3852987 3812158 3824801 3858025 3844840 3831969 3820212 3776215
16033 3776215 3758919 3772236 3790245 3747314 3779420 3758520 3772222 3790799 3793018 3750524 3766673
16022 3766673 3830396 3822633 3827976 3866622 3863364 3870414 3872695 3836949 3816583 3838760 3827084 3898367
$$ packed form
16104C594218M8112R7353p173j6821j430M2653J5114k0287O6484p9902M9326k2287
16092C765360k7421K7938j6215k5103r091R4830j6931p0125o178P344N0976o441
16080C768943k767k6561K8548M7597m5168r248O9623j7232j1435k123j6925J8938
16068C802190m9329Q226P4624n8706k2681N9992k6227n082L3790q609l1973Q7210
16056C863425M2222k7640n6845n862L736K322p616j2790R1295j1047m6890l3570
16044C800740O3261o714k5644K1344m0829J2643L3224j3185j2871j1757m3997
16033C776215j7296J3317J8009m2931L2106k0900J3702J8577K219m2494J6149
16022C766673O3723p763N343L8646l258P050K281l5746k0366K2177j1676P1283
$$ plain form
16010 3898367 3855898 3842698 3867074 3837310 3834265 3874115 3899977 3902545 3885171 3855228 3791713 3771013
15998 3771013 3853292 3898713 3897248 3875404 3881827 3875740 3901903 3900125 3910998 3891318 3898891 3833490
15986 3833490 3810709 3890996 3816313 3786673 3787043 3782475 3816841 3811287 3819990 3851227 3854221 3831870
15974 3831870 3862487 3856776 3828256 3828981 3887402 3889193 3896644 3856985 3906768 3898905 3893820 3837834 3816047
15961 3816047 3823636 3885113 3909968 3908238 3887695 3811031 3821637 3793702 3784798 3781077 3796635 3769608
15949 3769608 3790790 3923223 3897806 3912660 3894332 3793623 3804726 3811511 3848379 3862450 3856646
15938 3856646 3812602 3822247 3842793 3823359 3787023 3800312 3816418 3801172 3812682 3770242 3872287
15927 3872287 3935133 3932199 3983274 3934520 3922269 3894488 3817151 3847862 3899773 3904132 3893046 3892459
$$ packed form
16010C898367m2469j3200K4376k9764l045L9850K5862K568j7374k9943o3515k0700
15998C771013Q2279M5421j465k1844O423o087K6163j778J0873j9680P573o5401
15986C833490k2781Q0287p4683k9640L70m568L4366n554Q703L1237K994k2351
15974C831870L0617n711k8520P25N8421J791P451l9659M9783p863n085n5986k1787
15961C816047P589O1477K4855j730k0543p6664J0606k7935q904l721J5558k7027
15949C769608K1182J32433k5417J4854j8328j00709J1103O785L6868J4071n804
15938C856646m4044R645K0546j9434l6336J3289J6106j5246J1510m2440J02045
15927C872287O2846k934N1075m8754j2251k7781p7337L0711N1911M359j1086n87
$$ plain form
15915 3892459 3953673 3945320 3943114 3909278 3945918 3959324 3916138 3945369 3950707 3909268 3865820 3870386
15903 3870386 3897314 3889940 3916938 3908196 3924052 3907785 3901811 3912560 3887651 3864302 3912638 3890520
15891 3890520 3838129 3826589 3833356 3884029 3957354 3897931 3897493 3842309 3843307 3887494 3957401 3931064
15879 3931064 3884896 3908292 3910460 3894252 3841143 3893192 3893532 3867903 3790946 3844616 3831517 3860676
15867 3860676 3925996 3920373 3959132 3986556 3953452 3886010 3918304 3885484 3932804 3939447 3927292 3944523
15855 3944523 3942652 3973787 4020004 3987742 3892373 3939659 3917760 3903491 3926634 3896594 3951192
15844 3951192 3907453 3863164 3905394 3898703 3934269 3920516 3932273 3836818 3872427 3861875 3866210 3839455
15832 3839455 3881957 3922748 3919686 3923010 3960270 3972451 3949032 3930840 3957364 3923626 3898688 3878247
$$ packed form
15915C892459O1214q353k206l3836L6640J3406m3186K9231N338m1439m3448M566
15903C870386K6928p374K6998q742J5856j6267n974J0749k4909k3349M8336k2118
15891C890520n2391j1540O767N0673P3325n9423m38n5184R98M4187O9907k6337
15879C931064m6168K3396K168j6208n3109N2049L40k5629p6957N3670j3099K9159
15867C860676O5320n623L8759K7424l3104o7442L2294l2820M7320O643j2155J7231
15855C944523j871L1135M6217l2262r5369M7286k1899j4269K3143l0040N4598
15844C951192m3739m4289M2230o691L5566j3753J1757r5455L5609j0552M335k6755
15832C839455M2502M0791l062L324L7260J2181k3419j8192K6524l3738k4938k0441
$$ [...]
##END NTUPLES=NMR SPECTRUM
##END=
