##TITLE=1H_TG-2307-Ib
 CDCl3
 8 sc, 
 5.7.2023
##JCAMPDX= 6.0         $$ Bruker NMR JCAMP-DX V2.0
##DATA TYPE= NMR SPECTRUM
##DATA CLASS= NTUPLES
##ORIGIN= UXNMR, Bruker Analytische Messtechnik GmbH
##OWNER= root
$$ XWIN-NMR		Version 3.5
$$ Wed Jul  5 14:30:30 2023 Russian Standard Time (UT+4h)  she@DPX200
##.OBSERVE FREQUENCY= 200.13135
##.OBSERVE NUCLEUS= ^1H
##.ACQUISITION MODE= SIMULTANEOUS
##.ACQUISITION SCHEME= undefined
##.AVERAGES= 8
##.DIGITISER RES= 18
##SPECTROMETER/DATA SYSTEM= spect
##.PULSE SEQUENCE= zg30
##.SOLVENT NAME= CDCl3
##.SHIFT REFERENCE= (INTERNAL, CDCl3, 0, 15.7524)
##AUDIT TRAIL= $$ (NUMBER, WHEN, WHO, WHERE, WHAT)
$$ ##TITLE= Audit trail, XWIN-NMR		Version 3.5
$$ ##JCAMPDX= 5.01
$$ ##ORIGIN= Bruker BioSpin GmbH
$$ ##OWNER= she
$$ F:/spectra/data/she/nmr/H-F/1/pdata/1/auditp.txt
$$ ##AUDIT TRAIL=  $$ (NUMBER, WHEN, WHO, WHERE, WHAT)
(   1,<2023-07-05 14:29:24.40 +0400>,<she>,<DPX200>,
      <created by zg, POWCHK disabled, PULCHK disabled
       configuration hash MD5:
       00 E9 B6 7A A2 85 ED C7 34 08 36 98 17 FE 4E 26
       data hash MD5: 16K
       AE 8D 46 4C C4 3A 7F 2E 36 78 04 CD E4 BE AC EE>)
(   2,<2023-07-05 14:29:27.53 +0400>,<she>,<DPX200>,
      <Start of raw data processing
       efp BC_mod = 2 LB = 0.24 FT_mod = 6 PKNL = 1 PHC0 = -20785.89 PHC1 = 10.65272 SI = 16K 
       data hash MD5: 16K
       86 92 34 98 0F AE 35 E7 DC FD 70 38 6D 28 D0 B4>)
(   3,<2023-07-05 14:29:46.51 +0400>,<she>,<DPX200>,
      <pk PHC0 = 0.02618765 PHC1 = 0 
       data hash MD5: 16K
       B5 D9 98 76 8B B6 65 F5 D9 3D 8A 84 FC 4E 34 30>)
$$ ##END=
$$ 
$$ hash MD5
$$ 6C 98 5E C2 9A C8 C3 0E 5F 96 22 A8 26 D1 CC CC
##$RELAX= 
##$RELAX= 
##$RELAX= 
##$RELAX= 
##$RELAX= 
##$RELAX= 
$$ Bruker specific parameters
$$ --------------------------
##$DU= <F:/spectra>
##$EXPNO= 1
##$NAME= <H-F>
##$PROCNO= 1
##$TYPE= <nmr>
##$USER= <she>
##$AMP= (0..31)
100 100 100 100 100 100 100 100 100 100 100 100 100 100 100 100 100 100 
100 100 100 100 100 100 100 100 100 100 100 100 100 100 
##$AQSEQ= 0
##$AQ_mod= 1
##$AUNM= <au_zg>
##$AUTOPOS= <>
##$BF1= 200.13
##$BF2= 200.13
##$BF3= 200.13
##$BF4= 200.13
##$BF5= 200.13
##$BF6= 200.13
##$BF7= 200.13
##$BF8= 200.13
##$BYTORDA= 1
##$CFDGTYP= 0
##$CFRGTYP= 5
##$CHEMSTR= <none>
##$CNST= (0..31)
1 1 145 1 1 1 1 1 1 1 1 1 1 1 1 1 1 1 1 1 1 1 1 1 1 1 1 1 1 1 1 1 
##$CPDPRG= <>
##$CPDPRG1= <>
##$CPDPRG2= <>
##$CPDPRG3= <>
##$CPDPRG4= <mlev>
##$CPDPRG5= <mlev>
##$CPDPRG6= <mlev>
##$CPDPRG7= <mlev>
##$CPDPRG8= <mlev>
##$CPDPRGB= <>
##$CPDPRGT= <>
##$D= (0..31)
0 1.2 0 0 0 0 0 0 0 0.06 0 0.03 0 0 0 0 0.0002 0 0 0 0 0 0 0 0 0 0 0 0 
0 0 0 
##$DATE= 1688552963
##$DBL= (0..7)
120 120 120 120 120 120 120 120 
##$DBP= (0..7)
150 150 150 150 150 150 150 150 
##$DBP07= 0
##$DBPNAM0= <>
##$DBPNAM1= <>
##$DBPNAM2= <>
##$DBPNAM3= <>
##$DBPNAM4= <>
##$DBPNAM5= <>
##$DBPNAM6= <>
##$DBPNAM7= <>
##$DBPOAL= (0..7)
0.5 0.5 0.5 0.5 0.5 0.5 0.5 0.5 
##$DBPOFFS= (0..7)
0 0 0 0 0 0 0 0 
##$DE= 6
##$DECBNUC= <off>
$$ [...]
##$SUBNAM2= <"">
##$SUBNAM3= <"">
##$SUBNAM4= <"">
##$SUBNAM5= <"">
##$SUBNAM6= <"">
##$SUBNAM7= <"">
##$SUBNAM8= <"">
##$SUBNAM9= <"">
##$SW= 18.05172834244
##$SWIBOX= (0..15)
0 0 2 0 0 0 0 0 0 0 0 0 0 0 0 0 
##$SW_h= 3612.71676300578
##$TD= 16384
##$TD0= 1
##$TE= 0
##$TE2= 300
##$TE3= 300
##$TEG= 300
##$TL= (0..7)
0 120 120 120 120 120 120 120 
##$TP= (0..7)
150 150 150 150 150 150 150 150 
##$TP07= 0
##$TPNAME0= <>
##$TPNAME1= <>
##$TPNAME2= <>
##$TPNAME3= <>
##$TPNAME4= <>
##$TPNAME5= <>
##$TPNAME6= <>
##$TPNAME7= <>
##$TPOAL= (0..7)
0.5 0.5 0.5 0.5 0.5 0.5 0.5 0.5 
##$TPOFFS= (0..7)
0 0 0 0 0 0 0 0 
##$TUNHIN= 0
##$TUNHOUT= 0
##$TUNXOUT= 0
##$USERA1= <user>
##$USERA2= <user>
##$USERA3= <user>
##$USERA4= <user>
##$USERA5= <user>
##$V9= 5
##$VALIST= <valist>
##$VCLIST= <CCCCCCCCCCCCCCC>
##$VD= 0
##$VDLIST= <DDDDDDDDDDDDDDD>
##$VPLIST= <PPPPPPPPPPPPPPP>
##$VTLIST= <TTTTTTTTTTTTTTT>
##$WBST= 1024
##$WBSW= 4
##$XGAIN= (0..3)
0 0 0 0 
##$XL= 0
##$YL= 0
##$YMAX_a= 310316
##$YMIN_a= -247494
##$ZGOPTNS= <>
##$ZL1= 120
##$ZL2= 120
##$ZL3= 120
##$ZL4= 120
##$ABSF1= 0
##$ABSF2= 0
##$ABSG= 0
##$ABSL= 0
##$ALPHA= 0
##$AQORDER= 0
##$ASSFAC= 0
##$ASSFACI= 0
##$ASSFACX= 0
##$ASSWID= 0
##$AUNMP= <proc_1d>
##$AZFE= 0.1
##$AZFW= 0.1
##$BCFW= 0
##$BC_mod= 2
##$BYTORDP= 0
##$COROFFS= 0
##$CY= -3
##$DATMOD= 1
##$DC= 0
##$DFILT= <>
##$DTYPP= 0
##$F1P= 0
##$F2P= 0
##$FCOR= 1
##$FTSIZE= 16384
##$FT_mod= 6
##$GAMMA= 0
##$GB= 0
##$INTBC= 1
##$INTSCL= 3.70164e-10
##$ISEN= 128
##$LB= 0.24
##$LEV0= 0
##$LPBIN= 0
##$MAXI= 10000
##$MC2= 0
##$MEAN= 0
##$ME_mod= 0
##$MI= 1.114404
##$NCOEF= 0
##$NC_proc= -7
##$NLEV= 6
##$NOISF1= 3.799351
##$NOISF2= 2.8
##$NSP= 0
##$NTH_PI= 0
##$NZP= 0
##$OFFSET= 15.7524
##$PC= 1
##$PHC0= -20785.87
##$PHC1= 10.65272
##$PH_mod= 1
##$PKNL= yes
##$PPARMOD= 0
##$PSCAL= 0
##$PSIGN= 0
##$REVERSE= no
##$SF= 200.13000383107
##$SI= 16384
##$SIGF1= 3
##$SIGF2= 2
##$SINO= 5.538805
##$SIOLD= 16384
##$SREGLST= <1H.CDCl3>
##$SSB= 0
##$STSI= 16384
##$STSR= 0
##$SW_p= 3612.71676300578
##$SYMM= 0
##$S_DEV= 0
##$TDeff= 16384
##$TDoff= 0
##$TI= <>
##$TILT= no
##$TM1= 0
##$TM2= 0
##$TOPLEV= 0
##$USERP1= <user>
##$USERP2= <user>
##$USERP3= <user>
##$USERP4= <user>
##$USERP5= <user>
##$WDW= 1
##$XDIM= 16384
##$YMAX_p= 430474048
##$YMIN_p= -1663321
$$ End of Bruker specific parameters
$$ ---------------------------------
##NTUPLES= NMR SPECTRUM
##VAR_NAME=  FREQUENCY,     SPECTRUM/REAL,   SPECTRUM/IMAG
##SYMBOL=    X,             R,               I
##VAR_TYPE=  INDEPENDENT,   DEPENDENT,       DEPENDENT
##VAR_FORM=  AFFN,          ASDF,            ASDF
##VAR_DIM=   16384,         16384,           16384
##UNITS=     HZ,            ARBITRARY UNITS, ARBITRARY UNITS
##FACTOR=    0.220516191357247, 1,           1
##FIRST=     3152.5279520512, 0,             0
##LAST=      -460.188810954579, 0,           0
##MIN=       -460.188810954579, -1663321,    0
##MAX=       3152.5279520512, 430474048,     0
$$ Real data points
##PAGE= N=1
##DATA TABLE= (X++(R..R)), XYDATA
$$ [...]
5632B592298R5040P3390O0946q6764l8055Q4549j41588l7030q6256n353N0880
5621B562057L4843l3745R7990q0664j09422P303k1787J29475m2055M5006K7075
5610B616076n2669k7466R3131N0610J21854j31783Q704R7761p195M765O7887L4823
5598B876498R672K41926r922m8471Q8805J49517J38746J9950J27753j1363m8379
5587C534732L1197J7746R0043j4041l6644n3358j07067o4260j12754q8107K2174
5576C219661J04778J3508O2820N316k8750M9818L9830r098j45689L7888k7880
5565C322202k7638k4339j76500M8383r8700K0808k5299j76065L7935j76984p9043
5554B644760n0942j69078J6123L611K3061l7386o782J7038J5124J3911P105r6516
$$ y = [2592298, 2687338, 2760728, 2821674, 2734910, 2696855, 2781404, 2639816, 2602786, 2516530, 2511177, 2562057, 2596900, 2563155, 2661145, 2580481, 2471059, 2478362, 2456575, 2586050, 2543995, 2589001, 2616076, 2563407, 2535941, 2629072, 2679682, 2801536, 2669753, 2678457, 2776218, 2769023, 2773788, 2841675, 2876498, 2886170, 3128096, 3118174, 3069703, 3158508, 3308025, 3446771, 3466721, 3594474, 3583111, 3534732, 3565929, 3583675, 3673718, 3659677, 3623033, 3569675, 3462608, 3398348, 3285594, 3197487, 3219661, 3324439, 3337947, 3400767, 3406083, 3377333, 3427151, 3466981, 3457883, 3312194, 3350082, 3322202, 3294564, 3270225, 3093725, 3142108, 3043408, 3064216, 3038917, 2862852, 2900787, 2723803, 2644760, 2593818, 2424740, 2440863, 2444474, 2467535, 2430149, 2423367, 2440405, 2455529, 2469440, 2476545, 2380029]
5542B380029o1699J3212n1426n0549p6566K4985O4252M7681j9021N4217Q6275
5531B411390O1120m5391j50371K6525j47896P4737P9247K1642O2091r8703R2173
5520B386564R855M937J8944J22831l0282r7555J6727J02552l595L4478J67790
5509B733246r1457L5301J5883p249j36198M3655J59736q0210P2583q1390m2811
5498B621089J27937j5644L9096K8422M3692Q393j29799j3977P7167k3029L306
5487B766653N1748j5827J41515Q2643R5207j18156q6856K3881J87879l0658n9925
5476C038104J8797M560R5205j8598o968Q8439P181n3729J9783M9044K3680L1012
5464C296510m138L3396O0700J2456J8119J2895Q8941J08771k1142n5339K491n8748
$$ y = [2380029, 2318330, 2331542, 2280116, 2229567, 2153001, 2177986, 2242238, 2289919, 2270898, 2325115, 2411390, 2472510, 2427119, 2276748, 2303273, 2155377, 2230114, 2309361, 2331003, 2393094, 2294391, 2386564, 2396419, 2401356, 2420300, 2543131, 2512849, 2415294, 2432021, 2534573, 2530978, 2565456, 2733246, 2641789, 2677090, 2692973, 2685724, 2549526, 2593181, 2752917, 2672707, 2745290, 2663900, 2621089, 2749026, 2733382, 2772478, 2800900, 2844592, 2852985, 2723186, 2709209, 2786376, 2763347, 2766653, 2818401, 2802574, 2944089, 3026732, 3121939, 3003783, 2916927, 2940808, 3128687, 3098029, 3038104, 3056901, 3061461, 3156666, 3138068, 3131100, 3219539, 3226720, 3172991, 3192774, 3241818, 3265498, 3296510, 3292372, 3325768, 3386468, 3398924, 3417043, 3429938, 3518879, 3627650, 3606508, 3551169, 3553660, 3494912]
5452C494912Q1394r940j22746j39815p6161K3640m072j10517L2987Q0982n9590
5441C191074O4311r365j57405R5634p713p9706R1826J37457j65078j28051Q9769
5430C122753o8673N5720O4540k9897k4060l6977m5433k6019J74593K8540j05729
5419C109358K004p7928N3878j22253q6080n8331P9710M1514j05621Q610M0248
5408B885109J14985q4196j29934N7169o7482J04923j5651j00138n6665j4377k76
5397B693467j58648P1202J4723k6650M2045k9400j88397L7808J37234L8101j43103
5386B488382p4047O5302j12322J6184M6916r4533O4937k2689R3825q7913R1740
5375B475782K2924n4624O9088n3403k8837p1583M8848l641P0545p8096J4288J26601
$$ y = [3494912, 3576306, 3566366, 3443620, 3303805, 3227644, 3251284, 3247212, 3136695, 3169682, 3250664, 3191074, 3255385, 3246020, 3088615, 3184249, 3176536, 3096830, 3188656, 3326113, 3161035, 3032984, 3122753, 3054080, 3109800, 3174340, 3144443, 3120383, 3083406, 3037973, 3011954, 3186547, 3215087, 3109358, 3111362, 3033434, 3087312, 2965059, 2878979, 2820648, 2900358, 2941872, 2836251, 2844861, 2885109, 3000094, 2915898, 2785964, 2843133, 2775651, 2880574, 2864923, 2764785, 2708120, 2693743, 2693467, 2534819, 2606021, 2620744, 2594094, 2636139, 2606739, 2418342, 2456150, 2593384, 2631485, 2488382, 2414335, 2479637, 2367315, 2383499, 2430415, 2335882, 2400819, 2378130, 2471955, 2384042, 2475782, 2498706, 2444082, 2513170, 2459767, 2430930, 2359347, 2408195, 2404554, 2475099, 2397003, 2411291, 2537892]
5363B537892P5961o1395r9242L5205l8122j34641N0604p9502j36493M9185J75407
5352B374859m3911j18735J1300j57323P1940j6894r5115l7320P6332J38655L04
5341B204092k821m746r5677J33727j0884K0097o1778p9668Q6306P551k7753j20147
5329B048299j17758O0104O2833j13754P7935M0756J56975o651k04099K5260P6775
5318B106675j272Q850L2423n8417Q1199N0868O3710n0511n8531L97o690M1975
5306B210676P6077N0091q2147P3986K3636r3204J6649k9936m0582J89558j739
5295B393065j46594k1102l1716N3208K1951O6258q2551k8741N9173k7957p5265
5284B179729n1879N9989j08701m2076L2780Q9146J14970j42343n8318N3421l2848
$$ y = [2537892, 2613853, 2552458, 2453216, 2488421, 2450299, 2315658, 2366262, 2286760, 2150267, 2199452, 2374859, 2330948, 2212213, 2223513, 2066190, 2138130, 2121236, 2026121, 1988801, 2065133, 2203788, 2204092, 2201271, 2196525, 2100848, 2234575, 2223691, 2243788, 2182010, 2102342, 2188648, 2196199, 2168446, 2048299, 1930541, 1990645, 2053478, 1939724, 2017659, 2058415, 2215390, 2208739, 2004640, 2029900, 2106675, 2105403, 2114253, 2146676, 2088259, 2169458, 2220326, 2284036, 2233525, 2174994, 2175391, 2168701, 2210676, 2286753, 2336844, 2254697, 2328683, 2352319, 2259115, 2275764, 2245828, 2205246, 2394804, 2393065, 2246471, 2225369, 2193653, 2246861, 2268812, 2335070, 2252519, 2223778, 2282951, 2254994, 2179729, 2127850, 2187839, 2079138, 2037062, 2069842, 2158988, 2273958, 2131615, 2073297, 2126718, 2093870]
5273B093870J6477J04476N2860l6451J6373k714j31123j4941Q1587j42273o0577
5262A977564L4962k0510j23942J13066j32090M9833L3282j21063n0923l6828j65892
5251A557459n1018J04466R0226o0059N232q4977r148J55391M9710j16083O9569
5240A710768p9472M5935j9323j05625K25732N4135q2634q9234K5903n9210j34232
5229A492743J15900M8052j35088K741K769m2364m4484N1711j27468m2235n0697
5218A271580l5769M4695P4175Q259j27186j27981K52261n2855k0676j35244m9056
5207A102203J34423k3343Q1907Q8412N5880n8957q8679J9218j03340j08902J20972
5196A219794R0058o7180N1975K5704J36281j01433j25952q93j1750R5696j32474
$$ y = [2093870, 2110347, 2214823, 2267683, 2231232, 2247605, 2244891, 2113768, 2098827, 2180414, 2038141, 1977564, 2012526, 1992016, 1868074, 1981140, 1849050, 1898883, 1932165, 1811102, 1760179, 1723351, 1557459, 1506441, 1610907, 1701133, 1641074, 1646306, 1561329, 1552181, 1707572, 1757282, 1641199, 1710768, 1631296, 1677231, 1657908, 1552283, 1778015, 1832150, 1749516, 1660282, 1686185, 1626975, 1492743, 1608643, 1656695, 1521607, 1524348, 1527117, 1484753, 1440269, 1491980, 1364512, 1322277, 1271580, 1235811, 1280506, 1354681, 1362940, 1235754, 1107773, 1360034, 1307179, 1286503, 1151259, 1102203, 1236626, 1213283, 1295190, 1383602, 1439482, 1380525, 1291846, 1311064, 1207724, 1098822, 1219794, 1309852, 1242672, 1294647, 1320351, 1456632, 1355199, 1229247, 1228354, 1216604, 1312300, 1179826]
5185A179826L5436N6278J0837K6384O0918J2011k4163R9222p7450j15250R1451
5174A355500L1641M8538L7527M4586L7810o6461j3474j62151L8720j4230p5247
5163A262759J38633j17135p5214P8568r7529P6030J28458R2585o2235p1887m3122
5152A309911Q250J9100l1543J08469J47489p1587j1643L9068j35660K1366k1744
5141A381476L8432N3128k67586K3226K31346r0014j0040n4686J37954k4436q184
5130A410616J07171j3805q0965k8820K06130J35209p2759J5535j6652Q1212j9762
5119A723110p3410J03160J6927L300p5760K8987j7300l2594j04560r9225N3J31748
5107A604436J67008j529o2702K7311K3661J20110L6867p843k8464M1345R439L5233
$$ y = [1179826, 1215262, 1271540, 1282377, 1308761, 1369679, 1381690, 1357527, 1456749, 1379299, 1264049, 1355500, 1387141, 1435679, 1473206, 1517792, 1555602, 1489141, 1475667, 1313516, 1352236, 1338006, 1262759, 1401392, 1284257, 1209043, 1287611, 1190082, 1266112, 1394570, 1487155, 1424920, 1353033, 1309911, 1318161, 1337261, 1305718, 1414187, 1561676, 1490089, 1478446, 1517514, 1381854, 1403220, 1381476, 1419908, 1473036, 1205450, 1228676, 1460022, 1370008, 1359968, 1305282, 1443236, 1418800, 1410616, 1517787, 1503982, 1423017, 1394197, 1600327, 1735536, 1662777, 1678312, 1661660, 1742872, 1723110, 1649700, 1752860, 1769787, 1773087, 1697327, 1726314, 1709014, 1676420, 1571860, 1472635, 1472688, 1604436, 1771444, 1769915, 1707213, 1734524, 1758185, 1878295, 1915162, 1907319, 1878855, 1920200, 1929639, 1964872]
5095A964872J10883j71075P4689o6601j1367q741q3949p705j23469J33889N5835
5084A867261l1149L9461J00063N516J436M7974Q0311j2682n8790J15072n5953
5073B098520M3307K3381j56425N1229k829m4083Q2161j1567J5375k8211Q4978
5062B155836p6598J18226M3795l2003M3352j38953K1849M5608m6914J54188l8300
5051B250086N2380P009r2999O8905j75430N90Q5090O7791K0939M0844J7609p5601
5039B267213J50605p0992j52339j759K01005l0184j44589K3797M9043J61887P9880
5028B533567m8973k1846P0184r2469J32991r0316j43169J02339l9268m5573J52389
5017B509856K03514m7324j37053J0081N0060k1504j88378J08804J32846j3397
$$ y = [1964872, 2075755, 1904680, 1979369, 1912768, 1901401, 1892660, 1808711, 1801006, 1677537, 1811426, 1867261, 1836112, 1875573, 1975636, 1981152, 1982588, 2030562, 2110873, 2098191, 2039401, 2154473, 2098520, 2141827, 2165208, 2008783, 2060012, 2057183, 2013100, 2095261, 2083694, 2099069, 2070858, 2155836, 2079238, 2197464, 2241259, 2209256, 2252608, 2113655, 2135504, 2181112, 2134198, 2288386, 2250086, 2302466, 2309475, 2216476, 2285381, 2109951, 2110541, 2195631, 2263422, 2284361, 2325205, 2342814, 2267213, 2417818, 2346826, 2194487, 2192728, 2393733, 2363549, 2218960, 2242757, 2291800, 2453687, 2533567, 2484594, 2462748, 2532932, 2440463, 2573454, 2483138, 2339969, 2442308, 2403040, 2357467, 2509856, 2713370, 2666046, 2528993, 2539074, 2589134, 2567630, 2379252, 2488056, 2620902, 2607505]
5007B607505J06574K2128K9530J03621M8737J9990k0313k6250K3669O9741M0174
4996C025106O2164j16499J2319O6782J48116J0282q202N5709k8178J29747J8821
4985C376167J78692J3692J20666m1096K8J58048l6199K4039j5721K10231p153
4974C981394j42421L8426J45640J10939R8987l7376l1779J36446J00407R6346
4964D497009j4120p1309M7576R2556N3368K7240K02847o246N9982O9762J47235
4953E105900Q3273Q7762J56321J30411K11526l7154J74000K02950L50789J60188
4943F625966R7152J81570L05083J67843K54388N04626L25687K54192K61935L30052
4933I308494M79049M84033L86844K61450M01148L17842K50830K41919J05176L26485
$$ y = [2607505, 2714079, 2736207, 2765737, 2869358, 2918095, 2938085, 2917772, 2891522, 2915191, 2984932, 3025106, 3087270, 2970771, 2983090, 3049872, 3197988, 3208270, 3200068, 3255777, 3227599, 3357346, 3376167, 3554859, 3568551, 3689217, 3648121, 3648149, 3806197, 3769998, 3794037, 3778316, 3988547, 3981394, 3838973, 3877399, 4023039, 4133978, 4232965, 4195589, 4163810, 4300256, 4400663, 4497009, 4482889, 4411580, 4459156, 4551712, 4605080, 4632320, 4835167, 4828921, 4888903, 4958665, 5105900, 5189173, 5276935, 5433256, 5563667, 5775193, 5738039, 5912039, 6114989, 6465778, 6625966, 6723118, 6904688, 7209771, 7377614, 7632002, 8136628, 8462315, 8716507, 8978442, 9308494, 9787543, 10271576, 10658420, 10919870, 11321018, 11638860, 11889690, 12131609, 12236785, 12563270]
4923A2563270N3783j11096N8058K7451J8809k6767l391J15193J16270J37707J60847
4912A3110134O5484K63263K01506K23260J43058l8438J28041P6098j63746k74022
4902A3734638r0414k51686k22361j07589k1719j42749m3838J47376J98895J71489
4892A3372042K11468K48623K52534K33768M94857N44349N72197P00856P20238
4883A7350932Q85738R21869J028211J115710J163222J472475J147557J060126
4875B6145840J173418J012410P20629L84931R4298j25684j37343l48528k37486
4866B8682485l37580m581K12119j8797K92952K60766J24710K11976J56689k03002
4856B9377737m97937p39448q49048q42444j026006r09695r82942q84709r71723
$$ y = [12563270, 12617053, 12505957, 12564015, 12591466, 12610275, 12583508, 12580117, 12695310, 12811580, 12949287, 13110134, 13175618, 13438881, 13640387, 13863647, 14006705, 13968267, 14096308, 14172406, 14008660, 13734638, 13644224, 13392538, 13170177, 13062588, 13040869, 12898120, 12854282, 13001658, 13200553, 13372042, 13583510, 13832133, 14084667, 14318435, 14813292, 15357641, 15929838, 16630694, 17350932, 18236670, 19158539, 20186750, 21302460, 22465682, 23938157, 25085714, 26145840, 27319258, 28331668, 29052297, 29437228, 29531526, 29405842, 29268499, 28919971, 28682485, 28344905, 28340324, 28552443, 28533646, 28826598, 29087364, 29212074, 29424050, 29580739, 29377737, 28879800, 28140352, 27291304, 26448860, 25422854, 24513159, 23530217, 22645508, 21673785]
4847B1673785p55302p24197o57278o36460n00952n13471m79734k93554k71105
4838A6841732K122p299K7162K1162J47091L30086J51162M02387M37000O68714
4828A9021319N96899P25692J021881R10795J085680J219433J290232J250731J131460
4819B8254122P92581N08611L11869j16856m62357m32947n25901n12589k85405
4810B7531128j07862L4567O4916R151J29153Q2090p9805l34440o83999q11960
4800B5832939j132671j207922j235301j305834j063460r53090q13051p61124o29781
4791A6730705m48231k35767m07795l01388j40200q0707j35820J08808m9021L1827
4781A5072411K12057M43332M82807N26977Q27921R07502R55197J237651J686472
$$ y = [21673785, 20918483, 20194286, 19537008, 18900548, 18399596, 17886125, 17406391, 17112837, 16841732, 16843854, 16836555, 16863717, 16884879, 17031970, 17362056, 17513218, 17915605, 18352605, 19021319, 19618218, 20343910, 21365791, 22276586, 23362266, 24581699, 25871931, 27122662, 28254122, 29046703, 29555314, 29867183, 29750327, 29287970, 28855023, 28329122, 27816533, 27531128, 27423266, 27457833, 27522749, 27531900, 27661053, 27743143, 27663338, 27328898, 26644899, 25832939, 24700268, 23492346, 22257045, 20951211, 19887751, 18934661, 18121610, 17360486, 16730705, 16282474, 16046707, 15638912, 15337524, 15197324, 15116617, 14980797, 15089605, 15040584, 15072411, 15284468, 15727800, 16210607, 16737584, 17565505, 18473007, 19428204, 20665855, 22352327]
4772B2352327J855444K309437K550250L099387L065130K202533N70994j402534
4764C6602968l289456l881907l220728k462890j845862j265086p85801m69182
4756A9382056k85658M1824J40861R0369K91184L45535L29702L73030M99134M44293
4746B1652330M19232K38831J16927J3017q5714j35745k05589k27372k71911l24062
4736B1189944n3961k40507k00611R7407J18334L12090M50573M15069O00713O91738
4726B3380789P30329J012267J052935J159930J180235J550959J407414J281600
4718C2756458J444585J175544P71876K74701j20220o62859r62377j279708j216720
4709C2181280j327711j313449j230169j037431r88708n26626l01209k26298J25975
$$ y = [22352327, 24207771, 26517208, 29067458, 32166845, 35231975, 37434508, 38005502, 36602968, 33313512, 29431605, 26210877, 23747987, 21902125, 20637039, 19851238, 19382056, 19096398, 19138222, 19279083, 19369452, 19660636, 20006171, 20335873, 20708903, 21208037, 21652330, 22071562, 22310393, 22427320, 22440337, 22354623, 22218878, 22013289, 21785917, 21514006, 21189944, 21135983, 20895476, 20694865, 20792272, 20910606, 21222696, 21673269, 22088338, 22689051, 23380789, 24111118, 25123385, 26176320, 27336250, 28516485, 30067444, 31474858, 32756458, 34201043, 35376587, 36148463, 36423164, 36302944, 35640085, 34677708, 33398000, 32181280, 30853569, 29540120, 28309951, 27272520, 26283812, 25757186, 25455977, 25229679, 25355654]
4700B5355654L38870O04006P03119J005003J290842J656091J999211K047696K114858
4691C7115350L045784L088793K244646R85587j03290j166466k610529l083718
4683C9516157k852806k282111j353449p96593k42244J31001J63322L54759L53335
4674C2991371L2580k12943l28613o20346n80616o34655o86233l98062k72920k4783
4664B9264780J52031N0802j10549k83147m73933p28079r48523j148383j365239
4655B4409760j276838j383818j302676j154423r42508o46177o14130p91221n35584
4646A5762385l10418k44836k33034m18649l13074j95411j38940r2937l80567k43236
4636A3191283j99286m1044n7379j7702r6490p4877L2643J58351K63134L51715
$$ y = [25355654, 25694524, 26298530, 27001649, 28006652, 29297494, 30953585, 32952796, 35000492, 37115350, 40161134, 43249927, 45494573, 46480160, 46376870, 45210404, 42599875, 39516157, 36663351, 34381240, 33027791, 32231198, 31988954, 32119955, 32283277, 32638036, 32991371, 33023951, 32811008, 32482395, 31862049, 31281433, 30646778, 29960545, 29562483, 29289563, 29264780, 29416811, 29467613, 29357064, 29073917, 28599984, 27871905, 26923382, 25774999, 24409760, 23132922, 21749104, 20446428, 19292005, 18349497, 17703320, 17089190, 16297969, 15762385, 15451967, 15207131, 14974097, 14555448, 14242374, 14046963, 13908023, 13815086, 13434519, 13191283, 12991997, 12950953, 12893574, 12875872, 12779382, 12704505, 12737148, 12895499, 13158633, 13510348]
4626A3510348M10543L81319M26446L90616M08711L03796L83829o5191j26505n46074
4616A5477838n69302p54915p09065r57145n08473n37210n43362l78268k73637
4607A0246461j80718k70636j16545j73549j32901j13716k20787K0683P0702n3832
4597I075162J82704J6127L7200K2788J5320q9614m2757k41630j92956j82541j07552
4586H492251k23292j10603j37176j22182o9554J887o2801R3734q0200K0849R26
4575G803839O2571R8239o9499j40264j93356K0611k01247k07332k50368k26862
4565F696332l33438k80706k05733j46555j43684j95979k5927j32063q9095k1638
4555E121514l9764j04805p2768J24214r6162j06165m9212j10215j16242p9694
$$ y = [13510348, 13920891, 14302210, 14728656, 15119272, 15527983, 15831779, 16215608, 16150417, 16023912, 15477838, 14908536, 14153621, 13444556, 12487411, 11978938, 11441728, 10898366, 10520098, 10246461, 10065743, 9795107, 9678562, 9505013, 9372112, 9258396, 9037609, 9058292, 9128994, 9075162, 9257866, 9273993, 9311193, 9333981, 9349301, 9259687, 9216930, 8975300, 8782344, 8599803, 8492251, 8268959, 8158356, 8021180, 7898998, 7829444, 7831331, 7768530, 7862264, 7782064, 7802913, 7803839, 7866410, 7964649, 7895150, 7754886, 7561530, 7582141, 7380894, 7173562, 6923194, 6696332, 6362894, 6082188, 5876455, 5729900, 5586216, 5390237, 5364310, 5232247, 5143152, 5121514, 5081750, 4976945, 4904177, 5028391, 4932229, 4826064, 4776852, 4666637, 4550395, 4470701]
4545D470701j18360m255J04829q4186j57492j13602K3868j47016R8356K1000p5187
4534D018656o3183l8593K7041o3105j15977J35487J52928q6396N57l5351k7372
4523C904692R6520m2499O2913M8376j34262N5k7995N7230j88023J2869j599N1393
4511C839670r1625J3145J90356k2212J14601j4146n7899j31981J3296J50943p6451
4500C927697j0796j80158j46523j0161q37j18313k4138R651J53156J9925n8479
4489C561024K1508r2147N9868j10067L6914J98972o595J07801L5890p6820p1048
4478C665300L953J00279J2086j29103n5647N5177r2432j01965J15373n4380L2544
4467C551185j31203M4412J57828R7084J52296k9845O8951M7756m8229M2474Q9241
$$ y = [4470701, 4352341, 4348086, 4452915, 4368729, 4211237, 4097635, 4121503, 3974487, 4072843, 4093843, 4018656, 3955473, 3916880, 3943921, 3880816, 3764839, 3900326, 4053254, 3966858, 3967415, 3932064, 3904692, 4001212, 3958713, 4021626, 4070002, 3935740, 3935795, 3907800, 3965030, 3777007, 3789876, 3788277, 3839670, 3748045, 3761190, 3951546, 3929334, 4043935, 4029789, 3971890, 3839909, 3853205, 4004148, 3927697, 3916901, 3736743, 3590220, 3580059, 3579222, 3460909, 3436771, 3446422, 3599578, 3619503, 3561024, 3582532, 3490385, 3550253, 3440186, 3477100, 3676072, 3669477, 3777278, 3813168, 3736348, 3665300, 3669253, 3769532, 3781618, 3652515, 3596868, 3652045, 3559613, 3457648, 3573021, 3518641, 3551185, 3419982, 3464394, 3622222, 3719306, 3871602, 3841757, 3910708, 3958464, 3910235, 3952709, 4041950]
4456D041950J7924J20346J71681K37914J9099k774Q9896J55592J59355K14324
4446E225307J73832K73784J57714P5473J01609l398O1227J05629J17921J07980
4436F397078j7392R910L8031k2943J52160K06008J95876n8521j3380n5755q7940
4425F743132j26266l9562j51901k38935J6078j25039j69741l16784k13666j07722
4415E269594p3786k54724q8366k57721k75067j09403p0963j99607n5279j4734
4405C869944n0278Q041l9166K3020j07499l0141M3740o3068L3812M5636n2254
4394C681787O9652R8141r1912l58K6265J1872M5408P9389J01739j67743P0285
4383C924525m8893l8148K13630K30219J46037K2562J28218m3293m2375R0398j2878
$$ y = [4041950, 4059874, 4180220, 4351901, 4589815, 4608914, 4606140, 4696036, 4851628, 5010983, 5225307, 5399139, 5672923, 5830637, 5906110, 6007719, 6004321, 6065548, 6171177, 6289098, 6397078, 6379686, 6389596, 6427627, 6404684, 6556844, 6762852, 6958728, 6900207, 6886827, 6831072, 6743132, 6616866, 6577304, 6425403, 6186468, 6202546, 6077507, 5907766, 5590982, 5377316, 5269594, 5195808, 4941084, 4852718, 4594997, 4319930, 4210527, 4139564, 3939957, 3884678, 3869944, 3819666, 3827707, 3788541, 3811561, 3704062, 3673921, 3717661, 3654593, 3688405, 3734041, 3681787, 3751439, 3849580, 3757668, 3757310, 3783575, 3795447, 3840855, 3920244, 4021983, 3854240, 3924525, 3875632, 3837484, 4051114, 4281333, 4427370, 4449932, 4578150, 4534857, 4492482, 4582880, 4570002]
4372D570002M3967j293p3156J18357n3436o4932L2853J4688m8974M6099J35347
4361D719522k6542J46327j70466N6602J40493K6300r9952j92078J16781N4363
4351D771350j11996k38222Q0399M5218j03531l4601k6576o1818R5631j23119j83109
4340D109626k0316p6332k6396J6248j00259m4123j01285J25614L9288r6720j22355
4329C702990m1170K9455l8407J7446O2756J11168j13137j15530k4726L807o598
4318C588054N9367P5474P7619j5994n841O4382N1330l5098p8409R0905J36916
4307D008705J91473n4805l8123O8106N6938K9734j03884J09119j04039k4672R807
4296D148359J3273j39653J66308j07014L8371r61q2996J01253L2205j153j98048
$$ y = [4570002, 4613969, 4612676, 4539520, 4657877, 4604441, 4539509, 4572362, 4587050, 4538076, 4584175, 4719522, 4692980, 4839307, 4668841, 4725443, 4865936, 4892236, 4792284, 4600206, 4716987, 4771350, 4659354, 4421132, 4501531, 4546749, 4443218, 4408617, 4382041, 4320223, 4415854, 4292735, 4109626, 4089310, 4012978, 3986582, 4002830, 3902571, 3858448, 3757163, 3882777, 3922065, 3825345, 3702990, 3661820, 3691275, 3652868, 3670314, 3733070, 3844238, 3731101, 3615571, 3590845, 3594652, 3588054, 3647421, 3722895, 3800514, 3784520, 3778679, 3843061, 3894391, 3859293, 3780884, 3871789, 4008705, 4200178, 4145373, 4107250, 4175356, 4232294, 4262028, 4158144, 4267263, 4163224, 4138552, 4148359, 4161632, 4021979, 4188287, 4081273, 4119644, 4118683, 4035687, 4136940, 4169145, 4167992, 3969944]
4285C969944O3279O9481n1584Q5549Q1915k068j01917k7235K07723J16535k2870
4274D388752l0892L5620O996J05952O5848R7494O4296p3210J07531J12108K2862
4263D903357L0028K45709R7936j0224J07658J39751J27999L7623k1304L2200J25734
4252E816467R069L7582Q5074J02341M2572K09446J75168J69455R2075J16038K21246
4241G076533l6807j27337j2357P7421l272J55918R8199N9197N145K03226K76708
4230G772574R7585j0119K73062K56599Q6835K40437K52140J65052L26288K32953
4220I693406J10517J26459K18959K11568J98637K91674J70839K54683J12586L7304
4210A1426632K77602L27903P2038J24452K10422K27273J03993K11156J84525J85778
$$ y = [3969944, 4033223, 4102704, 4051120, 4136669, 4218584, 4216516, 4114599, 4087364, 4295087, 4411622, 4388752, 4357860, 4393480, 4400476, 4506428, 4572276, 4669770, 4734066, 4660856, 4768387, 4880495, 4903357, 4933385, 5179094, 5277030, 5266806, 5374464, 5514215, 5642214, 5679837, 5658533, 5690733, 5816467, 5825536, 5863118, 5948192, 6050533, 6093105, 6302551, 6477719, 6647174, 6739249, 6855287, 7076533, 7039726, 6912389, 6900032, 6977453, 6974181, 7130099, 7228298, 7287495, 7292640, 7495866, 7772574, 7870159, 7860040, 8133102, 8389701, 8476536, 8716973, 8969113, 9134165, 9460453, 9693406, 9803923, 9930382, 10149341, 10360909, 10559546, 10851220, 11022059, 11276742, 11389328, 11426632, 11704234, 12032137, 12104175, 12228627, 12439049, 12666322, 12770315, 12981471, 13165996, 13351774]
4200A3351774J87227K36264K44015L03201R4958L31450K52192L19636M42871N28365
4190A6291953L56091N10561N22525L74461N81604M77140L75406M90083N22314
4181B0502138M40059N11988N37502N42396O64824O84246Q44855P69489P61816
4172B6259313Q08469Q29932O94203P77182J157172J326485J492225J603790J492650
4163C6441421J540700J721320J843080K193345K636795K901677L404216M089962
4155E6772516M922504O078774O737090P973802R344272J0423344J2125550J4490898
4147A28868750J7513557K0162962K1449406K2172084K0942607J4829917J341710
4140B47280993j4315589k5025284k7676999k5019480k0479816j5762425j2343152
$$ y = [13351774, 13539001, 13775265, 14019280, 14322481, 14417439, 14748889, 15001081, 15320717, 15763588, 16291953, 16648044, 17158605, 17681130, 18055591, 18637195, 19114335, 19489741, 19979824, 20502138, 20942197, 21454185, 21991687, 22534083, 23198907, 23883153, 24728008, 25497497, 26259313, 27067782, 27897714, 28591917, 29369099, 30526271, 31852756, 33344981, 34948771, 36441421, 37982121, 39703441, 41546521, 43739866, 46376661, 49278338, 52682554, 56772516, 61695020, 67773794, 74510884, 82484686, 91828958, 102252302, 114377852, 128868750, 146382307, 166545269, 187994675, 210166759, 231109366, 245939283, 247280993, 232965404, 207940120, 180263121, 155243641, 134763825, 119001400, 106658248]
4133A06658248r953694q139113o375841n194896m345463l842906l499018l399842
4125F1907475l111636k708896k196659j686541j566512j222369r43833q02612
4117D7668417m51963j62877k14427j82452k15103j01568l36071o63659r95375
4108D4344922r07083o62978n58600l91671j79167R2347J35071O4868L45321J30482
4098D2413512K94696L10825N34329N78954O44625Q24949N59630N03373M52271
4089D7117164P25729P24547Q11595Q30308Q63560J061155J306732J494936J718840
4080E6654566J788434J918740K089824K328677K992455L341315L471748L625158
4072G8210917L921315L869628K159121m42177k601873l118421k563608j630543
$$ y = [106658248, 96704554, 88565441, 82189600, 76994704, 72649241, 68806335, 65307317, 61907475, 58795839, 56086943, 53890284, 52203743, 50637231, 49414862, 48471029, 47668417, 47216454, 47053577, 46839150, 46656698, 46441595, 46340027, 46003956, 45340297, 44344922, 43437839, 42774861, 42216261, 41824590, 41645423, 41737770, 41872841, 41937709, 42283030, 42413512, 42708208, 43019033, 43553362, 44132316, 44776941, 45601890, 46161520, 46664893, 47117164, 47842893, 48567440, 49379035, 50209343, 51072903, 52134058, 53440790, 54935726, 56654566, 58443000, 60361740, 62451564, 64780241, 67772696, 71114011, 74585759, 78210917, 82132232, 86001860, 88160981, 87718804, 85116931, 81998510, 79434902, 77804359]
4064G7804359n77347N10506K036574M209203M348557L529785O612885Q449348
4056A06923870J581395q995255j2074484j0596829q279299n748853m319323l465097
4048E5026125k754415k287204j916642j473741j564753j413343j330432j438078
4040D0847517j879849j641494j586442j320087j347844j251370j124884j003505
4032B9692042r05305q72228q68973r13311r26007r47073j114264r75891r09356
4023B1259634q86903q76063o42686n28334o46315n41233m10817n55346m04179
4014A5767758n35253m38532m86880k38112l08370l32576l86569n39797j80623
4005A2321046k59174j96740l66323m83274k84228l40684m24850k05163k40881
$$ y = [77804359, 77227012, 77737518, 79774092, 83983295, 88331852, 91861637, 98474522, 106923870, 108505265, 99510010, 87435526, 76838697, 68559398, 62810545, 58491222, 55026125, 52271710, 49984506, 48067864, 46594123, 45029370, 43616027, 42285595, 40847517, 38967668, 37326174, 35739732, 34419645, 33071801, 31820431, 30695547, 29692042, 28786737, 27914509, 27045536, 26132225, 25206218, 24259145, 23144881, 22168990, 21259634, 20372731, 19496668, 18853982, 18325648, 17679333, 17138100, 16727283, 16171937, 15767758, 15232505, 14793973, 14307093, 14068981, 13760611, 13428035, 13041466, 12501669, 12321046, 12061872, 11865132, 11498809, 11015535, 10731307, 10390623, 9965773, 9760610, 9519729]
3996I519729j58620l11113k48393j39407J2193k07332l70850j90854o1920l44805
3986G498628k39559j40111o1153j84282l4914j7199r8299j88680j86506P4414
3976F422339J19670q600j15324j65406j92594j54440j8045O5006j09077r7960
3966E745569J09364j26127j09511j24654r2504j76244N4733l0911j15053j39219
3956D995443j08321j45754m4781p4315j79421Q7957o7937J2810M4568J39392p2739
3945D586902J3741k8682K1133N8422J9359q8667o8500n0752l7980k4969M5028
3934D445035P5338p5761o5454p1211L1302o4913n7552P3609m7328j18502R5198
3923D219761O0140j62812l8911P4828J16798o5922l6979J1188j9258L3551J66346
$$ y = [9519729, 9361109, 9049996, 8801603, 8662196, 8674389, 8467057, 8096207, 7905353, 7843433, 7498628, 7259069, 7118958, 7057805, 6873523, 6838609, 6821410, 6723111, 6534431, 6347925, 6422339, 6542009, 6533409, 6418085, 6252679, 6060085, 5905645, 5887600, 5952606, 5843529, 5745569, 5854933, 5728806, 5619295, 5494641, 5402137, 5225893, 5280626, 5249715, 5134662, 4995443, 4887122, 4741368, 4696587, 4622272, 4442851, 4530808, 4462871, 4475681, 4520249, 4659641, 4586902, 4600643, 4571961, 4593094, 4651516, 4670875, 4582208, 4513708, 4462956, 4424976, 4400007, 4445035, 4520373, 4444612, 4379158, 4307947, 4339249, 4274336, 4216784, 4290393, 4243065, 4124563, 4219761, 4279901, 4117089, 4078178, 4153006, 4269804, 4203882, 4166903, 4178091, 4158833, 4192384, 4358730]
3912D358730o3303q1805J8732J07484k9273o6537n3473j9075m8515l1899J6632
3901D107698q4977L9226J20947M0982k1224n0554j19166o6461P4041k5360n3662
3890C961490J06939M2508l6513r6928M0240j3996J13221n5837k5700J84663J20477
3879D340564o3273J03224J17319p4319n020L6918m0275m4083Q0811P078k8703
3868D430241m0736K06515R2223p6870k0063K24206J66693M9226j32266l3001L5624
3857D901792O2346O0729J53512K71903L8037K10786J11377j15292n7384j16375
3847E521431k00784o7155K730j01912n0207J6384P651m4271o7928q1517R0395
3836E024817n4287Q0413L9949o1314J85396m4714j26217j08966J65594J48503
$$ y = [4358730, 4295427, 4213622, 4232354, 4339838, 4310565, 4244028, 4190555, 4171480, 4122965, 4091066, 4107698, 4022721, 4061947, 4182894, 4223876, 4202652, 4152098, 4032932, 3966471, 4040512, 4015152, 3961490, 4068429, 4110937, 4074424, 3977496, 4017736, 4003740, 4116961, 4061124, 4035424, 4220087, 4340564, 4277291, 4380515, 4497834, 4423515, 4418495, 4455413, 4415138, 4371055, 4451866, 4458944, 4430241, 4389505, 4596020, 4688243, 4611373, 4591310, 4815516, 4982209, 5031435, 4899169, 4866168, 4901792, 4964138, 5024867, 5178379, 5450282, 5488319, 5699105, 5810482, 5695190, 5637806, 5521431, 5320647, 5253492, 5256222, 5154310, 5104103, 5120487, 5128138, 5083867, 5015939, 4934422, 5024817, 4970530, 5050943, 5090892, 5029578, 5214974, 5170260, 5044043, 4935077, 5100671, 5249174]
3826E249174N0472M4924J0639O8400Q6776j47318o5645P9398J72714N334J8324
3815E573192J2110J55341P4231o3407k005J35218J8193j02017J19762P2026n0310
3804E942334M778J3722N5473O922j41311K0016l9727Q499J14031j8688K7768j3414
3792E980403J3982J23244K0179j56375m6117K12406J57551j48268j028Q6135R1722
3781F333834K7149J24900K11512N2804n9531K7212N7592J62135R7556P6098L8800
3770G150061r076J2254Q7311N1893O3520j067j39851q1618n5178K2310m5710L3242
3758G088091O53k240k0423l3745L5593R273r687K3283j13706R0176r5822P6991
3746G048437k1101J16627P2490j61264M4498l8883M3411K63483m8969n5906j8183
$$ y = [5249174, 5299646, 5344570, 5355209, 5423609, 5510385, 5363067, 5297422, 5376820, 5549534, 5554868, 5573192, 5585302, 5740643, 5814874, 5751467, 5749462, 5884680, 5902873, 5800856, 5920618, 5992644, 5942334, 5947112, 5960834, 6016307, 6023229, 5881918, 5901934, 5862207, 5870706, 5984737, 5966049, 5993817, 5980403, 5994385, 6117629, 6137808, 5981433, 5935316, 6147722, 6305273, 6157005, 6155977, 6242112, 6333834, 6360983, 6485883, 6697395, 6750199, 6690668, 6717880, 6775472, 6937607, 7035163, 7111261, 7150061, 7140985, 7153239, 7240550, 7292443, 7355963, 7354896, 7215045, 7133427, 7078249, 7100559, 7054849, 7088091, 7088744, 7086504, 7066081, 7032336, 7067929, 7077202, 7067515, 7090798, 6977092, 7067268, 6971446, 7048437, 7027336, 7143963, 7216453, 7055189, 7099687, 7060804, 7104215, 7367698, 7318729, 7262823, 7244640]
3735G244640R5101O3137q971R8869N6984q1686M4498J16429P2466J7725Q9214
3724G808406K29145Q5554P5202l7863K1709n3208N4652J28370M6545K28843J51138
3713H738493Q440J48348K23386J00216r646Q858J42850J28480J21414J33096J40064
3702I883999O5648J46794J72850J62124J46144J48334J99026K14186J46106J52938
3692A1438149K38629J72078K47898K82956L52800K79702K69568L23029L80813
3683A3985622L12177L39812M72612L01214K25336L71497N59777K97083L79653
3674A7244783L55067L38985L56098L84584M19874M75364L43922L63547M42136
3665B0724360K09809K85544L17798K85591L31766K69366L38251L50053L76471
$$ y = [7244640, 7339741, 7402878, 7393907, 7492776, 7549760, 7468074, 7512572, 7629001, 7701467, 7719192, 7808406, 8037551, 8123105, 8198307, 8160444, 8182153, 8128945, 8183597, 8311967, 8358512, 8587355, 8738493, 8746933, 8895281, 9118667, 9218883, 9209237, 9218095, 9360945, 9489425, 9610839, 9743935, 9883999, 9949647, 10096441, 10269291, 10431415, 10577559, 10725893, 10924919, 11139105, 11285211, 11438149, 11676778, 11848856, 12096754, 12379710, 12732510, 13012212, 13281780, 13604809, 13985622, 14297799, 14637611, 15110223, 15411437, 15636773, 16008270, 16568047, 16865130, 17244783, 17599850, 17938835, 18294933, 18679517, 19099391, 19574755, 19918677, 20282224, 20724360, 20934169, 21219713, 21537511, 21823102, 22154868, 22424234, 22762485, 23112538, 23489009]
3656B3489009M05906L37376L64945M33448L70377K01253N75899M82109M33995
3647B7094317N57394O42458N04257Q35926Q21867J040544R13530J203040J209602
3638C4822935J210591J326926J547662J684186J781788J999581K034035K007377
3630D8415081K268836K251655K207037K244422K206271K292894K199320K003330
3622F6088846J876139K111301J682446J517757J623356J350425J239082J015927
3614G8505279P99020Q77718M64068L49358M07471K57449n364j12786k40576m11257
3604H0890380m17787m39914q04663q30018r03330q85853r64868q22658o80039
3595G4141250o69410o76694q63013r82510q91811j192957j270985j245431j336574
$$ y = [23489009, 23894915, 24232291, 24597236, 25030684, 25401061, 25602314, 26178213, 26660322, 27094317, 27651711, 28294169, 28798426, 29634352, 30456219, 31496763, 32410293, 33613333, 34822935, 36033526, 37360452, 38908114, 40592300, 42374088, 44373669, 46407704, 48415081, 50683917, 52935572, 55142609, 57387031, 59593302, 61886196, 64085516, 66088846, 67964985, 70076286, 71758732, 73276489, 74899845, 76250270, 77489352, 78505279, 79304299, 80182017, 80646085, 80995443, 81402914, 81660363, 81654999, 81542213, 81301637, 80890380, 80472593, 80032679, 79228016, 78397998, 77494668, 76608815, 75643947, 74821289, 74141250, 73471840, 72795146, 71932133, 70949623, 70057812, 68864855, 67593870, 66348439, 65011865]
3586F5011865j201787j364879j399310j318676j069216j180238j081174r80241
3578E5416344r52416r85937j125829j130059j317140j284935j438469j529917
3570D5651642j601249j596335j637965j579441j464549j283949j300737j199235
3562C3988182j102333j047058q33892q15339o56142m49580m45088m82299m32229
3553B7724222m11055k76496k92551k37780j72733j22947l6552j50092j78160o6580
3543B5779276M8486o7755k62932M6821J25323r2512J8717k8387k15809k22468
3533B5128760j37608j27023l16065k01328j22589p2581o6526K5423j40208j21795
3523B3848460j32883j95541K0277j34237j04270j39699l8744j76847j39135k0453
$$ y = [65011865, 63810078, 62445199, 61045889, 59727213, 58657997, 57477759, 56396585, 55416344, 54463928, 53477991, 52352162, 51222103, 49904963, 48620028, 47181559, 45651642, 44050393, 42454058, 40816093, 39236652, 37772103, 36488154, 35187417, 33988182, 32885849, 31838791, 31004899, 30189560, 29533418, 29083838, 28638750, 28156451, 27724222, 27313167, 27036671, 26744120, 26506340, 26333607, 26210660, 26174108, 26024016, 25845856, 25779276, 25827762, 25760007, 25497075, 25543896, 25669219, 25576707, 25595424, 25567037, 25351228, 25128760, 24991152, 24864129, 24548064, 24346736, 24224147, 24151566, 24085040, 24110463, 23970255, 23848460, 23715577, 23520036, 23540313, 23406076, 23301806, 23162107, 23123363, 22946516, 22807381, 22786928]
3513B2786928k5777p983p3909n5403K7679N8127J34063J72470J62128M02084K03520
3502B3783927K71630M73968N02415N30795M30727M71103N61652N94993M73443
3493B8094653N88843O87907O47491O40852O57755O21078N06573O46786N16037
3484C3607975M05216N93264N56424M54076N08022N85992P00462Q38935N10469
3475C8760835O38780N40479M95790M90653L23228J42468J29978M4119j51155r7155
3465D1318020m11561k97232m1202j04675l5939l5586m0245J36473L61874L99566
3455D1249493K74958N21053Q09369Q20565R40305J140790J146012J137708J256415
3446D9296668J462119J441994J699461J672003J801280J844953K006857K042182
$$ y = [22786928, 22761151, 22753168, 22679259, 22623856, 22651535, 22709662, 22843725, 23016195, 23178323, 23580407, 23783927, 24055557, 24529525, 25031940, 25562735, 25993462, 26464565, 27026217, 27621210, 28094653, 28683496, 29371403, 30018894, 30659746, 31317501, 31938579, 32445152, 33091938, 33607975, 34013191, 34606455, 35162879, 35616955, 36124977, 36710969, 37411431, 38250366, 38760835, 39399615, 39940094, 40435884, 40926537, 41249765, 41392233, 41522211, 41566330, 41415175, 41318020, 40906459, 40609227, 40568025, 40463350, 40427411, 40391825, 40351580, 40488053, 40849927, 41249493, 41524451, 42045504, 42854873, 43675438, 44615743, 45756533, 46902545, 48040253, 49296668, 50758787, 52200781, 53900242, 55572245, 57373525, 59218478, 61225335, 63267517]
3438F3267517K193243K139285J941036K159084K266617K381983K322139K477705
3430H1148609K456066K547556K561817K706279K883364L094366L007786K904984
3422A03310827K934005K769742K615006K069462J677094J401251R26575M18317
3414A18122279k01318p75763j228269j553906j610392j880131k063181j989657
3406A06819662j925815j725234j446589r55102o73068j87412L78011P40816J238745
3397A02264014J526743K106500K614778K882887L050426L135228L337755L354102
3389A24272433K985618K687267K244367J630099Q93459p451p94904j655298k609990
3380A29645600l428893l967604m238981m754231m777976m803342m817232m496588
$$ y = [63267517, 65460760, 67600045, 69541081, 71700165, 73966782, 76348765, 78670904, 81148609, 83604675, 86152231, 88714048, 91420327, 94303691, 97398057, 100405843, 103310827, 106244832, 109014574, 111629580, 113699042, 115376136, 116777387, 117703962, 118122279, 117920961, 117145198, 115916929, 114363023, 112752631, 110872500, 108809319, 106819662, 104893847, 103168613, 101722024, 100766922, 100093854, 99906442, 100284453, 101025269, 102264014, 103790757, 105897257, 108512035, 111394922, 114445348, 117580576, 120918331, 124272433, 127258051, 129945318, 132189685, 133819784, 134713243, 134705792, 133910888, 132255590, 129645600, 126216707, 122249103, 118010122, 113255891, 108477915, 103674573, 98857341, 94360753]
3372I4360753m029912l473936l222716k827756k317432k064415j475684j264271
3364G3684631r21415o14646m12998j47409r463K19500L75088O12612M21453O74392
3354G3881745P74315N43048M03912L79985J72765L20538J03734l4909k04618l61586
3344G5978929l96373k08970l24728p22129o50073n05010n55683n91364m25720
3335G1598879m14899m71226n16335k62747k37266j75462j26823j65405n4485r0448
3325F9083783K18153K54478K69452M62978N42857N51738N39119Q30470J009295
3316G3762323J124048J153898J431902J543936J574401J773182K017065K384510
3308H6765265K659405K621961K992756L285190L414187L821763M118388M428161
$$ y = [94360753, 90330841, 86856905, 83634189, 80806433, 78489001, 76424586, 74948902, 73684631, 72763216, 72148570, 71735572, 71588163, 71578700, 71798200, 72173288, 72785900, 73207353, 73881745, 74656060, 75199108, 75603020, 75983005, 76155770, 76476308, 76580042, 76545133, 76340515, 75978929, 75582556, 75373586, 75048858, 74326729, 73676656, 73171646, 72615963, 72024599, 71598879, 71183980, 70712754, 70196419, 69933672, 69696406, 69520944, 69394121, 69228716, 69174231, 69083783, 69301936, 69556414, 69825866, 70288844, 70831701, 71383439, 71922558, 72753028, 73762323, 74886371, 76040269, 77472171, 79016107, 80590508, 82363690, 84380755, 86765265, 89424670, 92046631, 95039387, 98324577, 101738764, 105560527, 109678915, 114107076]
3300A14107076M640262M910688N150609N271083N321777N414543N296287N121599
3292A55233924M943046M576229M275269L879699L684898L563968L478082L649191
3284A87284306L831747L962757M261596M564118M509896M297231L866004L227799
3276B19805454K273113R93347k24265j539212k573854l271974l980408m251489
3268B07230712m236664l952234l771544l516333l564527l498008l686680m161847
3260A76842875m749571n421786n890127o487881o573128o970233o955891o588383
3252A27205875o636873o062115n420968m955052m601107m431521l821403l350575
3244H7926261k810763k729902k847459k290790k110812j936459j820313j576412
$$ y = [114107076, 118747338, 123658026, 128808635, 134079718, 139401495, 144816038, 150112325, 155233924, 160176970, 164753199, 169028468, 172908167, 176593065, 180157033, 183635115, 187284306, 191116053, 195078810, 199340406, 203904524, 208414420, 212711651, 216577655, 219805454, 222078567, 223071914, 222847649, 221308437, 218734583, 215462609, 211482201, 207230712, 202994048, 199041814, 195270270, 191753937, 188189410, 184691402, 181004722, 176842875, 172093304, 166671518, 160781391, 154293510, 147720382, 140750149, 133794258, 127205875, 120569002, 114506887, 109085919, 104130867, 99529760, 95098239, 91276836, 87926261, 85115498, 82385596, 79538137, 77247347, 75136535, 73200076, 71379763, 69803351]
3236F9803351j406326j221752j307112j147603j002578j061506j026851j026473
3228F0603150p96638q28357q50269r27095j148839j499152j721883j563080j302562
3219D9965275j263968j032506r76871q11542p41577q63670o50757o83225o34545
3210D2306614m43375l66739m13299n56351l26123j39044j48320l01561j47157
3201C9464645j75054k48894k83099o2882k57189o4828J36633j6511j83333j75399
3191C8134089o4857j82998q7128o5224j05343M0968R5323j22260j04030K34979
3181C7773519K14133J59731M60807K47691K52680L26812K47720M14147K54468
3172D0351708L09122J63191l6887K0172m1003j40005k32988J33733N0226R8425
$$ y = [69803351, 68397025, 67175273, 65868161, 64720558, 63717980, 62656474, 61629623, 60603150, 59806512, 58978155, 58127886, 57200791, 56051952, 54552800, 52830917, 51267837, 49965275, 48701307, 47668801, 46691930, 45880388, 45138811, 44275141, 43624384, 42941159, 42306614, 41863239, 41496500, 41083201, 40526850, 40200727, 40061683, 39913363, 39611802, 39464645, 39289591, 39040697, 38757598, 38694716, 38437527, 38372699, 38509332, 38492821, 38309488, 38134089, 38069232, 37886234, 37799106, 37733882, 37628539, 37669507, 37764830, 37642570, 37538540, 37773519, 37987652, 38147383, 38608190, 38855881, 39108561, 39435373, 39683093, 40097240, 40351708, 40660830, 40824021, 40787134, 40807306, 40766303, 40626298, 40393310, 40527043, 40577269, 40675694]
3162D0675694K17561K68354K95425K93287K30982M31708N31877N23678O23849
3153D4092415Q22903P25989P72919P39601R13096J084649J028260J182822J170393
3144E2533047J583117J554149J545819J756604J885867J742167J698977J728402
3136F6028149J598206J638313J604350J525597J450715J387681J317435J269917
3128G7820363J455227J507847J638234J873791J837607K114842K375780K350238
3120I2973929K086917K160229J953977J527256R37842M13441K2661n55800q74155
3111A00646297j341517j719853j668508j685197j949795j638860j637564j676639
3103H7328364j705838j409170j584762k131582k386139k698295k693484k874982
$$ y = [40675694, 40893255, 41161609, 41457034, 41750321, 41981303, 42413011, 42944888, 43468566, 44092415, 44915318, 45641307, 46414226, 47153827, 48066923, 49151572, 50179832, 51362654, 52533047, 54116164, 55670313, 57216132, 58972736, 60858603, 62600770, 64299747, 66028149, 67626355, 69264668, 70869018, 72394615, 73845330, 75233011, 76550446, 77820363, 79275590, 80783437, 82421671, 84295462, 86133069, 88247911, 90623691, 92973929, 95060846, 97221075, 99175052, 100702308, 101640150, 102053591, 102076252, 101520452, 100646297, 99304780, 97584927, 95916419, 94231222, 92281427, 90642567, 89005003, 87328364, 85622526, 84213356, 82628594, 80497012, 78110873, 75412578, 72719094, 69844112]
3095F9844112l042316l412171l043392l018076k762066k529656k500324k303239
3087D7232872k050776j697378j785247j585638j252357j260733j114215j239707
3079C5246821j125774r02271j005712p70903p35736o32658p42922m14304n30930
3070B8385611m47604m37510k74068k60018j18710j77095l22825k36929k01751
3061B5909101j87803j83743j59158l55306l31711j63421k69087l17246k19788
3052B3721838m21066k24321j30144j99057k65494r6473j87099k59475k21704j26009
3042B1590996k35425m57712l76871l78269l73076l62982m39929m56233l98937
3033A8111562l86872k66342j62836l00941k05118k29014j71992k53498p0128r526
$$ y = [69844112, 66801796, 63389625, 60346233, 57328157, 54566091, 52036435, 49536111, 47232872, 45182096, 43484718, 41699471, 40113833, 38861476, 37600743, 36486528, 35246821, 34121047, 33218776, 32213064, 31442161, 30706425, 30073767, 29330845, 28916541, 28385611, 27938007, 27500497, 27226429, 26966411, 26847701, 26670606, 26347781, 26110852, 25909101, 25721298, 25537555, 25378397, 25023091, 24691380, 24527959, 24258872, 23941626, 23721838, 23300772, 23076451, 22946307, 22747250, 22481756, 22385283, 22198184, 21938709, 21717005, 21590996, 21355571, 20897859, 20520988, 20142719, 19769643, 19406661, 18966732, 18510499, 18111562, 17724690, 17458348, 17295512, 16994571, 16789453, 16560439, 16388447, 16134949, 16064821, 16055295]
3023A6055295j44692q2929L5845k06370j39837j79625j16499j44438q0924K1842
3013A5017668j19235j57694J990J2872j70116M4208p8091j64084K1273l0739j96454
3002A4181598P2764J8465L6681L2756Q5990J24339j12152J29815Q8491L661L1004
2991A4693412L8265J10485J39843J03767L6317R5485J81759O3604J51249J66408
2981A5780594P409K44756j02462J44049K21989O011N8271J49692J49628J87761
2971A6847698J27801K99436J66325J27196K97389K10412K15096K35579K38375
2962A8765307K76025L99967L67195K10522K68038L96542L02008L72073M31087
2953B1788764M94751M42040O09612N36848M91566N00528O58995P37861P48775
$$ y = [16055295, 15910603, 15827674, 15863519, 15657149, 15517312, 15337687, 15221188, 15076750, 14995826, 15017668, 14898433, 14740739, 14742729, 14755601, 14585485, 14629693, 14551602, 14387518, 14408791, 14378052, 14181598, 14254362, 14272827, 14309508, 14342264, 14428254, 14552593, 14440441, 14570256, 14658747, 14662408, 14693412, 14731677, 14842162, 14982005, 15085772, 15122089, 15217574, 15399333, 15462937, 15614186, 15780594, 15788003, 16032759, 15930297, 16074346, 16296335, 16302346, 16360617, 16510309, 16659937, 16847698, 16975499, 17274935, 17441260, 17568456, 17865845, 18076257, 18291353, 18526932, 18765307, 19041332, 19441299, 19808494, 20019016, 20287054, 20683596, 20985604, 21357677, 21788764, 22283515, 22725555, 23335167, 23872015, 24363581, 24864109, 25523104, 26260965, 27009740]
2944B7009740P50920M78349N70414P40791P93575O84652P96390Q74343P28759
2935C3427933P57642Q36966R08722R68316J011600J120047J142597J097109J007815
2926D2278747J077856J146933J134588J017411R86857R61908R66962R83579J134417
2917E1689258J050060J161185J428693J455524J711935J763666J750999K056883
2909F4068203K258120K171598K373394K444770K446689K394097K101551J807959
2901H2066381J658801J844875J899751K097911K412137K883206L215364L546886
2893A01625312L734400M083914M435969M627364M932939N007631N451740O048591
2885A39947860O617484P322701Q289928R346684J0206719J1234276J2579432J3979102
$$ y = [27009740, 27760660, 28239009, 28809423, 29550214, 30343789, 31028441, 31824831, 32699174, 33427933, 34185575, 35022541, 35931263, 36899579, 37911179, 39031226, 40173823, 41270932, 42278747, 43356603, 44503536, 45638124, 46655535, 47642392, 48604300, 49571262, 50554841, 51689258, 52739318, 53900503, 55329196, 56784720, 58496655, 60260321, 62011320, 64068203, 66326323, 68497921, 70871315, 73316085, 75762774, 78156871, 80258422, 82066381, 83725182, 85570057, 87469808, 89567719, 91979856, 94863062, 98078426, 101625312, 105359712, 109443626, 113879595, 118506959, 123439898, 128447529, 133899269, 139947860, 146565344, 153888045, 162177973, 171524657, 181731376, 192965652, 205545084, 219524186]
2877B19524186J5310491J7017334J8658026J9873544K0520795J9897033J7770411
2870C48571820J3943189R062751L799792K57445j012899J04589K880094O474242
2862C84081023R814614J1607571J1713726R493444L763670n030119j5582532k4718831
2854C85142566l0319507l1781504l0592182k7783732k4286493k1009223j7903500
2847B01466425j5157023j3066537j1144875r705333q685168p726138p099196o424570
2839A22457585n598046m931644m322690m155958l677891l325509k968908k771646
2831I0705293k597685k536770k559998k205444k348087k331315k409764k599223
2823G1117007k743532k687547k830837k748138k566596k480263k264335k054664
$$ y = [219524186, 234834677, 251852011, 270510037, 290383581, 310904376, 330801409, 348571820, 362515009, 371577760, 375377552, 375634997, 374622098, 374726687, 377606781, 384081023, 393895637, 405503208, 417216934, 426710378, 430474048, 425443929, 409861397, 385142566, 354823059, 323041555, 292449373, 264665641, 240379148, 219369925, 201466425, 186309402, 173242865, 162097990, 152392657, 143707489, 135981351, 128882155, 122457585, 116859539, 111927895, 107605205, 103449247, 99771356, 96445847, 93476939, 90705293, 88107608, 85570838, 83010840, 80805396, 78457309, 76125994, 73716230, 71117007, 68373475, 65685928, 62855091, 60106953, 57540357, 55060094, 52795759, 50741095]
2815E0741095k068481j581811j494874j497871j464048j314678j210006j176813
2807C8932513j245617j282379j350731j095178j043520j375391j195460r89951
2799B9354286j071873r50761r82206r00669j046464q48358o28805n47056p38242
2790B1639852o44373n00851n94053n87807n27050m83901l77669k26673k31389
2781A7466086l29279k76828k2815k37978k09144k04834k47102j98973l24866m01838
2771A5012429o0605j21460l39411j60995k88576k15011j70299j39855k85193k70232
2761A2960792k37274k81805k24196j89604j92165k39814j40336j75034k22298
2752A1058266k04061p9581q6514n8311k35605q0533j34716j65646k8419j24620
$$ y = [50741095, 48672614, 47090803, 45595929, 44098058, 42634010, 41319332, 40109326, 38932513, 37686896, 36404517, 35053786, 33958608, 32915088, 31539697, 30344237, 29354286, 28282413, 27331652, 26349446, 25448777, 24402313, 23553955, 22925150, 22378094, 21639852, 20995479, 20494628, 19900575, 19312768, 18785718, 18301817, 17924148, 17697475, 17466086, 17136807, 16859979, 16837164, 16599186, 16390042, 16185208, 15938106, 15739133, 15414267, 15012429, 14951824, 14830364, 14490953, 14329958, 14041382, 13826371, 13656072, 13516217, 13231024, 12960792, 12723518, 12441713, 12217517, 12027913, 11835748, 11595934, 11455598, 11280564, 11058266, 10854205, 10774624, 10688110, 10629799, 10394194, 10313661, 10178945, 10013299, 9984880, 9860260]
2742I860260k52983o9029j08017j33981j57842j85129M5031Q2173r2639O3769
2732I051613R7130L2618p80p7679L1324O7266j60959K8609j08888k53133j14924
2721H592197j86598k80293k26238j70892p2715o8319j91171j84298k18549j32139
2711F860985J7917k82197j13558k3486k52264j12565l9912N4136j02280j52142
2701E854634j50462j17326R201j27947J7492j9769n1657r0830P4145Q818m6219
2690E360080o608n0740r0221j50164l2181j85787k0405j56142j56610n7475K7144
2679D480891n0837m3633j31799K042m4028l7666j62479j23240j66299j24290l5036
2668C563626P3454K7416m6166l9262M400k3717j75798J37745l9818N5131Q5240
$$ y = [9860260, 9607277, 9538248, 9430231, 9296250, 9138408, 8953279, 8998310, 9080483, 8987844, 9051613, 9148743, 9181361, 9180581, 9102902, 9134226, 9201492, 9040533, 9069142, 8960254, 8707121, 8592197, 8405599, 8125306, 7899068, 7728176, 7655461, 7587142, 7395971, 7211673, 6993124, 6860985, 6878902, 6596705, 6483147, 6459661, 6207397, 6094832, 6054920, 6109056, 6006776, 5854634, 5704172, 5586846, 5596047, 5468100, 5485592, 5465823, 5414166, 5323336, 5397481, 5406299, 5360080, 5353472, 5302732, 5212511, 5062347, 5030166, 4844379, 4823974, 4667832, 4511222, 4453747, 4480891, 4430054, 4386421, 4254622, 4256664, 4212636, 4174970, 4012491, 3889251, 3722952, 3598662, 3563626, 3637080, 3664496, 3618330, 3579068, 3583468, 3559751, 3383953, 3521698, 3481880, 3537011, 3622251]
2657C622251o7888j2085L555n0474j10220N8054J05664n297R2570j71423r9057
2646C365650J41364k4023M9922j87164k7496J75147k42554j17971L0629j54114
2636C009390j63033Q0849n571p4612J13695M4879n2415m4745k2460O5727R9229
2625C050933j0280j85147q9887L9420r4490n3676n4096J18050j2982k160R0689
2614B796374o50K9188j25491m4865J71460m9204L4016p1877J4274q1715l0783
2603B640727J09917k219M1806J7315R4952J0325L3358j01758O6909K555J45784
2592C059671J42058j2551Q4585n6753K6950J28983J09951j43323q1173J31400
2582C389798J6142l2535l3388k0145M5665K8069Q6615J22969n7141k2622m7533
$$ y = [3622251, 3554363, 3542278, 3545833, 3495359, 3385139, 3443193, 3548857, 3543560, 3636130, 3464707, 3365650, 3507014, 3482991, 3532913, 3345749, 3318253, 3493400, 3250846, 3132875, 3163504, 3009390, 2846357, 2927206, 2921635, 2847023, 2960718, 3005597, 2953182, 2908437, 2885977, 2951704, 3050933, 3040653, 2855506, 2765619, 2805039, 2710549, 2656873, 2602777, 2720827, 2707845, 2705685, 2796374, 2795724, 2824912, 2699421, 2654556, 2826016, 2776812, 2810828, 2738951, 2753225, 2671510, 2640727, 2750644, 2748425, 2790231, 2807546, 2902498, 2912823, 2946181, 2844423, 2911332, 2913887, 3059671, 3201729, 3189178, 3273763, 3217010, 3243960, 3372943, 3482894, 3339571, 3258398, 3389798, 3405940, 3373405, 3340017, 3319872, 3365537, 3393606, 3480221, 3603190, 3546049, 3523427, 3475894]
2571C475894K8068n8182k84192l55765j4601j31296j82357n4977j38807J7565
2561B301350j09486j31887n8646m0914r7540o0531J1530m4899l311r5800j11977
2550A557889o8065J094J04751N7741M6698l4267j46215J1504l9093J603n2759
2539A440881n5782M0850M1226J6727p440l2596R4182m9794j48746L4543Q0527
2528A454578j5498n3280L786k4210l3o6523j73109J3982M2845p2361J33890p9815
2516A164252j28709P9516P19q1553o8506j0810L4288m2989o4833l071N2474j2593
2504I18185L9931p5883N9824J5522j21440j08395k5519L86L887M7730J4649M9034
2492H17911L9831k3628o513M2052o5191l5649N7070J43972O402p1745j5414p9973
$$ y = [3475894, 3503962, 3445780, 3161588, 2805823, 2791222, 2659926, 2477569, 2422592, 2283785, 2301350, 2191864, 2059977, 2001331, 1960417, 1862877, 1802346, 1813876, 1768977, 1765666, 1669866, 1557889, 1489824, 1490918, 1595669, 1653410, 1700108, 1665841, 1519626, 1531130, 1492037, 1493640, 1440881, 1385099, 1425949, 1467175, 1483902, 1476462, 1443866, 1538048, 1488254, 1339508, 1374051, 1454578, 1439080, 1385800, 1389586, 1365376, 1365343, 1298820, 1125711, 1139693, 1182538, 1110177, 1244067, 1164252, 1035543, 1115059, 1115778, 1034225, 965719, 954909, 989197, 946208, 881375, 878304, 930778, 918185, 958116, 882233, 942057, 957579, 836139, 727744, 702225, 702611, 706498, 754228, 768877, 817911, 857742, 834114, 827601, 869653, 804462, 768813, 825883, 969855, 976257, 904512, 889098, 809125]
2480H09125o1237m1043Q0913Q0666m0509R0095J5996j34372L7208J06182o6068
2469H76956k6052O2427l3270m7591j12495j1640j07082R7540k9653j8498N4165
2458G04807k5622Q5440q161K6868n469K7938n911n5375j12581M5260k6043j8971
2446F32180M026r4804q7401K62305R8938k9562j08432j27154p043J08089j7944
2435F33198l9397o3485o180K5452j20965o6225J07480J33341j38196p6931K2717
2424D10809n6029J609M7606J5278P5765j80380P9614n4144J463K9472m3916J15775
2412D42922K1465N8582j14247p4762k673j47660M7345O878J4725j62663J86774
2401B76686J40295J9920o0619j39455J2920Q7655O52r731R393P610P7698j13864
$$ y = [809125, 747888, 706845, 787758, 868424, 827915, 918010, 934006, 799634, 836842, 943024, 876956, 850904, 913331, 880061, 832470, 719975, 708335, 601253, 698793, 669140, 650642, 704807, 679185, 764625, 756464, 783332, 777863, 805801, 799890, 744515, 631934, 677194, 651151, 632180, 636206, 541402, 454001, 716306, 815244, 785682, 677250, 550096, 543053, 651142, 633198, 593801, 530316, 524136, 549588, 428623, 362398, 469878, 603219, 465023, 388092, 410809, 354780, 356389, 403995, 419273, 495038, 314658, 394272, 340128, 341591, 371063, 327147, 442922, 464387, 522969, 408722, 333960, 331287, 183627, 230972, 237850, 252575, 89912, 276686, 416981, 436901, 376282, 236827, 249747, 337402, 338054, 328323, 337716, 345326, 423024, 309160]
2389C09160j8754J25614O8872j45949m6331N3256k3666m886L4325j33588J58309
2378C76362Q9063k3735j18043K0335L1854k0936J4164P083m3952K5938q0816J08952
2366C86269l1819n4141J49627J6140p1144J3517J08031n5885m5020o0262K0736
2355C76049Q7359J5949k8294O9313j86388k7688k8347O5855o505n9683q6032L5214
2343B26802P0899l0031J57283j07992J2005j10794m919J20637Q8650k7976k34029
2332A60535Q2363N9327p1060K2537J04229K1981P6825q0655j88327J3097l3985
2321A66867J55263J4275p2810n7772N6442m458k1753j5089n1642L0039R4289M2458
2309C36109j32901l3291L5803l680j1O4675j06042p0377O3234N911M7633R51p2868
$$ y = [309160, 290406, 416020, 484892, 338943, 292612, 345868, 322202, 317316, 351641, 218053, 376362, 465425, 441690, 323647, 343982, 375836, 354900, 369064, 376147, 332195, 358133, 277317, 386269, 354450, 300309, 449936, 466076, 394932, 408449, 516480, 460595, 415575, 355313, 376049, 463408, 479357, 451063, 520376, 333988, 306300, 277953, 343808, 337303, 277620, 191588, 226802, 297701, 267670, 424953, 316961, 328966, 218172, 213253, 333890, 422540, 394564, 160535, 242898, 302225, 231165, 253702, 357931, 379912, 456737, 376082, 187755, 200852, 166867, 322130, 336405, 263595, 205823, 262265, 257807, 236054, 220965, 169323, 199362, 293651, 336109, 203208, 169917, 205720, 202040, 202029, 266704, 160662, 90285, 153519, 159430, 207063, 208014, 135146]
2296A35146K3156N6615m5203n9650P7741J28162o0046l9666l469k05766R5588
2285A02608J40091m5509q3758M6126J41656q3063j22255j4386J61183K3853l4993
2274B31553j01093P7497m1586q0415L2832m1070P3882J26466n562Q872o1235n1297
2262A68844L9214M9451M1460k59663J43963n7339P9187J14828q4675K0840J01452
2251C57562p7019O148J11662k338m0089k114p5582L264J1032k373Q8148j5045
2239C63256l4364K7330M6190O7729k3845k9854j44446o6215K8533l2288R7302
2228B99328r4855M3692M5430Q325O336O0320j0895J0273K4452l1784r251r1183
2216B60188k1554J68176Q2654K0615m9474k4142j27819N2049L1325o1389m6796
$$ y = [135146, 158302, 214917, 169714, 110064, 187805, 315967, 255921, 216255, 212786, 7020, 102608, 242699, 197190, 113432, 159558, 301214, 218151, 95896, 81510, 242693, 266546, 231553, 130460, 207957, 166371, 85956, 118788, 77718, 151600, 278066, 272504, 281376, 220141, 168844, 208058, 257509, 298969, 39306, 183269, 125930, 205117, 319945, 235270, 256110, 357562, 280543, 286691, 398353, 396015, 355926, 353812, 278230, 281494, 292526, 290153, 378301, 363256, 328892, 356222, 402412, 470141, 446296, 416442, 271996, 205781, 234314, 202026, 299328, 204473, 248165, 293595, 301920, 308256, 368576, 357681, 367954, 392406, 360622, 351371, 260188, 238634, 406810, 489464, 510079, 460605, 436463, 308644, 360693, 392018, 330629, 283833]
2205B83833k7875K02066J14431j01867k2539L6174M0833j53082o406J36487J413
2194E03468j51717O2162K7818n3817o0262L783J42849o4994M5421j08532P4022
2183D20201R2252K806j45364j39714J09221N5687k2219M7349R2370j8000j8098
2172D76491Q7235o7664J06741O0561J7369Q1110k4173P9289N9139j31084J5729
2161G60743J3726k6689N3078k0286J21736l389m8255K1663P524J07733R7085Q049
2149A092718j58943J23293J13562q511L1120k6613J7663m3645Q253J03802M43
2138A253142k4181o2914P9969R1650K7363J14006J30848n7084l4673J3954J67072
2127A699152j04508P2538R448M8612K05773k1894K87244M2379Q5415M5022J55875
$$ y = [283833, 255958, 458024, 572455, 470588, 448049, 484223, 525056, 371974, 365568, 502055, 503468, 351751, 413913, 441731, 387914, 327652, 331435, 474284, 409290, 454711, 346179, 420201, 512453, 515259, 369895, 230181, 339402, 395089, 372870, 420219, 512589, 494589, 476491, 563726, 496062, 602803, 663364, 680733, 761843, 737670, 816959, 876098, 745014, 760743, 774469, 747780, 800858, 780572, 902308, 898919, 850664, 872327, 879851, 987584, 1084669, 1092718, 933775, 1057068, 1170630, 1162119, 1193239, 1166626, 1184289, 1140644, 1148897, 1252699, 1253142, 1228961, 1166047, 1246016, 1337666, 1365029, 1479035, 1609883, 1552799, 1518126, 1532080, 1699152, 1594644, 1667182, 1676630, 1725242, 1931015, 1909121, 2196365, 2238744, 2324159, 2369181, 2525056]
2116B525056J12818j29635m8660K22892K50777J25089J62936K77268J70069J26851
2106C795461J98846M42554L61078K90166L78800N68854L71672P49157Q38128R61159
2096H955875J018779J260231J548163K111535K819461M289569L781679L814329
2088B9599621O356940L911473l923376p531321o550275n045414k978138k443759
2080A1395751j782281j389490r93852p08428l98510m36443j08798m3347j58363
2071E376239m79371n31110m47981l02091j35708k33689k21696j94394q2804M381
2061B751776n8758j44831j52499j62023j83286k59121p8953r1464j19319j3307
2051A488215j05826o442J0492p6557j10498k3004L4989j10836p6181k8321J6172
$$ y = [2525056, 2637874, 2508239, 2459579, 2682471, 2933248, 3058337, 3221273, 3498541, 3668610, 3795461, 3994307, 4436861, 4797939, 5088105, 5466905, 6035759, 6407431, 7156588, 7994716, 8955875, 9974654, 11234885, 12783048, 14894583, 17714044, 22003613, 25785292, 29599621, 35956561, 39868034, 35944658, 28413337, 21863062, 16817648, 13839510, 11395751, 9613470, 8223980, 7230128, 6521700, 6123190, 5686747, 5577949, 5534602, 5376239, 4896868, 4365758, 3917777, 3615686, 3479978, 3246289, 3024593, 2830199, 2747395, 2751776, 2693018, 2548187, 2395688, 2233665, 2050379, 1791258, 1712305, 1620841, 1501522, 1488215, 1382389, 1375947, 1386439, 1309882, 1199384, 1176380, 1211369, 1100533, 1024352, 996031, 1012203]
2040A012203K9377j8025j31249K7556m2791j10556n4348n1797j64697j10467J76428
2029E61634K42220j52788j90409L0647j5247n3905n9839M7109q373N8927m0301
2018D19675l7996n3060n5535l1394K1198q9160M7814j1719M2796O6647J22651
2007D41917j13902j06895J24464J01399O0005j43927j29986J74085R8498n9240
1997D46418j27797j55466P2765M3575m241J34367l9041j59348K2745J4073k4702
1986B23348K7312q7730q336J1436k7183l3797n562Q0961J2733l9569K3609J53957
1974C31179k8677j46409o4419R0446j32589J2214J38351j5574r5008J84869J8561
1963B92944j34340K9203J23385n7748m6225q6936n4194K5160Q6758o2112q9265
$$ y = [1012203, 1041580, 1023555, 892306, 919862, 877071, 766515, 712167, 660370, 495673, 385206, 561634, 803854, 651066, 460657, 491304, 476057, 422152, 362313, 409422, 401049, 459976, 419675, 381679, 328619, 273084, 241690, 262888, 173728, 221542, 209823, 252619, 319266, 441917, 328015, 221120, 345584, 446983, 506988, 363061, 233075, 407160, 505658, 446418, 318621, 163155, 235920, 279495, 275254, 409621, 370580, 211232, 233977, 248050, 223348, 250660, 162930, 154594, 166030, 138847, 105050, 99488, 180449, 193182, 153613, 177222, 331179, 302502, 156093, 91674, 182120, 49531, 61745, 200096, 184522, 89514, 274383, 292944, 158604, 187807, 311192, 253444, 207219, 120283, 66089, 91249, 178007, 115895, 26630]
1952B6630K4824m9247N7252P2361o8927P2795M3746J2606j21261J6842N5861p5107
1940F8375K2033R2511N7097j59566j06522M5839M8399Q0004j12126o7522M7303
1929A5825k5259O4108p9694J10753K8396o7915k747L510k2222J19530n1045j3180
1917H0060J5754n7983p9107j8970N3533j927l8320R2178m1479Q5781q4782o2144
1905e7406J51927j1759l698o0259p2115k8623M2955O877l9712R388N227J11361
1893E4163k4402o5268J809n659N2771k28880O8027q518R7893J11202J00779J9325
1881A73242k8759K2841j6977j43968k844k8292L6457P7435K5641l7001j44708
1870f6933P0100O3880j15332m0572k3049J04879j5454K97J07185O681k3190n6604
$$ y = [26630, 51454, 2207, 59459, 131820, 62893, 135688, 179434, 192040, 70779, 87621, 143482, 68375, 90408, 182919, 240016, 80450, -26072, 19767, 68166, 148170, 36044, -31478, 15825, -9434, 54674, -25020, 85733, 114129, 46214, 43467, 46977, 24755, 144285, 93240, 80060, 95814, 37831, -41276, -60246, -6713, -8640, -46960, 45218, 3739, 89520, 4738, -57406, 94521, 82762, 79064, 18805, -53310, -81933, -38978, -32101, -71813, -62425, -57198, 54163, 29761, -35507, -33698, -39357, 13414, -215466, -147439, -155957, -58064, 53138, 153917, 173242, 144483, 167324, 150347, 6379, 3535, -24757, 11700, 89135, 114776, 77775, -66933, 3167, 67047, -48285, -88857, -111906, -7027, -22481, -22184, 85001, 91682, 68492, 11888]
1858A1888j3322L9549J55303j64250K9772j34161L6529j9183J4184j7114J12520
1847E1715k8931k19000J03520N6739j48269K8132N0865m9852J59699j1718r0370
1836i7470j5066o0761Q7285k7502P4487Q6715J76771k2840j69380L5589q9232
1825b1404M4485R2396N0642r6127Q7387l973m7822Q8775q3963n7600L2010k1053
1813F3753j24258M4318J64840L3615o6264j56002K1885Q1271n9745p3423P5952
1802E942J02364k0363M9571j07272j46441K1888K5629n709j06131O9384k3908
1791a35046R6245p919M4596L81P4972j5355j45929r4785r0034O2770L7722N8752
1779a13630J6606q2275J41872p6694L4784P980j5930n9714J9539M5012j07727
$$ y = [11888, -1434, 38115, 193418, 29168, 58940, -75221, -38692, -57875, -43691, -60805, 51715, 22784, -196216, -92696, -35957, -184226, -156094, -105229, -155081, 4618, -7100, -97470, -112536, -173297, -86012, -113514, -39027, 47688, 224459, 201619, 32239, 67828, -21404, 23081, 115477, 166119, 69992, 157379, 153406, 105584, 194359, 110396, 52796, 84806, 63753, -60505, -16187, 148653, 182268, 116004, -39998, -18113, 63158, 3413, -70010, 5942, 108306, 87943, 137514, 30242, -116199, -94311, -68682, -74391, -180522, -111138, -135046, -38801, -46720, -2124, -1743, 73229, 57874, -88055, -182840, -272874, -210104, -172382, -113630, -97024, -179299, -37427, -114121, -79337, -71357, -87287, -147001, -127462, -82450, -190177]
1768a90177l8784L8055K45559k7967J7156L1572M9082j37468k5116j11891n7494
1757b07473R7767J00953K5376o7088p9136K3793Q429M5292n6134p0735J96340
1746A7384O2630J011N127j6263j40986K4890j7944n6489R4265m6424k4827M643
1734i2983L8083j8j21069R249j31241Q9412J61169J18468J0869j43708N2573l2664
1722d1860M2536l0804J0022p4967n0000j4172J21200p8917k3377M1579Q3129l6519
1710e2150j44147r0980J54075P7177j0344K9948n7405p4153K2266P377M454J33923
1698D1K462n7368q0727k0504J50515j1112j03029L8024r2849J5930j5997P1084
1686a03530o4270j02115N5224J30558k0501N7244J22732j93783O1712m4814q3616
$$ y = [-190177, -228961, -190906, 54653, 26686, 43842, 75414, 124496, -12972, -38088, -149979, -207473, -109706, -8753, 16623, -50465, -129601, -105808, -97379, -52087, -108221, -178956, 17384, 80014, 81025, 86152, 69889, -71097, -46207, -64151, -120640, -26375, -72799, -97626, -92983, -54900, -54918, -175987, -166738, -297979, -208567, -47398, 71070, 81939, -61769, -9196, -41860, 676, -30128, -20106, -95073, -145073, -159245, -38045, -116962, -140339, -98760, -15631, -52150, -196297, -287277, -133202, -56025, -66369, -36421, -93826, -167979, -145713, -138336, -133882, 41, 2503, -54865, -135592, -156096, -5581, -16693, -119722, -81698, -174547, -158617, -174614, -103530, -167800, -269915, -214691, -84133, -104634, -47390, 75342, -118441, -56729, -101543, -185159]
1675a85159M5963n6134J03763k2714J6661j05102O7455O2624L8934q6942J4746
1664a05905Q4403j31317O8953O6275j13770J36679o2925O6794Q4103j38789K3793
1653b1706j7755M9968q1531O7645j3138n892p7770N8797J31539j99928p496N278
1641a11989O7307N6084J1174o1210j09252n9567N5510q1543l0005J80520J2535
1630g0436j55430M4383L1709O627J74600j34853n8872j6989K1542n9546k0295
1619b37560N8310J12480M7427o70J5663k9498p774j41883l0986J43989r497l9082
1607a19081r438J1721j1605k5856O2091k7716k5152j9894O7996R7114M4066m2371
1595A875l0506q2988n3591K3527L1308q2868J02349j3513j7754P9722o1734j534
$$ y = [-185159, -139196, -195330, -91567, -114281, -97620, -202722, -135267, -72643, -33709, -120651, -105905, -21502, -152819, -83866, -17591, -131361, 5318, -57607, 9187, 93290, -45499, -21706, -39461, 10507, -71024, -3379, -16517, -22409, -100179, -41382, 90157, -109771, -117267, -111989, -44682, 11402, 22576, -38634, -147886, -207453, -151943, -233486, -263491, -82971, -70436, -225866, -181483, -149774, -143147, 31453, -103400, -162272, -179261, -157719, -217265, -237560, -179250, -66770, -19343, -20013, -4350, -33848, -41622, -183505, -214491, -70502, -79999, -119081, -128519, -116798, -128403, -154259, -92168, -119884, -145036, -164930, -96934, 180, 44246, 1875, -28631, -111619, -165210, -141683, -110375, -193243, -90894, -104407, -122161, -42439, -104173, -105707]
1583a05707J17128n0360K8365m0633k7367Q8694O144o7702K5724L5338o8840n7817
1571a17033j04558J06780M4847P3519j58776o762P6761P6709p4584k6492m0810
1560a50399K2740o0261j65726R5423J61452o3822j13333J6858J62266K0837m8477
1549a22442K7298J12126J3204p4531l2607r1625J38038J1721p7502q0424O0711
1538a16033k7451L6800l5455J4847J9375O8923K3800L3063K5339m8935J4953k5777
1526a6551O3183j12754J26756L9408j87730j93100N1490K26696K5345m6605P6276
1515E2414j50851j21586M9146R684L4935M5330K3269O4734k861l4608P2964M6168
1503H8738j33923L1468j8391L8334K6940m6170L002N414j1079R297j0926N378
$$ y = [-105707, 11421, -38939, -10574, -51207, -78574, 10120, 16264, -51438, -25714, 9624, -59216, -117033, -221591, -114811, -69964, 3555, -155221, -161983, -85222, -8513, -83097, -109589, -150399, -127659, -187920, -353646, -258223, -96771, -160593, -273926, -257068, -94802, -73965, -122442, -95144, 16982, 30186, -44345, -76952, -168577, -30539, -18818, -96320, -176744, -116033, -143484, -106684, -142139, -127292, -107917, -38994, -15194, 17869, 43208, -5727, 9226, -16551, 46632, -66122, 60634, 100042, -87688, -280788, -229298, -2602, 22743, -23862, 52414, -98437, -220023, -170877, -161193, -126258, -80928, -57659, 7075, 4214, -30394, 42570, 88738, -45185, -13717, -32108, 6226, 33166, -13004, -10002, -4588, -15667, -6370, -17296, -11918]
1491a1918q6242m9777j26795P2379J44778j8032J38211j6522j64608Q1142m2722
1480h0106j06548J63427n0133P2818r8566O6322N2428l6624J3886q9929Q85k4189
1468a16329q9031L3822N0435O9454Q0979J07340k1736k10628q6899J5991p0775
1457b37377R0285k1865M9126N629o5755Q4588j31798j1071J80120L7284k7499
1446d8333j21233q1150L2469L3773P5891N9593n9979J1479r4791J88949j7725
1435b1057m2272j03860Q539M7122l0049R4106j67928J94775j7959p8566J18970
1424A821p8027O4698o6303R6909j17941j35398J77821k6401k8724J0521o781M6547
1412f1258k4492k0943l5655P9146J17368p2410q3856N2199R1573j34189j874M2911
$$ y = [-11918, -98160, -147937, -274732, -202353, -57575, -75607, 62604, 46082, -118526, -37384, -80106, -186654, -23227, -73360, -542, -99108, -32786, 19642, -16982, -3096, -93025, -92140, -116329, -205360, -171538, -121103, -51649, 29330, 136670, 114934, -95694, -182593, -166602, -237377, -147092, -168957, -119831, -114202, -179957, -95369, -227167, -238238, -58118, -20834, -48333, -169566, -250716, -218247, -184474, -108583, -48990, -108969, -97490, -192281, -3332, -21057, -63329, -167189, -158650, -111528, -141577, -47471, -215399, -20624, -38583, -117149, 1821, -76206, -11508, -77811, 19098, -98843, -234241, -56420, -82821, -111545, -101024, -107805, -61258, -85750, -106693, -142348, -63202, 54166, -18244, -102100, -49901, 41672, -92517, -94391, -51480]
1400e1480m7630j7839J6097o5415j4408Q3806J20168j77994J33678k5477r9074
1389a45568l1172J73879p0466J3599N6601j87497M6101p682q1k6602J27894l119
1377e4113r0052K2598P5815n2287O4403O4572m4778q9356q5687N2498o982j4849
1365a58218N6207m239K2814j89531J09354o4474J7978J41012q1872O5547P5333
1354a0089J6310j18018K8794L6195n211j05943j0786L1463R4699n6147j17295
1343b16028J5940L6883p2600M7804P4318P341J55895q7409p0468J2982r1713m6244
1331b33299j5329J12591j6908k7747O937J53339q318J7868k2131m6189j3131K2204
1319g0113N2111J02411j8560j6152O3999j79337O1331L4177o3262m9493j2663
$$ y = [-51480, -99110, -116949, -100852, -166267, -180675, -96869, 23299, -154695, -21017, -46494, -145568, -176740, -2861, -73327, -59728, -3127, -190624, -144523, -152205, -152286, -178888, -50994, -54113, -144165, -121567, -45752, -98039, -33636, 30936, -13842, -103198, -188885, -136387, -143369, -158218, -102011, -106250, -83436, -272967, -163613, -228087, -210109, -69097, -150969, -85422, -10089, 6221, -111797, -83003, -46808, -52019, -157962, -168748, -137285, -42586, -98733, -216028, -200088, -163205, -235805, -188001, -113683, -106342, 49553, -37856, -108324, -95342, -187055, -233299, -248628, -136037, -152945, -180692, -173755, -20416, -28734, -10866, -32997, -79186, -92317, -70113, -18002, 84409, 65849, 49697, 113696, -65641, -4310, 29867, -33395, -82888, -95551]
1308i5551J4781m2462j33769L1108J50758j5536J66250j16438j54272J6272J1088
1297a67771R0791o1232M3072N8278j30600K6895R41N2874j560o1236L8243N6962
1285e4343P3882M9042O1552m9670k5211j35587O5310j80858k6212K14946j23477
1274a30626n1411q1357q2O8527l3P7605J114K8506o9775l4314Q4848L5560n7866
1261a29304J24073N52J6654M367j22710j3571R943r149P6998o7633l6057r1317
1249b37154j18566N4642o726J46850m605R8454j4884j33583R6703m2906O1879
1238i9896O4446j26522L7843J6533j4427k3879k9924J14966p4534j59312P5193
1227b19513m7584J15067n786q9282N1241P8261N2851Q59n3390m922j5515p7212
$$ y = [-95551, -80770, -123232, -257001, -225893, -75135, -90671, 75579, -40859, -195131, -178859, -167771, -76980, -138212, -95140, -36862, -167462, -140567, -139626, -86752, -88312, -149548, -111305, -54343, 19539, 68581, 130133, 80463, 55252, -80335, -15025, -195883, -222095, -7149, -130626, -182037, -263394, -263476, -194949, -194982, -117377, -116263, -87757, -157532, -191846, -106998, -71438, -129304, -5231, -4679, 11975, 16342, -106368, -119939, -109996, -119145, -42147, -109780, -145837, -237154, -355720, -301078, -307804, -160954, -165559, -67105, -81989, -215572, -118869, -161775, -99896, -35450, -161972, -124129, -107596, -122023, -145902, -175826, -60860, -135394, -294706, -219513, -267097, -152030, -157816, -247098, -195857, -117596, -64745, -63886, -117276, -122198, -137713, -214925]
1215b14925Q6334j44467p1019K10213J49417j39652M0304k0166o4968p13J09693
1204e9949o088p3116O226k4870P4614K08431n779j58710r3628L4402k8233O5370
1192f1330p2831L5364O0539L9767j41816J80939j43372o554k5535j31479Q2226
1181a84082j79199K29084j04489J7144Q0191O535o6170O8914L0730j27555k03286
1170d32183J08319J74994q7775J7104l7137J2128K0495O7503L319r4959R4162
1159a54030K3410O8124J2600j01067N6168R599k23665N7062N5722n272k7926J13471
1147a15804N0600m3733j03062K7412J8259J8876M3158O6244j96324K1720M238
1136b08416J6021P2674L9427m0744n4801k5491j2403J19720L1134l3337m3412
$$ y = [-214925, -128591, -273058, -344077, -133864, 15553, -124099, -83795, -103961, -168929, -169642, -59949, -66037, -139153, -132927, -157797, -83183, 125248, 119469, -39241, -132869, -98467, -126700, -61330, -134161, -98797, -38258, 1509, -140307, 40632, -102740, -109294, -134829, -266308, -184082, -363281, -134197, -238686, -221542, -141351, -134816, -200986, -132072, -101342, -228897, -432183, -323864, -148870, -236645, -219541, -256678, -244550, -224055, -156552, -153233, -248192, -154030, -130620, -62496, -49896, -150963, -94795, -85196, -308861, -251799, -196077, -201349, -229275, -115804, -65204, -108937, -211999, -184587, -166328, -147452, -104294, -38050, -234374, -212654, -208416, -192395, -119721, -80294, -121038, -175839, -201330, -213733, -94013, -62879, -96216, -139628]
1125a39628J6l8084l5878R0612k4696J39233p3639n6773j43516q85M0254p7170
1113c20154J55404L8819K1667N3335l1074j2948R3665j23574l168m2993n6984
1102b28005N4185k4159m5270K7409j12874J18311L1466P148M2233J62632L8562
1091G1638j20421j25540r3276M6040L3589o5187K6698J04950O5503o9617Q5420
1080d0203j0662n320n0673Q042q183j7573r410J474J2439Q4902j05147M790R638
1067a25886l2896M367P5693K10772j26902l0001l5336n9184P9315p5067J3677
1056a01448J12840O3499r8285j18366P1675j6408r0862p986k52Q5000p462L4714
1044g3341J67404k5344o4345q9446k4854P096n7861P0994J27955J4257p4812j38571
$$ y = [-139628, -139612, -177696, -213574, -122962, -147658, -8425, -82064, -138837, -282353, -283238, -242984, -320154, -164750, -125931, -104264, -50929, -82003, -94951, -1286, -124860, -128028, -171021, -228005, -173820, -197979, -243249, -215840, -328714, -210403, -178937, -171789, -129556, 33076, 71638, -48783, -174323, -267599, -221559, -187970, -253157, -226459, -121509, -56006, -125623, -40203, -50865, -56185, -106858, -98816, -106999, -124572, -133982, -132508, -120069, -35167, -140314, -135524, -125886, -158782, -154415, -78722, 132050, 5148, -24853, -60189, -119373, -40058, -115125, -101448, 11392, 74891, -23394, -141760, -70085, -86493, -177355, -185341, -185593, -100593, -108055, -73341, 94063, 68719, 4374, -85072, -109926, -102830, -160691, -89697, 38258, 52515, -22297, -160868]
1032a60868K8724N289r0628J0778J4169r2687J33679n5791r7476J41798M7808
1021a15205N3231K434N0361k909N2529j44836j80308Q5540L0381N8798j04101
1010b14085p9259J26209J24899n0074r8523j67793j9846R6416O4213j2227Q316
999b21754P0787Q6417k541j48759k5651J20649J8029M6619o600j88156k5873J8156
987b58677R5032O0066J3128J34691p1595N2062o83j0559q4235P448l3783q851
975a05956P4427k7265o0390r313J3819K1180M6381j05666l1970o851J014r2891
963b83481J11355j50376n7961J77396J39014m0355n5898J28382m255p7185k6291
952a39655O322N3300o6853j00259K3613N7370k5398L6985M212r122J2151P5843
$$ y = [-160868, -132144, -126855, -217483, -206705, -192536, -285223, -151544, -207335, -304811, -163013, -115205, -61974, -59540, -9179, -12088, 40441, -104395, -284703, -199163, -168782, -109984, -214085, -293344, -167135, -42236, -92310, -190833, -358626, -378472, -282056, -217843, -230070, -221754, -150967, -64550, -67091, -215850, -241501, -120852, -102823, -56204, -62804, -250960, -276833, -258677, -163645, -103579, -90451, 44240, -27355, 24707, 24024, 13465, -70770, -63322, -97105, -105956, -31529, -58794, -119184, -128497, -114678, -93498, -47117, -152783, -184753, -191604, -190590, -283481, -172126, -322502, -380463, -203067, -64053, -104408, -160306, -31924, -36179, -113364, -139655, -133333, -80033, -146886, -247145, -223532, -166162, -191560, -154575, -150363, -159485, -147334, -71491]
940g1491j40614r9704N5562n6351L1931l53J17405r6137R010K0939o527P4019
928a62311O7596n8592l725J02709j10743q2883R0192L189M9819N1563K4483p6296
916a04999l8313K7100L4817k1595j4243M7433n6807O469p4130N2096O7594k7014
904a01592n0272J8698k2792m4700j8165J13580J38210L2523j80827n0843J03997
893f2183q0749j0661Q680P1132O9274J7630r5645n5499J1271k9486J10349p4335
881a20222j7296n8110j194n429L8246J81601j07949l1188R9286L5386m21r1j9380
868f761m4349j12625l6669K4266R1259q0273m2948R7748L7912l1439K5871N94
856g7414n5528J5742K8497K1452m3884J36703J9498k34316n3295N2266J50501
$$ y = [-71491, -212105, -311809, -256247, -312598, -280667, -281020, -163615, -259752, -250742, -229803, -236330, -162311, -94715, -153307, -157032, -54323, -165066, -247949, -157757, -154568, -104749, -53186, -28703, -104999, -143312, -116212, -81395, -102990, -117233, -69800, -126607, -120138, -194268, -142172, -74578, -101592, -151864, -133166, -155958, -200658, -218823, -105243, 32967, 65490, -115337, -166180, -62183, -142932, -153593, -144913, -73781, -4507, 13123, -82522, -138021, -126750, -156236, -45887, -120222, -137518, -195628, -196822, -202251, -164005, 17596, -90353, -121541, -22255, 13131, 12710, 12619, -6761, -51110, -163735, -200404, -176138, -84879, -165152, -208100, -110352, -72440, -103879, -78008, -77414, -132942, -117200, -88703, -67251, -111135, 25568, 45066, -189250, -242545, -190279, -39778]
845c9778j34008K8872K3861p7025P2097j28827K935M8536M4650K7571Q2233L4642
833a4241r6267j0328p1552L6217L7773m2722j30235O9499K7296m828L1987R8203
821f9198K5369P2674j3005p4329O5280o4087k2183R201o1280q2919J05383o0827
809a69921o3428n0554M2776J3108P5903O2879O2971j73201l6792O3727l8109p6685
797b87326R7877K35533M328o2939j733j10692j03387Q9747L6937K7799N7815K0261
785D220J6051j30151N4563q2110j77403l7658O2004J67778j59626n0369K56028
774g6673N1062m1330q3292o9452M7239J6184k8106j4075L7116n3506L4643l6803
762b16993R479J25532L3258R3069j30284j15037N3839K9298O1072m2334P062j05499
$$ y = [-39778, -173786, -144914, -121053, -198078, -125981, -254808, -251873, -203337, -158687, -131116, -48883, -14241, -110508, -120836, -192388, -156171, -118398, -161120, -291355, -221856, -194560, -199388, -167401, -69198, -43829, 28845, 15840, -58489, 6791, -57296, -79479, -70278, -131558, -214477, -109094, -169921, -233349, -283903, -241127, -228019, -152116, -89237, -26266, -199467, -236259, -172532, -210641, -287326, -189449, 46084, 50412, -12527, -14260, -124952, -228339, -138592, -101655, -73856, -16041, 4220, 20271, -109880, -55317, -137427, -314830, -352488, -290484, -122706, -282332, -332701, -76673, -25611, -66941, -150233, -219685, -172446, -156262, -184368, -198443, -161327, -214833, -180190, -216993, -207514, -81982, -48724, 44345, -85939, -200976, -147137, -117839, -56767, -99101, -92039, -197538]
750a97538O6244J09497K4539j04884p2669L4724J18960j1238p0666O6535j28225
739a64721J7338k7947L325M4332p2064rn4365k1658J08085N9704r8016Q4763J62784
726D1551q7270q7089m9534m9795P3459p96n487Q6691m8910j1817k8674K2761r493
713a54403Q388J6873q548Q78P6235j44328l464M1470j13376J51854R481l0489
701a49429j9521M4407M1974J6095j14682k7187J06617O7640o2347j86166J23965
690a58634J62668j28788J50151Q419R7523q9171k07933K3963K2220J37578m8866
679c0870o2896p0415n7927M7201k6487M7356K3451l3240n2250M7267o5916J983
667b32743J01959N0356L6127O9254p4695j49708P3363K9712j7274Q9845r647L4539
$$ y = [-197538, -131294, -21797, 2742, -102142, -174811, -140087, -21127, -32365, -103031, -36496, -164721, -147383, -175330, -172005, -127673, -199737, -199746, -254111, -275769, -167684, -107980, -205996, -121233, 41551, -45719, -132808, -182342, -232137, -158678, -159474, -164961, -78270, -127180, -138997, -167671, -144910, -154403, -146015, -129142, -137690, -136812, -60577, -204905, -208369, -166899, -280275, -128421, -118940, -149429, -168950, -124543, -82569, -66474, -181156, -208343, -101726, -34086, -96433, -282599, -158634, 4034, -124754, 25397, 33816, 131339, 42168, -165765, -141802, -119582, 17996, -30870, -93766, -164181, -222108, -174907, -201394, -154038, -130587, -163827, -216077, -168810, -234726, -232743, -130784, -80428, -44301, 24953, -49742, -199450, -126087, -96375, -113649, -23804, -33451, 1088]
655A088o7368j09195N8828K4420m7979L394J23777k00061m1093J00748l3233q8548
643b75222L2645M5907J38931M3919J30128j13782j59809P1046J68019j67791j66443
632b52452N3890J06982p0627j31169J96552Q2656j66196o462J9460r0967J04393
621a53940M3051P174n3136n2622m2230J2503m1853J47189J8644p6597K4448K9070
609a38299J31116j00489k8010N3639r5990l8409Q8409l2942m2109n7747n691Q6710
597a79812M2449J9736j32904J02731o6682O8360O2064N5785j44673m7245K0626
586a99565n5381K7040L7906J57730j1973o0487n5561N0832n4907Q7028R2986j00871
574h5223j8915l0148J65141j34184j27648J38688J00661j14892p1525K0332K5248
$$ y = [1088, -66280, -175475, -116647, -92227, -140206, -136812, -13035, -213096, -254189, -153441, -186674, -275222, -242577, -196670, -57739, -13820, 116308, 2526, -157283, -86237, 81782, -86009, -252452, -198562, -91580, -162207, -293376, -96824, -14168, -180364, -186826, -167366, -258333, -153940, -110889, -103715, -156851, -209473, -251703, -239200, -281053, -133864, -115220, -191817, -167369, -138299, -7183, -107672, -135682, -82043, -178033, -216442, -128033, -160975, -203084, -260831, -266522, -179812, -137363, -117627, -250531, -147800, -214482, -146122, -84058, -28273, -172946, -220191, -199565, -254946, -227906, -190000, -32270, -44243, -104730, -160291, -109459, -164366, -77338, 15648, -85223, -104138, -134286, 30855, -103329, -230977, -92289, 8372, -106520, -178045, -157713, -132465]
563a32465M1333o6244Q8559k0079K066l1769P72L0913m0588o5605j13273J21543
551a84837P2254p0371J13110m9876q9238p8371p567J07793Q8740J0959m4739n9468
539a91611M9305m1169n619P2579J1401k0748P4648l1653r769k28920J59426K6329
527a35801K792l5822q8503Q3451M7738m2661Q7578O9862k7746k6264K5769L5086
515d521j12718M1673J00622l1173o8006K0990o983j19423K8450P2868n1889j3180
503a43290p0289J08800j40522J10646k5718o6597j7855p2691K5683k250J01322
492a92761M3039k6930N4466K11573r8726o205k8355p3406m1555p8800J37885n5592
480a55367m9459L8765P8351j50270n9607R0626R7344m9721o7230J2374l7165l3335
$$ y = [-132465, -91132, -157376, -68817, -88896, -86830, -118599, -117827, -86914, -127502, -193107, -306380, -184837, -112583, -182954, -69844, -119720, -208958, -287329, -294896, -187103, -98363, -87404, -132143, -191611, -142306, -183475, -189094, -116515, -105114, -125862, -51214, -82867, -92636, -321556, -162130, -135801, -133009, -168831, -257334, -173883, -126145, -168806, -81228, -11366, -39112, -65376, -39607, -4521, -117239, -75566, 25056, -6117, -74123, -53133, -60116, -179539, -151089, -78221, -130110, -143290, -213579, -104779, -245301, -134655, -160373, -226970, -244825, -317516, -291833, -294083, -192761, -149722, -176652, -122186, 89387, -9339, -15544, -43899, -117305, -158860, -237660, -99775, -155367, -204826, -166061, -87710, -237980, -297587, -206961, -109617, -159338, -226568, -214194, -251359, -284694]
468b84694o1969O9657J86603k5292J8820M8650N7683k5700n8864k1982n2168j6015
456a65271k344j8263l9141J51817q1271J0562M4809m0226J32207K8376p0746k00185
444b49676N1875N6233J13658o5838p5098J13170n221j80782n5166J33512N5754
433a07579m8932N1166R4168L8805j0324N2166o9729j36989Q3247M5054j02810
422a11757J29430n5430p4536r2638k3192J13877L1157M9682L8642K0734J2011
411C7980m0164p1750j51659L5401P4868k2173R7049m8334j53432k7870L6111J00368
399a33605N5829l7309n8722N0732N6393j07576O3559j49406L5365O8805m423k6674
387a87032L7045J03342j42906K2070J07498j39882K4127M22M8632M0170k3420
$$ y = [-284694, -346663, -277006, -90403, -115695, -96875, -48225, 9458, -16242, -75106, -97088, -149256, -165271, -167615, -185878, -225019, -73202, -154473, -143911, -99102, -139328, -7121, 21255, -49491, -249676, -197801, -141568, -27910, -93748, -168846, -55676, -60897, -241679, -296845, -163333, -107579, -156511, -105345, -11177, 27628, 17304, 69470, -259, -137248, -54001, -8947, -111757, 17673, -37757, -112293, -204931, -228123, -114246, -83089, -33407, 5235, 25969, 37980, -2184, -73934, -225593, -190192, -115324, -137497, -40448, -88782, -242214, -270084, -233973, -133605, -77776, -115085, -173807, -123075, -66682, -174258, -110699, -260105, -224740, -155935, -160358, -187032, -149987, -46645, -189551, -167481, -59983, -199865, -175738, -175316, -126684, -86514, -109934]
376a09934j4916P531j33470M7977J02279Q2596j35706j2994J3998r1264j00638
365c44541K5305J13812k9689L7115q738K6494M2311L6693l5206O6290q5652J6141
353a39665M5938n8371J2012j93710j141J01994m8919j8618J76655o8546Q6617
342a05754L7861J11759j22945J4627J9308l1739j90140J31750P0805j34733M7236
331a51965O2180R8761k7554o2088j7865k203j69519M6686J29727k2318j64128
320b80286J6350L5018R8547q8219M8341J15145o5580J8247p4747n4330J20711
309a10803l6980L3508R690o2839j03260N9320j1050M7384k6804N7361J5143Q1564
297d7766K3174j34155L0058R0688Q7391l3873n6628k670r4684M9178N3894j4040
$$ y = [-109934, -124850, -117319, -250789, -202812, -100533, -17937, -153643, -166637, -152639, -243903, -344541, -319236, -205424, -235113, -197998, -206736, -180242, -137931, -101238, -136444, -70154, -155806, -139665, -93727, -152098, -140086, -333796, -334937, -232943, -281862, -300480, -123825, -192371, -105754, -67893, 43866, -79079, -64452, -45144, -76883, -267023, -135273, -64468, -199201, -151965, -89785, 8976, -18578, -80666, -98531, -100734, -270253, -223567, -93840, -116158, -280286, -263936, -228918, -130371, -218590, -170249, -55104, -120684, -102437, -177184, -231514, -110803, -147783, -114275, -104585, -167424, -270684, -211364, -222414, -175030, -201834, -144473, -129330, -47766, -24592, -158747, -128689, -38001, 49390, 15517, -41111, -43781, -138465, -89287, -35393, -49433]
285d9433k5497j16170l3542P0679n7205J1959m8154j2835N3601L6812K7767r318
273a51336j1322N4004j9381m8326j32190R7274Q2893j4499k9517K9581l9796K3442
261a59173J02275P4453p0987j18689J17404j03098l6563l2938j36818O2126P1757
250b30251k4368O7126o2861k503J80273O5149j02721L0162j36364P2495Q5505
239e8358j62996l0798M1113M2245K4939J6871p7211j34516J17391N0195j890o5861
227b38876j06824J36346K2715k596q8677j2845P3772O1335O6740m9017m4003l9741
215b21671k3607J36499l9583o7150P0200Q999n4215j39377k3597N6748J31297
204a65457J23365l1884l9884p3585l7368K7483o9492Q6354J1683m6441m8162q7236
$$ y = [-49433, -74930, -191100, -224642, -153963, -211168, -199209, -247363, -260198, -206597, -169785, -142018, -151336, -162658, -108654, -128035, -176361, -308551, -211277, -128384, -142883, -172400, -142819, -182615, -159173, -56898, 17555, -53432, -172121, -54717, -157815, -194378, -227316, -364134, -302008, -230251, -254619, -187493, -250354, -252857, -72584, -7435, -110156, -79994, -216358, -143863, -58358, -221354, -252152, -211039, -168794, -143855, -126984, -204195, -338711, -221320, -171125, -173015, -238876, -345700, -209354, -186639, -189235, -277912, -290757, -216985, -155650, -88910, -137927, -181930, -221671, -245278, -108779, -148362, -215512, -145312, -136313, -190528, -329905, -353502, -296754, -165457, -42092, -73976, -113860, -187445, -224813, -197330, -266822, -180468, -168785, -215226, -263388, -350624]
192c50624Q8547l647l8256j3681N5928o6819m6814J30216P4138M461o4378J21857
180a09072j1861k7275o452n4489P6462o1543k7244j17076Q2243M8926K3613L3347
168a50421m5743M103k2814M3038j40290Q976J3711Q9400p9579j5494N4870j08579
156c48822M7155N4049l6623J25388o3837m3098M4890J21168m9200j7667o3324
145b29921M6601l3718j9472L0805j73980o8262P9569J2288Q108R9905J2368O6811
133a68898o6345M116m2881n8634k4670K6106l229K4767k303p4951J23384j21092
121c84630j49216J06537J71355j12106K603n0104K4521K9705k9251J8403P5876
110b96307k1327l2099J33195m312L6218m9114j09265p8952O9721M9828n0475M5116
$$ y = [-350624, -262077, -265724, -303980, -317661, -261733, -328552, -375366, -245150, -171012, -166551, -230929, -109072, -120933, -148208, -154660, -209149, -132687, -194230, -221474, -338550, -256307, -207381, -183768, -150421, -196164, -192061, -214875, -171837, -312127, -303151, -289440, -200040, -279619, -295113, -240243, -348822, -301667, -247618, -284241, -158853, -222690, -265788, -220898, -99730, -148930, -166597, -229921, -183320, -217038, -236510, -205705, -379685, -447947, -368378, -356090, -347982, -248077, -235709, -168898, -235243, -231127, -274008, -332642, -357312, -331206, -334435, -309668, -311971, -386922, -263538, -384630, -533846, -427309, -255954, -368060, -365457, -415561, -391040, -361335, -390586, -372183, -296307, -317634, -349733, -216538, -220850, -184632, -233746, -343011, -421963, -352242, -302414, -352889, -307773]
98c07773p4212J37880q1382j89889O5824j31899J53313P382O7411k9591q271l0871
86d22078L2795l7066j1373M3909L8261m190P5874p4191n4869M5197L217J3587
74c50927n9163M4408K3371o1654Q1226j12643M1485o5341p0979k6785O2721O5284
62d28997p902r792m3299j5271l8504M4058N6707o9381m3305L4644l4042L9992
50e15092N6788q7173k9951J24366m0314m3143Q129j6173m6760O4231N6004p0440
38e39528L7257m6336l1260P5585J487j4613l031N150l2698Q771o4677n5196O6748
25e92341N3559m9709m0026q9656L466N5603L5824k6548o7940l4440J35541J4909
13f01758M0472o7715m7183j3980k2739m6830O7886M0577p7840L8334P0023J7549
$$ y = [-307773, -381985, -244105, -325487, -515376, -449552, -581451, -428138, -420756, -353345, -382936, -391207, -422078, -389283, -426349, -437722, -393813, -355552, -359742, -283868, -358059, -412928, -367731, -364514, -350927, -410090, -365682, -342311, -403965, -322739, -435382, -393897, -459238, -530217, -557002, -494281, -428997, -436899, -446691, -489990, -505261, -543765, -499707, -443000, -512381, -555686, -521042, -555084, -515092, -458304, -545477, -575428, -451062, -491376, -534519, -526390, -542563, -589323, -525092, -469088, -539528, -502271, -548607, -579867, -504282, -502795, -517408, -520439, -515289, -547987, -539216, -603893, -659089, -592341, -538782, -588491, -628517, -718173, -714707, -659104, -623280, -649828, -717768, -752208, -616667, -601758, -561286, -629001, -676184, -690164, -712903, -759733, -691847, -651270, -729110, -690776, -620753, -603204]
1f03204l2085
0f35289
$$ y = [-603204, -635289]
$$ Imaginary data points
##PAGE= N=2
##DATA TABLE= (X++(I..I)), XYDATA
16383c057623m3757Q1637N6367J42142L4577k7083K9881K4921M9041J15168O608
16372b588121J42804J49770O7j5861l2495J7740p2268J80231M8884L1192l2494
16361b170551M1577L7153O327J07672P8988Q4378J06874L7516L7922n9728Q5590
16350a606282Q95J954L7736L6667J74372J10416m0696j2611J63642L1684o0132
16339a162355l5770J27936J6071K2139J07428l5473P0113R6952k5022L0181K3714
16328g64086R7209M7678n5939N5546J42103J1781n1021P8129n132n4141J01060
16317c96813J30634P6896L6212k3872L3382P5058L5488M4075L5934J87619j5815
16306B18798j8629O1982o6664n8513J61588R1032J713K3k2320K5785j3772J9200
$$ y = [-3057623, -3101380, -3019743, -2963376, -2821234, -2786657, -2813740, -2783859, -2758938, -2709897, -2594729, -2588121, -2445317, -2295547, -2295480, -2311341, -2343836, -2326096, -2398364, -2218133, -2169249, -2138057, -2170551, -2128974, -2091821, -2085494, -1977822, -1898834, -1814456, -1707582, -1670066, -1632144, -1691872, -1606282, -1605387, -1603433, -1565697, -1529030, -1354658, -1244242, -1284938, -1297549, -1133907, -1102223, -1162355, -1198125, -1070189, -1054118, -1031979, -924551, -960024, -889911, -792959, -817981, -787800, -764086, -666877, -619199, -675138, -619592, -477489, -465708, -516729, -438600, -443732, -497873, -396813, -266179, -189283, -153071, -176943, -143561, -68503, -33015, 11060, 46994, 234613, 218798, 200169, 262151, 195487, 136974, 298562, 389594, 391307, 391330, 369010, 394795, 381023, 400223]
16294D00223J08301M3676L5913j0065J28322J0568j737K7173J6819M4780l660
16283H00313N7689K4615N2401l3676M8733M6638J29143j4730j24558P8788j632
16272A063724O6460J93558J9299l183Q440J9313j11079j6431O8580J21857J3788
16261A444326J6006P3782J3297R9201k4742j04201J24273O9528P1317k1563M5501
16250A806725K389j6086M7432L580L9308O1842j5040J6044j4129N4480R1881J47838
16238B226264j04427N4387J19939o7519J7092l8655m2527N1331L4474M891N0341
16227B305591P6713J17661o7964j27577n789M6877Q2114k1910o0766J09395M4251
16216B498596j77933M9759J43770M891l4319J20354J65975j54563L7726J7122
$$ y = [400223, 508524, 552200, 588113, 578048, 706370, 716938, 715201, 742374, 759193, 803973, 800313, 858002, 882617, 935018, 901342, 950075, 996713, 1125856, 1111126, 986568, 1065356, 1063724, 1130184, 1323742, 1343041, 1339858, 1348298, 1367611, 1256532, 1240101, 1308681, 1430538, 1444326, 1460332, 1534114, 1547411, 1646612, 1621870, 1517669, 1641942, 1711470, 1782787, 1761224, 1806725, 1809114, 1793028, 1840460, 1844040, 1883348, 1945190, 1930150, 1946194, 1932065, 1986545, 2078426, 2226264, 2121837, 2176224, 2296163, 2228644, 2245736, 2207081, 2164554, 2215885, 2250359, 2255250, 2305591, 2382304, 2499965, 2432001, 2304424, 2298635, 2345512, 2427626, 2405716, 2344950, 2454345, 2498596, 2320663, 2370422, 2514192, 2519083, 2484764, 2605118, 2771093, 2616530, 2654256, 2671378]
16206B671378k6916k9537p53J42619K0927M7812j06873N3697K8034j18255J48511
16195B830644n8953M8578p5369K8990J36983P9950n9980N59P3734n2130j8452
16184B934554J6373P0047P1240r4613K5870o6303N1673p6349O5802j9473Q7831
16173C066652J51791K9148j27671L4255p8648P6498J48072o2649p4976O5342L0707
16162C258521j6699J9529j77138K28868K388J09811j9134p1481k64L1215M7568
16151C413184o169m0652L7527j7056k4203O1668K850j14726O4582m795O9983N1219
16139C493412m8787j94L2076J6205o8507O3390O7068o8967O6850J20706j08264
16128C564988r7047K9817P0598l5531n5343o1308J4326J62823K1713l1854k707
$$ y = [2671378, 2644462, 2614925, 2614172, 2756791, 2777718, 2825530, 2718657, 2772354, 2800388, 2682133, 2830644, 2771691, 2820269, 2744900, 2773890, 2910873, 2990823, 2930843, 2931402, 3005136, 2953006, 2934554, 2950927, 3020974, 3092214, 2997601, 3023471, 2957168, 3008841, 2932492, 2998294, 2978821, 3066652, 3218443, 3247591, 3119920, 3154175, 3075527, 3152025, 3300097, 3237448, 3162472, 3227814, 3258521, 3241822, 3261351, 3084213, 3313081, 3315469, 3425280, 3406146, 3334665, 3334401, 3365616, 3413184, 3407015, 3366363, 3403890, 3386834, 3362631, 3424299, 3427149, 3312423, 3377005, 3372210, 3442193, 3493412, 3444625, 3444431, 3476507, 3492712, 3424205, 3487595, 3554663, 3485696, 3552546, 3673252, 3564988, 3467941, 3497758, 3568356, 3532825, 3477482, 3416174, 3430500, 3593323, 3615036, 3583182, 3580475]
16117C580475k2311j5628R2532J8292j25001J04433j39095j2830J0460p490J94286
16106C678123p7119L6095j2231L2489R1803j11085n0271J09371J66j8024J2017
16095C691334k9697n1023O0572o1956p9840J3324m6688L8300L4593k370O558J07710
$$ y = [3580475, 3558164, 3542536, 3635068, 3653360, 3528359, 3632792, 3493697, 3480867, 3491327, 3483837, 3678123, 3601004, 3637099, 3624868, 3657357, 3749160, 3638075, 3587804, 3697175, 3697341, 3679317, 3691334, 3661637, 3610614, 3671186, 3609230, 3529390, 3542714, 3496026, 3534326, 3568919, 3566549, 3573107, 3680817]
$$ [...]
##END NTUPLES=NMR SPECTRUM
##END=
