##TITLE=1H_TG-2307-Ia3
 CDCl3
 8 sc, 
 7.7.2023
##JCAMPDX= 6.0         $$ Bruker NMR JCAMP-DX V2.0
##DATA TYPE= NMR SPECTRUM
##DATA CLASS= NTUPLES
##ORIGIN= UXNMR, Bruker Analytische Messtechnik GmbH
##OWNER= root
$$ XWIN-NMR		Version 3.5
$$ Fri Jul  7 13:58:20 2023 Russian Standard Time (UT+4h)  she@DPX200
##.OBSERVE FREQUENCY= 200.13135
##.OBSERVE NUCLEUS= ^1H
##.ACQUISITION MODE= SIMULTANEOUS
##.ACQUISITION SCHEME= undefined
##.AVERAGES= 8
##.DIGITISER RES= 18
##SPECTROMETER/DATA SYSTEM= spect
##.PULSE SEQUENCE= zg30
##.SOLVENT NAME= CDCl3
##.SHIFT REFERENCE= (INTERNAL, CDCl3, 0, 15.7436)
##AUDIT TRAIL= $$ (NUMBER, WHEN, WHO, WHERE, WHAT)
$$ ##TITLE= Audit trail, XWIN-NMR		Version 3.5
$$ ##JCAMPDX= 5.01
$$ ##ORIGIN= Bruker BioSpin GmbH
$$ ##OWNER= she
$$ F:/spectra/data/she/nmr/H-F/1/pdata/1/auditp.txt
$$ ##AUDIT TRAIL=  $$ (NUMBER, WHEN, WHO, WHERE, WHAT)
(   1,<2023-07-07 13:57:13.40 +0400>,<she>,<DPX200>,
      <created by zg, POWCHK disabled, PULCHK disabled
       configuration hash MD5:
       00 E9 B6 7A A2 85 ED C7 34 08 36 98 17 FE 4E 26
       data hash MD5: 16K
       E1 E3 41 39 56 F1 1C AE 7D 87 71 79 A6 32 C0 31>)
(   2,<2023-07-07 13:57:16.43 +0400>,<she>,<DPX200>,
      <Start of raw data processing
       efp BC_mod = 2 LB = 0.24 FT_mod = 6 PKNL = 1 PHC0 = -20996.92 PHC1 = 22.85272 SI = 16K 
       data hash MD5: 16K
       7B 20 CE F9 B5 92 2A 3A 40 F1 3B F2 B2 C9 DC 7D>)
(   3,<2023-07-07 13:57:31.28 +0400>,<she>,<DPX200>,
      <pk PHC0 = 1.768669 PHC1 = -4 
       data hash MD5: 16K
       FB 96 93 70 02 6A 9C 98 F1 9B D2 C6 C4 DF BB 27>)
(   4,<2023-07-07 13:57:34.31 +0400>,<she>,<DPX200>,
      <abs ABSG = 5 
       data hash MD5: 16K
       0A 0C 9C BD FC 15 7E E3 9F 39 74 64 26 1E DA 2F>)
$$ ##END=
$$ 
$$ hash MD5
$$ 16 A5 E0 18 AF 84 92 21 76 51 63 51 69 7D 14 99
##$RELAX= 
##$RELAX= 
##$RELAX= 
##$RELAX= 
##$RELAX= 
##$RELAX= 
$$ Bruker specific parameters
$$ --------------------------
##$DU= <F:/spectra>
##$EXPNO= 1
##$NAME= <H-F>
##$PROCNO= 1
##$TYPE= <nmr>
##$USER= <she>
##$AMP= (0..31)
100 100 100 100 100 100 100 100 100 100 100 100 100 100 100 100 100 100 
100 100 100 100 100 100 100 100 100 100 100 100 100 100 
##$AQSEQ= 0
##$AQ_mod= 1
##$AUNM= <au_zg>
##$AUTOPOS= <>
##$BF1= 200.13
##$BF2= 200.13
##$BF3= 200.13
##$BF4= 200.13
##$BF5= 200.13
##$BF6= 200.13
##$BF7= 200.13
##$BF8= 200.13
##$BYTORDA= 1
##$CFDGTYP= 0
##$CFRGTYP= 5
##$CHEMSTR= <none>
##$CNST= (0..31)
1 1 145 1 1 1 1 1 1 1 1 1 1 1 1 1 1 1 1 1 1 1 1 1 1 1 1 1 1 1 1 1 
##$CPDPRG= <>
##$CPDPRG1= <>
##$CPDPRG2= <>
##$CPDPRG3= <>
##$CPDPRG4= <mlev>
##$CPDPRG5= <mlev>
##$CPDPRG6= <mlev>
##$CPDPRG7= <mlev>
##$CPDPRG8= <mlev>
##$CPDPRGB= <>
##$CPDPRGT= <>
##$D= (0..31)
0 1.2 0 0 0 0 0 0 0 0.06 0 0.03 0 0 0 0 0.0002 0 0 0 0 0 0 0 0 0 0 0 0 
0 0 0 
##$DATE= 1688723832
##$DBL= (0..7)
120 120 120 120 120 120 120 120 
##$DBP= (0..7)
150 150 150 150 150 150 150 150 
##$DBP07= 0
##$DBPNAM0= <>
##$DBPNAM1= <>
##$DBPNAM2= <>
##$DBPNAM3= <>
##$DBPNAM4= <>
$$ [...]
##$SUBNAM3= <"">
##$SUBNAM4= <"">
##$SUBNAM5= <"">
##$SUBNAM6= <"">
##$SUBNAM7= <"">
##$SUBNAM8= <"">
##$SUBNAM9= <"">
##$SW= 18.05172834244
##$SWIBOX= (0..15)
0 0 2 0 0 0 0 0 0 0 0 0 0 0 0 0 
##$SW_h= 3612.71676300578
##$TD= 16384
##$TD0= 1
##$TE= 0
##$TE2= 300
##$TE3= 300
##$TEG= 300
##$TL= (0..7)
0 120 120 120 120 120 120 120 
##$TP= (0..7)
150 150 150 150 150 150 150 150 
##$TP07= 0
##$TPNAME0= <>
##$TPNAME1= <>
##$TPNAME2= <>
##$TPNAME3= <>
##$TPNAME4= <>
##$TPNAME5= <>
##$TPNAME6= <>
##$TPNAME7= <>
##$TPOAL= (0..7)
0.5 0.5 0.5 0.5 0.5 0.5 0.5 0.5 
##$TPOFFS= (0..7)
0 0 0 0 0 0 0 0 
##$TUNHIN= 0
##$TUNHOUT= 0
##$TUNXOUT= 0
##$USERA1= <user>
##$USERA2= <user>
##$USERA3= <user>
##$USERA4= <user>
##$USERA5= <user>
##$V9= 5
##$VALIST= <valist>
##$VCLIST= <CCCCCCCCCCCCCCC>
##$VD= 0
##$VDLIST= <DDDDDDDDDDDDDDD>
##$VPLIST= <PPPPPPPPPPPPPPP>
##$VTLIST= <TTTTTTTTTTTTTTT>
##$WBST= 1024
##$WBSW= 4
##$XGAIN= (0..3)
0 0 0 0 
##$XL= 0
##$YL= 0
##$YMAX_a= 109404
##$YMIN_a= -185215
##$ZGOPTNS= <>
##$ZL1= 120
##$ZL2= 120
##$ZL3= 120
##$ZL4= 120
##$ABSF1= 15.74909
##$ABSF2= -2.302759
##$ABSG= 5
##$ABSL= 3
##$ALPHA= 0
##$AQORDER= 0
##$ASSFAC= 0
##$ASSFACI= 0
##$ASSFACX= 0
##$ASSWID= 0
##$AUNMP= <proc_1d>
##$AZFE= 0.1
##$AZFW= 0.1
##$BCFW= 0
##$BC_mod= 2
##$BYTORDP= 0
##$COROFFS= 0
##$CY= -3
##$DATMOD= 1
##$DC= 0
##$DFILT= <>
##$DTYPP= 0
##$F1P= 0
##$F2P= 0
##$FCOR= 1
##$FTSIZE= 16384
##$FT_mod= 6
##$GAMMA= 0
##$GB= 0
##$INTBC= 1
##$INTSCL= 3.70164e-10
##$ISEN= 128
##$LB= 0.24
##$LEV0= 0
##$LPBIN= 0
##$MAXI= 10000
##$MC2= 0
##$MEAN= 0
##$ME_mod= 0
##$MI= 1.114404
##$NCOEF= 0
##$NC_proc= -8
##$NLEV= 6
##$NOISF1= 3.799351
##$NOISF2= 2.8
##$NSP= 0
##$NTH_PI= 0
##$NZP= 0
##$OFFSET= 15.74358
##$PC= 1
##$PHC0= -20995.15
##$PHC1= 18.85272
##$PH_mod= 1
##$PKNL= yes
##$PPARMOD= 0
##$PSCAL= 0
##$PSIGN= 0
##$REVERSE= no
##$SF= 200.130005595213
##$SI= 16384
##$SIGF1= 3
##$SIGF2= 2
##$SINO= 5.538805
##$SIOLD= 16384
##$SREGLST= <1H.CDCl3>
##$SSB= 0
##$STSI= 16384
##$STSR= 0
##$SW_p= 3612.71676300578
##$SYMM= 0
##$S_DEV= 0
##$TDeff= 16384
##$TDoff= 0
##$TI= <>
##$TILT= no
##$TM1= 0
##$TM2= 0
##$TOPLEV= 0
##$USERP1= <user>
##$USERP2= <user>
##$USERP3= <user>
##$USERP4= <user>
##$USERP5= <user>
##$WDW= 1
##$XDIM= 16384
##$YMAX_p= 519388444
##$YMIN_p= -5404553
$$ End of Bruker specific parameters
$$ ---------------------------------
##NTUPLES= NMR SPECTRUM
##VAR_NAME=  FREQUENCY,     SPECTRUM/REAL,   SPECTRUM/IMAG
##SYMBOL=    X,             R,               I
##VAR_TYPE=  INDEPENDENT,   DEPENDENT,       DEPENDENT
##VAR_FORM=  AFFN,          ASDF,            ASDF
##VAR_DIM=   16384,         16384,           16384
##UNITS=     HZ,            ARBITRARY UNITS, ARBITRARY UNITS
##FACTOR=    0.220516191357247, 1,           1
##FIRST=     3150.76272637146, 0,            0
##LAST=      -461.954036634322, 0,           0
##MIN=       -461.954036634322, -5404553,    0
##MAX=       3150.76272637146, 519388444,    0
$$ Real data points
##PAGE= N=1
##DATA TABLE= (X++(R..R)), XYDATA
$$ [...]
5648B336588j81662k90729M93055J30788L48366n8646j89125r0128L79989j82536
5638B695960R2341o3281j53395O7508M51770j53283K01415j88565n29450L2891
5628B453911K52761L1608k7874j6011j90673o9746P6672P943l5579K05406K44129
5617B932547j69515l46965K70530n150M9438j33652M60539l11723K68300N358
5607C019707K78206l81401j35826K81462n59416K85182K67354q9383k1041J34597
5597C079441j16959k08889K02906J95569k18886J51164j38371j14884j94227J38434
5587B775298j06759J80864R7400j53085j51117j4163j90304M25248l31081L3286
5577B565587O5585L57697l80068l53186K987J9153n582P25765J30558k26124k39064
$$ plain form
5648 2336588 2154926 1864197 2357252 2488040 2836406 2777760 2588635 2498507 2878496 2695960
5638 2695960 2788301 2725020 2571625 2639133 3090903 2937620 3139035 2950470 2421020 2453911
5628 2453911 2706672 2738280 2710406 2694395 2503722 2433976 2510648 2518591 2483012 2688418 2932547
5617 2932547 2763032 2416067 2686597 2681447 2730885 2597233 3057772 2746049 3014349 3019707
5607 3019707 3297913 2916512 2780686 3062148 2502732 2787914 3055268 2965885 2944844 3079441
5597 3079441 2962482 2753593 2956499 3152068 2933182 3084346 2945975 2831091 2636864 2775298
5587 2775298 2668539 2849403 2946803 2793718 2642601 2628438 2438134 2863382 2532301 2565587
5577 2565587 2631172 2988869 2608801 2255615 2258602 2277755 2272173 2997938 3128496 2902372 2663308
5566B663308K06398R9842l70362L21025l55647Q6493k39289K60953J40807K5928
5556B839456j71115O6206n85733J89221J80708r5839n031K38050J52852L2813
5546B841588m79970O5231J27118N6624K75764K22719m69749p1991K99610k41336
5536B625608J38157M94928K03309k49212K08329p48744m91865L49106M60680N61540
5526C551836R3946N0226K46137J71561l93612j69035j04775L98538L77257J52156
5516D374235J34719j63614N35850L29119M62450P14498P43684J10489p37709k21101
5506F282620l29729l36947q42356k87997J48390k00745p30300J04062K80816M0730
5496D128544R1443L69074L7112K87071J55449O1653j18107J85879J53919j48055
$$ plain form
5566 2663308 2869706 2969548 2599186 2920211 2564564 2651057 2411768 2672721 2813528 2839456
5556 2839456 2668341 2734547 2148814 2338035 2518743 2422904 2417873 2655923 2808775 2841588
5546 2841588 2361618 2426849 2553967 2610591 2886355 3109074 2639325 2567334 2866944 2625608
5536 2625608 2763765 3258693 3462002 3212790 3421119 2672375 2180510 2529616 2990296 3551836
5526 3551836 3645782 3696008 3942145 4113706 3720094 3551059 3446284 3844822 4222079 4374235
5516 4374235 4508954 4345340 4881190 5210309 5672759 6387257 7130941 7241430 6503721 6282620
5506 6282620 5952891 5615944 4773588 4485591 4633981 4433236 3702936 3806998 4087814 4128544
5496 4128544 4219987 4589061 4626173 4913244 5068693 5130346 5012239 5198118 5352037 5203982
5486E203982N77475N19079P36092R97065J046193J497102J529973J275740J299174
5477A4681875M7016j386929j573642j254084r95157n29842r18680p39196n79099
5468F752262o50962l37119K1850j13318l44597K81091J2412l51231N97156P8696
5458E946240m35228k8821L42373J10299K28365P33828O52541N71650J317570J709662
5448A1148479J464473J171543J249274K2508k186175j751508r46768p39734p10770
5439H721322o75591j302625l90753j07156k34373k51193n76452l98360J62170
5430D946989n6015r6902R2281n063J52704r9679J85395l03433j8140K76610J11105
5419E185852L43576j59777M99850P5816N89147P18959p43953l80467r69370M3530
$$ plain form
5486 5203982 5781457 6300536 7036628 8033693 9079886 10576988 12106961 13382701 14681875
5477 14681875 14728891 13341962 11768320 10514236 9519079 8989237 8070557 7331361 6752262
5468 6752262 6101300 5764181 5786031 5672713 5328116 5609207 5621619 5270388 5867544 5946240
5458 5946240 5511012 5482191 5824564 5934863 6163228 6897056 7549597 8121247 9438817 11148479
5448 11148479 12612952 13784495 15033769 15056277 12870102 11118594 10171826 9432092 8721322
5439 8721322 8045731 6743106 6352353 6245197 6010824 5759631 5183179 4784819 4946989
5430 4946989 4890974 4794072 4886353 4881290 5033994 4934315 5119710 4816277 4798137 5074747 5185852
5419 5185852 5529428 5369651 5869501 5945317 6534464 7253423 6509470 6129003 5159633 5203163
5409E203163k23142m30305k00639k13786n2530k87872p67958r2878k15624L32544
5399C050973j19582j89420l7133K33722l08853K25902K16347K74749k99450j40925
5389B906330K33632J00144j47048Q5195l20175J67050K7317l69960M44408M16202
5379C543095n42429j30079J21004j58095j13581q3272O0826j59135K04722M3616
5369B786672K16467J13479j93161m14919R5123L06302J2005l20490p1159m9933
5359B480386q6967l18782K93984m2600Q2851n42071J88001J07653J88078J87479
5349B538012m4449L86532j86981k4666J06546l29356J35652k03291j0122l44432
5339B023445l42855J42865M91932J88562k59238k46417L33220J77590k61019l42702
$$ plain form
5409 5203163 4980021 4549716 4349077 4135291 4082761 3794889 3026931 2934053 2718429 3050973
5399 3050973 2931391 2741971 2704838 2938560 2629707 2855609 3071956 3346705 3047255 2906330
5389 2906330 3139962 3240106 3093058 3178253 2858078 3025128 3052445 2682485 3126893 3543095
5379 3543095 3000666 2870587 2991591 2833496 2719915 2636643 2697469 2538334 2743056 2786672
5369 2786672 3003139 3116618 2923457 2508538 2603661 2909963 2921968 2601478 2530319 2480386
5359 2480386 2393419 2074637 2368621 2326021 2408872 1866801 2054802 2162455 2350533 2538012
5349 2538012 2493563 2880095 2693114 2668448 2774994 2445638 2581290 2377999 2367877 2023445
5339 2023445 1680590 1823455 2315387 2503949 2244711 1998294 2331514 2509104 2248085 1905383
5329A905383J74100L08479n8706J22380J50318k99597L57003j70090j69333L29523
5319B649460p73829L66628n2074J77538K43364J82666k58896J53156L80727n45166
5309B523574k47682j88348j47792O3048K44544J11005o7267J73919K77558k93750
5299B448809j82882j04280m31969J74554K7842l86125K80670j45985J18601K75720
5289B074955k04938K3481L91286J33854L14642n21275K0741k53265l29588M17872
5279B067765j05657P6779j45253k28223J81390j71637J32532K1174q405J36335
5269A956800K23845l14645J68766Q1449n7104J09510m9022K40640n54020J99224
5259B005443J72436j44537j39619r1129P6947l00586K60129P22277L73294m68207
$$ plain form
5329 1905383 2079483 2387962 2329256 2451636 2601954 2302357 2659360 2489270 2319937 2649460
5319 2649460 1875631 2242259 2190185 2367723 2611087 2793753 2534857 2688013 3068740 2523574
5309 2523574 2275892 2087544 1939752 2002800 2247344 2358349 2291082 2465001 2742559 2448809
5299 2448809 2265927 2161647 1729678 1904232 1932074 1545949 1826619 1680634 1799235 2074955
5289 2074955 1870017 1893498 2284784 2418638 2733280 2212005 2232746 1979481 1649893 2067765
5279 2067765 1962108 2038887 1893634 1665411 1846801 1675164 1807696 1828870 1820465 1956800
5269 1956800 2180645 1866000 2034766 2116215 2059111 2168621 2119599 2360239 1806219 2005443
5259 2005443 2177879 2033342 1893723 1802594 1879541 1578955 1839084 2561361 2934655 2466448
5249B466448m67080q6556l050l9149k35856P32270J82038l73306K78636l1091
5239B423304k22440m701O85285O73832M3368K50549j44436L5071k48699m57828
5229C033305l79619K87621n69991n2971J37068k31207J31725l01999P4401l6014
5219B092319j44472n3671j17536j3285K4249R3238q4909J28093j10910l59859
5209A453257K53379J18679M9277o67392j95582L13537P0577L61139j54088L9257
5199A642040L19237k90829J05498j37623K31644K81939k69348l69822j41777M12480
5189A783439L87862r6844J32778m9758m15199N31282n373m66685p7088l18039
5179A406375j55065L66564J1954L75691k27890J74149N1281l82430m23320L6226
$$ plain form
5249 2466448 1999368 1912812 1909762 1870613 1634757 2367027 2549065 2175759 2454395 2423304
5239 2423304 2200864 2196163 2881448 3555280 3598648 3849197 3704761 3739832 3491133 3033305
5229 3033305 2653686 2941307 2371316 2318345 2455413 2224206 2355931 2053932 2128333 2092319
5219 2092319 1947847 1894176 1776640 1763355 1787604 1880842 1795933 1924026 1813116 1453257
5209 1453257 1706636 1825315 1874592 1207200 1011618 1325155 1395732 1756871 1602783 1642040
5199 1642040 1961277 1670448 1775946 1638323 1869967 2151906 1882558 1512736 1370959 1783439
5189 1783439 2171301 2074457 2207235 2157477 1742278 2273560 2268187 1801502 1724414 1406375
5179 1406375 1251310 1617874 1629828 2005519 1777629 1951778 2003059 1620629 1197309 1233535
5169A233535J39801M86538L71534m95464J00637k20207j08035L87493j75853J00457
5159A820436Q0574J85243J39377k57146k9405J80926l63400L4631j02357J12376
5149A801255K97473j66449J33126j7663J77493J68325j96757J98201R4916m36594
5139B053326l14625M57962O7294o9637K00438j48714o197K65896J7011j47045
5129B375709j01684j92330J02389P7255N9013R3050J20854l42345K31952K86467
5119B710330L8479l05358M7925N06038J7288l06986P1831J87944J14895P9713
5109C162099j78826j69938J85214k30973k95065K47889J88037l4462J56705K87083
5099C317763l14906j79719M07957L62914m320l48572K17362n10329l40433O9929
$$ plain form
5169 1233535 1373336 1859874 2231408 1735944 1836581 1616374 1508339 1895832 1719979 1820436
5159 1820436 1901010 2086253 2225630 1968484 1939079 2120005 1756605 1791236 1688879 1801255
5149 1801255 2098728 1932279 2065405 2047742 2225235 2393560 2196803 2395004 2489920 2053326
5139 2053326 1738701 2196663 2263957 2194320 2394758 2246044 2239847 2505743 2522754 2375709
5129 2375709 2274025 2081695 2184084 2261339 2320352 2413402 2534256 2191911 2423863 2710330
5119 2710330 2748809 2443451 2491376 2997414 3014702 2707716 2779547 2967491 3082386 3162099
5109 3162099 2983273 2813335 2998549 2767576 2472511 2720400 2908437 2873975 3030680 3317763
5099 3317763 3002857 2823138 3231095 3594009 3589689 3241117 3458479 2948150 2607717 2677646
5089B677646Q46814L9597o02254K25310O9220N53292Q3483l37320N1058J38550
5079C745396P6830J40172r5376j64039K0031j3106j89883l5682J78198L38599
5069D001140M25409J1160J06770J22893J16944r6413n4800Q849K96679q7775L58135
5058E208991j91670k5317N20749K36950P6262J48152O43209j5106j35804M59525
5048F925941q295M31968N46641n8025N67964K92406M12654M47816N90235J028726
5038A1178031J06258M87376j49100o2929L44549N53611O68069l75556J11553K67501
5028A3129363K66174k02831M06627L55522K7306q1883j34160M09654K15665K90515
5018A4681952K36606j47692j54807M5488J56287p63682l83407N45057J092635
$$ plain form
5089 2677646 3524460 3564057 2961803 3187113 3256333 3809625 3893108 3555788 3606846 3745396
5079 3745396 3822226 3962398 3867022 3702983 3723014 3709908 3520025 3484343 3662541 4001140
5069 4001140 4426549 4437709 4544479 4667372 4784316 4687903 4633103 4641952 4938631 4850856 5208991
5058 5208991 5017321 4992004 5512753 5749703 5825965 5974117 6617326 6602220 6466416 6925941
5048 6925941 6917646 7349614 7896255 7838230 8406194 8698600 9111254 9559070 10149305 11178031
5038 11178031 11284289 11771665 11622565 11559636 11904185 12457796 13125865 12750309 12861862 13129363
5028 13129363 13395537 13192706 13599333 13954855 13982161 13900278 13766118 14175772 14391437 14681952
5018 14681952 14918558 14770866 14616059 14661547 14817834 14054152 13670745 14215802 15308437
5009A5308437K54371J43203O99807O47000P32721Q99502J095011N62562L88193
5000B0730807P68080R64857K70014L00259N98455l25721J52478M54442M41383
4991B4355054L30770J018164O37756L36263P93250M7931J70664k23485p47761
4982B6718606l52073l9368j82906p19512n14415n23112j92485m68061m39365l85780
4972B2901529j07871N47023j33801k91749j34268p2393k06432K2067k81564k33304
4962B2009237j55281q8412K19829j46860l42180j37197K20021M2353Q34325K40205
4952B2696040N49514P09882J403073J330009J183266J360609J101566J059773
4944C1393732R12656K25749o33640n09926k55063J49442l10214k60726l55898
$$ plain form
5009 15308437 15562808 15706011 16405818 17052818 17785539 18685041 19780052 20342614 20730807
5000 20730807 21498887 22463744 22733758 23034017 23632472 23306751 23459229 23913671 24355054
4991 24355054 24685824 25703988 26341744 26678007 27471257 27519188 27689852 27466367 26718606
4982 26718606 26366533 26327165 26144259 25424747 24910332 24387220 24194735 23726674 23287309 22901529
4972 22901529 22793658 23340681 23206880 22915131 22780863 22708470 22502038 22524105 22242541 22009237
4962 22009237 21853956 21765544 21985373 21838513 21496333 21359136 21579157 21621510 22455835 22696040
4952 22696040 23245554 23955436 25358509 26688518 27871784 29232393 30333959 31393732
4944 31393732 32306388 32532137 31898497 31388571 31133508 31282950 30972736 30712010 30356112
4935C0356112l49814J1135J42884n49444r10522j106754j070603j569561j599373
4926B3354060j310274j606108j666846j080366j084787j447086q61186k07467
4918A4089940o74694m59075q97500o10550l19708m67840r48010l63983k41832
4909I106748L0936j68379n10424p12036K9037L15313j81353l7411j50378J43062
4899G865115l23025j75584m98712k4688K6332J78478j43872P144L05899Q2852
4889G299939k52159o17669M2158J7250J51426n9125L09428o0663L2213j99300
4879F663498l22700N21061J07098J82984j85904l68495R93753K59691j5646J93334
4869H028674j26862L00053L41253K71229L13936O03364r6113K91369L93247J37425
$$ plain form
4935 30356112 30006298 30017433 30160317 29610873 28700351 27593597 26522994 24953433 23354060
4926 23354060 22043786 20437678 18770832 17690466 16605679 15158593 14297407 14089940
4918 14089940 13415246 12956171 12058671 11448121 11128413 10660573 9712563 9348580 9106748
4909 9106748 9137684 8969305 8458881 7746845 7775882 8091195 7909842 7872431 7722053 7865115
4899 7865115 7542090 7366506 6867794 6843106 6869438 7047916 6904044 6911188 7217087 7299939
4889 7299939 7047780 6430111 6472269 6489519 6640945 6581820 6891248 6830585 6862798 6663498
4879 6663498 6340798 6861859 6968957 7151941 6966037 6597542 7591295 7850986 7835340 8028674
4869 8028674 7901812 8201865 8543118 8814347 9128283 9731647 9635534 9926903 10320150 10457575
4859A0457575R1157L09747P53959N82019P21584N74317k5941J024625J382718
4850A5871760J323458J328146J513004J140834J115414R47897J138589K47428
4842B4626530j11960l4518m04845p96198r53476q26866q72769r05703o22146n52071
4832A8545978k61737l39662M8323k85790m35450K96217j20892P45024O75061N06383
4822A9373455n8506M49911K94744N69901L10030M57591N01243K61037P65554R9157
4812B3024117J79158L68639K89356O24223J18515O15443M65022J054858J235194
4803B7974525Q07445N04692Q59173O62868L11204N40352O568p91306q24242k88223
4793B9763056J09530m9485o2026J01913o6125O00961N6395o01787o24098k87630
$$ plain form
4859 10457575 10548732 10858479 11612438 12194457 12916041 13490358 13464417 14489042 15871760
4850 15871760 17195218 18523364 20036368 21177202 22292616 23240513 24379102 24626530
4842 24626530 24514570 24480052 24075207 23279009 22325533 21498667 20625898 19720195 19098049 18545978
4832 18545978 18284241 17944579 17992902 17707112 17271662 17567879 17446987 18192011 18867072 19373455
4822 19373455 19314949 19764860 20059604 20629505 20939535 21397126 21898369 22159406 22924960 23024117
4812 23024117 23203275 23571914 23861270 24485493 24604008 25219451 25684473 26739331 27974525
4803 27974525 28781970 29286662 30145835 30808703 31119907 31660259 31666827 30875521 30051279 29763056
4793 29763056 29872586 29823101 29761075 29862988 29796863 30397824 30454219 29852432 29228334 28940704
4783B8940704o64473p44867o09750o92875j382565j335014r47916q55130j155443
4774B0552671q23151o39131m08201l61037m20190n7285q5569m13927j39957k09239
4764A6994984K4556o2270k44005N26394J82036r6089n16411k1858k91311k43607
4754A6252419M463l14830L66428K12457K01825Q6639M44663M36082L04512M68052
4744A8462710k7921K83439o42663o28877r21126p07262n88198p80023m2840j41166
4734A4266073l22014j43712l62278k27209l25585J7556K47918q65441l58236l54422
4724A1572650m11613k66707o00638o72301k81317k09486m82186l1925m37040o21945
4714G557492k11827k17898j46317l83296J6082K80937j12224o22464L49163k71502
$$ plain form
4783 28940704 28276231 27531364 26921614 26228739 24846174 23511160 22563244 21708114 20552671
4774 20552671 19729520 19090389 18682188 18321151 17900961 17843676 17758107 17344180 17204223 16994984
4764 16994984 17019540 16957270 16713265 17239659 17421695 17325606 16809195 16787337 16496026 16252419
4754 16252419 16256882 15942052 16308480 16520937 16722762 16809401 17254064 17690146 17994658 18462710
4744 18462710 18434789 18718228 18075565 17446688 16525562 15818300 15230102 14450079 14407239 14266073
4734 14266073 13944059 13800347 13438069 13210860 12885275 12902831 13150749 12285308 11927072 11572650
4724 11572650 11161037 10894330 10293692 9621391 9340074 9130588 8648402 8616477 8179437 7557492
4714 7557492 7345665 7127767 6981450 6598154 6614236 6895173 6782949 6160485 6509648 6238146
4704F238146K58174J94903l48462l83432m03496j24315l87124l36076J29890K04703
4694E042911l43599j39607L42042K752l70211j54344j74096r4402O787P1121J01025
4683D290379j66039j12942K77056k74557k90408L35516n6724J79379n69l42290
4673C838801o2971K51597Q8321p36567j11298j21552M30545J74282j91626K42476
4663C802008N4689k32569J66680K32916k62327j59373j82917K02323P7823L1492
4653C730745n889l70927k7472J37803J74608K1612j20694n92384L35038N96717
4643C879157j58347k70666m19259m2080K15787J49853k29694J26435N89398J93064
4633D033648m11535J13163m9298k75634K23907J75084n1318j15630l51968Q2468
$$ plain form
4704 6238146 6496320 6691223 6342761 5959329 5555833 5431518 5044394 4708318 4838208 5042911
4694 5042911 4699312 4559705 4901747 4904499 4534288 4379944 4205848 4111446 4118233 4189354 4290379
4683 4290379 4124340 4011398 4288454 4013897 3723489 4059005 4002281 4181660 4181091 3838801
4673 3838801 3775830 4027427 4115748 3379181 3267883 3146331 3576876 3751158 3559532 3802008
4663 3802008 3856697 3624128 3790808 4023724 3761397 3602024 3419107 3621430 3699253 3730745
4653 3730745 3724856 3353929 3326457 3464260 3638868 3660480 3539786 2947402 3282440 3879157
4643 3879157 3720810 3450144 3030885 2988805 3204592 3354445 3124751 3251186 3840584 4033648
4633 4033648 3622113 3735276 3685978 3410344 3634251 3809335 3758017 3642387 3290419 3372887
4623C372887J45645k53553O639K82513J32484K72256k38412o33257J88560J47146
4613C422908L0415k2135N63357l63761k60254n508q8501k6654r5030K05916m25065
4602B935688n2331L72286J96005p0607k84740l77171L56047j13309k90269l1279
4592B640320J65665K67822n00678k18481j0117O1294M4527j94250J95916l3131
4582B418887K17261m2785j86947J45476M2505l9915j42278P7488L23955Q5954
4572B899601l77834L7850J81664K49180l01079k8821k50010J6944J78392L0462
4562B636349J20816L40963j82602m08159j17280L97891l1386J96459K91834n62043
4552B682842P3369j06095p0477J09496k76386m49229J34476L5465J66795L65214
$$ plain form
4623 3372887 3518532 3264979 3271618 3554131 3686615 3958871 3720459 3087202 3275762 3422908
4613 3422908 3453323 3431188 3994545 3630784 3370530 3365022 3276521 3249867 3154837 3360753 2935688
4602 2935688 2883357 3255643 3451648 3381041 3096301 2719130 3075177 2961868 2671599 2640320
4592 2640320 2805985 3073807 2573129 2354648 2344531 2405825 2450352 2256102 2452018 2418887
4582 2418887 2636148 2593363 2406416 2551892 2594397 2554482 2412204 2489692 2813647 2899601
4572 2899601 2521767 2559617 2741281 2990461 2689382 2660561 2410551 2427495 2605887 2636349
4562 2636349 2757165 3098128 2915526 2507367 2390087 2787978 2756592 2953051 3244885 2682842
4552 2682842 2756211 2650116 2579639 2689135 2412749 1963520 2097996 2133461 2300256 2665470
4542B665470n07088J18656j60919L6462k18727J5243O27990J7487k72604J04087
4532B426057K9040q1362k56962j40564K65965k2037j58831j51071J93005r3088
4522B010152L65425j44822j87730L38743Q8191j53428M9822O7138J96855k44774
4512B385572J9844k0326N2081O1239q3341r509K57051m573K00245l35876j54042
4501B368365m4715O06355J16464k37855N79828j5387R497K19510K33646K896J847
4490C840451L1094l8081l98761k87454l01768o0869m61163J30634K35300j20655
4480B568728J50330k22054m8910L39173K08837m0064l08699j23073l49283k93298
4470A881687O41211K09889l45905k39685N07813m22607J82244J34448j63381L935
$$ plain form
4542 2665470 2158382 2277038 2116119 2152581 1933854 1949097 2577087 2594574 2321970 2426057
4532 2426057 2455097 2373735 2116773 1976209 2242174 2220137 2061306 1910235 2103240 2010152
4522 2010152 2375577 2230755 2043025 2381768 2469959 2316531 2366353 2433491 2630346 2385572
4512 2385572 2405416 2385090 2437171 2498410 2415069 2405560 2662611 2658038 2858283 2522407 2368365
4501 2368365 2323650 2930005 3046469 2808614 3388442 3373055 3382552 3602062 3835708 3838604 3840451
4490 3840451 3871545 3833464 3434703 3147249 2845481 2784612 2323449 2454083 2689383 2568728
4480 2568728 2719058 2497004 2448094 2787267 2996104 2956040 2647341 2524268 2174985 1881687
4470 1881687 2522898 2732787 2386882 2147197 2655010 2232403 2414647 2549095 2385714 2389649
4460B389649p829J80991k7181L06315j83609r3409k81440j48595L07756K32258
4450B674906K31943L4733j66095J64031l99765O4116L88372j84354K19438K63639
4440C290964k64738J86372K41197K50076j98112l06052J8519j8301k18533k13064
4430B768328j8262L03154L366l7530n8549j72478K06096j95576l31064k57693
4420B209792L38476J16407j65943j82473k3956J94339N20973l98129n00426k434
4410B106626o3495M35504L14969k28072k35368N8545K5831o1461m7424L28829
4400B634484k92243K47821L33137L7655l77931k03046K01840R849J962J49083
4390B742611L88069j36628K5025K2655k27490q03946j54754J90275j48953m2635
$$ plain form
4460 2389649 2381820 2562811 2535630 2841945 2658336 2564927 2283487 2134892 2442648 2674906
4450 2674906 2906849 2941582 2775487 2939518 2539753 2603869 2992241 2807887 3027325 3290964
4440 3290964 3026226 3212598 3453795 3703871 3505759 3199707 3218226 3199925 2981392 2768328
4430 2768328 2750066 3053220 3056586 3019056 2960507 2788029 2994125 2798549 2467485 2209792
4420 2209792 2548268 2664675 2498732 2316259 2292303 2486642 3007615 2609486 2109060 2106626
4410 2106626 2043131 2478635 2793604 2565532 2330164 2388709 2414540 2353079 2305655 2634484
4400 2634484 2342241 2590062 2923199 2960854 2582923 2379877 2581717 2591566 2593528 2742611
4390 2742611 3130680 2994052 3019077 3041732 2814242 2010296 1855542 2045817 1896864 1854229
4380A854229R9794Q626K87120N7206p5788J32937j38054J17484r7084J41350J70441
4369B558261L9679k33055K10649k51777J44781L89934J14569P3088k62978n9479
4359B723672Q6285M8476J46638L10560R9663J01029n85384l67641j5083J30900
4349B679115R5505K73130p7470L5010l35693m56675J41253p2323l30051j37163
4339A814638N51752N42036p4907RL1204n2519k84501R2432L26736J36179o9701
4328C013358n07014K38923j656N7196J96600M3666j98789K37266j18196l02613
4318B658741m3764P3086j72619K52398K59066j48976o07008M08660K10370m9378
4308B840576K4156j00249k01448J9717M6198O4607k1512m0778K97303j99731l9146
$$ plain form
4380 1854229 1954023 1962649 2249769 2306975 2231187 2364124 2226070 2343554 2246470 2387820 2558261
4369 2558261 2597940 2364885 2575534 2323757 2468538 2858472 2973041 3046129 2783151 2723672
4359 2723672 2809957 2858433 3005071 3315631 3415294 3516323 2930939 2563298 2548215 2679115
4349 2679115 2774620 3047750 2970280 3005290 2669597 2212922 2354175 2281852 1951801 1814638
4339 1814638 2366390 2908426 2833519 2833528 2864732 2812213 2527712 2620144 2946880 3083059 3013358
4328 3013358 2506344 2745267 2743611 2800807 2997407 3041073 2842284 3079550 2961354 2658741
4318 2658741 2614977 2688063 2515444 2767842 3026908 2877932 2270924 2679584 2889954 2840576
4308 2840576 2864732 2764483 2563035 2582752 2628950 2693557 2672045 2631267 2928570 2728839 2689693
4297B689693j51805n0358P3581J33294M41615M8935j98020J20761J43917J02193
4287C353806j90008j56359J09847R9582K15355O5573j33925J33232j76283J30601
4277C451421m16320M31539L1681J21966K30980L0032l3072K73947R6357k91099
4267C927432j90549k5488O47176J8938j00627r959N5227m2420j02692k47565P20834
4256D650307J02078k09899J365K12002J41487l26815q2059O2941k64794J54480
4246D441093P24965q8350K80035j20192J98342M93376j2060j71038J09777l85175
4236E470773L57846K38138o7936K56874K14285L9734K0030N38N29397j26531K05763
4225G138911M99931K7874j45810M7774L89823P6682O5708M10513O02891q0327
$$ plain form
4297 2689693 2537888 2487530 2561111 2694405 3136020 3184955 2986935 3107696 3251613 3353806
4287 3353806 3163798 3007439 3117286 3216868 3432223 3497796 3363871 3497103 3320820 3451421
4277 3451421 3035101 3466640 3498321 3620287 3851267 3881299 3848227 4122174 4218531 3927432
4267 3927432 3736883 3711395 4358571 4377509 4276882 4266923 4322150 4279730 4177038 3929473 4650307
4256 4650307 4752385 4542486 4543851 4755853 4897340 4570525 4488466 4551407 4286613 4441093
4246 4441093 5166058 5077708 5357743 5237551 5435893 5929269 5917209 5746171 5855948 5470773
4236 5470773 5828619 6066757 5998821 6255695 6469980 6509714 6529744 6530282 7059679 6933148 7138911
4225 7138911 7638842 7666716 7520906 7568680 7958503 8035185 8100893 8511406 9114297 9033970
4215I033970J20796P27237K62919j33926M83624P05926N5910J78111L04813l1722
4205A1707658M42007K04458J30671P25846O95888O01636M53191M94901J28536
4196A5584792K95253L26645K75380N45996N17965Q78296K10173O31149O70466
4187A9936115N48037J009840K12480L53204Q38634Q77941J014209J341345R58305
4178B7090110J164578J215642J193090J492951J690936J638421J614179J718356
4170C8818263K204799J803748K204986K346145K849005L719157L996377M422728
4162F2365208N283303O818212Q172244J0057596J1957982J4797120J7860423K2225039
4154A59537127K6989734L0942097L0270770K4413536R331243q309163k2453226
$$ plain form
4215 9033970 9154766 9882003 10144922 10010996 10494620 11200546 11256456 11434567 11739380 11707658
4205 11707658 12149665 12354123 12484794 13210640 13906528 14508164 14961355 15456256 15584792
4196 15584792 15880045 16206690 16482070 17028066 17546031 18424327 18634500 19265649 19936115
4187 19936115 20484152 21493992 21706472 22059676 22898310 23776251 24790460 26131805 27090110
4178 27090110 28254688 29470330 30663420 32156371 33847307 35485728 37099907 38818263
4170 38818263 41023062 42826810 45031796 47377941 50226946 53946103 57942480 62365208
4162 62365208 67648511 74466723 82638967 92696563 104654545 119451665 137312088 159537127
4154 159537127 186526861 217468958 247739728 272153264 281484507 273175344 250722118
4147B50722118k8953067k8507864k5106850k0789897j6132597j2769550r478310
4140A08983983p364034o050243m598136l860010l609691k969707k844082k363580
4132G5324500k561586j728607j625902j425816q94972q48331m07595j49392j09875
4123F5572424l63173R3458N40364L91471J42833R5907J70955K14268K44369K22916
4113F7325792M12408l96972K31121P53452L26515j63819L78680R559K05492J13192
4103F9195420K41512J46261M85504Q60837k01272k10788J64491L10941K80824
4094G1273730k39066p01533l61263l82608o15609n07389k36607n52914J72447
4085F7849188j7574J24124M33659J478507J458400K457725L342017M573387N721223
$$ plain form
4147 250722118 221769051 193261187 168154337 147364440 131231843 118462293 108983983
4140 108983983 101619949 95569706 90971570 87111560 83501869 80532162 77688080 75324500
4132 75324500 72762914 71034307 69408405 67982589 67087617 66239286 65831691 65682299 65572424
4123 65572424 65209251 65302709 65843073 66234544 66377377 66473284 66644239 66858507 67102876 67325792
4113 67325792 67738200 67341228 67572349 68325801 68652316 68488497 68867177 68876736 69082228 69195420
4103 69195420 69436932 69583193 70068697 70929534 70728262 70517474 70681965 70992906 71273730
4094 71273730 71034664 70333131 69971868 69589260 68973651 68466262 68229655 67676741 67849188
4085 67849188 67831614 67955738 68389397 69867904 71326304 73784029 77126046 81699433 87420656
4076H7420656Q472888J2808950J7806164K5570412L5066560L3430371K3601101
4069B44177102j1337199l5851095l3714112l0078221k4053032j8127575j2117348
4062G8898520q846090o564874n189260m394401l345385k891579k833903k679479
4054D2153549k021707j922926j976150j808206k398012j889018j173973o78226
4046B8285331r06725j384431p16548r68133p88073p38512o40602n39444n63873
4037B1038990m5872o22684j003562o98248n30197o46873n82160o59157O6888p09086
4027A5608039k31026k01490n99348l17323k15559n32000o5985p72771m62728K83343
4017A2493152k99097p3671l68188o54471P5454l16879k94906q6349N8165p0928
$$ plain form
4076 87420656 95893544 108702494 126508658 152079070 187145630 220576001 244177102
4069 244177102 232839903 196988808 163274696 133196475 109143443 91015868 78898520
4062 78898520 70052430 63487556 58298296 53903895 50558510 47666931 44833028 42153549
4054 42153549 40131842 38208916 36232766 34424560 32026548 30137530 28963557 28285331
4046 28285331 27378606 25994175 25277627 24309494 23521421 22782909 22142307 21602863 21038990
4037 21038990 20993118 20370434 19366872 18668624 18138427 17491554 16909394 16250237 16317125 15608039
4027 15608039 15377013 15175523 14576175 14258852 14043293 13511293 13445308 12672537 12209809 12493152
4017 12493152 12194055 12120384 11752196 11097725 11173179 10856300 10561394 10475045 10533210 10462282
4007A0462282o43442n29821J83302J08885j35772m40499k13992L48881k65430
3998H874394m15807R9640j54277m26402j58155K32538j84847l7619n5308j16324
3988G657833m11408L98505K09603k16332J16127j53543l67792J00715k56053k52409
3978F825246K779K9193j02649k47107l01718k82407j29561J38332Q0678K9466
3968F042252K94116J76995j74696j23262K10464j09304k13988j93266J6446j38949
3958E786808k13402q2774J52077O43728n20160m378O4528k90820K22979k18843
3948E539743M5732K25630n14266p8182j22933n008L94597l64692l2970L304J83214
3937E274169k92139K78353J43162L4562K8363m48529J17768k68583N2048N3578
$$ plain form
4007 10462282 9818840 9289019 9472321 9581206 9445434 9004935 8790943 9139824 8874394
3998 8874394 8458587 8558227 8403950 7977548 7819393 8051931 7867084 7829465 7774157 7657833
3988 7657833 7246425 7644930 7854533 7638201 7754328 7600785 7232993 7333708 7077655 6825246
3978 6825246 6828025 6857218 6754569 6507462 6205744 5923337 5793776 5932108 6012786 6042252
3968 6042252 6336368 6513363 6338667 6215405 6425869 6316565 6102577 5909311 5925757 5786808
3958 5786808 5573406 5490632 5642709 6286437 5766277 5761899 5826427 5535607 5758586 5539743
3948 5539743 5585475 5811105 5296839 5218657 5095724 5090716 5485313 5120621 5087651 5090955 5274169
3937 5274169 4982030 5260383 5403545 5438107 5466470 5017941 5135709 4867126 4919174 4972752
3927D972752m64435Q5125Q4486K89731J09061m36789K38438N00550n17666q1861
3917D779392J10811m2259n68666M11347Q2580J02991K11144J16818J73588k7526
3907E350220k21183k89382Q5289K20951k62960J31782p3148J1876Q584j83010
3897D779019k27439N96312L03008j95691K58207N5674n0783k20128K58518P8777
3887E635474L1643J15058K91087p7465j68283j93289J86833N4887J61321k33750
3877E803516L46422J19731k17136p9559Q0860K37929r1491o2013o3403M62144
3867F537000L78463K32880J60128K31525j54684L79569J87775k53653J52077J79852
3857H030932K68048m5096j57548P5711j28905k11518J19309J11360K5470j23387
$$ plain form
3927 4972752 4508317 4593442 4677928 4967659 5076720 4639931 4878369 5378919 4861253 4779392
3917 4779392 4890203 4847944 4279278 4690625 4773205 4876196 5087340 5204158 5377746 5350220
3907 5350220 5129037 4839655 4924944 5145895 4882935 5014717 4941569 4953445 4962029 4779019
3897 4779019 4551580 5147892 5450900 5255209 5513416 5569090 5518307 5298179 5556697 5635474
3887 5635474 5667117 5782175 6073262 5995797 5827514 5634225 5821058 5875945 6037266 5803516
3877 5803516 6149938 6269669 6052533 5972974 6053834 6291763 6200272 6138259 6074856 6537000
3867 6537000 6915463 7148343 7308471 7539996 7385312 7764881 7952656 7699003 7851080 8030932
3857 8030932 8298980 8253884 8096336 8172047 8043142 7831624 7950933 8062293 8087763 7964376
3847G964376J14676j22758L55515J29476L02476M05559K61261M98073m1018k11930
3837I655706K19406K23138N71921J87386J17697L76158O41439m0611N78790M93303
3827A3024333K23231N95738j14283M27629M88587M289L43548L36040K41403N44866
3817A6115381O76648K577k72216N77110K68921o6748L25723M45621K03219L9591
3807A8315827j55087o9430l91689R5808L77559J07360k18759M07075R4770n1495
3797A8511939J41347j48599N08264L59914P5801P7185N71374K98206M03187L55927
3787B1154545O18064N97136Q91804J011140J083014R98507N81777O05118J155854
3778B8696959J394802Q22699Q15897J186682J123057O50141J175983R26507L26478
$$ plain form
3847 7964376 8079052 7956294 8311809 8441285 8743761 9149320 9410581 9908654 9867636 9655706
3837 9655706 9875112 10098250 10670171 10857557 10975254 11351412 11992851 11952240 12531030 13024333
3827 13024333 13247564 13843302 13729019 14156648 14645235 14649524 14993072 15329112 15570515 16115381
3817 16115381 16792029 16794606 16522390 17099500 17368421 17301673 17627396 18073017 18276236 18315827
3807 18315827 18160740 18091310 17699621 17795429 18172988 18280348 18061589 18468664 18563434 18511939
3797 18511939 18653286 18504687 19012951 19372865 19448666 19525851 20097225 20395431 20798618 21154545
3787 21154545 21772609 22369745 23261549 24272689 25355703 26354210 26935987 27541105 28696959
3778 28696959 30091761 30914460 31730357 32917039 34040096 34690237 35866220 36792727 37119205
3769C7119205J177820R34930O38358Q87863N13286O94567M57884N74806k66645
3760D2732074O08328M39436k653J52541K27063n60605o3422M73814L17897O40418
3750D4964891J00886L12647J86522M24412L44470K65746N15508J52365P14397
3741D7981844N65793P68571Q22408J878808J302956Q26713P61282R99124J209352
3732E7116851J256575N75338K00637O45127P89902Q14587M62185n55177J40777
3723F1446802L58338j88510O2876k52504K86218k15972l33281l36891j178034
3714E9649042j314033r23156j265625j600675j509454j618602j435116j259153
3706D8723228j772523j382941j387986j545825j288896r31277j183977r46551
$$ plain form
3769 37119205 38297025 39231955 39870313 40758176 41271462 41966029 42423913 42998719 42732074
3760 42732074 43340402 43779838 43777185 43929726 44156789 43596184 43532762 44006576 44324473 44964891
3750 44964891 45065777 45378424 45564946 45989358 46333828 46599574 47115082 47267447 47981844
3741 47981844 48547637 49316208 50138616 52017424 53320380 54147093 54908375 55907499 57116851
3732 57116851 58373426 58948764 59149401 59794528 60584430 61399017 61861202 61306025 61446802
3723 61446802 61805140 61616630 61679506 61427002 61713220 61497248 61163967 60827076 59649042
3714 59649042 58335009 57411853 56146228 54545553 53036099 51417497 49982381 48723228
3706 48723228 46950705 45567764 44179778 42633953 41345057 40413780 39229803 38283252
3698C8283252j197509p44044j347344j145597q80233q46350p88445j178464o54524
3689B9500742n70559j008139n3211l17413j05450p86516m15113k67187L82343
3680B6359497p3262m61757k00686J74376k29791N4902j01658l07782J25640J34203
3670B5473682k74402j49652L31013j69278l8571O345k58022o1335J52951l59866
3660B4652865J57581j61959k68178n32295k52422K3859o38005p05130K74098j75925
3650B2374489j54428n66848j62179K28637M3053k83722O6390J46845R9811P499
3640B1799547j93586J96175M02427m831j9462k4080O68646M77657P47484P14346
3630B4764323L17691N99709Q42843Q21710Q26030J122995O26976M94782O44580
$$ plain form
3698 38283252 37085743 36341699 34994355 33848758 32968525 32122175 31333730 30155266 29500742
3689 29500742 28930183 27922044 27868833 27551420 27445970 26659454 26244341 25977154 26359497
3680 26359497 26286235 25824478 25623792 25798168 25568377 25623279 25521621 25213839 25339479 25473682
3670 25473682 25199280 25049628 25380641 25211363 25172792 25179137 24921115 24859780 25012731 24652865
3660 24652865 24810446 24648487 24380309 23848014 23595592 23619451 22981446 22276316 22550414 22374489
3650 22374489 22220061 21653213 21491034 21719671 21762724 21479002 21545392 21692237 21792048 21799547
3640 21799547 21605961 21802136 22204563 22199732 22180270 22156190 22824836 23302493 24049977 24764323
3630 24764323 25082014 25681723 26524566 27346276 28172306 29295301 29922277 30417059 31061639
3621C1061639P46632L32007J26760R2357l24554k01027O4078j00884k71029k26694
3611C1299285l95589j92687j54708o39624n37897J72605M26292L31766K67327
3602C0576770k40338k8303L00307J84149N43272o0179k17682N69880K63679j01944
3592C1789611K4428L25085R1336L98541L8626O65093O00161N65453O91764J149816
3582C6339914J019849J319312J231707R78173J834700J309725J220620J324452
3574D6578452J728425J875785J793370J400329Q63889P20124J080210J030748
3566E7071332K76989K18823k05659M88772K86027M44271l89720k72958J03475
3557E8021352O9476k29235n7517M92283Q25273P37916j39566R21078R58429O63016
$$ plain form
3621 31061639 31808271 32140278 32267038 32359395 32034841 31833814 31897892 31797008 31525979 31299285
3611 31299285 30903696 30711009 30556301 29916677 29378780 29551385 29977677 30309443 30576770
3602 30576770 30336432 30308129 30608436 30792585 31335857 31275678 31057996 31627876 31891555 31789611
3592 31789611 31814039 32139124 32230460 32629001 32667627 33332720 33932881 34498334 35190098 36339914
3582 36339914 37359763 38679075 39910782 40888955 42723655 44033380 45254000 46578452
3574 46578452 48306877 50182662 51976032 53376361 54240250 54960374 56040584 57071332
3566 57071332 57348321 57567144 57361485 57850257 58136284 58580555 58190835 57917877 58021352
3557 58021352 58090828 57861593 57804076 58296359 59121632 59859548 59719982 60641060 61599489 62262505
3547F2262505K53963J082783J280101J188085P49839N48820R56009J610154J490943
3538G1423202J647241J813653K097350K409625L335733K868162L813335L976285
3530I3384586M621565N203852N441481N622152N485969N822436N050574M740300
3522A35372915M410036L287452J980509J184072L00730j510551k453256k731551
3514A39840356m243325m890263n091962o017425n873381o082519n769675n396359
3506I6475447m770121n061939m374691l601408l709436l442429k647858k499723
3498F6367842k347527j992521j406266o19362j407780p86181o44281p12676J91205
3489E6642453r7840j21457L30668M39059N82357P42569R40492M89645J098180
$$ plain form
3547 62262505 62516468 63599251 64879352 66067437 66817276 67366096 68322105 69932259 71423202
3538 71423202 73070443 74884096 76981446 79391071 82726804 85594966 89408301 93384586
3530 93384586 98006151 103210003 108651484 114273636 119759605 125582041 130632615 135372915
3522 135372915 139782951 143070403 145050912 146234984 146535714 145025163 142571907 139840356
3514 139840356 135597031 130706768 125614806 119597381 113724000 107641481 101871806 96475447
3506 96475447 91705326 86643387 82268696 78667288 74957852 71515423 68867565 66367842
3498 66367842 64020315 62027794 60621528 60002166 58594386 57808205 57163924 56451248 56642453
3489 56642453 56544613 56423156 56753824 57192883 57775240 58517809 59458301 59947946 61046126
3480F1046126M53560O92019O89100J71202K63259J78293N46576l70779j089217
3471F2580139j69545j088611q32892j096953j465440j593743r70983j539646j935907
3462E1886419j938439j793221j389757j892685j779314j275894j268940j300687
3454C9247482j592641j133721j297540q39023j145259r05316n66294n95523k16522
3445C0955643n94088n501l23451n68703P7044K06384L58851L98530l26857P6590
3435C0254442N43018O48302M02173N46901N66164L29739M32351K20477Q63539
3426C4807106P82975k08688L73991M35948J81278M92380l46207k09221l93214
3417C5916348k1507p84977q92344o61933m56114o56571q96508r01076o15673m36436
$$ plain form
3480 61046126 61499686 62191705 62880805 63052007 63315266 63493559 64040135 63669356 62580139
3471 62580139 62410594 61321983 60489091 59392138 57926698 56332955 55361972 53822326 51886419
3462 51886419 49947980 48154759 46765002 44872317 43093003 41817109 40548169 39247482
3454 39247482 37654841 36521120 35223580 34384557 33239298 32333982 31767688 31172165 30955643
3445 30955643 30361555 30356054 30032603 29463900 29540944 29747328 30106179 30504709 30177852 30254442
3435 30254442 30797460 31445762 31847935 32394836 32961000 33290739 33723090 33943567 34807106
3426 34807106 35590081 35381393 35755384 36191332 36372610 36864990 36518783 36309562 35916348
3417 35916348 35894841 35109864 34217520 33555587 33099473 32442902 31546394 30645318 30029645 29593209
3407B9593209j091038p15058j048708l76066n32103p10262o04688m34776l60107
3398B3720403k76697o59043j40730j65593j76853p5648n57707m75276L28554J69078
3388B1690488k54847L13046J17071j21293K99595L05625J6916q8745J29156K37033
3378B2644045M94121N00372O15892O83162P6415M98441O29058L71594M37935L64112
3368B7315147O75821N08390M66892M74567P45656K95169M88172L95294Q72881
3359C2237989Q47000P05878P62523P89006L38035O27566O10579J018974O02301
3350C8539851K99833R01996P88622O99471P71040J170984O00221Q75714P33838
3341D5381570J214566J609826J028145J374256J395913R48991J711019J663340
$$ plain form
3407 29593209 28502171 27787113 26738405 26362339 25830236 25119974 24515286 24080510 23720403
3398 23720403 23443706 22784663 22643933 22478340 22301487 22225839 21668132 21192856 21521410 21690488
3388 21690488 21435641 21748687 21865758 21744465 22044060 22349685 22366601 22277856 22407012 22644045
3378 22644045 23138166 23638538 24254430 24937592 25014007 25512448 26141506 26513100 26951035 27315147
3368 27315147 27990968 28499358 28966250 29440817 30186473 30481642 30969814 31365108 32237989
3359 32237989 33084989 33790867 34553390 35342396 35680431 36307997 36918576 37937550 38539851
3350 38539851 38839684 39741680 40530302 41229773 42000813 43171797 43772018 44647732 45381570
3341 45381570 46596136 48205962 49234107 50608363 52004276 52953267 54664286 56327626
3333E6327626K074148J775640J548755K518919K649630K722228K442623K966881
3325G5026450L308500L813251M192076M299637M779481M580359N252732O427206
3317A11679692O411096O921635P362595Q018726Q230864P602579Q511250Q495997
3309A73234434P716242P963602P354515P182140N822146N103182M800567L238537
3301B22415365K277879J468737O89235R9057n47139j169536j383960k286184k573866
3292B18989588k970313m120285m659645n680687o101261o492708p307239q296094
3284A73361356q473138p736278q726742q022809p656660p292885o512128n934705
3276A13006011n652051n095979m935158m549353l825059l635614l610481k936572
$$ plain form
3333 56327626 58401774 60177414 61726169 64245088 66894718 69616946 72059569 75026450
3325 75026450 78334950 82148201 86340277 90639914 95419395 99999754 105252486 111679692
3317 111679692 118090788 125012423 132375018 140393744 148624608 156227187 164738437 173234434
3309 173234434 180950676 188914278 196268793 203450933 209273079 214376261 219176828 222415365
3301 222415365 224693244 226161981 226851216 226950273 226403134 225233598 223849638 221563454 218989588
3292 218989588 216019275 211898990 207239345 201558658 195457397 188964689 181657450 173361356
3284 173361356 164888218 157151940 148425198 140402389 132745729 125452844 118940716 113006011
3276 113006011 107353960 102257981 97322823 92773470 88948411 85312797 81702316 78765744
3268G8765744k611962k590670k448702j974753j841598j454069j781237j605838
3260F2456915j109011r49665j094140j222494o01417r44630l88894k45282p1793
3251E5829589N87814J144095J207665J012282Q11579q6170k020416k360956j550297
3242E4575185j407672q98527l60058j4729K13206J72285N46233l09594j328409
3233E1187920j242477j159894j255807j332466n62568n55535l1058n84576m07982
3224D4055557K95272L26986k0432N45091J416656J832506K751632L076195L355834
3215E7635297K765821j225437l777063k913851k606784j767876j974673j695273
3207D4440161j159403r12070n99991m56403p19077k01102m34194m18197o8864
$$ plain form
3268 78765744 76153782 73563112 71114410 69139657 67298059 65843990 64062753 62456915
3260 62456915 61347904 60398239 59304099 58081605 57480188 56535558 56146664 55901382 55829589
3251 55829589 56417403 57561498 58769163 59781445 60593024 60506854 58486438 56125482 54575185
3242 54575185 53167513 52268986 51908928 51894199 52107405 52279690 52825923 52516329 51187920
3233 51187920 49945443 48785549 47529742 46197276 45634708 45079173 45048115 44463539 44055557
3224 44055557 44350829 44677815 44657383 45202474 46619130 48451636 51203268 54279463 57635297
3215 57635297 60401118 59175681 55398618 52484767 49877983 48110107 46135434 44440161
3207 44440161 43280758 42368688 41768697 41312294 40593217 40392115 39957921 39539724 39470860
3198C9470860m75822m36643k78633j14958k60914K74262L14348J86935N20746
3189C9200181L98021P25757J055419J434759K003537K161344K017845n51274j298659
3180D7146930n82061m48334p23784k20326m01401P7112M65868Q40445J022335
3171D7176784M94624O82948J184897J699402Q76887J065490J561651K054486J678134
3162E8475303J985615K281798K475249K716502L243250L563374L491268M190147
3154H2422506M308290M015439M092453M228072M716139M363712L877978L768783
3146A15793372K718730K638210J434295O49693J59895k43840k94884j231572j745057
3137A19878842k405377k428932k477666k616660k903129l203107l489501m283308
$$ plain form
3198 39470860 38995038 38558395 38279762 38164804 37903890 38178152 38492500 38679435 39200181
3189 39200181 39598202 40323959 41379378 42814137 44817674 46979018 48996863 48445589 47146930
3180 47146930 46564869 46116535 45392751 45172425 44771024 44848136 45314004 46154449 47176784
3171 47176784 47671408 48354356 49539253 51238655 52115542 53181032 54742683 56797169 58475303
3162 58475303 60460918 62742716 65217965 67934467 71177717 74741091 78232359 82422506
3154 82422506 86730796 90746235 94838688 99066760 103782899 108146611 112024589 115793372
3146 115793372 118512102 121150312 122584607 123234300 123394195 123150355 122855471 121623899 119878842
3137 119878842 117473465 115044533 112566867 109950207 107047078 103843971 100354470 96071162
3129I6071162l752002l286608m389125m601375m331974m049012l969142l344351
3121F4347573l405955l019767k482716k393032k541632k423737k289215k039090
3113D3752429j954751j296155j526648j594751r68512j294195j321394j146221
3105C2649802p41356q54417p59599p92598q17905o62760p46679r15012p31933
3096B5627543l39276l24139R0481o83811p21039J30849m0012l56592j68585l49507
3086B2865912k05658j81358l88273l4818j59707O0727J01292q77066K41393K00474
3076B1622918j06368l90263q801j74479k88491j5514j93600m39509n89453q81508
3066A8534932j166603k55313l46972n78199m65162k37336n34657k7498o2114o5760
$$ plain form
3129 96071162 92319160 89032552 84643427 80042052 75710078 71661066 67691924 64347573
3121 64347573 60941618 57921851 55439135 53046103 50504471 48080734 45791519 43752429
3113 43752429 41797678 40501523 38974875 37380124 36411612 35117417 33796023 32649802
3105 32649802 31908446 31054029 30294430 29501832 28683927 28021167 27274488 26359476 25627543
3096 25627543 25288267 24964128 25054609 24370798 23649759 23780608 23740596 23384004 23215419 22865912
3086 22865912 22660254 22478896 22090623 22055805 21896098 21956825 22058117 21181051 21422444 21622918
3076 21622918 21516550 21126287 21117486 20943007 20654516 20639002 20445402 20005893 19416440 18534932
3066 18534932 17368329 17113016 16766044 16187845 15722683 15485347 14950690 14923192 14861078 14795318
3056A4795318l95576m35496k0093j96500r7317m63915j98997r6090k90745o09157
3046A1991432K76307K12662p34921J88528J22765m9717m10406k24781K90964R7565
3036A1760398j38675K15339q1811N6323j12547j81645l12636r4291J98094K93680
3026A1602229k89420j56978M21656Q7686j89826m263j87467L2371J82610J3923
3016A1512521r5073N37322q7452l67222m35978N87328J63337o6099p2585o4368
3006A1611731K10833l85079k32752J48555L21085O7706K35315L2562j16663J96008
2996A2089301O8177j69149K23930m27853r6369N63722J36552j2770l62919K06439
2986A2219061L12495K67203K95626J30646j27603L40653L23074M51699J30144
$$ plain form
3056 14795318 14399742 13964246 13944153 13747653 13650336 13186421 12987424 12891334 12600589 11991432
3046 11991432 12267739 12480401 11745480 11934008 12056773 12007056 11596650 11371869 11662833 11760398
3036 11760398 11621723 11837062 11755251 11811574 11699027 11517382 11204746 11110455 11308549 11602229
3026 11602229 11312809 11155831 11577487 11665173 11475347 11471084 11283617 11315988 11498598 11512521
3016 11512521 11417448 11954770 11867318 11500096 11064118 11651446 11814783 11748684 11676099 11611731
3006 11611731 11822564 11437485 11204733 11353288 11674373 11742079 11977394 12009956 11893293 12089301
2996 12089301 12157478 11988329 12212259 11784406 11688037 12251759 12388311 12375541 12012622 12219061
2986 12219061 12531556 12798759 13094385 13225031 13097428 13438081 13761155 14212854 14342998
2977A4342998R4595j5475J94201L31039J00045M47527j45529P7175L90778N40072
2967A6357426N23339M14208K91240M46362K43275K84571N73362M67774J05138
2958A9706695P51284K53714O99959N54604M98980R96461M96989N87402O21416
2949B5167504P47723P46684P09161J026667O28757R20831J083222R72814J461642
2940C3465005J258791J236829J549892J125187R68507J308333J403926Q96380
2932D3212850R95365O14716J439306J448734J927908K081334J826889J860326
2924E5407428K070884K122399K160419K432292K179240K487851K313557J787228
2916G2961298K774224L113081L425504L474002L499007L675385L743227M301076
$$ plain form
2977 14342998 14437593 14422118 14616319 14947358 15047403 15494930 15349401 15426576 15817354 16357426
2967 16357426 16880765 17294973 17586213 18032575 18275850 18560421 19133783 19601557 19706695
2958 19706695 20457979 20711693 21411652 21966256 22465236 23461697 23958686 24546088 25167504
2949 25167504 25915227 26661911 27371072 28397739 29026496 29947327 31030549 32003363 33465005
2940 33465005 34723796 35960625 37510517 38635704 39604211 40912544 42316470 43212850
2932 43212850 44208215 44822931 46262237 47710971 49638879 51720213 53547102 55407428
2924 55407428 57478312 59600711 61761130 64193422 66372662 68860513 71174070 72961298
2916 72961298 75735522 78848603 82274107 85748109 89247116 92922501 96665728 100966804
2908A00966804M508818N057679N388465N439529N803057O180348O163354O427881
2900A45935935P088653Q086325R291037J0630502J2384519J4339137J5903462
2893B23659570J9124274K1921733K4198918K7618052K9315825L0223609L0667564
2886D06729545K8750295K5461984K1885857J7674250J2781862O104651k635120
2879E16753324j2607815k2165993k9807114l3342170l3708454l2737782l0078052
2872C22305944k6870207k4169152k1486994j8811193j6247460j4403340j3533249
2865A86784349j1687657j0387536r216932q733626q152818p544208o291238n801314
2857A18969020n464349m560036m634408m167312l260867l190707k851882k471005
$$ plain form
2908 100966804 105475622 110533301 115921766 121361295 127164352 133344700 139508054 145935935
2900 145935935 153024588 161110913 170401950 181032452 193416971 207756108 223659570
2893 223659570 242783844 264705577 288904495 316522547 345838372 376061981 406729545
2886 406729545 435479840 460941824 482827681 500501931 513283793 519388444 516753324
2879 516753324 504145509 481979516 452172402 418830232 385121778 352383996 322305944
2872 322305944 295435737 271266585 249779591 230968398 214720938 200317598 186784349
2865 186784349 175096692 164709156 155492224 146758598 138605780 131061572 124770334 118969020
2857 118969020 113504671 108944635 104310227 100142915 96882048 93691341 90839459 88368454
2849H8368454k515655k538368k488276k631418k819154k149924k148709k511665
2841F8565285k243217k101043k217922j694916j596486k218075j564281j654245
2833E3275100j452586j410760j651615j605572j127098j138410j615310r99082
2825D2274667r04380q44865j101220r77716j036992j163767j063875q30210q71921
2816C3479721j090931n43381o77970j247508m07790p23725j246338q95615n20510
2807B6125953n42560p89390l79008l28353M645p18484n29309n95028k35485p88417
2797B1224564p83444l31284R2173J3060q07134J22172l63912p75420j03636n85942
2787A7701197k99889k65081l80945l83484l1392J32868l14839K99829o80914k77252
$$ plain form
2849 88368454 85852799 83314431 80826155 78194737 75375583 73225659 71076950 68565285
2841 68565285 66322068 64221025 62003103 60308187 58711701 56493626 54929345 53275100
2833 53275100 51822514 50411754 48760139 47154567 46027469 44889059 43273749 42274667
2825 42274667 41370287 40525422 39424202 38446486 37409494 36245727 35181852 34351642 33479721
2816 33479721 32388790 31845409 31167439 29919931 29512141 28788416 27542078 26646463 26125953
2807 26125953 25583393 24794003 24414995 24086642 24091287 23372803 22843494 22248466 22012981 21224564
2797 21224564 20441120 20109836 20202009 20215069 19407935 19530107 19166195 18390775 18287139 17701197
2787 17701197 17401308 17136227 16755282 16371798 16340406 16473274 16158435 16458264 15777350 15500098
2777A5500098J17776n52843k55477j85709l12743l13394O6449J1093j5887j85777
2767A3873586l76060n10179l62811j500J35671k19345m81445j23849j17730L5220
2757A1851558p6632o1734j67104l93300q1801N67776m89674n82662k60293j89962
2747A0116172L4564m74058j34175N58463R9559o8256l0l58615k29977j3151L86463
2736I916959l72338k08139l73989j44547J26304K31938k52026K18844k34671K9055
2726H937390J88935j22157n42115n0323o8027n09283k474J39723O13394Q4828
2716H669891k22298k37290m07268l00705k48635L95900K70653k62520o5133j98796
2706G393799l8695j57547K06507o75632J33561j33098k22862l43534M27669k7959
$$ plain form
2777 15500098 15617874 15065031 14809554 14623845 14311102 13997708 14064157 14075250 14059363 13873586
2767 13873586 13497526 12987347 12624536 12623036 12758707 12539362 12057917 11934068 11816338 11851558
2757 11851558 11774926 11713192 11546088 11152788 11070987 11638763 11149089 10566427 10306134 10116172
2747 10116172 10150736 9676678 9542503 10100966 10200525 10132269 10132239 9773624 9543647 9530496 9916959
2736 9916959 9544621 9336482 8962493 8817946 8944250 9176188 8924162 9143006 8908335 8937390
2726 8937390 9126325 9004168 8462053 8411730 8343703 7834420 7831946 7971669 8585063 8669891
2716 8669891 8447593 8210303 7803035 7502330 7253695 7649595 7920248 7657728 7592595 7393799
2706 7393799 7355104 7197557 7404064 6728432 6861993 6728895 6506033 6162499 6590168 6562209
2696F562209m4933R0360p568J59887l04818k29062k96067m0204M45573n21905
2686E813472N6949l10385J38809k51039j75846P3592p3011k14598p6072J41018
2676E122889R4155j84241r2805K57276m95152j83538l92393J37M19195K19361
2666D764884K19120O637l17997j00955J01366m128j5520J61129m76562m69206
2656C868768j02585L73527j54280o9648k7350K01521J03127k70742k54560N5707
2646C723485M04279l3815l74580O59484j10633n64802j57523N7908N9580N7070
2636C720453q4240j94736M2572J57609m734q6601J24397J45099N6940n37949l94279
2625B944531L47593k18553N16872J07581j9195j63236M19026K98710o24165j75527
$$ plain form
2696 6562209 6517276 6607636 6600068 6759955 6455137 6226075 5930008 5889804 6335377 5813472
2686 5813472 5870421 5560036 5698845 5447806 5271960 5345552 5272541 5057943 4981871 5122889
2676 5122889 5217044 5032803 4939998 5197274 4702122 4518584 4126191 4126328 4545523 4764884
2666 4764884 4984004 4990641 4672644 4571689 4673055 4668927 4653407 4814536 4337974 3868768
2656 3868768 3766183 4139710 3985430 3915782 3888432 4089953 4193080 3922338 3667778 3723485
2646 3723485 4127764 4093949 3719369 4378853 4268220 3703418 3545895 3603803 3663383 3720453
2636 3720453 3636213 3441477 3484049 3641658 3636924 3550323 3674720 3819819 3876759 3338810 2944531
2625 2944531 3292124 3073571 3590443 3698024 3678829 3515593 3934619 4233329 3609164 3433637
2615C433637m749o1515k1461k06427M78926Q8651M230N52545k91875j66246L57565
2604D163281J98070j70097N56089K36339j40907J23102L6374j7391k80736k79668
2594D424456R9533j13557O2742J46915j32116k49373j18576l84784p6896m9730
2584C608614K46606P2200j73303j75991l48242q1527r6432R6973N6275K7058m17615
2573B814616L28396k26562m39989K67q5071K46263K69530n5k81593N6929j87414
2562B495317P08961j82226j74177k18586k3567M25282L630k28708j96843l5834
2552B573249J46400k54175q8069J17008L4169M1581l18904J18893j38052k04596
2542B027504K32028J32391o10673k28852K62226K28278k67260J11350m5466j81879
$$ plain form
2615 3433637 3428888 3367373 3345912 3139485 3618411 3707062 3711292 4263837 3971962 3805716 4163281
2604 4163281 4361351 4191254 4747343 4983682 4842775 4965877 5002251 4984860 4704124 4424456
2594 4424456 4523989 4410432 4473174 4620089 4487973 4238600 4120024 3735240 3658344 3608614
2584 3608614 3855220 3927420 3754117 3578126 3229884 3148357 3051925 3148898 3205173 3232231 2814616
2573 2814616 3143012 2916450 2476461 2476728 2391657 2637920 2907450 2907395 2625802 2682731 2495317
2562 2495317 3204278 3022052 2847875 2629289 2605722 3031004 3034634 2805926 2609083 2573249
2552 2573249 2719649 2465474 2377405 2494413 2528582 2570163 2251259 2370152 2232100 2027504
2542 2027504 2259532 2391923 1781250 1552398 1814624 2042902 1775642 1886992 1841526 1659647
2532A659647J37273J77564k94240K84960J43528J19878L13157L8174k28392J22172
2522B473721n99834n71471N43730N56336j38578j67277k1854k03888J16901K05632
2512B193418k06192n64493N91917J8474j82204k68574K13832L12761k99670j81472
2502A627797j5424J49613L80847n94937j12534L2247J87366K74425j44141l19035
2492A466224L0819K18393K95231J4908n08436L85158M02911k96515l07481Q2778
2482A783990L0481j59879J72868M6912j32560J59851k01318n4241j32182J96267
2472A710189k64229p9126j74356N85724L47858k06498J91580J03509k66091l71855
2462A576705K17054K30257l58607m2229j8971j99538L73717j11923k2330J49883
$$ plain form
2532 1659647 1796920 1974484 1680244 1965204 2108732 2228610 2541767 2579941 2351549 2473721
2522 2473721 1873887 1302416 1846146 2402482 2263904 2096627 2074773 1870885 1987786 2193418
2512 2193418 1987226 1422733 2014650 2033124 1850920 1582346 1796178 2108939 1809269 1627797
2502 1627797 1612373 1761986 2142833 1547896 1435362 1467609 1654975 1929400 1785259 1466224
2492 1466224 1497043 1715436 2010667 2025575 1517139 1902297 2305208 2008693 1701212 1783990
2482 1783990 1814471 1654592 1827460 1874372 1741812 1901663 1700345 1646104 1513922 1710189
2472 1710189 1445960 1366834 1192478 1778202 2126060 1919562 2111142 2214651 1948560 1576705
2462 1576705 1793759 2024016 1665409 1623180 1604209 1404671 1778388 1666465 1644135 1794018
2452A794018K78146k11220j63311m12144j04542J63787J11503J42014O6323k54136
2442A410438j50594j02906m611K32857M03411J74523k60452m52747R3898k14343
2432A129474j63066m6574J42379j33913O8512K52854k9477J17128L02369j85122
2422A454564r6929K25002N296j28382J47946J64597j45497q2498l15114J69638
2412A398623M2971j36883k74445j83710R5610L04100k181j89342M52553j81917
2402A325379m05280K33465J75114K42194n26016K15873J11651k8728l42731m7112
2392I53809P0224M96124N5467j5781j4520m55834M28218l2616m35553P0836J06449
2381A226823l81684J77714K76045l84626j5390L08981k2559k05514j09291J02251
$$ plain form
2452 1794018 2072164 1860944 1697633 1285489 1180947 1344734 1456237 1598251 1664574 1410438
2442 1410438 1259844 1156938 1152327 1385184 1788595 1963118 1702666 1249919 1343817 1129474
2432 1129474 966408 919834 1062213 928300 996812 1249666 1220189 1337317 1639686 1454564
2422 1454564 1357635 1582637 1587933 1459551 1607497 1772094 1626597 1544099 1228985 1398623
2412 1398623 1441594 1304711 1030266 846556 942166 1246266 1244085 1054743 1507296 1325379
2402 1325379 920099 1153564 1328678 1570872 1044856 1260729 1372380 1343652 1000921 953809
2392 953809 1024033 1520157 1575624 1559843 1545323 1089489 1517707 1485091 1049538 1120374 1226823
2381 1226823 845139 1022853 1298898 914272 898882 1207863 1185304 979790 870499 972750
2371I72750L27507J48357m66497j84916K25167n9234N77245j04468l49268J85340
2361A271983j29387J50106K67567l7820J75487j37156k23396j31458J12160j85077
2351A133009P3420j43242j82283r4722M26358k26292j99141M05522j60384J67906
2341A200151N52948k67626p731J18200J01217k00454m71362M7663K12827j30672
2331A155161l2748J17783k66339Q9091j84501k29458J78231J13282l3483M24862
2321A331881J03549p7180j74269j63946p3765J59971l25989N6856J72367J10662
2311A120137l48007M80973j01714l38747j37244K7683o8104J64694K89918L32535
2301A422124n49497K97746M2764l05531L7423K92611o8232M1919K61548m66771
$$ plain form
2371 972750 1300257 1448614 982117 797201 1022368 963134 1540379 1435911 1086643 1271983
2361 1271983 1142596 1292702 1560269 1522449 1697936 1560780 1337384 1205926 1318086 1133009
2351 1133009 1206429 1063187 880904 786182 1212540 986248 787107 1192629 1032245 1200151
2341 1200151 1753099 1485473 1477742 1595942 1697159 1496705 1025343 1073006 1285833 1155161
2331 1155161 1122413 1240196 973857 1062948 878447 648989 827220 940502 907019 1331881
2321 1331881 1435430 1358250 1183981 1020035 946270 1106241 780252 837108 1009475 1120137
2311 1120137 772130 1253103 1151389 812642 675398 703081 634977 799671 1089589 1422124
2301 1422124 872627 1170373 1213137 907606 945029 1237640 1169408 1211327 1472875 1006104
2291A006104J36595j63307k1854L03651k04276n1391K87619J5384j84300k0375
2281A103850l7576j27382J67182J78765j28215L27411Q6976m50909l24525k88358
2271E07219M05464K39028q1508k58743r2346L01976k52759M3673l2552L06742
2261A086194j26633k12913J64661k08213Q5509j59540k1106L98162M11822n36605
2251H81338O33938l17195l60179L67876J7670L5194l59782p8815j25654J04810
2241G99201L79136l53565J13911L1528p5513k98834O7535M9976N1998L77634m3962
2230A099045j73446j93704K08911L80245Q5039m11956j62353L52044j34684k2234
2220A026907J3284m17252M7334L92891k15807J59065L431l13826J59177M11700
$$ plain form
2291 1006104 1142699 979392 957538 1261189 1056913 1005522 1293141 1308525 1124225 1103850
2281 1103850 1066274 938892 1106074 1284839 1156624 1484035 1571011 1120102 795577 507219
2271 507219 912683 1151711 1070203 811460 719114 1021090 768331 812004 779452 1086194
2261 1086194 959561 746648 911309 703096 788605 629065 607959 1006121 1417943 881338
2251 881338 1515276 1198081 837902 1205778 1223448 1258642 898860 820045 694391 799201
2241 799201 1178337 824772 938683 970211 894698 595864 663399 713375 765373 1143007 1099045
2230 1099045 925599 731895 940806 1321051 1406090 994134 831781 1183825 1049141 1026907
2220 1026907 1040191 622939 670273 1063164 847357 1006422 1009853 696027 855204 1266904
2210A266904k41157n5279k69471M2432K62980r8753k08959J12456J08656j65344
2200G54465j39966L45484J40494k53873J85555J86029j92319R1363L28101k17246
2190A228087q6757m35701L28165q4509K96683R8529o8792L18180n92739K26980
2180A228126M38501l19420m14484k7866L5658K1376L92682j19400K76405L45473
2170A857051l59413j36429p3969k2006p6103K57384K60702K6719j65329N64866
2160B133473l26782j85873N09673j78965J71279M963M6691m15271l96194J96813
2150A559807P29075Q3626J83001O056l3319Q7094J7245J87646P5039L0784k36031
2139B690023k76917N0565L55656N1398M2749J02696L19955J08051j89165J42361
$$ plain form
2210 1266904 1025747 970468 700997 743429 1006409 907656 698697 811153 919809 754465
2200 754465 614499 959983 1100477 846604 1032159 1218188 1025869 1117232 1445333 1228087
2190 1228087 1141330 705629 1033794 949285 1245968 1344497 1275705 1593885 1001146 1228126
2180 1228126 1666627 1347207 932723 904857 940515 961891 1354573 1235173 1511578 1857051
2170 1857051 1497638 1361209 1287240 1265234 1189131 1446515 1707217 1733936 1568607 2133473
2160 2133473 1806691 1620818 2130491 1951526 2122805 2127768 2174459 1759188 1362994 1559807
2150 1559807 2288882 2372508 2555509 2561565 2528246 2615340 2632585 2820231 2895270 2926054 2690023
2139 2690023 2413106 2463671 2819327 2870725 2913474 3016170 3336125 3444176 3255011 3397372
2129C397372j68808K00069J36119N80154L82402K33323K49424M84784N8938L76661
2119E930438L50839M77792L83666K5810L53872L14417M64558Q82679Q23608O26240
2109A0633919M6040N85247Q49382J081750J508128K141254K404028L662679M394011
2100B7306438O521641Q855793J2797064J7044212J4288080M754767j0078803j5401388
2092F6087804j4464889j1186482p669774n588282l870858k760131k030809j808876
2084A6707703j017402q23452j072451n43881m53019r25800j220729o94905m09117
2075I546947j206881o15620k59805q10350k56768n89116k26678J13372M3787l65792
2065E373096n19575j92641l29216k03536R9175o5949k40393l03974o4970j9510
$$ plain form
2129 3397372 3228564 3428633 3564752 4144906 4527308 4760631 5010055 5494839 5553777 5930438
2119 5930438 6281277 6759069 7142735 7168545 7522417 7836834 8301392 9184071 10007679 10633919
2109 10633919 10679959 11265206 12114588 13196338 14704466 16845720 19249748 22912427 27306438
2100 27306438 33828079 42683872 55480936 72525148 86813228 91567995 81489192 66087804
2092 66087804 51622915 40436433 32766659 27178377 23307519 20547388 18516579 16707703
2084 16707703 15690301 14866849 13794398 13250517 12797498 11871698 10650969 9956064 9546947
2075 9546947 8340066 7724446 7464641 6654291 6397523 5808407 5581729 5695101 5738888 5373096
2065 5373096 4853521 4660880 4331664 4128128 4227303 4161354 3920961 3616987 3552017 3532507
2055C532507k46303j51878k0016N7923L76688r8348m94707L1264j89626m12609
2045B384895K66956L65570j26912l63392k35122k95745n6164O0637K21280P5672
2035B297675l38300l14365q6026O7905k44034L59894M76097l37893k1331r3759
2025A765863l44061j51831K47931J25266K39625n732j44319J6618l00881k19597
2015A228882J06793k5884j8522j88645L2920K58947k5791J01300J27145l73361
2005A223784j55899j02636k05281J14646J36865N3220j63731L69965L7913l91314
1995I17532k02463M6363J54889j00809L1825J26451J58583P2160J59652l70264
1985I93919r7784N7402k00488Q9452q897n0128k63237M85492m38500j80055N17143
$$ plain form
2055 3532507 3286204 3134326 3114310 3172233 3548921 3450573 2955866 2987130 2797504 2384895
2045 2384895 2651851 3017421 2890509 2527117 2291995 1996250 1940086 2000723 2222003 2297675
2035 2297675 1959375 1645010 1558984 1626889 1382855 1742749 2218846 1880953 1859622 1765863
2025 1765863 1421802 1269971 1517902 1643168 1882793 1877061 1732742 1749360 1448479 1228882
2015 1228882 1335675 1309791 1291269 1102624 1135544 1394491 1368700 1470000 1597145 1223784
2005 1223784 1067885 965249 759968 874614 1011479 1064699 900968 1270933 1308846 917532
1995 917532 715069 761432 916321 815512 847337 973788 1132371 1204531 1364183 993919
1985 993919 896135 953537 753049 842501 833604 783476 520239 1005731 567231 387176 904319
1974I04319j7760j58268K67005K28823N741l87658K04695P6730q4779J60153J85073
1963A384074k66596l60781Q356N89197j12743j2332k56610k02129J60874j43793
1953G87517L09401J01824j22191j51697J78180q5836O578r7471j45736L1154o4616
1942G47107M37607m9966K23895m10201m18481p5428m7589M60503l43173J1419
1932E35693L12988r0307j80064J99864J8126K37849k40056j56343r3924M6383
1922E90209k4520J39254J78089l07809r5171O8420J57884M4752K32700r984j37794
1911H36030n8906N1028k28260J60643k13008j63799R0248K98864k11043p2558
1901D89239M06536Q892K99335n33175j26691P2225J45473J09708L6414l61836
$$ plain form
1974 904319 886559 728291 995296 1224119 1229860 842202 1046897 1123627 1038848 1199001 1384074
1963 1384074 1117478 756697 765053 1354250 1241507 1229175 972565 770436 931310 787517
1953 787517 1096918 1198742 1076551 924854 1103034 1017198 1023776 926305 780569 811723 747107
1942 747107 1184714 1134748 1358643 948442 529961 454533 406944 867447 524274 535693
1932 535693 848681 758374 578310 778174 796300 1034149 794093 637750 543826 590209
1922 590209 565689 704943 883032 575223 480052 548472 706356 751108 983808 973824 836030
1911 836030 777124 828152 599892 760535 547527 383728 473976 772840 561797 489239
1901 489239 895775 904667 1204002 670827 544136 616361 761834 871542 907956 546120
1891E46120R2856L49773l53584l3197K87806n1156j71223l71709J25416J04978
1881E26080N03153m7574m21156N51141j87116k40641l1936J68428O8515J32762
1871A021656j22605j24374J19924J74828n26979m46158K36372L43775K40975m28007
1861D89407r2048k02874M4372J34451K38054n8077K1559Q6142N4996m1097K70410
1850I45295J70579O6766k30131M3569L2746J7748n94440k98314J82049J46799
1840D82666j341K62743j66464k65369P5316J07942O29009l90940n6118P9773j45363
1829F11854J17365J25600l02210J96824l14037J71951j62106Q9192k72689M09375
1819F71119K57896j65913J51312J09368L0635n65104l36548q5489L99125K01801
$$ plain form
1891 546120 638976 988749 635165 601968 889774 838618 667395 295686 421102 526080
1881 526080 1029233 981659 560503 1111644 924528 683887 651951 820379 888894 1021656
1871 1021656 899051 774677 894601 1069429 542450 96292 332664 676439 917414 489407
1861 489407 397359 194485 238857 373308 611362 553285 574844 660986 715982 674885 945295
1850 945295 1115874 1182640 952509 996078 1028824 1046572 452132 153818 335867 482666
1840 482666 481325 744068 577604 312235 387551 495493 1124502 733562 677444 757217 611854
1829 611854 729219 854819 552609 749433 435396 607347 445241 534433 261744 671119
1819 671119 929015 763102 914414 1023782 1054417 489313 152765 67276 466401 668202
1809F68202n77014J1678K90061Q6012Q000K0847J58939M60495j72956k57732l20496
1798C76036k77611M9187k29179O56260j31514Q7713k23901j59624J04255K69054
1788E20676j217k70841J07620P7252J2760j93890O522J23494J6140K92647P5655
1777G66818j22739m15406k61361j65407N58304n740J34052J28501k97438J26149
1767D45733K80724k17040j78526r7997K71077p5518O3893K5336K04737j28160
1757E94259j79321J6319q7669K89634k21146J96443l4080k04162n01907K95682
1747A64052m40130J32212P53426l36452k06186L56576l3325j50314J9228k07766
1737E1321j15406n7037O2872J33045k5287J81397J82154k84857k48944M9569O8736
$$ plain form
1809 668202 91188 102866 392927 478939 486939 507786 666725 1127220 954264 696532 376036
1798 376036 98425 147612 -81567 574693 443179 530892 306991 147367 251622 520676
1788 520676 519459 248618 356238 433490 446250 252360 258882 382376 398516 691163 766818
1777 766818 644079 228673 -32688 -198095 360209 354469 488521 617022 319584 445733
1767 445733 726457 509417 330891 232894 503971 428453 492346 517682 722419 594259
1757 594259 414938 431257 343588 633222 412076 608519 574439 370277 -131630 164052
1747 164052 -276078 -143866 609560 273108 66922 423498 390173 239859 259087 51321
1737 51321 -64085 -121122 -58250 74795 49508 230905 413059 128202 -120742 -71173 -2437
1726b437L21933r7438J65370K29769J63386j37611N7868L2486o4671N6507j0346
1715G14816j29636J21895m91642k55833P2740N8452L28055q5776l36714K85814
1705B82171j28066l8021N03720k97372l78557K43943K5516j61591J58005J77083
1695C86831n4944N14604j47395k83719O2949j60333j11680r8916J4204R0864n2141
1684A60324O3025j22182R9325k68237l41955r2957M17908M00270j04776K06016
1674D16761K66808q1555r203L41546m13790K25553p9286j00320k32226j4116n14546
1663a94374L9055O79170L18257k54298K4628j04685k47114P1170J37511J66219
1653F35539P4281m10237j41214L13826J25699k29198o5373M76957l64940m9878
$$ plain form
1726 -2437 319496 222058 387428 617197 780583 642972 700840 733326 668655 725162 714816
1715 714816 585180 707075 215433 -40400 32340 90792 418847 333071 -3643 282171
1705 282171 154105 116084 619804 322432 -56125 187818 213334 51743 209748 386831
1695 386831 331887 846491 699096 415377 478326 317993 206313 107397 121601 212465 160324
1684 160324 223349 101167 200492 -67745 -409700 -502657 -84749 315521 210745 416761
1674 416761 683569 602014 592811 934357 520567 746120 666834 566514 334288 320172 -194374
1663 -194374 -155319 523851 842108 587810 612438 507753 260639 331809 469320 635539
1653 635539 709820 299583 158369 472195 597894 368696 303323 780280 415340 365462
1643C65462p4809k47246N6769K5873R5086L5636K16006k77165K09271m47710k53938
1632b96765O97886M62048P7927n00954j17528K86498o6233K91668n29226L992
1622C09313k22647L0984J87032j18560J22075K3958j47375j14188j10690J73654
1612A33556J1035j37037J77785J92325l4782m32516n2813M68264J55411J6371
1602D97599k59746j3606P0047j42672r5680J55532J82714l33757R2891K09388
1592C62710l47074J65712L81691n18239M04620j01359R0723m0551p2940k10504
1582A14789q7234j24077N85871j6007K71699k80337j38646n4885o6804j63671
1572D0698k66378L18516k8093L09403j98641k88972L67311J29296q2088n7806
$$ plain form
1643 365462 290653 43407 100176 126049 221135 256771 472777 195612 404883 -42827 -296765
1632 -296765 401121 863169 941096 440142 322614 609112 542879 834547 305321 309313
1622 309313 86666 117650 304682 186122 308197 332155 184780 70592 -40098 133556
1612 133556 144591 7554 185339 377664 342882 -89634 -142447 325817 481228 497599
1602 497599 237853 224247 294294 151622 55942 211474 394188 60431 153322 362710
1592 362710 15636 181348 563039 44800 449420 348061 438784 398233 325293 114789
1582 114789 27555 -96522 489349 473342 745041 464704 326058 271173 204369 40698
1572 40698 -225680 92836 64743 374146 175505 -113467 253844 383140 301052 243246
1562B43246m8326j46850J7447J53199J46412K24903N0399m03044k82825J18925
1552G3486n8359N4201J00081J74869k87557K71747o4545j57346K08649J46945
1542D62171j70753l31895L47467K30421k27701J2230Q8768j44960J40308L03168
1532G09224N2157j64647n69382M91201o9876m75878K29458M12795K2498J08834
1522G46384j25123k30706o7430k04666M25242j9870k94729K34791j77639m89368
1512b03114J00739j70711k54153J94415N54501p2353j11740J06135k90265J54598
1502H052o0766k2500l34867K05692K65601J70258J19101l81731P8905L89974k10272
1491B27447j15013m59914j20019K65986l0118L90437p9548L14811l44740j16892
$$ plain form
1562 243246 194920 48070 65517 218716 365128 590031 640430 237386 -45439 73486
1552 73486 15127 69328 169409 344278 56721 328468 263923 106577 315226 462171
1542 462171 291418 -40477 306990 537411 309710 321940 410708 265748 406056 709224
1532 709224 761381 596734 27352 518553 448677 -27201 202257 615052 637550 746384
1522 746384 621261 390555 323125 118459 543701 523831 229102 463893 286254 -203114
1512 -203114 -102375 -273086 -527239 -332824 221677 149324 37584 143719 -146546 8052
1502 8052 -52714 -75214 -410081 -204389 61212 231470 350571 -31160 47745 437719 227447
1491 227447 112434 -347480 -467499 -201513 -231631 158806 79258 394069 49329 -67563
1481f7563K98737m4567k16439L7762j23182J02602M294J84486j69912M7142O19700
1470F73060M75090o07771m28753K72313L2832J08648l69454k71516L98496o7753
1460B15192k03993J1618K45764R4099M5240j16418M14515k40331r8660L9704l82221
1449B4509J61850J05774n35949j12061K12872J59182J82035L39637j44215n69156
1439a75522p679N0839L29333j26387L41468j59480n6805Q8502j13465k79467K22124
1428A13461m1754J09232J22564j17649N9296j36919J7366j14555k38414L00081
1418G2709K71794l37769J1300Q04343j78387m3756l61144J15648j10354l04714
1408f0330k8589O9103M14880o06376M07123Q4608l50902K65178L4722O5284j55994
$$ plain form
1481 -67563 231174 186607 -29832 7930 -115252 -12650 -8356 176130 6218 53360 673060
1470 673060 1148150 540379 111626 383939 416771 525419 155965 -115551 282945 215192
1460 215192 11199 22817 268581 362680 407920 291502 706017 465686 367026 406730 24509
1449 24509 186359 292133 -243816 -355877 -143005 16177 198212 537849 393634 -175522
1439 -175522 -183201 -132362 196971 70584 412052 252572 195767 284269 170804 -108663 113461
1428 113461 71707 180939 303503 185854 245150 108231 125597 11042 -227372 72709
1418 72709 344503 6734 18034 822377 643990 600234 239090 354738 244384 -60330
1408 -60330 -88919 -19816 395064 -211312 195811 280419 -70483 194695 229417 294701 138707
1397A38707L5804J18857k0600j16728o3717n6118K75201m04699J58041j06668
1387d1920J25129j57367M12465L27498j17439J76352j44238j92927q4333K44372
1377E47592r2383m32315l6785K38255K23126r4212j66393J9364q8840o5409q3318
1366c1318L98937K3499J14293n25029o2348K7943m6811J18763K94669j09469P5203
1355B78332m18764j94985L01303j0413R2363J89171k6475K75294N19981m33836
1345E71971m03239j51246K31121k43077M62630N1513m50299M49067r107k78726
1335B30608j48311J58833k17341J52680M7629j58370k34150j02391p5833k476
1325c49122K8791L46228N1260l2815J00857j49966k5385R4461N52655p4511n50003
$$ plain form
1397 138707 174511 293368 272768 156040 92323 36205 311406 -93293 64748 -41920
1387 -41920 83209 -74158 338307 665805 548366 724718 580480 387553 303220 547592
1377 547592 455209 22894 -13891 224364 447490 353278 186885 206249 117409 52000 -31318
1366 -31318 367619 391118 505411 -19618 -81966 -54023 -100834 17929 312598 203129 278332
1355 278332 -140432 -335417 -34114 -44527 47836 237007 210532 485826 1005807 571971
1345 571971 168732 17486 248607 5530 468160 519673 69374 518441 509334 230608
1335 230608 82297 241130 23789 176469 224098 65728 -168422 -270813 -346646 -349122
1325 -349122 -320331 25897 77157 44342 145199 -4767 -30152 64309 616964 542453 -7550
1314g550j10670K55616q4809L9204J64690k57768J62888j32067L31936n8143k67183
1303C6144J79802K00439l91639m76187p4384O41892J35289k84530j3582M85641
1293D38885L87527k6445m38854r526j56350n93865j28004M30644O3346J31054
1283I8412q8890l64065J92795R0290l28766J43576J15436k94511L84503J61285
1273A10065j3040n32231J40567M6366n6878m7706P6210R7001N96275J40768m76383
1262H1014m59735L06418L84900j58565J52706l9424p7134L2304k57331M91189
1252D56342r348r3791J65686k3458l6265l55172m63108K12434N92725n442m95624
1241e5021J17791m2250P2614k9043j01176L07810j49452J76095k93366m273J54603
$$ plain form
1314 -7550 -118220 137396 52587 91791 256481 -1287 161601 29534 361470 303327 36144
1303 36144 215946 416385 24746 -451441 -525825 116067 251356 -33174 -46756 438885
1293 438885 826412 799967 361113 351587 195237 -398628 -526632 -95988 -32642 98412
1283 98412 9522 -354543 -161748 -71458 -400224 -256648 -141212 -435723 -51220 110065
1273 110065 97025 -435206 -294639 -248273 -305151 -352857 -276647 -179646 416629 557397 81014
1262 81014 -378721 -72303 312597 154032 306738 267314 190180 222484 -34847 456342
1252 456342 446994 353203 518889 495431 459166 103994 -359114 -146680 446045 440603 -55021
1241 -55021 62770 20520 93134 64091 -37085 270725 121273 297368 4002 -271 154332
1230A54332K5857K57697K86523l84068k90470M9201K52170m1467l53575k6215
1220g0015L80371P1675j65377q4730j59410L95212m77690m5546K55023j77800
1210g8287k20105J25428N40231J85560n77795k22145J5968J22011L0467J99411
1200A20744J5438k62919m1990K00462K92214N4135l44236J37517K67428n7956
1190C80837J71385n0508j62827l91901k9013J55958M4234j66542r5863K17582
1180G3342M31347n74413m6934o3893M22506J73984l95805K55591L38153Q3488
1170F97366o19661Q8610O4956L04086l33035k94870k0182K81372L1406k76498
1160g6450M99185J2264N0839L8734Q256l93622J41839j47028l75421K55239k3253
$$ plain form
1230 154332 180189 437886 724409 340341 49871 99072 351242 309775 -43800 -70015
1220 -70015 310356 382031 216654 131924 -27486 367726 -109964 -155510 99513 -78287
1210 -78287 -298392 -172964 367267 552827 -24968 -247113 -231145 -109134 -78667 120744
1200 120744 136182 -126737 -168727 31735 323949 378084 33848 171365 438793 380837
1190 380837 552222 501714 338887 -53014 -82027 73931 118165 -48377 -144240 73342
1180 73342 504689 -69724 -116658 -180551 241955 415939 20134 275725 613878 697366
1170 697366 77705 166315 231271 535357 202322 -92548 -112730 168642 200048 -76450
1160 -76450 422735 434999 485838 524572 532828 139206 281045 134017 -241404 13835 -9418
1149i418J46546R8880P5627j16928k0616K49116k81584J41841k65450k09898J3514
1138a78370n151r8900j0525O2697K29168j14763k74272L78308j61644q0304J72938
1127h0818K57850j06955j78585j91029J25335K413J26227L38217o1995j6099K99229
1116E13790K8121l44197k81084J0026J40296O5449M18494k52907k48382j34405
1106h4799K05628J55950J17555l0397k93247J75158J30644K59868l2949r0623
1096E12788k54382n6380q5484k23666J59665m034K21038j76181j14345M03903
1086C82922l05964Q8181j06405J87669R020k23997j38269k17971K69850J36807
1076H1843j5724l60967N3390N41560o32643l2080K36057L04594o2807l34135K5465
$$ plain form
1149 -9418 137128 236008 311635 194707 174091 423207 141623 283464 18014 -191884 -178370
1138 -178370 -183521 -282421 -292946 -230249 -1081 -115844 -390116 -11808 -173452 -253756 -80818
1127 -80818 177032 70077 -108508 -299537 -174202 -171789 -45562 292655 230660 214561 513790
1116 513790 541911 197714 -83370 -73344 66952 132401 550895 297988 49606 -84799
1106 -84799 120829 276779 394334 363937 70690 245848 376492 636360 603411 512788
1096 512788 258406 202026 116542 -107124 52541 48507 269545 93364 -20981 382922
1086 382922 76958 165139 58734 246403 255423 31426 -106843 -324814 -54964 81843
1076 81843 66119 -294848 -241458 300102 -332541 -364621 -128564 176030 113223 -220912 -195447
1065a95447r2235L88266M03252k61396o22024K16304K33031K07294k538j96551
1055G7956k05357K00836m31461P1443J29079J91335o1454p4886j79480K0196l1621
1044b93414J63460j9419J1648L37057m6048k08854j30130L1128L95548L4733k46937
1033B8772M06304j87609k22023K30480p0966j17652j78541J29462N11189J17580
1023F46996k72910o91891p5046L48724J87258p4939M2768k55989L5016K07712
1013I7699m05880l10123M54820K94954j09348O4482j39085j11287K09533l72823
1003c27058L60563j31215k62885L04168n0058K31758j77985o041J56768k34244
993a36229k61901O0371L54186L56389n34811o84316M05378L4372J22883K45524
$$ plain form
1065 -195447 -287682 100584 503836 242440 -379584 -163280 69751 277045 274507 77956
1055 77956 -127401 73435 -358026 -286583 -157504 33831 -27623 -102509 -281989 -261793 -293414
1044 -293414 -129954 -149373 -137725 199332 153284 -55570 -185700 -154572 240976 275709 28772
1033 28772 435076 247467 25444 255924 184958 67306 -111235 18227 529416 646996
1023 646996 374086 -317805 -392851 -44127 143131 68192 110960 -145029 -110013 97699
1013 97699 -308181 -618304 -163484 131470 22122 86604 -52481 -163768 45765 -327058
1003 -327058 33505 -97710 -360595 -56427 -106485 125273 -52712 -58753 98015 -136229
993 -136229 -398130 -337759 16427 372816 -161995 -846311 -440933 -406561 -283678 -38154
983c8154K42644j22316j61395m2200K02401j16335J4761J30294l4386m54892L15229
972f4349m0327N432K41197k18784K16657O7279J3175K1190j49109q5858N05868
961E12371j35331k29143k63224o5674K85865l90596J65267O748k70500j8047M7185
950c55079K44181j49295J98537J62677p7325j0246j44574K64910L53877l62311
940A25352J13076k47661L74022l85610K00595J65647J81564K0197o5395m0924
930D40863k18167p799J5757Q0114j41669J84765k51861j78050m0461L8408J05985
919B7885K21350j69973k01404J97442r7433K0219J24048P5628l17534J38041l25772
908c07503l59702o3913o2909M67790j29280P354R2727J41191K1747k1858j59725
$$ plain form
983 -38154 204490 82174 -79221 -121421 80980 -35355 -20594 109700 75314 -379578 -64349
972 -64349 -104676 -99244 141953 -76831 139826 207105 220280 241470 92361 6503 512371
961 512371 377040 147897 -115327 -181001 104864 -285732 -120465 -113717 -384217 -402264 -355079
950 -355079 -110898 -260193 -61656 101021 23696 13450 -131124 133786 487663 125352
940 125352 238428 -9233 364789 -20821 179774 345421 526985 547182 481787 440863
930 440863 222696 214897 230654 310768 169099 353864 102003 -76047 -116508 -78100 27885
919 27885 249235 79262 -122142 75300 -22133 -1914 122134 197762 -119772 18269 -307503
908 -307503 -667205 -731118 -794027 -326237 -455517 -448163 -355436 -214245 -192498 -214356 -374081
897c74081j54854J54586J09138L30354j64975k13714Q8959j73792J80445j727
887b19661N20096j64017l08694m9036k7530K96949o1150j38626J10806J24804
877H3941k31581n1727N38930L0249j42657k80781K11501q4817K45727j27946k43073
866e2234j38965J64327P0697N9348q4786r3066l9011J0563J32322l42741P3980
855b39566K88067L46765k87573j64162k15842J81103K82082J86307j77968k92224
845i3011p2102J62553k99668J64020M9462j19059M3729L970j15758o5032J90955
834a49941n0248P4247J095p6731L15208K10914l07574p449J41537j56159J17159
823A12058q830j63059M7220j15023j62722j65691k1826M38934K87751m89417l11450
$$ plain form
897 -374081 -528935 -374349 -265211 65143 -99832 -313546 -224587 -398379 -217934 -219661
887 -219661 300435 136418 -172276 -221312 -248842 48107 -13043 -151669 -40863 83941
877 83941 -147640 -199367 339563 369812 227155 -53626 157875 73058 318785 190839 -52234
866 -52234 -191199 -26872 43825 103173 18387 -74679 -113690 -103127 29195 -313546 -239566
855 -239566 48501 395266 107693 -56469 -272311 -91208 190874 377181 199213 -93011
845 -93011 -165113 -2560 -302228 -138208 -88746 -207805 -164076 -160106 -275864 -340896 -149941
834 -149941 -200189 -125942 -124847 -201578 113630 324544 16970 9521 151058 -5101 112058
823 112058 103228 -59831 -12611 -127634 -290356 -456047 -477873 -38939 248812 -240605 -552055
812e52055M12742j24101K57984J65051o23959J28768K91970J354l52881K42725
802a52402o5898J13512J36396o9112K89102l53788j68851L88314k21736j61965
792b66428J98057r9204J30476o2581M07449L36825o18528j42383O5178q4829K41120
781A05152m52839k05535Q1272N01874K11640j43787j20662q836M5353k78071j8714
770b83153L86774j71089R3248L35596k82614k78635p23308K71427K66282o3298
760d48770L27203N6275j69019m16061N80353j42361o7010k01786K96154K65378
750H0356o717J1992m91487j07182p515o5682K64719P74393j43055o85455O1871
739c13762R9614L33125k07475j04485K12071k23624p0154j93056M2820K99963
$$ plain form
812 -552055 -139313 -263414 -5430 159621 -464338 -335570 -43600 -42246 -395127 -152402
802 -152402 -218300 -104788 31608 -37504 251598 -102190 -271041 117273 -104463 -266428
792 -266428 -68371 -167575 -37099 -99680 307769 644594 26066 -116317 -51139 -135968 105152
781 105152 -347687 -553222 -471950 29924 241564 97777 -22885 -31721 13632 -264439 -283153
770 -283153 103621 -67468 25780 361376 78762 -199873 -923181 -651754 -385472 -448770
760 -448770 -121567 -65292 -234311 -650372 -70019 -212380 -279390 -481176 -185022 80356
750 80356 73639 85631 -405856 -513038 -520553 -586235 -321516 452877 309822 -375633 -313762
739 -313762 -214148 118977 -88498 -192983 19088 -204536 -274690 -467746 -424926 -124963
729a24963K12647K38305o963O7587o14891o07278O53926r5824n1171j87889N39609
718B3095q9289j278j8869k49016J73283J45507m23550L36007K71346L48196k65011
707B50421j62455k28123n518O3507J29563L64481k91601j12660l51036k6037J43632
696b25826o2966q9361J741M26489Q6266p9477k22334m50931M38633M38026q2551
685A77709n02122L72255q6368k40807N51407l53675P9462J70153J7693l64340
675a78633m34179j56988K11163j88355K02769M66354j55277K94451j28526l7360
665a04581l17491L48125K20116o57519J63181k58995M61195j32454l94505K81766
655c91162J77174J81542q2080L21733n90906o941R1203k3556j09351O6544j26521
$$ plain form
729 -124963 87684 325989 319026 386613 -228278 -835556 -181630 -277454 -328625 -516514 23095
718 23095 -66194 -67472 -86341 -335357 -162074 -16567 -440117 -104110 167236 515432 250421
707 250421 87966 -140157 -145675 -82168 47395 411876 120275 7615 -343421 -369458 -225826
696 -225826 -288792 -378153 -376412 50077 136343 56866 -165468 -616399 -177766 260260 177709
685 177709 -324413 47842 -38526 -279333 272074 -81601 -2139 168014 185707 -178633
675 -178633 -612812 -769800 -558637 -746992 -544223 -77869 -233146 61305 -67221 -104581
665 -104581 -422072 -73947 146169 -511350 -348169 -607164 -145969 -278423 -672928 -391162
655 -391162 -213988 -32446 -114526 207207 -383699 -390640 -299437 -322993 -432344 -365800 -492321
644d92321L92598j88455K05790j24850L308K6216j5641L1992j5169q811k49306
633d34649M5772k8052J37873j90456M29668m05497j0103l1420P1488L59026k70298
622c26648j14897m4606K38806M361O2598p2124J52317O05M4383J68905j69241
611e5541N2974k4082l95015K89138k32444j92902K91584j2032j12418l00250k34013
600i25001M22851N79530J38376n59429J58278K85429k37572m88230L83422k5360
590b67706J5408J08537l87324N75295N32884j73868j3535j61008l28918J45706
580D5471N4474j79544Q9525p0468l18627J90170j27227j57441J38773N97076k51006
569A1176m43403R8680L15476j40706J25783K36031N9690o00375j67496J97423
$$ plain form
644 -492321 -99723 -288178 -82388 -207238 -203930 -177714 -193355 -161363 -176532 -185343 -434649
633 -434649 -388877 -416929 -279056 -469512 -39844 -445341 -455444 -486864 -415376 -56350 -326648
622 -326648 -441545 -486151 -247345 -242984 -180386 -252510 -100193 -99588 -55205 113700 -55541
611 -55541 -2567 -26649 -421664 -132526 -364970 -557872 -266288 -278320 -390738 -690988 -925001
600 -925001 -502150 77380 215756 -343673 -185395 100034 -137538 -625768 -242346 -267706
590 -267706 -252298 -143761 -531085 44210 577094 403226 389691 228683 -100235 45471
580 45471 99945 -79599 9926 -60542 -379169 -188999 -316226 -473667 -334894 262182 11176
569 11176 -432227 -333547 -18071 -158777 -32994 203037 262727 -337648 -505144 -307721
559c07721J97018m61852k07869R097K81284K14476J3529K36680j00674K68185
549A42153k84190m2906L50872m04605j89954K31235o9585R6727O44693n48835
539g4395J11368J37807k98728K90768j93298k64783J08454J3028j02114j65928
529d37821L55213j86309p8864M4820K12442k02708k79245J67964J140L75771j51185
518a78782K92213k13980j77234k37755l34685K32177M20619K9k44962K4675L23161
507i4524K7911j6026J03293M26467l36259k92862l9035J04759J71694l79112N5829
496b67865l4133Q2561l716K1260K50261j87938n09896k22200L69662q2147R2169
485d91982j08587o54991M11089J66866l04337L58449J12652q5219L39508p4392
$$ plain form
559 -307721 -110703 -572555 -780424 -771327 -490043 -275567 -262038 -25358 -126032 142153
549 142153 -142037 -184943 165929 -238676 -428630 -197395 -266980 -170253 474440 -74395
539 -74395 36973 174780 -123948 166820 -26478 -291261 -182807 -169779 -271893 -437821
529 -437821 -82608 -268917 -347781 -302961 -90519 -293227 -572472 -404508 -403368 -27597 -178782
518 -178782 113431 -100549 -277783 -515538 -850223 -618046 -197427 -197398 -442360 -417685 -94524
507 -94524 -66613 -82639 20654 447121 110862 -182000 -221035 -116276 55418 -323694 -267865
496 -267865 -301998 -219437 -223153 -201893 48368 -139570 -649466 -871666 -502004 -584151 -491982
485 -491982 -600569 -1255560 -844471 -677605 -981942 -623493 -510841 -596060 -256552 -330944
475c30944k76119R168K51470k8462o9942N76622n43720k02728L64177l55463J24608
464d81333k3445O40211j48299j83305J54051j69100l96071J64290J33591J39452
454a69958J50206q94N6465k5816J74498q2020N5734l36096m90214K5498P15039
443G2442J11969L14312j83058l0211l18421k26660j22478K34839p5044j44202
433c66512j32846O16056j94507k93605M17001L0973j37403l80201J96233K8201
423b16610J73420k11596l45739K33407Q5647o7644n1008N6418j18855L04151K68560
412A10151k35439k84147j99886K26235N3408K48350k35221j77131m17567N3568
402h57679M21473J76900M71755J07066l76285j8726j36866J33666j01644j58222
$$ plain form
475 -330944 -607063 -597895 -346425 -374887 -444829 131793 -411927 -614655 -250478 -605941 -481333
464 -481333 -504778 135433 -12866 -196171 -42120 -211220 -607291 -443001 -309410 -169958
454 -169958 -19752 -20646 35819 10003 184501 102481 158215 -177881 -668095 -642597 72442
443 72442 184411 498723 315665 285454 -32967 -259627 -382105 -147266 -222310 -366512
433 -366512 -499358 116698 -77809 -371414 45587 76560 -60843 -441044 -244811 -216610
423 -216610 -43190 -254786 -600525 -367118 -281471 -349115 -400123 -343705 -462560 -158409 110151
412 110151 -125288 -409435 -609321 -383086 -329678 -81328 -316549 -493680 -911247 -857679
402 -857679 -436206 -259306 212449 319515 -56770 -75496 -212362 -78696 -180340 -338562
392c38562l43156l0424M32190J42882k28024L08330q5516k00367K8171j26568
382d41044L7727N6490J36151N3519M27642O7928k24575l36686O7384Q5856k5499
371i5107J60179j89465l31890R1720j22000L65116m42575m5078K38050m5043J56172
360b59921q4552l7415j12213M33917k50302K83589j68526L93581P8945k60948
350A6155m42859j98274J02497j64005l5124J2827K77798J18799m54984K18029
340e49141J72001M2815M48656p4788k83103j43424J44721K00552q9547q8481k79103
329d98842k95224N90898n8841J10781k46480J1825J28114J23598l25708Q814O679
318d44386N2245l49691L7589j04471L32495L53931J12848k33878j22491l4877
$$ plain form
392 -338562 -681718 -712142 -279952 -137070 -365094 -56764 -142280 -342647 -314476 -441044
382 -441044 -403317 -346827 -210676 -157157 270485 338413 113838 -222848 -155464 -69608 -95107
371 -95107 65072 -124393 -456283 -364563 -486563 -121447 -564022 -609100 -371050 -416093 -259921
360 -259921 -344473 -381888 -494101 -60184 -310486 -26897 -195423 198158 277103 16155
350 16155 -426704 -624978 -522481 -686486 -721610 -708783 -430985 -312186 -767170 -549141
340 -549141 -377140 -334325 114331 39543 -243560 -386984 -242263 -41711 -131258 -219739 -498842
329 -498842 -794066 -203168 -262009 -151228 -397708 -385883 -257769 -134171 -459879 -451065 -444386
318 -444386 -392141 -741832 -704243 -808714 -476219 -122288 -9440 -243318 -365809 -400686
308d00686j33796K34656P7886N10093k13483o08529J28152j52673m08515M44756
298e22139J29605o0595j26186l89398N79692M17130m47584p7402Q7996K40820
288a68061J42289k60348k17407K44745p5342K41914J46756m48905j46626K34304
278c06681K26790K26462k97907m75277J2789J51630K58590J26712j18136k24709
268d19737R3860j51105l25690K91374J19862O23789k46506j98391J86397J11448
258H5301K3232j08400k08557J24810j31745k85592J65071J01996K44990k44923
248b33817k02459r079K72727L68378k46171J53554l95944l45367O122K11540J81489
237b39027M77343l13403m82667Q5625J16117m2841J52860Q898K15186o5566q5573
$$ plain form
308 -400686 -534482 -299826 -221940 288153 74670 -533859 -405707 -558380 -966895 -522139
298 -522139 -392534 -453129 -579315 -968713 -389021 28109 -419475 -496877 -408881 -168061
288 -168061 -25772 -286120 -503527 -258782 -334124 -92210 54546 -394359 -540985 -306681
278 -306681 -79891 146571 -151336 -626613 -613824 -462194 -203604 -76892 -195028 -419737
268 -419737 -325877 -476982 -802672 -511298 -391436 232353 -14153 -212544 -26147 85301
258 85301 108533 133 -208424 -83614 -215359 -500951 -335880 -233884 11106 -233817
248 -233817 -436276 -445355 -172628 195750 -50421 103133 -292811 -638178 -632056 -420516 -239027
237 -239027 238316 -75087 -557754 -472129 -356012 -398853 -245993 -237095 -21909 -87475 -173048
226a73048j08635q5133L1423k58347L15884j5278J3192K03108j2423q2607M9722
215a22142M2903j34483K1650M22641j50193q3485p29547J62104R5557j34085j53173
204g62253M81460N0493l76193k89894K28665L27723k58863M33361o9561k86602
194e21664K81043j62445k66790J10732L50501J14169k28362r459K50499l94089
184d75865L02060q1459j81976K78302l48668l00628R4702L4423K88305K67002
174a23802k25812l19142o5999L45557L48087j88503l33808j0901K27456m17037
164g63904j04848L72741j8464J69740j05033N7458P734J3449m71k3391M6756j43516
152d91749M9959K53057j8297J28696m39624L74570j49601k68331j05572K44883
$$ plain form
226 -173048 -281683 -366816 -335393 -593740 -277856 -293134 -279942 -76834 -89257 -171864 -122142
215 -122142 -79239 -213722 -192072 230569 80376 -3109 -732656 -570552 -474995 -609080 -762253
204 -762253 -280793 -230300 -606493 -896387 -667722 -339999 -598862 -165501 -235062 -521664
194 -521664 -240621 -403066 -669856 -559124 -208623 -94454 -322816 -332275 -81776 -475865
184 -475865 -173805 -255264 -437240 -158938 -507606 -808234 -713532 -679109 -390804 -123802
174 -123802 -349614 -668756 -734755 -389198 -41111 -229614 -563422 -574323 -346867 -763904
164 -763904 -868752 -496011 -514475 -344735 -449768 -392310 -384576 -371127 -371598 -394989 -348233 -491749
152 -491749 -441790 -188733 -207030 -78334 -517958 -143388 -292989 -561320 -666892 -422009
142d22009K67831j78953n5453j82269j78950K81297J78755j04341j338L5307k057
131c62180l9128O9626k34894k68090J51000L14185j51591o929M15383N3491J6228
120d2899j828j47183j92412n1036J03497J60223n3482K40562m6026k38525K35975
109c3134k60444k83926J42020J55916j5236J13363L0187k34542m8641q0637R8872
98d16202K92811m202r4980j66008j889J18209p1965q0605k22757j00282Q5554
87f62316j50973O3426j33716K27146O8680j26811K85091J91649j92146R3335J14694
76b21941J10632J39924j12933k28660K4817r6035J65994K08583l64240j57645
66e31504J04588L8308q1275K59190J96277m12699L972L22560l17490j71410P8469
$$ plain form
142 -422009 -154178 -333131 -388584 -570853 -749803 -468506 -289751 -394092 -395430 -360123 -362180
131 -362180 -401308 -331682 -566576 -834666 -683666 -369481 -521072 -528001 -112618 -59127 -42899
120 -42899 -44727 -191910 -384322 -435358 -331861 -171638 -225120 15442 -30584 -269109 -33134
109 -33134 -293578 -577504 -435484 -279568 -294804 -181441 -151254 -385796 -434437 -515074 -416202
98 -416202 -123391 -127593 -222573 -388581 -390470 -272261 -344226 -424831 -647588 -747870 -662316
87 -662316 -813289 -749863 -883579 -656433 -587753 -714564 -429473 -237824 -429970 -336635 -221941
76 -221941 -111309 28615 -84318 -312978 -288161 -384196 -218202 -9619 -373859 -531504
66 -531504 -426916 -388608 -469883 -210693 -14416 -427115 -423143 -100583 -418073 -589483 -511014
55e11014L3819L45565m9511r9193l1439K10160j06752j49007n4096Q3936j16504
44d44036j38376j13825K43411K17882l48304n1004K52233J42926n8116P6889l05716
33e26036j41389J78122J40745J46509j01520q4234j71543j73015J84757Q0960
23d66644j87365L71796q3222l7464L26216n1414k99312m25981M29577J46273J66382
12a11158j80138J67995l7517k66251J42054j15915M9758k10467j07396J9070J19082
1e30883j02201
0f33084
$$ plain form
55 -511014 -477195 -131630 -181141 -280334 -311773 -101613 -208365 -357372 -411468 -327532 -444036
44 -444036 -582412 -696237 -452826 -234944 -583248 -634252 -382019 -239093 -297209 -220320 -526036
33 -526036 -667425 -489303 -348558 -202049 -303569 -387803 -559346 -732361 -547604 -466644
23 -466644 -654009 -282213 -365435 -402899 -76683 -128097 -427409 -853390 -423813 -277540 -111158
12 -111158 -291296 -123301 -160818 -427069 -285015 -400930 -351172 -561639 -669035 -649965 -530883
1 -530883 -633084
0 -633084
$$ Imaginary data points
##PAGE= N=2
##DATA TABLE= (X++(I..I)), XYDATA
16383b774828j65511J42734j53850J64406j22809L07187Q14P4795k11830l72303
16373c111195K31739K16109K35261j25449M1810L97051O3758k71211j73922K11503
16363b284546N337K23404m8348j03911K83231R5563m8692p1562J98776k20669
16353a971417M18551J09929Q9881k24875O5700j86015J13216q5860j08083J44572
16343a634401J84489N8773j02179J92670j8074j47441K04535K28181q1354l03764
16333a418565M14791K08256J61943k4235K75291N325p1864p7569k22444J6898
16323g32173m5403p0054L19250K09060K89004J25755k32990q1932n6622P2311
16313b03794K06716j03279r5595j5592J6608K28753j70608j10555k50953L31675
$$ plain form
16383 -2774828 -2940339 -2797605 -2951455 -2787049 -2909858 -2602671 -2601857 -2527062 -2738892 -3111195
16373 -3111195 -2879456 -2663347 -2428086 -2553535 -2511725 -2114674 -2050916 -2322127 -2496049 -2284546
16363 -2284546 -2279209 -2055805 -2104153 -2208064 -1924833 -1829270 -1877962 -1949524 -1750748 -1971417
16353 -1971417 -1552866 -1442937 -1353056 -1577931 -1512231 -1698246 -1585030 -1670890 -1778973 -1634401
16343 -1634401 -1449912 -1391139 -1493318 -1300648 -1318722 -1466163 -1261628 -1033447 -1114801 -1418565
16333 -1418565 -1003774 -795518 -633575 -657810 -382519 -377194 -449058 -526627 -749071 -732173
16323 -732173 -777576 -847630 -528380 -319320 -30316 95439 -137551 -219483 -276105 -203794
16313 -203794 2922 -100357 -195952 -211544 -194936 33817 -136791 -247346 -498299 -166624
$$ [...]
##END NTUPLES=NMR SPECTRUM
##END=
