##TITLE=1H_TG-2307-Ia2
 CDCl3
 8 sc, 
 7.7.2023
##JCAMPDX= 6.0         $$ Bruker NMR JCAMP-DX V2.0
##DATA TYPE= NMR SPECTRUM
##DATA CLASS= NTUPLES
##ORIGIN= UXNMR, Bruker Analytische Messtechnik GmbH
##OWNER= root
$$ XWIN-NMR		Version 3.5
$$ Fri Jul  7 14:04:20 2023 Russian Standard Time (UT+4h)  she@DPX200
##.OBSERVE FREQUENCY= 200.13135
##.OBSERVE NUCLEUS= ^1H
##.ACQUISITION MODE= SIMULTANEOUS
##.ACQUISITION SCHEME= undefined
##.AVERAGES= 8
##.DIGITISER RES= 18
##SPECTROMETER/DATA SYSTEM= spect
##.PULSE SEQUENCE= zg30
##.SOLVENT NAME= CDCl3
##.SHIFT REFERENCE= (INTERNAL, CDCl3, 0, 15.7634)
##AUDIT TRAIL= $$ (NUMBER, WHEN, WHO, WHERE, WHAT)
$$ ##TITLE= Audit trail, XWIN-NMR		Version 3.5
$$ ##JCAMPDX= 5.01
$$ ##ORIGIN= Bruker BioSpin GmbH
$$ ##OWNER= she
$$ F:/spectra/data/she/nmr/H-F/1/pdata/1/auditp.txt
$$ ##AUDIT TRAIL=  $$ (NUMBER, WHEN, WHO, WHERE, WHAT)
(   1,<2023-07-07 14:03:07.50 +0400>,<she>,<DPX200>,
      <created by zg, POWCHK disabled, PULCHK disabled
       configuration hash MD5:
       00 E9 B6 7A A2 85 ED C7 34 08 36 98 17 FE 4E 26
       data hash MD5: 16K
       F3 42 64 F7 12 8C F9 AB C1 7A 04 A3 D4 3C 89 85>)
(   2,<2023-07-07 14:03:10.03 +0400>,<she>,<DPX200>,
      <Start of raw data processing
       efp BC_mod = 2 LB = 0.24 FT_mod = 6 PKNL = 1 PHC0 = -20995.15 PHC1 = 18.85272 SI = 16K 
       data hash MD5: 16K
       53 E1 16 52 B2 86 60 9E BC A6 2E 5C 2F CE A8 C6>)
(   3,<2023-07-07 14:03:31.28 +0400>,<she>,<DPX200>,
      <pk PHC0 = 3.352746 PHC1 = -5.6 
       data hash MD5: 16K
       F7 72 B1 A7 F5 FF 69 A1 50 B3 76 DE D9 F1 BF DB>)
(   4,<2023-07-07 14:03:34.17 +0400>,<she>,<DPX200>,
      <abs ABSG = 5 
       data hash MD5: 16K
       54 5A 83 D6 66 43 A2 D3 66 32 56 94 3F 4B E5 15>)
$$ ##END=
$$ 
$$ hash MD5
$$ 72 9E 54 C8 03 64 E8 99 27 8B F7 E5 A5 E7 2C 30
##$RELAX= 
##$RELAX= 
##$RELAX= 
##$RELAX= 
##$RELAX= 
##$RELAX= 
$$ Bruker specific parameters
$$ --------------------------
##$DU= <F:/spectra>
##$EXPNO= 1
##$NAME= <H-F>
##$PROCNO= 1
##$TYPE= <nmr>
##$USER= <she>
##$AMP= (0..31)
100 100 100 100 100 100 100 100 100 100 100 100 100 100 100 100 100 100 
100 100 100 100 100 100 100 100 100 100 100 100 100 100 
##$AQSEQ= 0
##$AQ_mod= 1
##$AUNM= <au_zg>
##$AUTOPOS= <>
##$BF1= 200.13
##$BF2= 200.13
##$BF3= 200.13
##$BF4= 200.13
##$BF5= 200.13
##$BF6= 200.13
##$BF7= 200.13
##$BF8= 200.13
##$BYTORDA= 1
##$CFDGTYP= 0
##$CFRGTYP= 5
##$CHEMSTR= <none>
##$CNST= (0..31)
1 1 145 1 1 1 1 1 1 1 1 1 1 1 1 1 1 1 1 1 1 1 1 1 1 1 1 1 1 1 1 1 
##$CPDPRG= <>
##$CPDPRG1= <>
##$CPDPRG2= <>
##$CPDPRG3= <>
##$CPDPRG4= <mlev>
##$CPDPRG5= <mlev>
##$CPDPRG6= <mlev>
##$CPDPRG7= <mlev>
##$CPDPRG8= <mlev>
##$CPDPRGB= <>
##$CPDPRGT= <>
##$D= (0..31)
0 1.2 0 0 0 0 0 0 0 0.06 0 0.03 0 0 0 0 0.0002 0 0 0 0 0 0 0 0 0 0 0 0 
0 0 0 
##$DATE= 1688724186
##$DBL= (0..7)
120 120 120 120 120 120 120 120 
##$DBP= (0..7)
150 150 150 150 150 150 150 150 
##$DBP07= 0
##$DBPNAM0= <>
##$DBPNAM1= <>
##$DBPNAM2= <>
##$DBPNAM3= <>
##$DBPNAM4= <>
$$ [...]
##$SUBNAM3= <"">
##$SUBNAM4= <"">
##$SUBNAM5= <"">
##$SUBNAM6= <"">
##$SUBNAM7= <"">
##$SUBNAM8= <"">
##$SUBNAM9= <"">
##$SW= 18.05172834244
##$SWIBOX= (0..15)
0 0 2 0 0 0 0 0 0 0 0 0 0 0 0 0 
##$SW_h= 3612.71676300578
##$TD= 16384
##$TD0= 1
##$TE= 0
##$TE2= 300
##$TE3= 300
##$TEG= 300
##$TL= (0..7)
0 120 120 120 120 120 120 120 
##$TP= (0..7)
150 150 150 150 150 150 150 150 
##$TP07= 0
##$TPNAME0= <>
##$TPNAME1= <>
##$TPNAME2= <>
##$TPNAME3= <>
##$TPNAME4= <>
##$TPNAME5= <>
##$TPNAME6= <>
##$TPNAME7= <>
##$TPOAL= (0..7)
0.5 0.5 0.5 0.5 0.5 0.5 0.5 0.5 
##$TPOFFS= (0..7)
0 0 0 0 0 0 0 0 
##$TUNHIN= 0
##$TUNHOUT= 0
##$TUNXOUT= 0
##$USERA1= <user>
##$USERA2= <user>
##$USERA3= <user>
##$USERA4= <user>
##$USERA5= <user>
##$V9= 5
##$VALIST= <valist>
##$VCLIST= <CCCCCCCCCCCCCCC>
##$VD= 0
##$VDLIST= <DDDDDDDDDDDDDDD>
##$VPLIST= <PPPPPPPPPPPPPPP>
##$VTLIST= <TTTTTTTTTTTTTTT>
##$WBST= 1024
##$WBSW= 4
##$XGAIN= (0..3)
0 0 0 0 
##$XL= 0
##$YL= 0
##$YMAX_a= 350832
##$YMIN_a= -601775
##$ZGOPTNS= <>
##$ZL1= 120
##$ZL2= 120
##$ZL3= 120
##$ZL4= 120
##$ABSF1= 15.74358
##$ABSF2= -2.30827
##$ABSG= 5
##$ABSL= 3
##$ALPHA= 0
##$AQORDER= 0
##$ASSFAC= 0
##$ASSFACI= 0
##$ASSFACX= 0
##$ASSWID= 0
##$AUNMP= <proc_1d>
##$AZFE= 0.1
##$AZFW= 0.1
##$BCFW= 0
##$BC_mod= 2
##$BYTORDP= 0
##$COROFFS= 0
##$CY= -3
##$DATMOD= 1
##$DC= 0
##$DFILT= <>
##$DTYPP= 0
##$F1P= 0
##$F2P= 0
##$FCOR= 1
##$FTSIZE= 16384
##$FT_mod= 6
##$GAMMA= 0
##$GB= 0
##$INTBC= 1
##$INTSCL= 3.70164e-10
##$ISEN= 128
##$LB= 0.24
##$LEV0= 0
##$LPBIN= 0
##$MAXI= 10000
##$MC2= 0
##$MEAN= 0
##$ME_mod= 0
##$MI= 1.114404
##$NCOEF= 0
##$NC_proc= -7
##$NLEV= 6
##$NOISF1= 3.799351
##$NOISF2= 2.8
##$NSP= 0
##$NTH_PI= 0
##$NZP= 0
##$OFFSET= 15.76342
##$PC= 1
##$PHC0= -20991.8
##$PHC1= 13.25272
##$PH_mod= 1
##$PKNL= yes
##$PPARMOD= 0
##$PSCAL= 0
##$PSIGN= 0
##$REVERSE= no
##$SF= 200.130001625351
##$SI= 16384
##$SIGF1= 3
##$SIGF2= 2
##$SINO= 5.538805
##$SIOLD= 16384
##$SREGLST= <1H.CDCl3>
##$SSB= 0
##$STSI= 16384
##$STSR= 0
##$SW_p= 3612.71676300578
##$SYMM= 0
##$S_DEV= 0
##$TDeff= 16384
##$TDoff= 0
##$TI= <>
##$TILT= no
##$TM1= 0
##$TM2= 0
##$TOPLEV= 0
##$USERP1= <user>
##$USERP2= <user>
##$USERP3= <user>
##$USERP4= <user>
##$USERP5= <user>
##$WDW= 1
##$XDIM= 16384
##$YMAX_p= 462518527
##$YMIN_p= -511387
$$ End of Bruker specific parameters
$$ ---------------------------------
##NTUPLES= NMR SPECTRUM
##VAR_NAME=  FREQUENCY,     SPECTRUM/REAL,   SPECTRUM/IMAG
##SYMBOL=    X,             R,               I
##VAR_TYPE=  INDEPENDENT,   DEPENDENT,       DEPENDENT
##VAR_FORM=  AFFN,          ASDF,            ASDF
##VAR_DIM=   16384,         16384,           16384
##UNITS=     HZ,            ARBITRARY UNITS, ARBITRARY UNITS
##FACTOR=    0.220516191357247, 1,           1
##FIRST=     3154.73329123083, 0,            0
##LAST=      -457.983471774948, 0,           0
##MIN=       -457.983471774948, -511387,     0
##MAX=       3154.73329123083, 462518527,    0
$$ Real data points
##PAGE= N=1
##DATA TABLE= (X++(R..R)), XYDATA
$$ [...]
5582F018233J36356J63874m111O7199K20817N7845m8092j72492j77268J20315
5572F382676J0262j69438p7505J8533j82852J46868m2089K54888J33142j11916
5562F362569N7925j24015j13255k50192j0167j64705k61600j71092J39571j35809
5552E329230J02354p4261J19208k37898k49061L0655j22887k5352j55051p7612
5542D639325m2749N590N7881j10372K50256K61729l92788r4147j15067J81279
5532D640937m7179r7924J46465J50330M9473p9366P3058K176q8044n9464O6762
5521D757224Q6002J17888k48760l1222K8267K09563J53517m6743j26958n3639
5511D845139K2842O5231j75399k15272R3009J29584N3210l8586J93833Q5723k74162
$$ plain form
5582 6018233 6154589 6318463 6314352 6381551 6602368 6660213 6612121 6439629 6262361 6382676
5572 6382676 6392938 6223500 6145995 6164528 5981676 6128544 6086455 6341343 6474485 6362569
5562 6362569 6420494 6296479 6183224 5933032 5922865 5758160 5496560 5325468 5465039 5329230
5552 5329230 5431584 5357323 5476531 5238633 4989572 5020227 4897340 4871988 4716937 4639325
5542 4639325 4596576 4602166 4660047 4549675 4799931 5061660 4668872 4574725 4459658 4640937
5532 4640937 4593758 4495834 4642299 4792629 4842102 4762736 4835794 4837970 4749926 4690462 4757224
5521 4757224 4843226 4961114 4712354 4681132 4709399 4918962 5072479 5025736 4898778 4845139
5511 4845139 4867981 4933212 4757813 4542541 4635550 4765134 4818344 4779758 4973591 5059314 4785152
5500D785152o4225J78212J53704J23421J22047P4016M1485l7576j9114R0542j33424
5489E314240K7719J12576J58996K53670Q0317J79470Q914M5730K85145K01686
5479F668463N9878L92945L47778P9662L03091j20813J37050J60698p8212j66519
5469G784021o9840J15668R9071j18373k69046o864L78345r6660l3728J92451j34374
5458G840671J38480K777L0307K0957K10520J15774J39155N2096J54489P976J2732
5447H725934K18251m1784R9279j3145j85518m64944l44855m18302m22440k46974
5437F905502j41280l52249k19260k16980j71716P3384k67334j03460O2846j67381
5427E402072j4620J6612j42182N3430R0214K40536j51888o0340L86839K86965
$$ plain form
5500 4785152 4720927 4899139 5052843 5176264 5298311 5372327 5413812 5376236 5357122 5447664 5314240
5489 5314240 5341959 5454535 5613531 5867201 5947518 6126988 6135902 6181632 6466777 6668463
5479 6668463 6728341 7121286 7469064 7548726 7851817 7731004 7868054 8028752 7950540 7784021
5469 7784021 7714181 7829849 7928920 7810547 7541501 7534637 7912982 7816322 7782594 7975045 7840671
5458 7840671 7979151 7981928 8012235 8033192 8243712 8359486 8498641 8550737 8705226 8713202 8725934
5447 8725934 8944185 8902401 9001680 8988535 8803017 8338073 7993218 7574916 7152476 6905502
5437 6905502 6764222 6411973 6192713 5975733 5804017 5877401 5610067 5506607 5569453 5402072
5427 5402072 5387452 5404064 5261882 5315312 5405526 5646062 5494174 5433834 5820673 6107638
5417F107638r6077k39524M02113L65801K64082J31478l55430k63252j34121k88356
5407E894352n9754j31092l9463q7569j5244r5908M5645n915r6554K65170Q1704
5396E755372r9950J21527l3168l59770K43092Q7057j99142K51053J46568j03584
5386E809055K09065k85999J30052J61633j64670K590l5910j14415m26339O3348
5376E348410l7087j81073j39329k12297j93274P4965r5443j1523l9673o5288j46686
5365D301702O3925q2919q8693R2849j23580j13334J52738J4073p3745P5112J25
5354D218253j37683p5184j05122j5107j57551O4716K18069j96517P795M9557r632
5343C861594J28391j11109j95249P873O8429J19162L3546R2816p692J8835j15400
$$ plain form
5417 6107638 6011561 5772037 6174150 6539951 6804033 6935511 6580081 6316829 6182708 5894352
5407 5894352 5834598 5703506 5664043 5576474 5561230 5465322 5510967 5505052 5408498 5673668 5755372
5396 5755372 5655422 5776949 5743781 5384011 5627103 5714160 5515018 5766071 5912639 5809055
5386 5809055 6018120 5732121 5862173 6023806 5859136 5861726 5825816 5711401 5285062 5348410
5376 5348410 5311323 5130250 4990921 4778624 4585350 4660315 4564872 4553349 4513676 4448388 4301702
5365 4301702 4365627 4282708 4194015 4286864 4163284 4049950 4202688 4216761 4143016 4218128 4218253
5354 4218253 4080570 4005386 3900264 3885157 3727606 3792322 4010391 3813874 3821669 3871226 3861594
5343 3861594 3989985 3878876 3683627 3691500 3759929 3879091 3912637 4005453 3997761 4016596 3901196
5332C901196j6875K905r0348J14787K11627m6141j45824O5188J36864J25447Q3403
5321D342229k40057M30o2366J65095p9359k68135J08927J90757N3603k12499j68451
5310C830174K71514K2928r3806J81553L3887J03252P9909j7219l3111m0120J56317
5299D495278j9004n7271m126R7600j88181M8969M8986P1984K39645P087j77833
5288D563134J83299j78015r2285J32572M0475l1605o0856m0800Q5142j01615j76764
5277D322682J35398m8956k3211j14939L245J42302J33883O8224Q606k09727m6143
5266D371364M01953R5448j09705k8121o8761K16770o6309N5890R680q820l2912
5255D836477k17471K3527K08897K9244j18383P9414J38558k18492J27593O1112
$$ plain form
5332 3901196 3884321 3887226 3796878 3911665 4123292 4077151 3931327 3996515 4133379 4258826 4342229
5321 4342229 4102172 4102602 4040236 4205331 4125972 3857837 3966764 4157521 4211124 3998625 3830174
5310 3830174 4101688 4124616 4030810 4212363 4246250 4349502 4429411 4412192 4379081 4338961 4495278
5299 4495278 4476274 4419003 4414877 4512477 4324296 4373265 4422251 4494235 4733880 4740967 4563134
5288 4563134 4746433 4568418 4476133 4608705 4649180 4617575 4556719 4515919 4601061 4499446 4322682
5277 4322682 4458080 4409124 4385913 4270974 4274219 4416521 4550404 4618628 4627234 4417507 4371364
5266 4371364 4773317 4868765 4759060 4730939 4662178 4878948 4812639 4868529 4878209 4869389 4836477
5255 4836477 4619006 4642533 4851430 4880674 4762291 4841705 4980263 4761771 4889364 4950476
5245D950476o8387J030j40986J37344L16955q0554P4871L50733J54776o4184r6558
5234E535516j26396J9696K7280O7443J12355l4159J60647K11689O6216L01878
5224F342165J49469k49799j49848J15349j18910K61410K45350J2140J24379J40040
5214F871745O8810j6003j49910q0475J8792J39105L22261J92419k2123O1202K27357
5203G633180p6918q6177Q7986P3463J4072j36496j7368J72315q5459r7741K49920
5192G730777j4809J46065K4251J39061J91733J01813j870K06646J79141J9010
5182H721818M39156J79503K27367Q2796K45021J37151J15716L16534L31814J13585
5172A0910461L19791M34741L44842K62842K79349L34285J92699l9754M58753L85121
$$ plain form
5245 4950476 4882089 4883119 4742133 4879477 5196432 5115878 5190749 5541482 5696258 5632074 5535516
5234 5535516 5409120 5428816 5456096 5523539 5635894 5601735 5762382 5974071 6040287 6342165
5224 6342165 6491634 6241835 6091987 6207336 6088426 6349836 6595186 6607326 6731705 6871745
5214 6871745 6940555 6924552 6774642 6694167 6712959 6852064 7174325 7366744 7344621 7405823 7633180
5203 7633180 7556262 7470085 7558071 7631534 7645606 7509110 7491742 7664057 7578598 7480857 7730777
5192 7730777 7715968 7862033 7886284 8025345 8217078 8318891 8317021 8523667 8702808 8721818
5182 8721818 9160974 9340477 9567844 9650640 9895661 10032812 10148528 10465062 10796876 10910461
5172 10910461 11230252 11664993 12009835 12272677 12552026 12886311 13079010 13039256 13498009 13883130
5162A3883130J15824L1203L26010O8962q6760J15221j5230m0254l5210q4219p3302
5151A4205375K28421k16271j69937k36101j37485j90565k71257n1111o8818j12726
5141A2979525M5649J34484Q2084N4985j34419r932L00374J23955j18364O7223
5131A3525564J03803J62224J48410P6565L09034J44842J15628L60225M30787K86485
5121A5663567N25020O27732L27266N15831N60972O02593O19858O77202N51944
5112B0671985M57648j4615J13824m7082k94298j49871k18484k27332k2848K927
5102B0271854l1811J83145J26658o9374K4046L5566L34261J25053J78102l0168
5092B1147332l50947l97272l99819k31505k91909l22941p49031o34542o38939
$$ plain form
5162 13883130 13998954 14030157 14356167 14425129 14338369 14453590 14438360 14398106 14362896 14278677 14205375
5151 14205375 14433796 14217525 14047588 13811487 13674002 13483437 13212180 13161069 13092251 12979525
5141 12979525 13025174 13159658 13241742 13296727 13162308 13152376 13452750 13576705 13458341 13525564
5131 13525564 13629367 13791591 13940001 14016566 14325600 14470442 14586070 14946295 15377082 15663567
5121 15663567 16188587 16816319 17143585 17659416 18220388 18822981 19442839 20120041 20671985
5112 20671985 21129633 21115018 21228842 21181760 20887462 20737591 20519107 20291775 20268927 20271854
5102 20271854 20240043 20423188 20549846 20480472 20504518 20540084 20874345 20999398 21177500 21147332
5092 21147332 20796385 20399113 19999294 19767789 19475880 19152939 18403908 17769366 17130427
5083A7130427l31149l69183l08125k40208n9085j10295n7613j88324L8561Q1356
5073A5586362J87157j01317K620L10841L61250j5211j77414m82720l04282k24561
5063A5142725l79724l478k12313j96898J57797J09735r3341O9605P3287K49506
5053A4916901n2054K10939O4449K62565J68126J70009L28878K99044O3134K31160
5043A6663151L03658R2471L43959M24818L15159K12725K80787L55163L98570M19713
5033A9810174O44322P14070N26233M82877M99019N95014O15399L39607L50151
5024B4576866M95979M38140K72118j00877K3440O1509j01556J04746J86585k2197
5014B5934753Q7709k35910o0301l80928l00951l26233m73280k07952m24452k16646
$$ plain form
5083 17130427 16799278 16430095 16121970 15881762 15822677 15712382 15654769 15466445 15505006 15586362
5073 15586362 15773519 15672202 15674822 15985663 16346913 16331702 16154288 15671568 15367286 15142725
5063 15142725 14763001 14759523 14547210 14350312 14508109 14617844 14524503 14594108 14667395 14916901
5053 14916901 14864847 15075786 15140235 15402800 15570926 15740935 16069813 16368857 16431991 16663151
5043 16663151 16966809 17059280 17403239 17828057 18143216 18355941 18636728 18991891 19390461 19810174
5033 19810174 20454496 21168566 21694799 22177676 22676695 23271709 23887108 24226715 24576866
5024 24576866 25072845 25510985 25783103 25682226 25705666 25767175 25665619 25770365 25956950 25934753
5014 25934753 26022462 25786552 25726251 25345323 25044372 24718139 24244859 24036907 23612455 23395809
5004B3395809k23806n31382m31669J8821O5275P0608j71082J3902L96983Q5765
4994B2689224J64102J68090J86669K07189L26295L40307Q6571L92774O47954M30318
4984B5639493L57690L25811J52085N90848N44760P54276O67377O67221O68901
4975C0368462O85121P77183P34960O26791Q93057O70524N26499N07491N53347
4966C6343435J74444R9693J77709l1993j06990j63648j28236m3988k26522l53666
4956C5740238m01606m1765l77826p04836m68012o57104m06713k69300l75595k59332
4946C1778149k44799l04127j67127O7551O4138m8834K4234j71441m5140j32704
4936C0819900l23036m09402j77202l1526l63296j92279k49944j20207J4704k83083
$$ plain form
5004 23395809 23172003 22640621 22208952 22227773 22293048 22363656 22192574 22206476 22603459 22689224
4994 22689224 22853326 23021416 23208085 23415274 23741569 24081876 24168447 24561221 25209175 25639493
4984 25639493 25997183 26322994 26475079 27065927 27610687 28364963 29032340 29699561 30368462
4975 30368462 31053583 31830766 32565726 33192517 34085574 34756098 35282597 35790088 36343435
4966 36343435 36517879 36617572 36795281 36763288 36656298 36492650 36364414 36320426 36093904 35740238
4956 35740238 35338632 35296867 34919041 34214205 33746193 33089089 32682376 32413076 32037481 31778149
4946 31778149 31533350 31229223 31062096 31129647 31193785 31144951 31169185 30997744 30952604 30819900
4936 30819900 30496864 30087462 29910260 29878734 29515438 29323159 29073215 28953008 28967712 28684629
4926B8684629J08142j4905l78679k11904j49849l0112O3502j06805J31756P3338
4916B8169113K40009K45485K27790M25609N86401K09110K57025M54953N57218
4907C1372713L81749L87918N39064M56541O00955M99610O12182M60374M57901
4898C5769007K95419M04140L97870J53599M73522N65006O92342M49482O85110
4889C9885497N05387K12940M92128R5916M64593J66358n03256m41094n37230o74637
4879C9666602n34987q67820o27534o74103p55136n53655n15216n33639n60501
4870C4044011l82693l35827m17021m08930l71727m98323l6136k61373k51252k15789
4860C0864940k46149R0770j45974r8172r5737O5279J0796R7637M18244K0896L50267
$$ plain form
4926 28684629 28792771 28777866 28399187 28187283 28037434 28007322 28070824 27964019 28095775 28169113
4916 28169113 28409122 28654607 28882397 29308006 29894407 30103517 30360542 30815495 31372713
4907 31372713 31754462 32142380 32681444 33137985 33738940 34238550 34850732 35311106 35769007
4898 35769007 36064426 36468566 36866436 37020035 37493557 38058563 38750905 39200387 39885497
4889 39885497 40390884 40603824 41095952 41191868 41656461 41822819 41319563 40878469 40341239 39666602
4879 39666602 39131615 38263795 37636261 36962158 36207022 35653367 35138151 34604512 34044011
4870 34044011 33661318 33325491 32908470 32499540 32127813 31629490 31593354 31331981 31080729 30864940
4860 30864940 30618791 30709561 30563587 30465415 30369678 30434957 30445753 30543390 30961634 30982530 31332797
4849C1332797N88412L19406M48646O20450N69439M39166K99340L77873K89107
4840C5284636J25098N3134J82196k40586l05216l85393k04311k28332m04963k40937
4830C3635326j79282m76439m89313p97484m28135j02994o14469m56942m28846
4821B9661422l36447j71348j52234m42972l774j5401r5670k02779r6430K90999
4811B8435366J21331R4584L14900k82709l5423K71636K71Q9248j06114J69370
4801B9072460P8960Q0270m5304J07407J86759j8327J66608L22600L28053J69574
4791C0449060J98792J93308L48099L60071M25574M37798L09476J50958Q8590J01440
4781C3063166j41901l38605J14901j39751M3921M1844k82486J55759J34735M32460
$$ plain form
4849 31332797 31921209 32240615 32689261 33309711 33879150 34318316 34617656 34995529 35284636
4840 35284636 35409734 35462868 35645064 35404478 35099262 34713869 34509558 34281226 33876263 33635326
4830 33635326 33456044 32979605 32490292 31692808 31264673 31161679 30547210 30090268 29661422
4821 29661422 29324975 29153627 29001393 28558421 28554647 28539246 28443576 28240797 28144367 28435366
4811 28435366 28556697 28651281 28966181 28683472 28648049 28919685 28919956 29009204 28903090 29072460
4801 29072460 29151420 29231690 29186386 29293793 29480552 29462225 29628833 29951433 30279486 30449060
4791 30449060 30647852 30841160 31189259 31549330 31974904 32412702 32722178 32873136 32961726 33063166
4781 33063166 32921265 32582660 32697561 32557810 32601731 32643575 32361089 32516848 32651583 33084043
4771C3084043O05325O95177P82623J278272J414299J498146K037912K463715L030681
4762D6890193L633557L912663K655874M72273j765854l858285m066073l107125
4754D4767223k255099j726863j345843r02451p26200o36944l91801l66267m75732
4745C5940023l86192l90077m78095k92611j44598m03054l75237j40886Q2069k07903
4735C3203439l64322k69426l5071o8076j52045k29211k22787j78857l00400l90497
4725C0992747k87468k81112l50092k57057m67366n62450l19251l34987l43482
4716B7789482n89117k28215m52227m38738k04070m13284n19758n50930k72655
4707B4120488l48324j85450j30946l89238n30518q7549j4552l94197j57471o3154
$$ plain form
4771 33084043 33689368 34384545 35167168 36445440 37859739 39357885 41395797 43859512 46890193
4762 46890193 50523750 54436413 57092287 57564560 55798706 51940421 47874348 44767223
4754 44767223 42512124 40785261 39439418 38536967 37810767 37173823 36782022 36415755 35940023
4745 35940023 35553831 35163754 34685659 34393048 34248450 33845396 33470159 33329273 33411342 33203439
4735 33203439 32839117 32569691 32534620 32466544 32314499 32085288 31862501 31683644 31383244 30992747
4725 30992747 30705279 30424167 30074075 29817018 29349652 28787202 28467951 28132964 27789482
4716 27789482 27200365 26972150 26519923 26081185 25877115 25463831 24944073 24393143 24120488
4707 24120488 23772164 23586714 23455768 23066530 22536012 22448463 22433911 22039714 21882243 21819089
4697B1819089q6545k55464k73764N0932P9444j68013j25242M4118k22363J11530
4687B0973722L12540J83303M97879L74538L21642N93084O44510J176655J368557
4678B6446430J576360J413080K031495K771772L046985K342863Q57748j92119
4670D0294614j148865k886748l897180l423454k674817j811584j469533j004731
4662B1977702r80456p80604m33744n85613n14079j97028n10291k73198k34193
4653A7468496m34618j96739m5091k28999l84531k56156m8034j73663l07775l37423
4643A5055467j65670k37065l84783j00585O9470n9745k11456J0112j09949p5101
4633A3790695Q1151Q4010r4528m7538N2327L8874P4494N1092O949k70116j88761
$$ plain form
4697 21819089 21732544 21477080 21203316 21254248 21333692 21165679 21040437 21084555 20862192 20973722
4687 20973722 21286262 21469565 21967444 22341982 22663624 23256708 23901218 25077873 26446430
4678 26446430 28022790 29435870 31467365 34239137 37286122 39628985 40486733 40294614
4670 40294614 39145749 36259001 32361821 28938367 26263550 24451966 22982433 21977702
4662 21977702 20997246 20216642 19782898 19197285 18683206 18486178 17975887 17702689 17468496
4653 17468496 17033878 16837139 16792048 16563049 16178518 15922362 15874328 15700665 15392890 15055467
4643 15055467 14889797 14652732 14267949 14167364 14236834 14177089 13965633 13975745 13865796 13790695
4633 13790695 13871846 13955856 13861328 13813790 13866117 13904991 13979485 14030577 14037526 13767410 13578649
4622A3578649j42266k42505R3116k01349l40639j32725j11866j32126r8454j06381
4612A2163454k78605k89425j9595j70907j30215j09146K6202n0692L0307j31369
4602A1040009k11349m5067j55346j43023J75816o7993j09746o1070K5815Q8280
4592A0536326j14293k326Q9377n8948L9665M30306J77772J40216J12336J47457
4582A1497888J18040K22088J64977M1457K0255j14555m860k5804o0013k25702
4572A1633771j77571j6602j68072J25216K17366J49511J141j64543n558J90118
4562A1784777P8770j3892K21868m1381k68938m5478k85834l20933m44719l25452
4552A0338788k23806m58257k99100k86082k96489j80079k5637k62895k06718p1652
$$ plain form
4622 13578649 13436383 13193878 13286994 13085645 12745006 12612281 12500415 12368289 12269835 12163454
4612 12163454 11884849 11595424 11575829 11404922 11274707 11165561 11191763 11141071 11171378 11040009
4602 11040009 10828660 10783593 10628247 10485224 10661040 10593047 10483301 10422231 10448046 10536326
4592 10536326 10422033 10419707 10509084 10450136 10489801 10920107 11097879 11238095 11350431 11497888
4582 11497888 11615928 11838016 12002993 12044450 12064705 11950150 11945290 11919486 11859473 11633771
4572 11633771 11456200 11439598 11271526 11396742 11614108 11763619 11764760 11600217 11594659 11784777
4562 11784777 11863547 11849655 12071523 12030142 11761204 11715726 11429892 11108959 10664240 10338788
4552 10338788 10114982 9656725 9357625 9071543 8775054 8594975 8569338 8306443 8099725 8028073
4542H028073j83942k57531n3504j46008j47271j80114k24334l5565J22540j53927
4532F768417j29460J26136l38946j61238m9975k7209J0118j2345O560L0016l328
4521F218746j50922K9246P604J2878k1282K6329J00903m4103K7658j56415J96690
4510F247332L5758m0330n6551o4331R6368J20138j92028K78385R1013j4760P5019
4499F576013j66743M4182R2157M8383J39549P7696K0322j1371k85895m04675J5928
4488F145546k07383l05436j5131q0742m3993j21917k46355j22198J15953N9422
4478E177766K5389o8259k5457n6198l2352J18115J32136M0442J9653l50348J16537
4467E097424K11501j09666J0680r8638J12342L1353q7806j61822P5030J50772
$$ plain form
4542 8028073 7844131 7586600 7533096 7387088 7239817 7059703 6835369 6799804 6922344 6768417
4532 6768417 6638957 6765093 6426147 6264909 6214934 6187725 6197843 6185498 6192058 6222074 6218746
4521 6218746 6067824 6097070 6104674 6117552 6096270 6122599 6223502 6179399 6207057 6050642 6247332
4510 6247332 6283090 6242760 6186209 6121878 6218246 6338384 6146356 6424741 6515754 6500994 6576013
4499 6576013 6409270 6453452 6545609 6593992 6733541 6811237 6831559 6820188 6534293 6129618 6145546
4488 6145546 5938163 5632727 5617596 5536854 5492861 5370944 5124589 5002391 5118344 5177766
4478 5177766 5203155 5134896 5109439 5053241 5020889 5139004 5271140 5311582 5331235 4980887 5097424
4467 5097424 5308925 5199259 5209939 5111301 5223643 5254996 5167190 5005368 5080398 5231170
4457E231170o8930l9267J14702P3766k147K06764J9034J43714L05617R1434L42819
4446F418676J9607n7364M68809K44692K43346M00580J33566Q9862L58885K08253
4436H528912J43503l1265l4472N6454p1373K7638K3335M8848R5692j23124M3872
4425H708020j26861J41400K25034J54389N9993J0894j2971L56829K63189O7863
4415I847779p004j19469j87956j79573k64725l94381l27023k29213l41830k55655
4405G540950k36796k21131l53204k12484J80044k13442k66273j75059n1170J05908
4395F097343q2583j48912j21802Q5791L3113j262j33280j90247Q4087M3217R1879
4384E757344n9432j87311m4134P1346J3770N9405N969M86052J77667n0677Q7390
$$ plain form
4457 5231170 5162240 5122973 5237675 5311441 5309294 5516058 5535092 5678806 5984423 6075857 6418676
4446 6418676 6438283 6380919 6849728 7094420 7337766 7738346 7871912 7961774 8320659 8528912
4436 8528912 8672415 8641150 8606678 8663132 8591759 8619397 8642732 8691580 8787272 8664148 8708020
4425 8708020 8581159 8722559 8947593 9101982 9161975 9172869 9159898 9516727 9779916 9847779
4415 9847779 9840775 9721306 9533350 9353777 9089052 8694671 8367648 8138435 7796605 7540950
4405 7540950 7304154 7083023 6729819 6517335 6697379 6483937 6217664 6042605 5991435 6097343
4395 6097343 6014760 5865848 5744046 5829837 5862950 5861688 5728408 5538161 5622248 5665465 5757344
4384 5757344 5697912 5510601 5466467 5537813 5551583 5610988 5616957 6103009 6280676 6229999 6317389
4373F317389J62181J9013j24032K78588K64181j02907m204J17775N7259K62795
4363G248038J92087l48705j58716l8854P9518j33487M0206L89065o9622O2850
4353G262380j33236R564J15699j88378l550l2886O4060o7956r5357L3497K3352
4342F987189J07721j59260j33499j75191p5585l08937n832K6425j33846j08216
4332F020969K4227j01003l7434j34443r3894J0231J21439m4572l37048K5966Q7791
4321E542229O0329J455N1586M3777q1038j7966j00236k4187K0767q1049K69423
4310E685090q7027N334l8949l5427k73788J01724J75579j15563O3736J67030L5574
4299E683313j49797j86270p6882K9822J77623K5945L10723K90574j0563k78824
$$ plain form
4373 6317389 6479570 6498583 6374551 6653139 6917320 6814413 6810209 6927984 6985243 7248038
4363 7248038 7440125 7091420 6932704 6893850 6973368 6839881 6880087 7269152 7199530 7262380
4353 7262380 7129144 7138708 7254407 7066029 7062479 7029593 7093653 7025697 6930340 6963837 6987189
4342 6987189 7094910 6935650 6802151 6626960 6551375 6242438 6236606 6263031 6129185 6020969
4332 6020969 6045196 5944193 5906759 5772316 5678422 5688653 5810092 5765520 5428472 5454438 5542229
4321 5542229 5602558 5604013 5655599 5699376 5618338 5600372 5500136 5475949 5496716 5415667 5685090
4310 5685090 5598063 5603397 5564448 5529021 5255233 5356957 5532536 5416973 5480709 5647739 5683313
4299 5683313 5533516 5347246 5270364 5300186 5477809 5503754 5814477 6105051 6094488 5815664
4289E815664p556O0324o3550K06795L29809K04957j25328j00437P7481K86638
4279F684797M6579n9516j9613R6120J82122O2345J93999J10583k33479J57209
4269G221146J81783J00643K58812J0410k62610j49180K26761K47804K01788J87373
4259H224730k7490j58684K05758M01232K55151n9703L0303j43203J31371J16427
4249H975892Q8179J79040J55313l9379l0650M12828J24613J41771J16057J21603
4239A0245267J50893J66088k0529N4635M28072J77488K32655J67874L27902N35260
4229A2465605L99246M50879R163K93148J4713K79271J89351J46913j67159J32842
4219A4213972J47532Q9425K3466J3235M42174L28719J57659J62326K83550R1826
$$ plain form
4289 5815664 5808108 5868432 5804882 6011677 6341486 6546443 6421115 6320678 6398159 6684797
4279 6684797 6731376 6671860 6652247 6748367 6930489 6992834 7186833 7297416 7063937 7221146
4269 7221146 7402929 7503572 7762384 7772794 7510184 7361004 7587765 7835569 8037357 8224730
4259 8224730 8197240 8038556 8244314 8645546 8900697 8840994 8871297 8728094 8859465 8975892
4249 8975892 9064071 9243111 9398424 9359045 9328395 9741223 9865836 10007607 10123664 10245267
4239 10245267 10396160 10562248 10541719 10596354 11024426 11201914 11434569 11602443 11930345 12465605
4229 12465605 12864851 13315730 13324893 13618041 13632754 13912025 14101376 14248289 14081130 14213972
4219 14213972 14361504 14450929 14474395 14487630 14929804 15258523 15416182 15578508 15862058 15953884
4209A5953884J9592J30182j26399J18952L58490O2665K87867L24720K83054M46217
4199A7859224L28606N8080L27096M49283L73632L38589O91538N92890L07251N03484
4189B1829673O86286L49577L78620O57441O09351M42798O99686R69444O70472
4180B7293348M65051R24759N93129M62161P47707P59652J013756J173489P57565
4171C4190617P65097R81611Q62662J076431J190590J412681J139481J157761J393641
4162D4170572J415082J312826J471082J596253J745163J903354K011754J854682
4154E7480768K121035K285019K129958K443929K463350K916500L215303L495165
4146G8551027L628975M133298M687823N418932O236860O896082P687502Q760301
$$ plain form
4209 15953884 15973476 16103658 15977259 16096211 16454701 16517366 16805233 17129953 17413007 17859224
4199 17859224 18187830 18245910 18573006 19022289 19395921 19734510 20426048 21018938 21326189 21829673
4189 21829673 22515959 22865536 23244156 23901597 24510948 24953746 25653432 26622876 27293348
4180 27293348 27758399 28683158 29276287 29738448 30486155 31245807 32259563 33433052 34190617
4171 34190617 34955714 35937325 36799987 37876418 39067008 40479689 41619170 42776931 44170572
4162 44170572 45585654 46898480 48369562 49965815 51710978 53614332 55626086 57480768
4154 57480768 59601803 61886822 64016780 66460709 68924059 71840559 75055862 78551027
4146 78551027 82180002 86313300 91001123 96420055 102656915 109552997 117240499 126000800
4138A26000800J0404169J1698797J3386823J5011624J6996450J9312020K1004377
4131B33815060K1393920K0797034K0163362J9349149J8026811J2517016L84056
4124C46446408j3628969k2309578k2960556j9721121j5238651j1310873q349540
4117B32927120q008014j0447376j2947978j3947762j3067634j1465972r564586
4110A53477798p738798o626032n755396m946120m192679l704482l254853k722194
4102A14537244k684946k220050k141125k028621j883448j767198j607779j498748
4094I8705329j481346j288582j157904r58563j313317j041947q15356q93261j339671
4085H8415382j521156j291007j704393j611648j454185j217517j341298j289582
$$ plain form
4138 126000800 136404969 148103766 161490589 176502213 193498663 212810683 233815060
4131 233815060 255208980 276006014 296169376 315518525 333545336 346062352 346446408
4124 346446408 332817439 310507861 287547305 267826184 252587533 241276660 232927120
4117 232927120 224919106 214471730 201523752 187575990 174508356 163042384 153477798
4110 153477798 145739000 139112968 133357572 128411452 124218773 120514291 117259438 114537244
4102 114537244 111852298 109632248 107491123 105462502 103579054 101811856 100204077 98705329
4094 98705329 97223983 95935401 94777497 93818934 92505617 91463670 90648314 89755053 88415382
4085 88415382 86894226 85603219 83898826 82287178 80832993 79615476 78274178 76984596
4077G6984596r11527r18321j087725q68348p19335n88030o44374m91023l49306
4068G0406607k60430L3449N82353J010017J182950J601943K451872K442150K673284
4059H2124195L528690M229092M877557K408020k711120o618543p457853o690470
4051G3689568n856367m785870l478602k935196k232045k357010k275178j424712
4043D8344588j370115j410578j106437q05879p62605p60817q09376j064571j060711
4034C9193499r16237p39441q35171p65248o84952n99729p21631n43475n93231
4025C2794384m05735l68701m22789m31479n12098m53941n17119m42748m84332
4016B8755442m49412n07072m37802o24372l68563l25242m74793k58461n00920
$$ plain form
4077 76984596 76073069 75154748 74067023 73198675 72479340 71891310 71246936 70755913 70406607
4068 70406607 70146177 70179626 70761979 71771996 72954946 74556889 77008761 79450911 82124195
4059 82124195 85652885 89881977 94759534 97167554 94456434 87837891 80380038 73689568
4051 73689568 67833201 63047331 59568729 56633533 54401488 52044478 49769300 48344588
4043 48344588 46974473 45563895 44457458 43651579 42888974 42128157 41318781 40254210 39193499
4034 39193499 38277262 37537821 36702650 35937402 35252450 34652721 33931090 33387615 32794384
4025 32794384 32388649 32019948 31597159 31165680 30653582 30199641 29682522 29239774 28755442
4016 28755442 28306030 27798958 27361156 26736784 26368221 26042979 25568186 25309725 24808805
4007B4808805m88475k00436l42775k72778l35313n00416k58575k29019k37690
3998B1943328n51454l16880k2137n9263j31459l13178j32655l87197l10273j77181
3988A9541651m45322k20014k09278k46792j54043q5975k8831k11245l09939l49378
3978A7280834J38129p6963r6212j57876J51271j5324j27398k5598J87997R7560
3968A7356420Q9148J84376J6593L21074J65326K71911J79963J13800M38559K49506
3958A9386676J1644n3573p5321j65990j06918K11703L23799j59566J9574j5860
3948A9376168L9095K32838J77626r9698K14626K57111L83170K24919l7379L03310
3938B1071786M41826K44436J86762J60882N5204M87628j0045J61028N7431K47865
$$ plain form
4007 24808805 24320330 24119894 23777119 23504341 23169028 22668612 22410037 22181018 21943328
3998 21943328 21391874 21074994 21052857 20993594 20862135 20548957 20416302 20029105 19718832 19541651
3988 19541651 19096329 18876315 18667037 18420245 18266202 18180227 18151396 17940151 17630212 17280834
3978 17280834 17418963 17342000 17245788 17087912 17239183 17223859 17096461 17070863 17258860 17356420
3968 17356420 17445568 17629944 17646537 17967611 18132937 18404848 18584811 18698611 19137170 19386676
3958 19386676 19398320 19344747 19269426 19103436 18996518 19208221 19532020 19372454 19392028 19376168
3948 19376168 19415263 19648101 19825727 19726029 19940655 20197766 20580936 20805855 20768476 21071786
3938 21071786 21513612 21758048 21944810 22105692 22160896 22648524 22638479 22799507 22856938 23104803
3928B3104803K05860R4986J98376L60279M85084J42437K00020J89757L74344N05133
3918B5861079J56638J88211K82380L91865M56625M32019L17388K14005M32635
3909B8732845K49284J06555L44851L79740K91528L10450J16885M67074L25668
3900C1324880J93468K92055L93027L62323O91040K35351O8779N24154L51468N40104
3890C4976649M11479N68557N68667O24055Q64064P89345M11090N70405M31170
3881D0215481R70159R44331P02304O39857N14880O31262O34709O81640N31399
3872D6466022M80871N27994O65507M11035K25619J91494L46863k33788K29785
3863D9311402K44950j29999k2858m575j5867l20529k88058l01900l2471q2228
$$ plain form
3928 23104803 23310663 23405649 23604025 23964304 24449388 24591825 24791845 24981602 25355946 25861079
3918 25861079 26017717 26205928 26488308 26880173 27336798 27768817 28086205 28300210 28732845
3909 28732845 28982129 29088684 29433535 29813275 30104803 30415253 30532138 30999212 31324880
3900 31324880 31518348 31810403 32203430 32565753 33256793 33492144 33560923 34085077 34436545 34976649
3890 34976649 35388128 35956685 36525352 37149407 38013471 38802816 39213906 39784311 40215481
3881 40215481 41185640 42129971 42832275 43472132 43987012 44618274 45252983 45934623 46466022
3872 46466022 46946893 47474887 48140394 48551429 48777048 48968542 49315405 49081617 49311402
3863 49311402 49556352 49426353 49403495 49398920 49383053 49062524 48774466 48472566 48440095 48357867
3853D8357867k78644k24587k06280l80351j70521j17677N5964q052k9959j60602
3843D6837158J0907J86603M32598L45206K82311M20803N50692O86177O86399M72560
3833E0911414L32903N29278O35832N97109M89095O24796Q24892P84837M12514
3824E6142670N61451L73420N36521M75804K06571M02185J85216L12178J00173
3815E9296189J61687j89897j36669n3692n0216k90837o64740n22135l74613o66808
3805E6508269m54160o48741o56049o35904o42985o58851o18803n13422o94548
3796E0984806m24370m01046n16491n64429k54849m80788j80933P597J09948J30324
3786D8409769m178j46832L68123M01176M49148L70630L60922N28704O49177L66169
$$ plain form
3853 48357867 48079223 47854636 47648356 47268005 47097484 46979807 47035771 47027719 46997760 46837158
3843 46837158 46848065 47034668 47467266 47812472 48094783 48515586 49066278 49752455 50438854 50911414
3833 50911414 51244317 51773595 52409427 53006536 53495631 54120427 54945319 55730156 56142670
3824 56142670 56704121 57077541 57614062 58089866 58296437 58698622 58883838 59196016 59296189
3815 59296189 59457876 59267979 59131310 59077618 59027402 58736565 58071825 57549690 57175077 56508269
3805 56508269 56054109 55405368 54749319 54113415 53470430 52811579 52192776 51679354 50984806
3796 50984806 50560436 50159390 49642899 49078470 48823621 48342833 48161900 48169497 48279445 48409769
3786 48409769 48405591 48258759 48626882 49028058 49477206 49847836 50208758 50737462 51386639 51752808
3776E1752808K96035M92091L73594L31849J86005L50709j23915P0606J79915K9370
3766E3939067M7790k00771N3444j57029j92674k48658j25423j84044j29380k98201
3756E2504121m34946j83602l12364k69974m07915n36490m10728j45848o0870j92273
3746D9549111M3221j20129j52621J74611K5818m4129L30380K94827J24861L3633
3736E0259583O2374K66924L96936K54439J59404J52561K41895L05896L8060L2133
3726E2170205L09369J8383J52336J78091j0302Q1561j72056j37202L8694j43803
3716E2485276J62608p1736K2935Q6558J894K43563K97371J18891R2629K10598
3706E3650587L47726K21242K40743K77351O16616M80139K77033L94048M41841
$$ plain form
3776 51752808 52048843 52540934 52914528 53246377 53432382 53783091 53659176 53729782 53909697 53939067
3766 53939067 53986857 53786086 53839530 53682501 53489827 53241169 53115746 52931702 52802322 52504121
3756 52504121 52069175 51885573 51573209 51303235 50895320 50358830 49948102 49802254 49741384 49549111
3746 49549111 49592332 49472203 49319582 49494193 49520011 49475882 49806262 50101089 50225950 50259583
3736 50259583 50321957 50588881 50985817 51240256 51399660 51552221 51794116 52100012 52138072 52170205
3726 52170205 52479574 52497957 52650293 52828384 52818082 52899643 52727587 52590385 52629079 52485276
3716 52485276 52647884 52576148 52599083 52685641 52687535 52931098 53228469 53347360 53439989 53650587
3706 53650587 53998313 54219555 54460298 54737649 55354265 55834404 56111437 56505485 56947326
3697E6947326N65810O71547O89220O30954R56994N95755N86157P42156J087681
3688F3473600Q41547P51204R47451J082984O23821J052464J024007R93292R70607
3679G1760977J176365J153537J029024J253053J711886J425758J151780J519371
3671H2181751J397032J365289J416151J577812J498972J345233J052727J066629
3663I2901596R44735R63679N15978N35470N08247K96717J26381j27783J02456
3654I6767476p4764m59603l79777m77567p30169n84866q83630r83302q16706j039343
3644I0337749j168523j130763p62762o24982j128169p60795q67887r09192o77926
3635H2306750o29632o25007j27472Q3689r8949j64622J7925J71852l0576K48554
$$ plain form
3697 56947326 57513136 58184683 58873903 59504857 60461851 61057606 61643763 62385919 63473600
3688 63473600 64315147 65066351 66013802 67096786 67720607 68773071 69797078 70790370 71760977
3679 71760977 72937342 74090879 75119903 76372956 78084842 79510600 80662380 82181751
3671 82181751 83578783 84944072 86360223 87938035 89437007 90782240 91834967 92901596
3663 92901596 93846331 94810010 95325988 95861458 96369705 96666422 96792803 96665020 96767476
3654 96767476 96692712 96233109 95853332 95375765 94645596 94060730 93177100 92193798 91377092 90337749
3644 90337749 89169226 88038463 87275701 86650719 85522550 84761755 83893868 82984676 82306750
3635 82306750 81677118 81052111 80924639 81008328 80909379 80744757 80762682 80934534 80903958 81152512
3625H1152512O23783K49365K95793M28399P17198O89617M25186N20087O09727
3616H5711667L84609J73895N51081K65664Q7472N7029l0280J63256Q191j70343
3606H7202241m06571n01678m35182o54900m69220q64359m46147m91544o22283
3597H2310357o28155q07215o15010o24710o74406m06170p11794m51243m12348
3588G6979306j66294k30296k92876k6687m08044j89163J28747K33164J82901K01545
3578G6412303K98955M22875M82825P55025P69333Q86058J078938J115424J383609
3569H3605345J439169J516507J600184J809687K104096K211411J920076K016194
3561I8222669K222896J883080J496541J561520J351471Q30309M99317P4499j24993
$$ plain form
3625 81152512 81776295 82025660 82321453 82749852 83467050 84156667 84581853 85101940 85711667
3616 85711667 86096276 86270171 86821252 87086916 87174388 87231417 87201137 87364393 87372584 87202241
3606 87202241 86795670 86293992 85858810 85203910 84734690 83870331 83424184 82932640 82310357
3597 82310357 81682202 80874987 80259977 79635267 78960861 78554691 77842897 77391654 76979306
3588 76979306 76813012 76582716 76289840 76263153 75855109 75665946 75794693 76027857 76210758 76412303
3578 76412303 76711258 77134133 77616958 78371983 79141316 80027374 81106312 82221736 83605345
3569 83605345 85044514 86561021 88161205 89970892 92074988 94286399 96206475 98222669
3561 98222669 100445565 102328645 103825186 105386706 106738177 107568486 108067803 108142302 108017309
3552A08017309m95506j118126j590828j725722k172331k268257k574482k542680
3544I3529377k372603k345446k337945k248388k411744j892977k053308j798492
3536G6068474j700876j517609j374440j266017j027600r86230q44352r19554p30604
3527F5701192l59548n98097m21843l29725m80286j64707m21579j50499j47348
3518F2627560k51702l44547N158k53452K20928K57296K41071L14577j8040M92490
3508F3291339N34609L17820M48181N40447M88042K23981M77294N48524j6912J83823
3498F7037148N2676k17235j52017l84572m76898n74381m55958p75773p86176q55436
3488F2411378p95277j018048r47414p14030o85628q49006r25225r89074o56312
$$ plain form
3552 108017309 107521803 106403677 104812849 103087127 100914796 98646539 96072057 93529377
3544 93529377 91156774 88811328 86473383 84224995 81813251 79920274 77866966 76068474
3536 76068474 74367598 72849989 71475549 70209532 69181932 68195702 67351350 66431796 65701192
3527 65701192 65341644 64743547 64321704 63991979 63511693 63346986 62925407 62774908 62627560
3518 62627560 62375858 62031311 62036469 61783017 62003945 62261241 62502312 62816889 62798849 63291339
3508 63291339 63825948 64143768 64591949 65132396 65620438 65844419 66321713 66870237 66853325 67037148
3498 67037148 67089824 66872589 66720572 66336000 65859102 65284721 64828763 64052990 63266814 62411378
3488 62411378 61616101 60598053 59650639 58936609 58250981 57401975 56476750 55487676 54831364
3479E4831364o50235o24078l68858m47638l82860m74230l89194n60735k58405
3470E0675131m15605l09888k31596j67175l40970r6824j24846j82746K11570k70920
3460D8746131j21636L5550o742O7485J80205J83536J44369J89188M68754K14385
3450E0101225r066K08224J35394J54847o091j45146j37275k8179Q6461k77761
3440E0082633m42688l22465l96147m12084m08366m81155n73530m83051l62613
3431D6200534o39704k78817j94703k86471l24754k90236q8279j27083l76361q2564
3421D3511562l54391j07321R4305k67848R3915N7633l97779K20378K70655K44
3411D3121353r118N6181K81858J20957L96051N4022M81361L19115L46160L61976
$$ plain form
3479 54831364 54181129 53557051 53188193 52740555 52357695 51883465 51494271 50933536 50675131
3470 50675131 50259526 49949638 49718042 49550867 49209897 49113073 48988227 48805481 49017051 48746131
3460 48746131 48624495 48660045 48653303 48720788 48900993 49084529 49228898 49418086 49886840 50101225
3450 50101225 50092159 50300383 50435777 50590624 50584533 50439387 50302112 50273933 50360394 50082633
3440 50082633 49639945 49317480 48921333 48509249 48100883 47619728 47046198 46563147 46200534
3431 46200534 45560830 45282013 45087310 44800839 44476085 44185849 44097570 43970487 43594126 43511562
3421 43511562 43157171 43049850 43144155 42876307 42970222 43027855 42630076 42850454 43121109 43121353
3411 43121353 43112235 43168416 43450274 43571231 43967282 44021304 44502665 44821780 45167940 45529916
3401D5529916L86191L38202M86453N44778M70891P43224O70248P32043M98084
3392E0400030K02090M36206P87679Q54754P36493P50521P31864O86414L91686
3383E5977737R37382M65413Q21906J054134N83606N47812O45992R78179P70402
3374F2782563O55774J150993J081116Q96519J004915N89996J09727m8911K48128
3365F8470820L40645J54700N84231O51313M50578R89039O45628L57940J036532
3356G3681426Q13159J006564J009234Q28496J135495J110116J044697J321619
3348H1950806J274712J240861J595313J525822J659624J769709J536727K022262
3340I4575836J980735J943284K017221K043547K704372K539259K736104K667693
$$ plain form
3401 45529916 45916107 46254309 46740762 47285540 47756431 48499655 49169903 49901946 50400030
3392 50400030 50602120 51038326 51826005 52680759 53417252 54167773 54899637 55586051 55977737
3383 55977737 56915119 57380532 58202438 59256572 59840178 60387990 61033982 62012161 62782563
3374 62782563 63438337 64589330 65670446 66566965 67571880 68161876 68271603 68222692 68470820
3365 68470820 68811465 68966165 69550396 70201709 70652287 71641326 72286954 72644894 73681426
3356 73681426 74494585 75501149 76510383 77338879 78474374 79584490 80629187 81950806
3348 81950806 83225518 84466379 86061692 87587514 89247138 91016847 92553574 94575836
3340 94575836 96556571 98499855 100517076 102560623 105264995 107804254 110540358 113208051
3332A13208051L077851L140777L253411L199432L270765L386235L449210L435148
3324A39420880L396190L427074L527600L500315L359227L657136L438040L453681
3316A67180143L235749L409195L321561L158320K977009K791555K709050K514107
3308A91296689K703957K481970K545533K383992K486412K273096K353286K503254
3300B11028189K559924K719140K612697K652668K606433K925304K818563K586289
3292B32509207K583231K489528K505797K247157J871624J461356J393254Q22426
3284B47883580K85541J0608l77396r26687j164407j594709j726752j934007k237007
3275B38218764k539588k630217k987066l140931l188821l655860m065328m109114
$$ plain form
3332 113208051 116285902 119426679 122680090 125879522 129150287 132536522 135985732 139420880
3324 139420880 142817070 146244144 149771744 153272059 156631286 160288422 163726462 167180143
3316 167180143 170415892 173825087 177146648 180304968 183281977 186073532 188782582 191296689
3308 191296689 194000646 196482616 199028149 201412141 203898553 206171649 208524935 211028189
3300 211028189 213588113 216307253 218919950 221572618 224179051 227104355 229922918 232509207
3292 232509207 235092438 237581966 240087763 242334920 244206544 245667900 247061154 247883580
3284 247883580 248169121 248179729 247802333 246875646 245711239 244116530 242389778 240455771 238218764
3275 238218764 235679176 233048959 230061893 226920962 223732141 220076281 216010953 211901839
3267B11901839m203095m107790m081076m221914m046959l867130l608271l686338
3259A80079266l477905k723315k385593k594175k461301k235619j931791j838282
3251A60431285j456227j387583j437945j156935j151056r46437r62550q20761
3243A51111791p39795o67844q61397n83813o57324m27681m12550n67350p10488
3234A45483549m88485n86230l70927n06867n29121o43289q02736p24036r87392
3225A39844466j137647j039965p73895j114945j165719j025448o70404q54458
3217A32061985j073249j411971j471754j778532j648589j664390j682785j638548
3209A19692167j588964j595335j460782j680422j349223j532717j166962j229098
$$ plain form
3267 211901839 207698744 203590954 199509878 195287964 191241005 187373875 183765604 180079266
3259 180079266 176601361 173878046 171492453 168898278 166436977 164201358 162269567 160431285
3251 160431285 158975058 157587475 156149530 154992595 153841539 152895102 151932552 151111791
3243 151111791 150371996 149704152 148842755 148258942 147601618 147173937 146761387 146194037 145483549
3234 145483549 144995064 144408834 144037907 143531040 143001919 142358630 141555894 140831858 139844466
3225 139844466 138706819 137666854 136892959 135778014 134612295 133586847 132916443 132061985
3217 132061985 130988736 129576765 128105011 126326479 124677890 123013500 121330715 119692167
3209 119692167 118103203 116507868 115047086 113366664 112017441 110484724 109317762 108088664
3201A08088664j051780j253994j111992j121486r89393q09007p29422r63091o85611
3192I9372888n23533m46024m53728n59810l22004Q829N8819l63593j102938j344146
3182I4324760q19244q14892l23437k30768j81213J73108K93441L12699N57578
3173I3292032O46337J207392J038055J055199J492764J956382J982618J944426
3165A04615205K230045K256649K228653K461305K706206K750903K393727K340771
3157A23983464K666863K312385K623934K221647J672715J322594J034493J017604
3149A38855699M39259L73038K7614j91192m43974n83773r78503j193502j472836
3140A34831830j817756j889367k025663j569490j708000j402154j239122j072380
$$ plain form
3201 108088664 107036884 105782890 104670898 103549412 102560019 101751012 101021590 100058499 99372888
3192 99372888 98849355 98403331 97949603 97389793 97067789 97076618 97135437 96771844 95668906 94324760
3182 94324760 93505516 92690624 92367187 92136419 91955206 92128314 92421755 92734454 93292032
3173 93292032 93938369 95145761 96183816 97239015 98731779 100688161 102670779 104615205
3165 104615205 106845250 109101899 111330552 113791857 116498063 119248966 121642693 123983464
3157 123983464 126650327 128962712 131586646 133808293 135481008 136803602 137838095 138855699
3149 138855699 139294958 139667996 139695610 139504418 139060444 138476671 137498168 136304666 134831830
3140 134831830 133014074 131124707 129099044 127529554 125821554 124419400 123180278 122107898
3132A22107898p01691n79104n68406l15290j1955j65292k25214j92995m39693
3123A18908258o02856o28655r23028r20268j117716j385876j622749j756176j882684
3114A08068250k011275k416002k528429k495300k651513k494610k618664k546177
3106H8306280k626625k598619k404593k233290j897322j793344j497223j347131
3098G1908133j282795j292209j021372r22092p33131o43042m65976o62586n97766
3089F4287164m85955m49885p76688o11651m48493n35913o45299m87313n63999
3080E9281968o67427n99037n25212l41835o23486n78840n52742o77727o00238
3071E4115424m68239m32157p57889j92042k40604n08539l99128k89600k71718
$$ plain form
3132 122107898 121406207 120827103 120258697 119943407 119931452 119766160 119540946 119347951 118908258
3123 118908258 118305402 117676747 116753719 115833451 114715735 113329859 111707110 109950934 108068250
3114 108068250 106056975 103640973 101112544 98617244 95965731 93471121 90852457 88306280
3106 88306280 85679655 83081036 80676443 78443153 76545831 74752487 73255264 71908133
3098 71908133 70625338 69333129 68311757 67389665 66656534 66013492 65547516 64884930 64287164
3089 64287164 63801209 63351324 62574636 61962985 61514492 60978579 60333280 59845967 59281968
3080 59281968 58614541 58015504 57490292 57148457 56524971 55946131 55393389 54715662 54115424
3071 54115424 53647185 53215028 52457139 52265097 52024493 51515954 51116826 50827226 50555508
3062E0555508k74473j57886l88460k94501m76335n46991l59937n59130o83035
3053D6814760m82064p40586q34784q51073n82662q86917r65992p86482p86711
3044C9897489p71056p69335n43511n90787m77386m64307l30791n27487k99615
3035C5123214k12800m01502k42443l56643l25873l24491l51143m01115n87754
3026C1919450k38058j39543J585k14725o01720k23689m0160j97478j52566q4529
3016C0028567k45657p8009o9599j12623k9251m9036J02786j54904j65092J60411
3006B9387593J9705k04223l6545M18634N7085k5109k4189j12915K89608j06400
2996B9663244q9327J65699m7897m7924r1215N1977r803J5700J34529J32922J13153
$$ plain form
3062 50555508 50281035 50123149 49734689 49440188 48963853 48416862 48056925 47497795 46814760
3053 46814760 46332696 45592110 44757326 43906253 43323591 42436674 41470682 40684200 39897489
3044 39897489 39126433 38357098 37813587 37222800 36745414 36281107 35950316 35422829 35123214
3035 35123214 34910414 34508912 34266469 33909826 33583953 33259462 32908319 32507204 31919450
3026 31919450 31681392 31541849 31543434 31328709 30726989 30503300 30463140 30265662 30113096 30028567
3016 30028567 29782910 29704901 29635302 29522679 29493428 29444392 29547178 29392274 29227182 29387593
3006 29387593 29407298 29203075 29166530 29585164 29642249 29617140 29592951 29480036 29769644 29663244
2996 29663244 29573917 29739616 29691719 29643795 29552580 29604557 29594754 29610454 29744983 29877905 29991058
2985B9991058J78320J0493K66047L96384L80071J99582O2016J64523K98811L85442
2975C2332747K34299K19301M17013K35570M36060L44364L56295N16805M01566
2966C5494020J46372L42173N01367N24884P34732N02639N76791R00784O68134
2957D0391896O14885Q76684P31725O06584Q05786J131007J126640Q47439J053345
2948D8185991R19240J224574J144447J229265R89580J348170J583841J449767
2940E8074875J599727J744643J567470J821220J695721J668198K032734K319320
2932G2523908K068185K375464K256604K201841K576741K452797K681748K829150
2924I1966438L087746L274356L697388L892942M177190M451162M714458M844235
$$ plain form
2985 29991058 30169378 30179871 30445918 30842302 31222373 31421955 31483971 31648494 31947305 32332747
2975 32332747 32567046 32786347 33203360 33438930 33874990 34219354 34575649 35092454 35494020
2966 35494020 35640392 35982565 36483932 37008816 37743548 38246187 38822978 39723762 40391896
2957 40391896 41006781 41883465 42615190 43221774 44027560 45158567 46285207 47132646 48185991
2948 48185991 49105231 50329805 51474252 52703517 53693097 55041267 56625108 58074875
2940 58074875 59674602 61419245 62986715 64807935 66503656 68171854 70204588 72523908
2932 72523908 74592093 76967557 79224161 81426002 84002743 86455540 89137288 91966438
2924 91966438 95054184 98328540 102025928 105918870 110096060 114547222 119261680 124105915
2916A24105915N244293N527650N459772N087824M733301L736709L445165L266892
2908A60607521L364154L799579M562539M895477N516057O242252P095979P815598
2900B03899156Q720582R523125J0456983J1197835J2094498J2660641J2996894
2893B81549714J2930900J3322866J3689144J3342386J3599381J3724334J3243525
2886C75402250J2736907J1940174J0899440R456497Q396974P683585P014816O173447
2878D49704090M550276K449372J99466k401918m166947n307298n084871l862532
2870D36079638k449625k80552J387230L239665N055047N607664N682274N216016
2862D59537357K981170j37553m682095r676702j4169727j7996556k0011527k0113615
$$ plain form
2916 124105915 129350208 134877858 140337630 145425454 150158755 153895464 157340629 160607521
2908 160607521 163971675 167771254 172333793 177229270 182745327 188987579 196083558 203899156
2900 203899156 212619738 222142863 232599846 243797681 255892179 268552820 281549714
2893 281549714 294480614 307803480 321492624 334835010 348434391 362158725 375402250
2886 375402250 388139157 400079331 410978771 420435268 428832242 436515827 443530643 449704090
2878 449704090 454254366 456703738 456903204 454501286 450334339 445027041 439942170 436079638
2870 436079638 433630013 433349461 434736691 437976356 443031403 448639067 454321341 459537357
2862 459537357 462518527 462380974 457698879 448022177 433852450 415855894 395844367 375730752
2854C75730752j9561340j8295825j6857591j5922174j4243818j2805433j1632255
2847B66412316j0366628r148034p933001p086273n966863n210948n313418n102672
2839B10284479n392314n209225n574191n886848n478009m993657m598186m456719
2831A68695330l586046l029686k997976k479118k090919k398398k882760l065848
2823A46164579l472439l968070m345018m523316m449585m272196l722877l435122
2815A13975956l075837k815642k822181k499744k390767k502761k571670k874833
2807I2422521k849149k670049k425947k514189k336047j924269j518008j574034
2799G4610829j162123j135450j359428j436355j525538j700621k242633k607456
$$ plain form
2854 375730752 356169412 337873587 321015996 305093822 290850004 278044571 266412316
2847 266412316 256045688 246897654 238964653 231878380 225911517 220700569 215387151 210284479
2839 210284479 204892165 199682940 194108749 188221901 182743892 177750235 173152049 168695330
2831 168695330 165109284 162079598 159081622 156602504 154511585 152113187 149230427 146164579
2823 146164579 142692140 138724070 134379052 129855736 125406151 121133955 117411078 113975956
2815 113975956 110900119 108084477 105262296 102762552 100371785 97869024 95297354 92422521
2807 92422521 89573372 86903323 84477376 81963187 79627140 77702871 76184863 74610829
2799 74610829 73448706 72313256 70953828 69517473 67991935 66291314 64048681 61441225
2791F1441225k593905k353178k471106k261417k108331j952834j830537j609059
2783D4260858j399289j305037j187717j249154j120416j352120r03549j072079
2775C4671497n50772q95393r57913p98765q21241p30157q11229o03197m58493
2766B8044337o95759o21752o16930m74402l99477l59190m54499l97445k83926
2757B3740957o17146o46502m32578l60504j63301l48772n31880j96567l04839
2748B0138868k17024k11964m10411j40902q1805n42543l32467j38373k84383m11409
2738A7367587k55159L9253k66639l95579j84680j97382k5108m70115k7712m0234
2728A5544232k54267k21550k15599j39062k73070k12820j04558j53230j38739
$$ plain form
2791 61441225 58847320 56494142 54023036 51761619 49653288 47700454 45869917 44260858
2783 44260858 42861569 41556532 40368815 39119661 37999245 36647125 35743576 34671497
2775 34671497 34120725 33225332 32267419 31468654 30647413 29917256 29106027 28502830 28044337
2766 28044337 27348578 26726826 26109896 25635494 25236017 24876827 24422328 24024883 23740957
2757 23740957 23123811 22477309 22044731 21684227 21520926 21172154 20640274 20443707 20138868
2748 20138868 19921844 19709880 19299469 19158567 19076762 18534219 18201752 18063379 17778996 17367587
2738 17367587 17112428 17151681 16885042 16489463 16304783 16107401 16082293 15612178 15584466 15544232
2728 15544232 15289965 15068415 14852816 14713754 14440684 14227864 14123306 13970076 13831337
2719A3831337j49764j91269k21282j50086m4347o1792k68465j29476j48878l58453
2709A2107525j70328J18373l10396q652k7099j10313O487k97588j24141l5554
2699A1148314j36025m9713k88648j97395j05161k097r1052K8218o2482k74192
2689I969767j7303r8997M336k03291n0400r6212j85239j42042R6889k70751k50118
2678H756639K2220j74168k52766q5928j17002j78156J0917j59259j01627j76787
2668G544083L5663l7727n5351P2310l01429k60480J06207P1902l6592k86007l89706
2657F462873j5073P3650r2216J8392K14034K794j50276j47600n6556L2263N474
2646F347759k2302r7846j6117o7910j52546k30087P1906M2567R6281m4370j24182
$$ plain form
2719 13831337 13681573 13490304 13269022 13118936 13074589 13012797 12744332 12614856 12465978 12107525
2709 12107525 11937197 12055570 11745174 11736522 11709423 11599110 11605597 11308009 11183868 11148314
2699 11148314 11012289 10962576 10673928 10476533 10371372 10369275 10278223 10306441 10243959 9969767
2689 9969767 9952464 9853467 9857803 9654512 9604112 9507900 9322661 9180619 9277508 9006757 8756639
2678 8756639 8778859 8604691 8351925 8265997 8148995 7970839 7981756 7822497 7720870 7544083
2668 7544083 7579746 7542019 7486668 7558978 7257549 6997069 7103276 7175178 7138586 6852579 6462873
2657 6462873 6447800 6521450 6429234 6447626 6661660 6664454 6514178 6366578 6310022 6342285 6347759
2646 6347759 6325457 6227611 6211494 6143584 5991038 5760951 5832857 5875424 5971705 5927335 5803153
2635E803153j370k5036o9429k53827p2205J20714j89566K22146p099l04009L4541
2624E258013Q4040J40468M4702j18331J16881J47819k23709Q7856O3414L2698
2614E633851r5464n401q4495K8981L9910O5795J14510K6960j23179j24016R9453
2603E576905R2713L2955J6622j07273L4870P579l139J41121Q4424m1654l19660
2592E515463j7021J19057J86428J19730j74295j58601j47286r0395n883J82560
2582E529757Q6201j1087k12242k9074j04390M4147M1804k9365j18458j30258o4895
2571E002140l20750J07401K07774j60478j27000j37727j54392J08433k44865J563
2561D282099p5212j06854k9470j84427r2407k38189j39227j4024J24617j96431
$$ plain form
2635 5803153 5801783 5776747 5707318 5453491 5381286 5502000 5312434 5534580 5527481 5223472 5258013
2624 5258013 5342053 5482521 5527223 5408892 5525773 5673592 5449883 5537739 5601153 5633851
2614 5633851 5538387 5532986 5448491 5477472 5517382 5583177 5697687 5724647 5601468 5477452 5576905
2603 5576905 5669618 5702573 5719195 5611922 5646792 5654371 5651232 5792353 5876777 5835123 5515463
2592 5515463 5498442 5617499 5803927 5923657 5749362 5590761 5443475 5353080 5347197 5529757
2582 5529757 5615958 5604871 5392629 5363555 5259165 5303312 5345116 5315751 5197293 5067035 5002140
2571 5002140 4681390 4788791 4996565 4836087 4709087 4571360 4416968 4525401 4280536 4282099
2561 4282099 4206887 4100033 4070563 3886136 3793729 3555540 3416313 3402289 3526906 3330475
2551C330475J4489J51047m4509j52758k40963j11020N574J02906J67881k12155
2541C010967J32846n5334j24988q3582K7984P688M2956J6429q9164Q8393j2474
2530B961721r747l47385j10117J42347R8151K2847J65772j17291m1820j49396
2520B615082k56695j84026O5337N6874J22694J86042k29855n1770l7280R9290
2510B385693P5951J00844J68591n0867o9727k8160j65174j12146R6182R8909r9772
2499B400324J7246k51548j16562K6826j01514q2251j08234K42601j08540Q6822
2489B005170j23507r628j59150k2591J51140r2584J63450q7151J13957K18446
2479B157552k62967o4406o0758j73394M165l6246k8149J73623J86273J15223k52908
$$ plain form
2551 3330475 3344964 3496011 3451502 3298744 3057781 2946761 2952335 3055241 3223122 3010967
2541 3010967 3143813 3088479 2963491 2879909 2907893 2915581 2958537 2974966 2885802 2974195 2961721
2530 2961721 2951974 2604589 2494472 2636819 2734970 2757817 2923589 2806298 2764478 2615082
2520 2615082 2358387 2174361 2239698 2296572 2419266 2605308 2375453 2323683 2286403 2385693
2510 2385693 2461644 2562488 2731079 2680212 2610485 2582325 2417151 2305005 2401187 2500096 2400324
2499 2400324 2417570 2166022 2049460 2076286 1974772 1892521 1784287 2026888 1918348 2005170
2489 2005170 1881663 1872035 1712885 1690294 1841434 1748850 1912300 1825149 1939106 2157552
2479 2157552 1894585 1830179 1769421 1596027 1600192 1563946 1535797 1709420 1895693 2010916 1758008
2468A758008k3331R710n5989J10507j54206J04650l6688n5171J5901j96510J91860
2457A668741P133J29293o2001K862k33223m3810J93443k01650O0408J82344J7645
2446A721185k52363j50008Q6443K23686m996j34954J55827L7518j91922L4793
2436A525209O7132p2774R6006m0787k25275k0301J16541O8181j93901J65744N4912
2425A540687n0550m42908O6176K021L5927J34632r1153P9275N1293k1133K2960
2414A327227o3668l8942N5273P17k9939P0727j1565J6942J47981m1007j02941
2403A330805j67589J31792J09202n8489N5538k43812K721l1426K59922J0082j86279
2392A212467p2990j322J11033k1171o024O7525j7414k06313J589J76053J46036
$$ plain form
2468 1758008 1734677 1744387 1688398 1798905 1644699 1749349 1712661 1657490 1673391 1476881 1668741
2457 1668741 1675874 1805167 1743166 1746028 1512805 1468995 1662438 1460788 1521196 1703540 1721185
2446 1721185 1468822 1318814 1405257 1628943 1623947 1488993 1644820 1682338 1490416 1525209
2436 1525209 1592341 1519567 1615573 1574786 1349511 1329210 1445751 1513932 1320031 1485775 1540687
2425 1540687 1490137 1047229 1113405 1115426 1151353 1285985 1194832 1274107 1325400 1304267 1327227
2414 1327227 1263559 1224617 1279890 1280607 1250668 1321395 1309830 1326772 1474753 1433746 1330805
2403 1330805 1163216 1295008 1404210 1345721 1401259 1157447 1160168 1128742 1388664 1398746 1212467
2392 1212467 1139477 1138155 1249188 1228017 1221993 1289518 1272104 1065791 1067380 1243433 1389469
2381A389469j04521n3564j46363J37272j56613J81722J09812j58113k665j00553
2371A095883o6414P6869j7047k7335K2487L8568k8464M3612K21439R8221j97341
2360A260478n0644p2262j83726K67080n3446k0589r355M349J64234j99331Q611
2349A115399J47408R0190L715j66715P4865j6269k1546k37778n2215J52726k1491
2338A068289r4351Q0315J98303j76115j9728P9212j01787k8848q3370j59834K99013
2327A061099Q4349m7825m720J56979j28570K6571R8451j15599L2418o050k47852
2316I09251j09222K6433N1546p7572j46026J06509P9130J02539n9480J28874J0532
2305A022514K9306n1822l4104J4652k3546P4807q9792j65595L7448o7977J08961
$$ plain form
2381 1389469 1284948 1231384 1085021 1222293 1065680 1247402 1357214 1199101 1196436 1095883
2371 1095883 1029469 1106338 1089291 1061956 1084443 1123011 1094547 1138159 1359598 1457819 1260478
2360 1260478 1209834 1137572 953846 1220926 1167480 1146891 1137536 1141885 1306119 1106788 1115399
2349 1115399 1262807 1352997 1356712 1189997 1264862 1248593 1227047 989269 937054 1089780 1068289
2338 1068289 973938 1054253 1252556 1076441 1056713 1135925 1034138 1005290 921920 762086 1061099
2327 1061099 1145448 1097623 1092903 1249882 1121312 1147883 1246334 1130735 1163153 1157103 909251
2316 909251 800029 826462 878008 800436 654410 760919 840049 942588 883108 1011982 1022514
2305 1022514 1051820 999998 965894 980546 957000 1031807 942015 776420 813868 745891 854852
2294H54852J39800J29788j84927j63451Q1231k6075O5483K1675p4913j46797J70905
2283H67571M7352j09328J6970j10689q6434K5476p4709K21019J00823j8755R7929
2272I77225L8696j40267j77928M3436P6376m0926k5856L4941j07840q8906q9799
2261D99152Q9389J97364j2423l5729o6433P2287N373J20888l17759J725L15768
2250H69602j408K6026L099j12921j29480O688M555M8988N7919o5569j24629J76168
2238G59038j7973J20882J71886j65032k25401J29165k213k8970l0968K10188J45657
2227A066259j53726j35642K5485k6512M2888L806k1760M8281j15637L282K79275
2216A015999m4413l8089j92636J9031J32272j16355o523J0178J23388J471r2537
$$ plain form
2294 854852 994652 1124440 939513 776062 857293 831218 896701 918376 843463 696666 867571
2283 867571 914923 805595 822565 711876 625442 650918 576209 797228 898051 879296 977225
2272 977225 1015921 875654 697726 741162 817538 776612 750756 785697 677857 588951 499152
2261 499152 588541 785905 773482 737753 671320 743607 748980 869868 552109 553834 869602
2250 869602 868194 894220 897319 784398 654918 661606 666161 715149 773068 707499 582870 759038
2238 759038 741065 861947 1033833 868801 643400 772565 770352 741382 710414 920602 1066259
2227 1066259 912533 776891 802376 775864 818752 822558 800798 849079 733442 736724 1015999
2216 1015999 971586 933497 740861 759892 892164 775809 769286 779464 902852 904323 811786
2205H11786k15485M5953J38959Q8106J1642j96208j3027K24918O0307J01633j99398
2194H59186N8782N8380j13905p54J79360O5492m9769k03602q3526J97688p029
2183I60303p3547M9368K7962P3346L5227Q8313k65464j27743O9557R4024K5528
2172I56874P422p3094j45626R5156j6610p62K15079o6357j09811J55953p7038
2161I41186N4329J6879k7362R9608K9637n5772J60442o6829r6716J53067J53089
2150A361558n8133Q5902P5199j24988k56426J09231R1902J13721l6801R1515J31579
2139A584259j807m8548n6747M4666l745j55149o9107K13328K03445m5867L9941
2128A704669K31608J18460j86243p2050J52969J81740L8386m375j30562N0072
$$ plain form
2205 811786 596301 642254 781213 869319 880961 684753 671726 896644 956951 1058584 859186
2194 859186 917968 976348 862443 861689 1041049 1106541 1056772 853170 769644 967332 960303
2183 960303 886756 936124 964086 1037432 1072659 1160972 895508 767765 837322 931346 956874
2172 956874 964296 891202 745576 840732 824122 823360 1038439 972082 862271 1018224 941186
2161 941186 995515 1012394 985032 1084640 1114277 1058505 1218947 1152118 1055402 1208469 1361558
2150 1361558 1303425 1389327 1464526 1339538 1083112 1192343 1284245 1397966 1361165 1452680 1584259
2139 1584259 1582452 1533904 1477157 1521823 1518078 1362929 1293822 1507150 1710595 1664728 1704669
2128 1704669 1936277 2054737 1868494 1796444 1949413 2131153 2169539 2165164 2034602 2084674
2118B084674M6993L50292p6178K98K28975j2138Q2397J8852K43949o3990L14307
2107C218431L52098p3336J68520J69197Q6757K51128K83817L9931K84161L53444
2097E134148R6758L22165K55951P91025N80234M44061L09647O78992P50711J046007
2087A0409699J292988J485116J960503K702111L681169N348473M451421N523647
2079C6855127R690989P863752m078242j1230535r959229o899068m184114l045381
2071A5013299k516633k024096j366504r29118m54998k59927k58975l20809k54213
2062F628026l63064n72425n58534k91443n59136j46687k81087r4184k70665k29852
2052C260949l03718j21970r2979j14373l51211L1801J76024M97K0282J73882j03151
$$ plain form
2118 2084674 2131667 2481959 2405781 2406079 2635054 2622916 2705313 2724165 2968114 2904124 3218431
2107 3218431 3570529 3497193 3665713 3834910 3921667 4172795 4456612 4496543 4780704 5134148
2097 5134148 5230906 5553071 5809022 6600047 7180281 7624342 7933989 8612981 9363692 10409699
2087 10409699 11702687 13187803 15148306 17850417 21531586 26880059 31331480 36855127
2079 36855127 46546116 54409868 50331626 39101091 29141862 22242794 18058680 15013299
2071 15013299 12496666 10472570 9106066 8176948 7721950 7462023 7203048 6882239 6628026
2062 6628026 6264962 5692537 5134003 4842560 4283424 4136737 3855650 3761466 3490801 3260949
2052 3260949 2957231 2835261 2742282 2627909 2276698 2308499 2484523 2485020 2505302 2679184 2576033
2041B576033l15698m5277R48r8485J29334j74652j57171o6732l94301J11784M0320
2030A606103m723q0408Q5799O3030l01674M3540J35690o2144j09919m096J19148
2019A490346j51003k33785j7273k08551J12392K02533O4461j14557L9883Q5493
2009A269939j02492J15050p8165k70391Q1786K6550l7850J04846J42872j28359
1999A123786j54805j4378j09985n9794r432Q4732o9904r7937K06907P8556j76681
1988H01065j32060J72025n837q4855j69265K4654J87378M813k8128J49959O4476
1977I84225j29197j31269o8066r6597P4654Q0776j03835P437L7189q1310J39246
1966G13253j39838K84649J4768l82287J61065J30098l1877L1324L53465k52819
$$ plain form
2041 2576033 2260335 2215058 2216006 2117521 2246855 2072203 1915032 1848300 1453999 1565783 1606103
2030 1606103 1601380 1520972 1606771 1669801 1368127 1411667 1547357 1485213 1375294 1371198 1490346
2019 1490346 1339343 1105558 1088285 879734 992126 1194659 1259120 1144563 1184446 1269939
2009 1269939 1167447 1282497 1204332 933941 1015727 1042277 1004427 1109273 1252145 1123786
1999 1123786 968981 954603 844618 784824 775392 860124 790220 692283 899190 977746 801065
1988 801065 669005 841030 835193 750338 581073 605727 793105 797918 769790 919749 984225
1977 984225 855028 723759 655693 559096 633750 714526 610691 618128 655317 574007 713253
1966 713253 573415 858064 872832 490545 651610 781708 749831 781155 1134620 881801
1956H81801l12033J6593k9814o2365K66950N6679j07123j34717N8425n2910j07240
1945D74246R5973J80443J272Q01l8836k17847j28382L7982P5755J13248R616j43978
1933D60293k98815K55728L520K37055q0027j9882M6334m3420o7860m1291J07810
1922E59445k46726J03649j9259J01942K42010q0483j45983j85723J11755K69254
1912G09881l24197n0519P1569J52412J5283K6750j8006l4959j37822j8640J16701
1901E08453k83j18344M8632L3091N5907m4520q3781K8813k3771J77459k22433
1890C59223j08366J76220l2224q3414m8846j16886K3510J52119k0079j3415p50
1879B87092J1575K6678n5226J37681m4360j225m4103q0747j14381J03447J31061
$$ plain form
1956 881801 569768 586361 556547 494182 761132 817811 710688 575971 634396 581486 474246
1945 474246 570219 750662 751934 752735 713899 496052 367670 405652 481407 594655 604271 460293
1933 460293 161478 417206 420726 657781 577754 557872 604206 560786 492926 451635 559445
1922 559445 312719 416368 397109 499051 741061 660578 514595 328872 440627 709881
1912 709881 385684 335165 406734 559146 574429 601179 583173 548214 410392 391752 508453
1901 508453 508170 389826 438458 471549 527456 482936 399155 427968 404197 581656 359223
1890 359223 250857 427077 394853 311439 262593 145707 169217 321336 301257 287842 287092
1879 287092 298667 325345 270119 407800 363440 362215 318112 237365 122984 226431 357492
1868C57492J39653m8143O1568L5644j92171L4794P1177r6623k9883l6488r5832
1857B01188l1142J37263J65783J58857j38125j53860J86194m5492l0798p020j36883
1846C05965L7232Q8384p4740K7320P1673l4644J27313n4803J03313J90286j92663
1835E94636j48779R7402j83601o1656J4544l2120K2523J0302J68545j10285k1641
1824C49870O4709o5814J4050J2935k8985l4409P3504K33217j7152r2435j25380
1813C84110J78978O339n3857k5887L53948j46680j55255o87j08104r9481n8336
1802B75088O1028N7667J75522N7032j30268j94585p6559O5650o4455k195J48182
1791C72107k3879q4800p937J69880j19364n7470M8798r0101K2404k6721k1829
$$ plain form
1868 357492 497145 449002 510570 546214 354043 388837 460014 363391 333508 297020 201188
1857 201188 170046 307309 473092 631949 493824 339964 526158 480666 449868 442848 305965
1846 305965 343197 431581 356841 384161 455834 421190 548503 493700 597013 787299 594636
1835 594636 445857 543259 359658 298002 312546 280426 302949 313251 481796 371511 349870
1824 349870 414579 348765 362815 375750 346765 312356 385860 619077 601925 509490 384110
1813 384110 563088 569427 515570 489683 843631 696951 541696 541009 432905 333424 275088
1802 275088 336116 393783 569305 626337 496069 301484 224925 290575 226120 223925 372107
1791 372107 348228 263428 255491 425371 306007 248537 297335 207234 229638 202917 181088
1780A81088Q916M59658j71266k33900L5105O9914o5664p8523j05953N7786J5802
1769A72963N2316J23624k02638J03261K23936j20858j95384P6224M443J08516
1759C46403l4379k08420L471O6400J81539K2081j13943j07295K3411k5216Q8266
1748B42318J55378j19058j62029J57605q74J01409j19959R486J47425J237n1005
1737C61933J5593k6523q3933j9080K6926P3532k39638K35674O2830r0842j05094
1726B11378L8477J23559M8913j40391L5725r1683P7290j54833J5319q2551J94451
1715B75654o1249P0080p1173O8122K33037j03067k1361m1770m1813q8373J4881
1704B32968K5853j30676O0079J20902j23006m453r0137j36234o1939J61675J41168
$$ plain form
1780 181088 190004 649662 478396 244496 279601 349515 283851 205328 99375 157161 172963
1769 172963 225279 348903 146265 249526 473462 352604 157220 233444 237887 346403
1759 346403 312024 103604 107075 173475 355014 377095 263152 155857 179268 154052 242318
1748 242318 397696 278638 116609 274214 273340 374749 254790 264276 411701 412938 361933
1737 361933 377526 351003 267070 247990 274916 348448 108810 344484 407314 316472 211378
1726 211378 249855 373414 422327 281936 317661 225978 303268 148435 163754 81203 275654
1715 275654 214405 284485 213312 281434 514471 411404 390043 348273 306460 218087 232968
1704 232968 258821 128145 188224 309126 186120 181667 91530 -44704 -106643 55032 196200
1693A96200j18958l4235K2427J8116r6684M737R865J18327L6032k4880L2162k4289
1681A38820m3834j28077J48575J51005m7305l4450q6447K4397j53427o0832J64408
1670G2833Q649J0542Q8992M5052K8867P7392q0339k05858k9219L01260j24435
1659A93736k12569O5720k7820K74830j27799m3304J07677O7972P7479k8330R3997
1648D41589q4674p6510j83286L3291R4529M6114m4028J5442O653j03114K89323
1637D35329j60209k9292M9359k44824o3802J46950M7376k3000J92680L3932K18182
1626F02681l9964r0145j09193j50320k37953J01599J66729j27908p1873R617K15712
1615B68982J96624l34330O2489K18735n5655j2552m2063r4772J48813j4437j23099
$$ plain form
1693 196200 77242 43007 65434 83550 -13134 -8397 1468 119795 155827 130947 163109 138820
1681 138820 94986 -33091 115484 266489 219184 184734 98287 122684 -30743 -91575 72833
1670 72833 81482 92024 181016 226068 254935 332327 251988 46130 16911 318171 193736
1659 193736 -18833 46887 19067 293897 166098 122794 230471 298443 375922 347592 441589
1648 441589 356915 280405 97119 130410 224939 271053 227025 242467 249120 146006 435329
1637 435329 275120 245828 295187 50363 -13439 133511 180887 157887 350567 384499 602681
1626 602681 562717 472572 363379 213059 -24894 76705 243434 115526 43653 53270 268982
1615 268982 465606 131276 193765 412500 356845 344293 302230 207458 356271 341834 218735
1604B18735j07276J22450J3464K69901r9258j88059j07566K66211k19671j53436
1594A5495R2468q915j9695N8156N8011o0754O8332M948j75777P7521N2623p2085
1582I0328L0997k36592k4616k8081J55293L545k3246J20093P5306k3994K70739
1571D09772m0067k01375J65171j87952j57075J59469l3395r3506J69673q061j14831
1560F7823J54863K10187R6072k31815j85277J09916R0397j18931l9964j30307
1550B2964J46826p9376n4286P8914j2679P3962r7283n7721P5389o4780J49591
1539A81521m511p1944K846O4708N802Q3552n1433j71225j5484J47410J1943q4899
1527I8286J01175L8456k01356O8946K37137q1082q3978k37469j0779K99559r1797
$$ plain form
1604 218735 111459 233909 247373 517274 418016 229957 122391 388602 168931 15495
1594 15495 107963 99048 79353 137509 195520 134766 203098 208046 32269 109790 162413 90328
1582 90328 121325 -115267 -139883 -167964 -12671 -9126 -32372 87721 163027 139033 409772
1571 409772 369705 168330 333501 145549 -11526 147943 114548 21042 190715 182654 67823
1560 67823 222686 432873 528945 297130 111853 221769 312166 193235 153271 22964
1550 22964 169790 90414 36128 115042 102363 176325 79042 21321 96710 31930 181521
1539 181521 177010 105066 107912 172620 178422 261974 210541 39316 23832 171242 183185 98286
1527 98286 199461 237917 36561 105507 342644 261562 177584 -59885 -70664 228895 137098
1516A37098j13327J48999j8153k2281j20354N6193K11851j73853L5283K50998
1506C92454o609j48035j40156O4313K63035j28011j51040K8384q0724l3473L8418
1495I8556J36100L4069o7708Q8607J7545j03815p5153P8765J2723r9351J8039
1484A38377J32149r2495l4712J57134J5493j419j45517l1614K97492j49531j26000
1473A59357j19394P3025O4680j95754j4290J62319o2796m7378L2802J58820M2783
1462B54174m5440J59450j81104j00804J26431O72r9132N1669j22186J1725j58138
1451a02683l0616J37518j15783J23321P9894j8685R6451K7875p6167q9827Q5808
1440A17106J1705L7653M5769k65770j15456K07459j6259j8230L6313K18532P1035
$$ plain form
1516 137098 23771 172770 154617 132336 11982 68175 280026 106173 141456 392454
1506 392454 385845 237810 97654 161967 425002 296991 145951 174335 93611 60138 98556
1495 98556 234656 268725 201017 289624 307169 203354 128201 206966 219689 120338 138377
1484 138377 270526 178031 143319 300453 315946 314527 169010 137396 434888 285357 159357
1473 159357 39963 112988 177668 -18086 -32376 129943 67147 19769 52571 211391 254174
1462 254174 208734 368184 187080 86276 212707 213379 114247 165916 43730 55455 -102683
1451 -102683 -133299 4219 -111564 11757 91651 72966 169417 197292 121125 31298 117106
1440 117106 128811 166464 212233 -53537 -168993 38466 22207 3977 40290 258822 329857
1429C29857p3072j54988K8433N2921j08272L8941Q2396p6728J1451R850m2572
1418I8217J17801j20388j45299O7461J86041P9397K4990j06873n9226R9759K6001
1407B67881j05272j20830J468l3061K9146Q6312J79851J17480j14521l0016k06558
1396G1880J71509q7764j80853J01930N778k8082P9697n2181O9226O6761r4716
1385A23185j78618o465J753L8325j3270L0800J35772n0031J57284o2388L441j04937
1373G4851J1109j74957R4869J13567Q5430L4042o0965k41529J35377O7227J02093
1362B41114k01279J28121j35593k85254J14404R8610j6974J88153m8767k22132
1352a39597J44572l7260O1329N7669K64076R3030j40033N1118k4j19236k29091
$$ plain form
1429 329857 256785 101797 130230 183151 74879 113820 196216 119488 130939 140789 98217
1418 98217 216018 95630 -49669 17792 203833 283230 308220 201347 142121 241880 267881
1407 267881 162609 41779 43247 10186 39332 125644 305495 422975 308454 278438 71880
1396 71880 243389 155625 -25228 76702 82480 54398 134095 81914 151140 217901 123185
1385 123185 -55433 -61898 -60145 -21820 -35090 -4290 131482 81451 238735 176347 179788 74851
1373 74851 85960 -88997 5872 119439 204869 238911 177946 -63583 71794 139021 241114
1362 241114 39835 167956 32363 -252891 -138487 -39877 -56851 131302 82535 -139597
1352 -139597 4975 -32285 29044 86713 350789 443819 303786 354904 354880 235644 6553
1341F553j68141K29572j6260j5348J43110q7057q8952k3949L1375J37517n3239
1330I5181J7120k3690J9645k68817J46287P1203k28736J36399Q7320n1690j4533
1319a4311P148l5237K26880R9243j79768L1681j74265K08896Q4793l0454m7371
1308A77235k18104r6411j08224R5299J18971J36283K10201K4730j99303j11002
1298B9675j02399J82373l4101n9233Q3263O5508o2770j79307J2427N185O925k2279
1286g4733M8683N9597j2782o3202j97621n0162K56939k407J71513M6238j57160
1275B4903p7322j10073q6171M4268R1112K60615k24310j9248N0535Q5271p576
1264C2004m6585k26332Q7330Q839j106K26039j90182J48292J28743l471k5373
$$ plain form
1341 6553 -161588 67984 51724 36376 179486 92429 3477 -20472 10903 148420 95181
1330 95181 112301 88611 108256 -160561 -14274 56929 -171807 -35408 51912 222 -14311
1319 -14311 -7163 -42400 184480 283723 103955 135636 -38629 170267 255060 224606 177235
1308 177235 -40869 -137280 -245504 -150205 -31234 105049 315250 339980 140677 29675
1298 29675 -72724 109649 75548 16315 99578 165086 102316 -76991 -64564 -59379 -52454 -74733
1286 -74733 -26050 33547 20765 -42437 -240058 -290220 -33281 -35688 135825 182063 24903
1275 24903 -52419 -162492 -248663 -204395 -113283 147332 -76978 -96226 -45691 39580 32004
1264 32004 -14581 -240913 -153583 -144744 -145850 80189 -109993 38299 167042 163571 138198
1253A38198K09240J739p3675j24392R2794L368j71176J05288j32421k3053R2279
1242A18189P4718k0483j52451J56403O366j65374j21426J7409J09453M8943p5958
1231d211n4614K7010J39642j50315Q1109j31749Q244J46705l03276J31827R0988
1220a8640j08131K2204J44358j85497M2714J91483m9829M9612j03271K1137k4043
1209a7903O227j71868k32394M7263J57963Q5157P7616m5947J54970M1781m375
1198I8490R0599j48408q4240j05716K22394r3995o8351J87647L1279m7612R015
1187I1102j07600j01828R3416L2435J89307M2805j61315n2358j81103K6247L08926
1176A80034m6061j73415J95450q534l4217k6717P5130J10865j20284j3435m3972
$$ plain form
1253 138198 347438 349177 275502 151110 243904 247272 76096 181384 48963 25910 118189
1242 118189 192907 172424 19973 176376 182742 17368 -104058 -86649 22804 71747 -4211
1231 -4211 -58825 -31815 107827 -42488 38621 -93128 -84884 61821 -241455 -109628 -18640
1220 -18640 -126771 -104567 39791 -145706 -102992 88491 38662 88274 -14997 6140 -17903
1209 -17903 -11676 -183544 -415938 -368675 -210712 -125555 -47939 -93886 61084 102865 98490
1198 98490 189089 40681 -43559 -149275 73119 -20876 -89227 98420 129699 82087 91102
1187 91102 -16498 -118326 -24910 7525 196832 239637 78322 25964 -155139 -128892 180034
1176 180034 133973 -39442 156008 147474 113257 86540 161670 272535 152251 138816 94844
1165I4844J15418j25720j2226J77050n7737k6584k0102J82245K01742k45869q5683
1154A97378K1672J55930n177o7643j62967J04007K6615o0231p159r3494k3341
1143H5590j02656J74301j925l2855J62775o2457m3203N4323j29121j24452J30915
1132A11235j21778J55765j0285m0685J9102J7141Q9305l8452Q53k8173o9218j71048
1120h6238q6832J23904J65093o7991R7310M7573m2905o8407m0656K1945L8837
1109A01633j40483k4059Q0289o0503q785Q5838l5729J30645R8356r1692M7254
1098A82764m7768k4156N3027K00502q8258j11374p8356J11102J43936j22629K0215
1087B39005k8607j42581K2422J07060n052j93788j21775L1828J58884Q0053j29787
$$ plain form
1165 94844 210262 84542 72316 249366 191629 165045 144943 327188 528930 283061 197378
1154 197378 219050 374980 369803 302160 139193 243200 269815 209584 202425 108931 85590
1143 85590 -17066 157235 155310 122455 285230 222773 179570 233893 104772 -19680 111235
1132 111235 -10543 145222 134937 94252 113354 130495 219800 181348 182201 154028 84810 -86238
1120 -86238 -173070 -49166 115927 47936 145246 192819 149914 81507 40851 62796 101633
1109 101633 -38850 -62909 17380 -43123 -51908 33930 -1799 128846 227202 135510 182764
1098 182764 134996 110840 163867 364369 276111 164737 86381 197483 341419 218790 239005
1087 239005 210398 67817 90239 197299 192247 -1541 -123316 -91488 67396 147449 17662
1076A7662l9823j39319L38112K4191K5486M4299o4937k31378o6855Q1309k7269
1065c8522K12058k4611j63963J87847k0680j35628q054j24476J28809J33636q4178
1054F2238k1496j90647Q7611J33775R4152k65252r644Q658q6615K18522Q5365
1043A16667L2219J06992k98686j11151O0196J63500l1173j5997j9411j40473J64117
1032B6800j49251L74228k61943m6821O4164p2715N1049o8005j50966p444K42972
1021B068J44493K3500k81728J20496l3529P8190p2877k3841L501%m6624k23656
1009c10007K31665J552m6293N6050J27962J11446K8051k39375O7175m4897L4251
998A7580J77710p2206q4051j08881j20181Q1638J63427P2691j01262k18894K56970
$$ plain form
1076 17662 -22161 -161480 176632 200823 226309 270608 205671 -25707 -92562 -11253 -38522
1065 -38522 173536 148925 -15038 172809 152129 16501 8447 -116029 12780 146416 62238
1054 62238 40742 -149905 -62294 71481 165633 -99619 -109263 -100605 -187220 31302 116667
1043 116667 148886 255878 -42808 -153959 -93763 69737 38564 22567 3156 -137317 26800
1032 26800 -122451 251777 -10166 -56987 7177 -65538 -14489 -82494 -233460 -240904 2068
1021 2068 146561 170061 -111667 8829 -24700 53490 -19387 -43228 -39727 -39727 -86351 -310007
1009 -310007 -78342 -76790 -123083 -67033 60929 172375 200426 -38949 28226 -16671 17580
998 17580 195290 123084 39033 -69848 -190029 -108391 55036 127727 26465 -192429 64541
987F4541J9825j03143m7787l7089j9351j982k9761l3686K5642P0854k2684o5747
975a80368P8861J31284J3592J981P2658m7622N6873l6867j09786r4783J160J83922
963G0905m766j3727P3323R242Q7287k59267J36525J6140j60007J154N0533Q3019
951I0361p1216j46743R7584L413j05422M1438k9877J5530J89486l2609K1245J1280
939H4470j819J29772j01054k47783P4749J50910O706k27425P0257Q0706j82325
928a62836J13433J19773q3878L3774n0599q6994Q71M7634l0113J6047L9843Q4498
916D1453O995j13399n4399R6622J23062K2371N9629L3362k89333r2968L39103
905A72498j5388J0470j86811R3402r4218Q1190l9367n3965P3953n1483r849j8731
$$ plain form
987 64541 84366 -18777 -66564 -103653 -123004 -124986 -154747 -188433 -162791 -91937 -114621 -180368
975 -180368 -101507 29777 43369 45350 118008 70386 127259 90392 -19394 -114177 -113017 70905
963 70905 66139 52412 125735 134977 222264 -37003 99522 115662 -44345 -43191 7342 90361
951 90361 19145 -127598 -30014 -26601 -132023 -90585 -120462 -104932 84554 51945 73190 84470
939 84470 82651 212423 111369 -136414 -61665 89245 95951 -131474 -61217 19489 -162836
928 -162836 -49403 70370 -13508 20266 -30333 -117327 -116456 -68822 -98935 -82888 -43045 41453
916 41453 48448 -64951 -119350 -22728 100334 122705 182334 215696 -73637 -166605 172498
905 172498 157110 167580 -19231 74171 -20047 61143 21776 -32189 41764 -9719 -19568 -38299
893c8299M9370K29795m1389k13932Q825K4189l4073q5200j35642Q4401K69487
882A17532M7893J485m7092k13470k06379J66098Q2765K4429p6252L6858K22278
871A56145J04153o1893l2852r2730j91820J30161J11754M3614J19579j93001j48408
860e5298N3537K70888m8591k30967n710q4212K22585k34243m9221R7625K4071
849c9536j50159j39725K93427K21188j74695J4220p6515J33705M8715k76574r9760
838b45709M8468P235J02587l4087P4591m5433O0781M6354N6855r5772k47247K30502
826d0875P3203j40147L3614R7259r6865K19600J16884k71833j00295K2672N5822
815c0961O4004j42241Q2317j51518J2238J44770j9797j30592N6319L7351n7045
$$ plain form
893 -38299 11071 240866 199477 -14455 -5630 18559 -15514 -100714 -236356 -151955 117532
882 117532 165425 166910 119818 -93652 -300031 -133933 -51168 -26739 -102991 -66133 156145
871 156145 260298 198405 165553 72823 -118997 11164 122918 166532 286111 93110 -55298
860 -55298 -1761 269127 220536 -10431 -16141 -100353 122232 -112011 -161232 -63607 -39536
849 -39536 -189695 -329420 -35993 185195 10500 24720 -51795 81910 130625 -145949 -245709
838 -245709 -197241 -190006 -87419 -121506 -46915 -92348 -31567 14787 71642 -24130 -271377 -40875
826 -40875 32328 -107819 -74205 23054 -73811 145789 262673 -9160 -109455 -86783 -30961
815 -30961 33043 -109198 -26881 -178399 -166161 -21391 -41188 -171780 -115461 -78110 -135155
804a35155J02757L0443n2873j1430j22071J60296j69744J7679M1301K27741j62773
793g3829k34329J89751j23400K8578n3253P3166K75401M0448j41923r6369K07964
782I2205j97946q4402P0150k2180N9524o555k348Q4532J25366q5024k2888l0441
770b0007n4382R0559J67258J0526k62804n9502K99172m8045j75606J4892j02966
759a40905Q6279p3040j123K4867L7949J6524j65573K05339j01301r9986K05397
748e573M2360k66007K7813m2240J10489J7921J63662J5282j6497j2831Q2345j28435
736a1711l3964j30960O1308Q8345j64493n0105n1094J85188l3107J03371J4872
725b2350r8912p8178k3485J88019j0689j14473k9928J7170J4075m8875M2408j40729
$$ plain form
804 -135155 -32398 -1955 -54828 -66258 -188329 -28033 -197777 -180098 -138797 88944 -73829
793 -73829 -308158 -118407 -241807 -213229 -266482 -193316 82085 122533 -19390 -115759 92205
782 92205 -105741 -190143 -119993 -142173 -82649 -89204 -91552 -7020 118346 33322 10434 -20007
770 -20007 -74389 16170 183428 193954 -68850 -128352 170820 122775 -52831 -37939 -140905
759 -140905 -54626 -127666 -128789 -103922 -65973 -49449 -215022 -9683 -110984 -210970 -5573
748 -5573 36787 -229220 -201407 -243647 -133158 -115237 48425 63707 47210 34379 116724 -11711
736 -11711 -45675 -176635 -115327 -26982 -191475 -241580 -292674 -107486 -140593 -37222 -22350
725 -22350 -121262 -199440 -222925 -34906 -45595 -160068 -189996 -172826 -158751 -207626 -165218 -305947
713c05947K0226K6030K3446J85744r7098R2931j03590J2709P2522j54718J41064
702h6681J4982N5663R0417j43986j17394o1120K15432J148L6824J9351k01301
691a76665K42609L2340o2232k92148o2847K81870J46601J40426q5097k00116n0699
680h5958j21695J00499m6244n9257m6822J74536L2320j51593r6712Q0734P9091
669a41101j7313r6504p7144J12271J65227j08436p2305J7185L30809Q0463j44550
658D8602n8718q5068k8838j18277j65146K60284R2425L8469j24041K5222J16892
647A806j00838k9261k16836R1132J06132J07091R7463n5913l00708N2835k3899
636b70996j07348J06614n9143J07250J14633R6045p6305l7762j54667j17791J23382
$$ plain form
713 -305947 -285721 -259691 -236245 -50501 -147599 -54668 -158258 -145549 -73027 -227745 -86681
702 -86681 -71699 -16036 74381 -69605 -186999 -248119 -32687 -31539 5285 24636 -176665
691 -176665 65944 98284 36052 -256096 -318943 -37073 109528 249954 164857 -35259 -85958
680 -85958 -207653 -107154 -153398 -212655 -259477 -84941 -52621 -204214 -300926 -220192 -141101
669 -141101 -158414 -254918 -332062 -219791 -54564 -163000 -235305 -218120 112689 193152 48602
658 48602 -10116 -95184 -124022 -242299 -407445 -147161 -54736 -16267 -140308 -115086 1806
647 1806 -99032 -128293 -345129 -253997 -147865 -40774 56689 776 -299932 -247097 -270996
636 -270996 -378344 -271730 -330873 -223623 -108990 -12945 -89250 -127012 -281679 -399470 -276088
625b76088M9746N5604j65135L12222n088j53076Q6544m1717K3288K0957q4837
614a77580o213j6249K30928l7028J06803k1762P6995j79650j66821J41826J00019
603E1268k87869m0084N3150K554J13310M7444J50751k9071M8114j49156J1620
592b7969Q9374j26226j07985K10972J43897j16077L9735j52449p2708p0206o0483
581b50125K33486k4737o6664l4253j87736K39758q9851n4156J26579N8783l5753
570h4669n2326m913j05389k14581Q4928K74787j6307J02260j2536j13344K3238
559a18852P650R2610J44997k48137J83111m8285P647k7138k02271L5955k30509
548d03222J5061J77755o2319M3650o3258p0032O9525J02253L0694q5598r743Q8680
$$ plain form
625 -276088 -226342 -170738 -335873 -23651 -28739 -181815 -95271 -136988 -113700 -92743 -177580
614 -177580 -183793 -200042 30886 -6142 100661 78899 155894 -23756 -190577 -48751 51268
603 51268 -236601 -276685 -223535 -220981 -107671 -60227 90524 61453 109567 -39589 -27969
592 -27969 61405 -64821 -172806 38166 182063 65986 105721 -46728 -119436 -189642 -250125
581 -250125 -16639 -41376 -108040 -142293 -330029 -90271 -180122 -234278 -107699 -48916 -84669
570 -84669 -136995 -141908 -247297 -461878 -376950 -102163 -118470 -16210 -28746 -142090 -118852
559 -118852 -111202 -18592 126405 -121732 61379 13094 20741 -6397 -208668 -172713 -403222
548 -403222 -388161 -210406 -272725 -229075 -292333 -362365 -292840 -190587 -159893 -245491 -255234 -166554
536a66554k05470o0019J21351J63734K2411j15325P1706j2656J12724n5750K9494
525i4354J38143j51753j89537j12314J26768J27543J61065j76233L8425N0114
515h2133j99047R9411L7362k18778K60312J09111l5045o9610K8179N8805n4316
504f5749p8613k071J17304o7453n2949J46102N2010n5391M4245J57215j67459
493B7191k04287j19045p4625R7214j7817L5930P3050J8223L7635J71805J8989
482F4263j18812J2683O2183J78046k59711j40504J05740J73430j28823O4601j5272
471b176j66225J45905j34825R9352j30632p7900M0194J15002J14863m8904k16777
460b62123m2417K76033o3721p0362J88147j92132q5157J41042M3786j06557L5265
$$ plain form
536 -166554 -372024 -432043 -310692 -146958 -124547 -239872 -168166 -180822 -68098 -123848 -94354
525 -94354 43789 -107964 -297501 -409815 -283047 -155504 5561 -170672 -132247 -82133
515 -82133 -281180 -181769 -144407 -363185 -102873 6238 -28807 -98417 -70238 -11433 -65749
504 -65749 -144362 -146433 -29129 -96582 -149531 -3429 48581 -6810 37435 194650 27191
493 27191 -177096 -296141 -370766 -273552 -291369 -255439 -182389 -164166 -126531 45274 64263
482 64263 -54549 -41866 20317 198363 -61348 -201852 -96112 77318 -51505 13096 -2176
471 -2176 -168401 -22496 -157321 -57969 -188601 -266501 -226307 -111305 3558 -45346 -262123
460 -262123 -304540 -28507 -92228 -162590 25557 -166575 -251732 -110690 -66904 -173461 -138196
449a38196P5194q6826j91761J72575K7386K44289j25226l3621K6518j99122J19714
438a09076J77927M2817k79019J48931J70846k85694j44696J65731j09560j06252
428c28045P6240J66394L5715p9563J38861o1824L9860j0354r4010j90075J07815
417a98986J27945r1689l2420N7400M5609j14104p4370O4261L11336M638r1566
406H054m2618j17913j465j40404J54540O0089J23277j92259J88209J60001k83957
395h4446K368M9418j39747O6994J73834j32439n0524l3123J63451r541p8138k8129
383a00022j9036K18392j6733j04206j45340j58224Q4796J68857J2274K3320J46348
372A10426N5714j38715m6628L40361j23291L6461k05475j13422J05160K7886P6826
$$ plain form
449 -138196 -63002 -149828 -341589 -169014 -141628 102661 -22565 -56186 -29668 -228790 -109076
438 -109076 68851 111668 -167351 -18420 152426 -133268 -277964 -112233 -221793 -328045
428 -328045 -251805 -85411 -49696 -129259 9602 -52222 -12362 -22716 -116726 -306801 -198986
417 -198986 -71041 -162730 -195150 -137750 -92141 -206245 -280615 -216354 94982 99620 8054
406 8054 -34564 -152477 -153942 -294346 -139806 -79717 43560 -148699 39510 199511 -84446
395 -84446 -82078 -32660 -172407 -105413 68421 -64018 -114542 -147665 15786 6245 -71893 -100022
383 -100022 -119058 99334 82601 -21605 -166945 -325169 -240373 -71516 -59242 -35922 110426
372 110426 166140 27425 -19203 321158 197867 234328 28853 -84569 20591 48477 125303
361A25303J73447r4095k07919j11477m9886j14863K13222k7608p8310j63254J22642
350b12798J36604k7197K7588N8245j3838j36228K7704l4945K49314L7771L0069
339A42289l1516R43j5911n7501o8840p4152R3191j33974k45121J05237J53955
328a31400R3363o2496j00686j20747l8591K0379J81236Q2310P94O5447j98217
317b08608J59927j18549k3791J83988n9113j8139k3328J01130L4340J75412j33562
306F9707k57003R4075K9529j6694O497k7635n6644r0644N4804K65337n6914j70202
294a55787j00732l6756K17704J05225j08494p63O3409L3869o391N6787k36647
283a68576k0766L16216J6955l1605j29701p2580J84918L393j14802q0022r8541
$$ plain form
361 125303 298750 204655 -3264 -114741 -164627 -279490 -66268 -93876 -172186 -335440 -212798
350 -212798 -76194 -103391 -75803 -17558 -31396 -167624 -139920 -174865 74449 112220 142289
339 142289 110773 111716 95805 38304 -30536 -104688 -11497 -145471 -390592 -285355 -131400
328 -131400 -38037 -100533 -201219 -321966 -360557 -340178 -158942 -76632 -75838 -10391 -208608
317 -208608 -48681 -167230 -191021 -7033 -66146 -84285 -107613 -6483 27857 203269 69707
306 69707 -187296 -93221 -63692 -80386 -73889 -101524 -158168 -248812 -194008 71329 14415 -155787
294 -155787 -256519 -293275 -75571 29654 -78840 -79603 -16194 17675 11284 68071 -168576
283 -168576 -189342 126874 143829 112224 -17477 -90057 94861 98254 -16548 -96570 -195111
272a95111K46786P2294j71406N4496j14282m774J22622j8516k48059k0733J21506
261a55177K42622K2009k25752J56098K0231K4273k590J28468j04385q2527R8515
250A21785N1541k98588l1219J43346o6391p0806J54257M5721j95320O9701J9429
239e6544K7398r9164n9286J83235p6828n357M7917j09304j07718K44189K68993
228B57531o8160k11796q1159j17070K1758O6247J80550j825j96510l109j02787
217b56330J33834L22317j64797k26224J21787k3508Q3370o8408j83082K62189
207A148m4497M6476M9537k3028j72608m6827J83158N7864K05633k47645K6897
196C6108J24565k51885j59637j9316J14981O1714O3110k1225j63735J19687J02326
$$ plain form
272 -195111 51675 123969 -47437 7059 -107223 -111997 10625 -7891 -255950 -276683 -155177
261 -155177 87445 109454 -116298 39800 60031 84304 81714 210182 105797 23270 121785
250 121785 173326 -125262 -156481 -13135 -79526 -150332 3925 49646 -145674 -75973 -56544
239 -56544 -29146 -128310 -187596 -4361 -81189 -86546 -38629 -147933 -255651 -11462 257531
228 257531 189371 -22425 -103584 -220654 -198896 -132649 47901 46076 -150434 -153543 -256330
217 -256330 -122496 199821 35024 -191200 -69413 -92921 -9551 -77959 -261041 1148
207 1148 -43349 3127 52664 29636 -142972 -189799 -6641 51223 256856 9211 36108
196 36108 160673 -91212 -250849 -270165 -155184 -93470 -30360 -51585 -215320 -95633 6693
185F693l8424J9176J22118o4468j5879J0927l8847j23720m9785Q3078k8488J26831
173I212p5211j71630o3200Q5374K7523l55353K56686L3311L7910n1726O0980R5159
161a10965J70532q0378l14773p2016J88760J47560j23734O934Q9082q3961J01375
150h1584K39302j32108P9688k21160K7461L3078L1227l7839P0604R7677m5380
139F0966j63024L2632L7163P0778j33054j38524J85412j27990m6796P2207J80208
128B9978M8825o1506j36296J62035M8575q0198q6429p5255J82705P5637j09264
117a193n9038j415j35348K652J41897l4734m5629J44785q4048k0799J34405q3693
105d2158j19279j8821J12820O1337j72448j68257J38747q73J49602l6623j21914
$$ plain form
185 6693 -31731 -12555 109563 45095 29216 40143 1296 -122424 -172209 -89131 -117619 9212
173 9212 -65999 -237629 -300829 -215455 -187932 -543285 -286599 -253288 -215378 -267104 -206124 -110965
161 -110965 59567 -20811 -335584 -407600 -218840 -71280 -195014 -188080 -98998 -182959 -81584
150 -81584 157718 25610 105298 -115862 -88401 -55323 -24096 -61935 8669 106346 60966
139 60966 -102058 -69426 -32263 38515 -94539 -233063 -47651 -175641 -222437 -150230 29978
128 29978 78803 17297 -118999 43036 91611 11413 -75016 -150271 32434 108071 -1193
117 -1193 -60231 -61646 -196994 -194342 -52445 -87179 -132808 11977 -72071 -92870 41535 -42158
105 -42158 -161437 -180258 -67438 -6101 -178549 -346806 -208059 -208932 -59330 -95953 -217867
94b17867J50038J26564j32260J3269Q9336o6379n5632r1526J76971m3212K760
83d7938j03904K3906J7696j3471J5739j05104J16214j53462J30315R9867r871
72c0013K0457j08509M2517P3999l431m3348j2606Q1716k49772Q66K75153o790
60D0239q613l2940q7558q4459J80759l0502m0626N3384J8780q0348J4340P6845
48A9301m7361j37123R3194j76001m0219J40578R387q452J09301n2390N3321J30185
36I3721n5207q4525O3186k3517r6799k730m3460r1884J12841J33355J2968j8413
24d64k1685j21940j737K3410r7101o412L5956Q5206M8678R8030j08492L7944j27971
11a56578P1247j8623j2167Q2802P1169r2262k5703k7483k061k09474J40949
$$ plain form
94 -217867 -67829 58735 -73525 -60256 29080 -37299 -92931 -184457 -7486 -50698 -47938
83 -47938 -151842 -127936 -110240 -123711 -107972 -213076 -96862 -250324 -120009 -20142 -30013
72 -30013 -9556 -118065 -75548 -1549 -4980 -48328 -60934 20782 -228990 -228124 47029 40239
60 40239 31626 -1314 -88872 -173331 7428 -23074 -63700 -10316 8464 -71884 -57544 19301
48 19301 -28060 -165183 -71989 -247990 -288209 -147631 -138244 -146696 -37395 -89785 -36464 93721
36 93721 38514 -46011 17175 -6342 -103141 -105871 -149331 -241215 -128374 4981 17949 -464
24 -464 -22149 -144089 -145826 -122416 -219517 -225929 -189973 -104767 -56089 41941 -66551 -28607 -156578
11 -156578 -85331 -103954 -116121 -33319 37850 -54412 -80115 -107598 -109659 -319133 -178184
0a78184
$$ plain form
0 -178184
$$ Imaginary data points
##PAGE= N=2
##DATA TABLE= (X++(I..I)), XYDATA
16383d882610N3795L289J64247J36666J21036k7914J07444P8011R825J3517P919
16372d214775J06232J54415P7677m3229L2189J45824N8969J68402P1863J84623
16362c257810R7495k1509N7170p816k0952M3290R8220K03404j84180J07468L08457
16351b576763j1171O4263J85680k084K3108J18395Q2731M5775J59850j37492P8638
16340a969070j172L3012J27004N7856J26752J53534J66654Q0753n3310R7164Q6979
16329a093844m133J32415N2764J08752j18720J02301p4313J02705J34983J34018
16319e23072Q9963n280K9710J08578R4766P4112m8695K8710J2515N0947J99638
16308A11892M5250j0569J58879k2026J56419J52096j6381M0050J33756J693L4409
$$ plain form
16383 -4882610 -4828815 -4825526 -4661279 -4524613 -4403577 -4431491 -4324047 -4246036 -4236211 -4222694 -4214775
16372 -4214775 -4108543 -3954128 -3876451 -3919680 -3887491 -3741667 -3682698 -3514296 -3442433 -3257810
16362 -3257810 -3160315 -3181824 -3124654 -3132470 -3153422 -3110132 -3011912 -2808508 -2992688 -2885220 -2576763
16351 -2576763 -2587934 -2523671 -2337991 -2340075 -2316967 -2198572 -2115841 -2070066 -1910216 -2047708 -1969070
16340 -1969070 -1970242 -1937230 -1810226 -1752370 -1625618 -1472084 -1305430 -1224677 -1277987 -1180823 -1093844
16329 -1093844 -1097977 -965562 -912798 -804046 -922766 -820465 -894778 -792073 -657090 -523072
16319 -523072 -433109 -438389 -408679 -300101 -205335 -131223 -179918 -151208 -138693 -87746 111892
16308 111892 157142 146573 305452 283426 439845 591941 575560 615610 749366 751059 785468
16297G85468J05793J73544j01931R4492J21890J8258n6612J5812N5966k8752J29913
16286A313841J9918O7595R6711n3179J74593R0415M5411J43260K18775j03731
16276B013609n8215J91450J16397j1099K9060O9648j40095N8758N5977Q3878M5698
16265B455066k2294J04089J23913n7243J61902m3N5080J25606J33678q87l3671
16254C045196Q161k0214K475J18359J0718k561n1040J56789p3182q3651J65302
16243C276352P2886K2565K08998n5785J48258j1364l1895J28053k38970R1725
16233C610823J05850K32781P257N484L2833Q4211J0323n3944j12071O9004J60662
16222D153213l3915N1533M1875J24001J24688M6029j66255P3867K18329J8305
$$ plain form
16297 785468 891261 1064805 962874 1057366 1179256 1197514 1140902 1156714 1212680 1183928 1313841
16286 1313841 1333759 1401354 1498065 1444886 1619479 1709894 1755305 1898565 2117340 2013609
16276 2013609 1955394 2146844 2263241 2252142 2281202 2350850 2210755 2269513 2325490 2409368 2455066
16265 2455066 2432772 2536861 2660774 2603531 2765433 2765390 2820470 2946076 3079754 3078867 3045196
16254 3045196 3053357 3033143 3035618 3153977 3164695 3162134 3111094 3267883 3194701 3111050 3276352
16243 3276352 3349238 3371803 3580801 3525016 3673274 3661910 3630015 3758068 3519098 3610823
16233 3610823 3716673 3949454 3956711 3962195 3995028 4079239 4089562 4035618 3923547 3992551 4153213
16222 4153213 4119298 4170831 4212706 4336707 4461395 4507424 4341169 4415036 4633365 4651670
16212D651670r5538j21863K65495J81956j57737l4606M4418J16981R6700J60501
16202E107977K55j41591k27710J28271Q7358L1046k06890P8755J99643J38584
16192E195698j84306l9278J49526p1584k12117J2987K18560R2237N8747j19967
16182E100503J88610p8844p8963j17222J58162O8475J5003O8687R754R6263j96527
$$ plain form
16212 4651670 4556132 4434269 4699764 4881720 4723983 4689377 4733795 4850776 4947476 5107977
16202 5107977 5108232 4966641 4738931 4867202 4954560 4985606 4778716 4857471 5057114 5195698
16192 5195698 5011392 4972114 5121640 5050056 4837939 4850926 5069486 5161723 5220470 5100503
16182 5100503 5289113 5210269 5131306 5014084 5172246 5240721 5255724 5324411 5334165 5430428 5233901
$$ [...]
##END NTUPLES=NMR SPECTRUM
##END=
