##TITLE=1H_TG-2307-Ia1
 CDCl3
 8 sc, 
 6.7.2023
##JCAMPDX= 6.0         $$ Bruker NMR JCAMP-DX V2.0
##DATA TYPE= NMR SPECTRUM
##DATA CLASS= NTUPLES
##ORIGIN= UXNMR, Bruker Analytische Messtechnik GmbH
##OWNER= root
$$ XWIN-NMR		Version 3.5
$$ Thu Jul  6 15:15:14 2023 Russian Standard Time (UT+4h)  she@DPX200
##.OBSERVE FREQUENCY= 200.13135
##.OBSERVE NUCLEUS= ^1H
##.ACQUISITION MODE= SIMULTANEOUS
##.ACQUISITION SCHEME= undefined
##.AVERAGES= 8
##.DIGITISER RES= 18
##SPECTROMETER/DATA SYSTEM= spect
##.PULSE SEQUENCE= zg30
##.SOLVENT NAME= CDCl3
##.SHIFT REFERENCE= (INTERNAL, CDCl3, 0, 15.7359)
##AUDIT TRAIL= $$ (NUMBER, WHEN, WHO, WHERE, WHAT)
$$ ##TITLE= Audit trail, XWIN-NMR		Version 3.5
$$ ##JCAMPDX= 5.01
$$ ##ORIGIN= Bruker BioSpin GmbH
$$ ##OWNER= she
$$ F:/spectra/data/she/nmr/H-F/1/pdata/1/auditp.txt
$$ ##AUDIT TRAIL=  $$ (NUMBER, WHEN, WHO, WHERE, WHAT)
(   1,<2023-07-06 15:14:08.62 +0400>,<she>,<DPX200>,
      <created by zg, POWCHK disabled, PULCHK disabled
       configuration hash MD5:
       00 E9 B6 7A A2 85 ED C7 34 08 36 98 17 FE 4E 26
       data hash MD5: 16K
       CB D1 8F 64 32 30 F0 DB 71 35 43 A3 88 05 87 E0>)
(   2,<2023-07-06 15:14:10.92 +0400>,<she>,<DPX200>,
      <Start of raw data processing
       efp BC_mod = 2 LB = 0.24 FT_mod = 6 PKNL = 1 PHC0 = -20793.65 PHC1 = 18.45272 SI = 16K 
       data hash MD5: 16K
       06 70 A6 9A 1B 26 71 BF 00 92 2A AB 01 D3 AD 1D>)
(   3,<2023-07-06 15:14:26.84 +0400>,<she>,<DPX200>,
      <pk PHC0 = 2.445315 PHC1 = -2.8 
       data hash MD5: 16K
       FD 08 69 8F 19 00 6F 8D DC F0 C5 3E A4 27 78 0E>)
(   4,<2023-07-06 15:14:30.45 +0400>,<she>,<DPX200>,
      <abs ABSG = 5 
       data hash MD5: 16K
       7D E5 AB 16 36 46 43 B5 6B 4D 10 4B F0 76 BF D4>)
$$ ##END=
$$ 
$$ hash MD5
$$ 09 7C A0 1B 1B 43 E2 D3 6A B5 BA 85 67 C2 2D E0
##$RELAX= 
##$RELAX= 
##$RELAX= 
##$RELAX= 
##$RELAX= 
##$RELAX= 
$$ Bruker specific parameters
$$ --------------------------
##$DU= <F:/spectra>
##$EXPNO= 1
##$NAME= <H-F>
##$PROCNO= 1
##$TYPE= <nmr>
##$USER= <she>
##$AMP= (0..31)
100 100 100 100 100 100 100 100 100 100 100 100 100 100 100 100 100 100 
100 100 100 100 100 100 100 100 100 100 100 100 100 100 
##$AQSEQ= 0
##$AQ_mod= 1
##$AUNM= <au_zg>
##$AUTOPOS= <>
##$BF1= 200.13
##$BF2= 200.13
##$BF3= 200.13
##$BF4= 200.13
##$BF5= 200.13
##$BF6= 200.13
##$BF7= 200.13
##$BF8= 200.13
##$BYTORDA= 1
##$CFDGTYP= 0
##$CFRGTYP= 5
##$CHEMSTR= <none>
##$CNST= (0..31)
1 1 145 1 1 1 1 1 1 1 1 1 1 1 1 1 1 1 1 1 1 1 1 1 1 1 1 1 1 1 1 1 
##$CPDPRG= <>
##$CPDPRG1= <>
##$CPDPRG2= <>
##$CPDPRG3= <>
##$CPDPRG4= <mlev>
##$CPDPRG5= <mlev>
##$CPDPRG6= <mlev>
##$CPDPRG7= <mlev>
##$CPDPRG8= <mlev>
##$CPDPRGB= <>
##$CPDPRGT= <>
##$D= (0..31)
0 1.2 0 0 0 0 0 0 0 0.06 0 0.03 0 0 0 0 0.0002 0 0 0 0 0 0 0 0 0 0 0 0 
0 0 0 
##$DATE= 1688642048
##$DBL= (0..7)
120 120 120 120 120 120 120 120 
##$DBP= (0..7)
150 150 150 150 150 150 150 150 
##$DBP07= 0
##$DBPNAM0= <>
##$DBPNAM1= <>
##$DBPNAM2= <>
##$DBPNAM3= <>
##$DBPNAM4= <>
$$ [...]
##$SUBNAM3= <"">
##$SUBNAM4= <"">
##$SUBNAM5= <"">
##$SUBNAM6= <"">
##$SUBNAM7= <"">
##$SUBNAM8= <"">
##$SUBNAM9= <"">
##$SW= 18.05172834244
##$SWIBOX= (0..15)
0 0 2 0 0 0 0 0 0 0 0 0 0 0 0 0 
##$SW_h= 3612.71676300578
##$TD= 16384
##$TD0= 1
##$TE= 0
##$TE2= 300
##$TE3= 300
##$TEG= 300
##$TL= (0..7)
0 120 120 120 120 120 120 120 
##$TP= (0..7)
150 150 150 150 150 150 150 150 
##$TP07= 0
##$TPNAME0= <>
##$TPNAME1= <>
##$TPNAME2= <>
##$TPNAME3= <>
##$TPNAME4= <>
##$TPNAME5= <>
##$TPNAME6= <>
##$TPNAME7= <>
##$TPOAL= (0..7)
0.5 0.5 0.5 0.5 0.5 0.5 0.5 0.5 
##$TPOFFS= (0..7)
0 0 0 0 0 0 0 0 
##$TUNHIN= 0
##$TUNHOUT= 0
##$TUNXOUT= 0
##$USERA1= <user>
##$USERA2= <user>
##$USERA3= <user>
##$USERA4= <user>
##$USERA5= <user>
##$V9= 5
##$VALIST= <valist>
##$VCLIST= <CCCCCCCCCCCCCCC>
##$VD= 0
##$VDLIST= <DDDDDDDDDDDDDDD>
##$VPLIST= <PPPPPPPPPPPPPPP>
##$VTLIST= <TTTTTTTTTTTTTTT>
##$WBST= 1024
##$WBSW= 4
##$XGAIN= (0..3)
0 0 0 0 
##$XL= 0
##$YL= 0
##$YMAX_a= 97896
##$YMIN_a= -85081
##$ZGOPTNS= <>
##$ZL1= 120
##$ZL2= 120
##$ZL3= 120
##$ZL4= 120
##$ABSF1= 15.73587
##$ABSF2= -2.315979
##$ABSG= 5
##$ABSL= 3
##$ALPHA= 0
##$AQORDER= 0
##$ASSFAC= 0
##$ASSFACI= 0
##$ASSFACX= 0
##$ASSWID= 0
##$AUNMP= <proc_1d>
##$AZFE= 0.1
##$AZFW= 0.1
##$BCFW= 0
##$BC_mod= 2
##$BYTORDP= 0
##$COROFFS= 0
##$CY= -3
##$DATMOD= 1
##$DC= 0
##$DFILT= <>
##$DTYPP= 0
##$F1P= 0
##$F2P= 0
##$FCOR= 1
##$FTSIZE= 16384
##$FT_mod= 6
##$GAMMA= 0
##$GB= 0
##$INTBC= 1
##$INTSCL= 3.70164e-10
##$ISEN= 128
##$LB= 0.24
##$LEV0= 0
##$LPBIN= 0
##$MAXI= 10000
##$MC2= 0
##$MEAN= 0
##$ME_mod= 0
##$MI= 1.114404
##$NCOEF= 0
##$NC_proc= -9
##$NLEV= 6
##$NOISF1= 3.799351
##$NOISF2= 2.8
##$NSP= 0
##$NTH_PI= 0
##$NZP= 0
##$OFFSET= 15.73587
##$PC= 1
##$PHC0= -20791.21
##$PHC1= 15.65272
##$PH_mod= 1
##$PKNL= yes
##$PPARMOD= 0
##$PSCAL= 0
##$PSIGN= 0
##$REVERSE= no
##$SF= 200.130007137558
##$SI= 16384
##$SIGF1= 3
##$SIGF2= 2
##$SINO= 5.538805
##$SIOLD= 16384
##$SREGLST= <1H.CDCl3>
##$SSB= 0
##$STSI= 16384
##$STSR= 0
##$SW_p= 3612.71676300578
##$SYMM= 0
##$S_DEV= 0
##$TDeff= 16384
##$TDoff= 0
##$TI= <>
##$TILT= no
##$TM1= 0
##$TM2= 0
##$TOPLEV= 0
##$USERP1= <user>
##$USERP2= <user>
##$USERP3= <user>
##$USERP4= <user>
##$USERP5= <user>
##$WDW= 1
##$XDIM= 16384
##$YMAX_p= 423208821
##$YMIN_p= -5617076
$$ End of Bruker specific parameters
$$ ---------------------------------
##NTUPLES= NMR SPECTRUM
##VAR_NAME=  FREQUENCY,     SPECTRUM/REAL,   SPECTRUM/IMAG
##SYMBOL=    X,             R,               I
##VAR_TYPE=  INDEPENDENT,   DEPENDENT,       DEPENDENT
##VAR_FORM=  AFFN,          ASDF,            ASDF
##VAR_DIM=   16384,         16384,           16384
##UNITS=     HZ,            ARBITRARY UNITS, ARBITRARY UNITS
##FACTOR=    0.220516191357247, 1,           1
##FIRST=     3149.21984772829, 0,            0
##LAST=      -463.496915277495, 0,           0
##MIN=       -463.496915277495, -5617076,    0
##MAX=       3149.21984772829, 423208821,    0
$$ Real data points
##PAGE= N=1
##DATA TABLE= (X++(R..R)), XYDATA
$$ [...]
6965A747083J29719j14235l5737j85141j20444K34511j68833Q71667m77623q7562
$$ 1747083 1876802 1762567 1726830 1541689 1421245 1655756 1486923 2358590 1880967 1793405
6955A793405q5562N4473j66434m46727l85679l158K31851M51916n6616m33976
$$ 1793405 1707843 1762316 1595882 1149155 763476 760318 992169 1444085 1387469 953493
6945I53493K84670K16807j84366J23902k38193M61789n66121m69241O92077q6078
$$ 953493 1238163 1454970 1270604 1394506 1156313 1618102 1051981 582740 1274817 1188739
6935A188739k01188k79945K42920M0519o2289l7470J35967O284K40802k35030
$$ 1188739 987551 707606 950526 991045 928756 891286 1027253 1033537 1274339 1039309
6925A039309k55266L6243j70360k01320o4475K61054k29206K05792N26909K90355
$$ 1039309 784043 820286 649926 448606 384131 645185 415979 621771 1148680 1439035
6915A439035l69383j31052J06541j41275j39479k92222K69934L37667j64279K74394
$$ 1439035 1069652 938600 1045141 903866 764387 472165 742099 1079766 915487 1189881
6905A189881l68958l56838L93930o7723l2717N1367J51768N3370J213j7356n87555
$$ 1189881 820923 464085 858015 790292 757575 808942 960710 1014080 1015293 997937 410382
6894D10382J77355O55489j48311o5465P3157k67123J43061R5428K52710j65674
$$ 410382 587737 1243226 1094915 1029450 1102607 835484 978545 1073973 1326683 1161009
6884A161009j95489k7240j44772K50099L10509j440k03122K70861m817l75531
$$ 1161009 965520 938280 793508 1043607 1354116 1352676 1149554 1420415 1415598 1040067
6874A040067J65246j76876m20562n2396L46079K63426J27446j66653l5335j92401
$$ 1040067 1205313 1028437 607875 555479 901558 1164984 1292430 1125777 1090442 898041
6864H98041K31146M54681q5829k32593J01638J60931O8450m07020O7578J99771
$$ 898041 1129187 1583868 1498039 1265446 1367084 1528015 1596465 1189445 1257023 1456794
6854A456794j33407K5639r3385J08773k82053m97821k51192L61321K23263R1002
$$ 1456794 1323387 1349026 1255641 1364414 1082361 584540 333348 694669 917932 1008934
6844A008934J97466L02064l84662j55614J42838K06000K13714l2373q6281m03820
$$ 1008934 1206400 1508464 1123802 968188 1111026 1317026 1530740 1498367 1412086 1008266
6834A008266n9139l27379l31720L79607j63564M21865M70106n70632O7324J07398
$$ 1008266 949127 621748 290028 669635 506071 927936 1398042 827410 894734 1002132
6824A002132k12432j25170L58885J93282l81622M22125L11708k11535l88570K92974
$$ 1002132 789700 664530 1023415 1216697 835075 1257200 1568908 1357373 968803 1261777
6814A261777R4562J3653j49679j46781J50700M12208l55650K16510l94027r3322
$$ 1261777 1356339 1369992 1220313 1073532 1224232 1636440 1280790 1497300 1103273 1009951
6804A009951j63817k81174Q2899K25562L74192l17157k45824J18555J00926p6451
$$ 1009951 846134 564960 647859 873421 1247613 930456 684632 803187 904113 827662
6794H27662L11895m5927k32498o0108R1526o5582N7445L7422K46320p109L68274
$$ 827662 1139557 1093630 861132 801024 892550 826968 884413 921835 1168155 1161046 1529320
6783A529320J8160l84128k50310r5056j34554J08004K90503K00863k83654k92926
$$ 1529320 1547480 1163352 913042 817986 683432 791436 1081939 1282802 999148 706222
6773G06222K11944m39503l21412N31861K22310o1926J54148L9693M6063j40230
$$ 706222 918166 478663 157251 689112 911422 849496 1003644 1043337 1089400 949170
6763I49170J59736O7877l97474k49883k30646P9762K43841K72625o8246n59754
$$ 949170 1108906 1176783 779309 529426 298780 378542 622383 895008 826762 267008
6753B67008K67218o9784J39600N11376J90775m70666k77867L75929J54966K62246
$$ 267008 534226 464442 604042 1115418 1306193 835527 557660 933589 1088555 1350801
6743A350801K40225J62509j70590m08162J59790J52039l30415J17651l59452M46098
$$ 1350801 1591026 1753535 1582945 1174783 1334573 1486612 1156197 1273848 914396 1360494
6733A360494J83474l46112L24697R8747m12374Q5744k02818Q1931J62766K70016
$$ 1360494 1543968 1197856 1522553 1621300 1208926 1294670 1091852 1173783 1336549 1606565
6723A606565k63493j47510K35341k9250j73021j36646m16662j54869K63300L915
$$ 1606565 1343072 1195562 1430903 1401653 1228632 1091986 675324 520455 783755 787670
6713G87670j8992Q0501j1277N8137j6323n21867K17050O06996r9877l57642L43025
$$ 787670 768678 849179 837902 896039 879716 357849 574899 1181895 1082018 724376 1067401
6702A067401k33643k80417j31629K09418l00992M9877O9194m28259L59050K57759
$$ 1067401 833758 553341 421712 631130 330138 380015 449209 20950 380000 637759
6692F37759k64291L50831J47839P8771k95448M7297k58298l8125M91491l5259
$$ 637759 373468 724299 872138 950909 655461 702758 444460 406335 897826 862567
6682H62567j02196j08008l65236o3717j56157K03551L51722K74054L0913l720
$$ 862567 760371 652363 287127 223410 67253 270804 622526 896580 927493 923773
6672I23773r9300m15851j6859j5558N43254M2408L89493m47717k64401J58559
$$ 923773 824473 408622 391763 376205 919459 961867 1351360 903643 639242 797801
6662G97801j70812j64811J76347r512j58429K68564r4660r2140J72898k88111
$$ 797801 626989 462178 638525 629013 470584 739148 644488 552348 725246 437135
6652D37135q59485K67784L93356j92257J94753L1729N4575l07244J78951P1760
$$ 437135 -422350 -154566 238790 46533 241286 273015 327590 20346 199297 271057
6642B71057N5079j19611J22171K07948l3077P0354K00248j48460N7674k71013
$$ 271057 326136 206525 328696 536644 503567 573921 774169 625709 683383 412370
6632D12370k34206J03258J87330K00403K8445M9588J60125j0238j75691n4353
$$ 412370 178164 281422 468752 669155 697600 747188 907313 897075 721384 667031
6622F67031K99036J84115j56312k98243k12958o658K71617K87850m62365J43531
$$ 667031 966067 1150182 993870 695627 482669 476011 747628 1035478 573113 716644
6612G16644K68387J40924m31431N11963j7000j59435j94804n1379p5030J80725
$$ 716644 985031 1125955 694524 1206487 1189487 1030052 835248 783869 708839 889564
6602H89564o2917o2203J71267N9292K61784k88921k29163j01023m5300k9686Q2595
$$ 889564 826647 764444 935711 995003 1256787 967866 738703 637680 592380 562694 645289
6591F45289L27812l60597l86674L60721P8731J59063K8272J78123K22404j0655
$$ 645289 973101 612504 225830 586551 665282 824345 852617 1030740 1253144 1242489
6581A242489j55974q4596k6828n8137q0389l85526K49986m5904k83926R5638q460
$$ 1242489 1086515 1001919 975091 916954 836565 451039 701025 655121 371195 466833 458373
6570D58373K28278j12634O0008J25726J28598j83867j92023j9379O13259k37821
$$ 458373 686651 574017 634025 759751 888349 704482 512459 493080 1106339 868518
6560H68518o46476J086O69127L72788o38453R5496o3101k09457P31548N56192
$$ 868518 222042 223128 892255 1265043 626590 722086 658985 449528 1181076 1737268
6550A737268l91413l84264R9453j09494l10576m05840K69021L18294j10357K2386
$$ 1737268 1345855 961591 1061044 951550 640974 235134 504155 822449 712092 734478
6540G34478J74783m8436k22202j15082J98207J31687O786l72899J81199N31513
$$ 734478 909261 860825 638623 523541 721748 853435 860221 487322 668521 1200034
6530A200034k28790l36940J42597K70237l39725K22452L84586j05908l08730L11625
$$ 1200034 971244 634304 776901 1047138 707413 929865 1314451 1208543 899813 1211438
6520A211438Q4403j01294j19189l03772N1764J30367q8475J23653o0261l51401
$$ 1211438 1295841 1194547 1075358 771586 823350 953717 865242 988895 928634 577233
6510E77233M30832K7883p4623j88814N9364M16087o0575j65533j26842K97571
$$ 577233 1008065 1035948 961325 772511 831875 1247962 1187387 1021854 895012 1192583
6500A192583m15172N82K20754l44984j43766J85837j19523M55614l54676j58043
$$ 1192583 777411 777993 998747 653763 509997 695834 576311 1031925 677249 519206
6490E19206p69M4587k48182K81032M00195k26666J13080l5199J10497n7273j39912
$$ 519206 518437 563024 314842 595874 996069 769403 882483 847284 957781 900508 760596
6479G60596M24800J1630K7424M06782j70451m64143J19070l03010l34271K09691
$$ 760596 1185396 1197026 1224450 1631232 1460781 996638 1115708 812698 478427 688118
6469F88118J07400J29448j82542K62350J20458P1018n81192K05194J98636P8831
$$ 688118 795518 924966 742424 1004774 1125232 1196250 615058 820252 1018888 1097719
6459A097719O3726j55008J37787r3670n577R3823P4798m3256M11430k1264k76957
$$ 1097719 1161445 1006437 1144224 1050554 1044977 1138800 1213598 1170342 1581772 1560508 1283551
6448A283551J33983K83528J83130m77130J91497K16267j84464l11965K16728J0380
$$ 1283551 1417534 1701062 1884192 1407062 1598559 1814826 1630362 1318397 1535125 1545505
6438A545505N0650l48763j10476L17526J60954j1212J6784M6875l38716q6608
$$ 1545505 1596155 1247392 1136916 1454442 1615396 1604184 1620968 1667843 1329127 1242519
6428A242519K16532J58154r7188k42599L27343N371N110n14930K6894J0283J03835
$$ 1242519 1459051 1617205 1520017 1277418 1604761 1610132 1615242 1100312 1127206 1137489 1241324
6417A241324K99298J89336K79011R356m796K21382J17422q70078L9503N33668
$$ 1241324 1540622 1729958 2008969 2018325 2013529 2234911 2352333 1482255 1521758 2055426
6407B055426n3028l28641R713k7358K05600L6210J49426K6080j42471j3049L72111
$$ 2055426 2002398 1673757 1683470 1656112 1861712 1897922 2047348 2073428 1930957 1917908 2290019
6396B290019k35456K08973L31073j0861r5963p12853J17706M34475j29074k7999
$$ 2290019 2054563 2263536 2594609 2583748 2487785 1774932 1892638 2327113 2198039 2170040
6386B170040K24031L52183m07444k86459M98398K1091m7807J99814m12769j9756
$$ 2170040 2394071 2746254 2338810 2052351 2550749 2571840 2524033 2723847 2311078 2291322
6376B291322r917N1740K43778J41045j54611J57021R172q2411J29512L13245k58531
$$ 2291322 2281405 2333145 2576923 2717968 2563357 2720378 2729550 2647139 2776651 3089896 2831365
6365B831365j45643L46025k93505M26678K06135K7092J63202N8328j5866J66425
$$ 2831365 2685722 3031747 2738242 3164920 3371055 3398147 3561349 3619677 3603811 3770236
6355C770236Q0075p5340j45319J87283j83716m368j5675L67104J23514P6714k27688
$$ 3770236 3850311 3774971 3629652 3816935 3633219 3628851 3613176 3980280 4103794 4180508 3952820
6344C952820k14571M70579M71960L18081P8928k17582q6776K21643l55788L49813
$$ 3952820 3738249 4208828 4680788 4998869 5077797 4860215 4773439 4995082 4639294 4989107
6334D989107P59025n7402l40823n8486j22105Q6619K31438L52829K08119j55797
$$ 4989107 5748132 5690730 5349907 5291421 5169316 5255935 5487373 5840202 6048321 5892524
6324E892524J10003K33731q0989l05319K35247M22081L37138j12541L38237L88315
$$ 5892524 6002527 6236258 6155269 5849950 6085197 6507278 6844416 6731875 7070112 7458427
6314G458427O653L30591J88466J59210K12411L16413n3510L79417j2836o0291
$$ 7458427 7465080 7795671 7984137 8143347 8355758 8672171 8618661 8998078 8985242 8924951
6304H924951J62728O06532O56123K44840P77706K99337M18921L11793K48385R579
$$ 8924951 9087679 9694211 10350334 10595174 11372880 11672217 12091138 12402931 12651316 12660895
6294A2660895J5171O45981N46162J174813N20019Q38762P50483Q54313R21879
$$ 12660895 12676066 13322047 13868209 15043022 15563041 16401803 17152286 18006599 18928478
6285A8928478R33805J458743J297711J503875J473680K266637K882896K803146
$$ 18928478 19862283 21321026 22618737 24122612 25596292 27862929 30745825 33548971
6277C3548971L172398M219802N257911O379371Q904311J2126322J6811481K2197357
$$ 33548971 36721369 40941171 46199082 52578453 61482764 73609086 90420567 112617924
6269A12617924K3218722J4628640q624112k6261632k6189958k0102564j3365972
$$ 112617924 135836646 150465286 141841174 115579542 89389584 69287020 55921048
6262E5921048r860848p282756n078797l716985l779501l197213k363552j683565
$$ 55921048 46060200 38777444 33698647 29981662 26202161 23004948 20641396 18957831
6254A8957831j577288j322282j302407r63620p34816j90268n78827n86074o32480
$$ 18957831 17380543 16058261 14755854 13792234 13057418 12867150 12288323 11702249 11069769
6245A1069769j22602k35029j65483j95182m97828j59455o93482n79439M2160K37029
$$ 11069769 10947167 10712138 10546655 10351473 9853645 9694190 9000708 8421269 8463429 8700458
6235H700458j96761l50827o86582J05401j71318m71773j75461N5658m55666k75046
$$ 8700458 8503697 8152870 7466288 7571689 7400371 6928598 6753137 6808795 6353129 6078083
6225F078083n61717L0182n03384K56173K85532k59012n9346l89746k85463N7522
$$ 6078083 5516366 5546548 5043164 5299337 5584869 5325857 5266511 4876765 4591302 4648824
6215D648824k08146K94780l0663p7125M16098L3743q8895r8842j59273p1278J76812
$$ 4648824 4440678 4735458 4704795 4627670 5043768 5077511 4988616 4889774 4730501 4659223 4836035
6204D836035m3424K18145m14925o25869K60005M18659m49095J56931r351P2109
$$ 4836035 4792611 5010756 4595831 3969962 4229967 4648626 4199531 4356462 4347111 4419220
6194D419220K08746m89561L84282L05902j34819j76455L21546l23082l57804j48252
$$ 4419220 4627966 4138405 4522687 4828589 4693770 4517315 4838861 4515779 4157975 4009723
6184D009723l51703M8202M98952K52812k67612k34739j16978j26216K76656q2773
$$ 4009723 3658020 3706222 4205174 4457986 4190374 3955635 3838657 3712441 3989097 3906324
6174C906324O5863j92823m93954M62560L85396K41158j38382l30346J39226R0208
$$ 3906324 3972187 3779364 3285410 3747970 4133366 4374524 4236142 3905796 4045022 4135230
6164D135230l95076j33594m07921L03906M06108k96663k87101M3476j25696R3721
$$ 4135230 3740154 3606560 3198639 3502545 3908653 3611990 3324889 3368365 3242669 3336390
6154C336390o9169K08454m47931j57912O0418k18185L14558K1397L79734k20873
$$ 3336390 3267221 3475675 3027744 2869832 2930250 2712065 3026623 3048020 3427754 3206881
6144C206881O1596k00875K05958N5307j63016J85619K8728j09906N53219J05941
$$ 3206881 3268477 3067602 3273560 3328867 3165851 3351470 3380198 3270292 3823511 3929452
6134C929452r320j19174l23265J7021j39751j53249j73632j23695K53317L45609
$$ 3929452 3920132 3800958 3477693 3494714 3354963 3201714 3028082 2904387 3157704 3503313
6124C503313r1332Q7302k04045J40545j370K32028k28373q5702J65761J47165
$$ 3503313 3411981 3499283 3295238 3435783 3434413 3666441 3438068 3352366 3518127 3665292
6114C665292q3568L22004M1643m42928L55057J26575k60931P4236R9661j08001
$$ 3665292 3581724 3903728 3945371 3502443 3857500 3984075 3723144 3797380 3897041 3789040
6104C789040o09501L62622N15360k35223k1066N2392L22199l2202L65474J06699
$$ 3789040 3179539 3542161 4057521 3822298 3801232 3853624 4175823 4143621 4509095 4615794
6094D615794m3269K32249q0707K94872N6993L39728O0389j12980J61320K58175
$$ 4615794 4572525 4804774 4724067 5018939 5075932 5415660 5476049 5363069 5524389 5782564
6084E782564j45972L74767Q847L32330M56377K09982N72242L37187P80447L85871
$$ 5782564 5636592 6011359 6020206 6352536 6808913 7018895 7591137 7928324 8708771 9094642
6074I094642M00181J13057p5948j008751o48092j02972l06366K07435J96826m09041
$$ 9094642 9494823 9607880 9531932 8523181 7875089 7772117 7465751 7673186 7870012 7460971
6064G460971p96211o75298j75162N2385M6235l09815k97819k81892l34760j51751
$$ 7460971 6664760 5989462 5814300 5866685 5912920 5603105 5305286 5023394 4688634 4536883
6054D536883L14984k14537n0693L75444k12201j85361R2280J83474J47500J74830
$$ 4536883 4851867 4637330 4586637 4962081 4749880 4564519 4656799 4840273 4987773 5162603
6044E162603r6029R2919J41930k35401k55138K47055J43746j51220J0565M94253
$$ 5162603 5066574 5159493 5301423 5066022 4810884 5057939 5201685 5050465 5061030 5555283
6034E555283m13943q5133L48860k8661j80642j21587l87874J87048J02481R0608
$$ 5555283 5141340 5056207 5405067 5376406 5195764 5074177 4686303 4873351 4975832 5066440
6024E066440r3937n28073j33749N68772O30660m0649L64068l77843N81738J44390
$$ 5066440 4972503 4444430 4310681 4879453 5510113 5469464 5833532 5455689 6037427 6181817
6014F181817j0498L4436J35614J94367l8943q8135n97979m32561J10584l17717
$$ 6181817 6171319 6205755 6341369 6535736 6496793 6408658 5810679 5378118 5488702 5170985
6004E170985K46983l99757K73240M23155J5722k79171J0849L80029N0567j09573
$$ 5170985 5417968 5018211 5291451 5714606 5730328 5451157 5462006 5842035 5892602 5783029
5994E783029k14470L88242m46753L95249L45035j40710j91688N0341N23354M4215
$$ 5783029 5568559 5956801 5510048 5905297 6250332 6109622 5917934 5968275 6491629 6535844
5984F535844k67015k95864K29635J63126L09027K85828N1581J67508m44353K54813
$$ 6535844 6268829 5972965 6202600 6365726 6674753 6960581 7012162 7179670 6735317 6990130
5974F990130J33094k20737n81364N02157M09760j1722m58439K35157J10705N9771
$$ 6990130 7123224 6902487 6321123 6823280 7233040 7221318 6762879 6998036 7108741 7168512
5964G168512J26867k8712R692J11896q5758L3801j85155k45768p4957M96559N03877
$$ 7168512 7295379 7266667 7276359 7388255 7302497 7336298 7151143 6905375 6830418 7326977 7830854
5953G830854M231M51139K15232j66488j66593M08988j65394M8704M33873q833
$$ 7830854 7835085 8286224 8501456 8334968 8168375 8577363 8411969 8460673 8894546 8885713
5943H885713j99707M96870J36721O0114k05830j49233K15936R11928L47935O79245
$$ 8885713 8686006 9182876 9319597 9379711 9173881 9024648 9240584 10152512 10500447 11179692
5933A1179692k29492k05394M36029J53291k51951j11193j07524K93659N57010
$$ 11179692 10950200 10744806 11180835 11334126 11082175 10970982 10863458 11157117 11714127
5924A1714127j06682j72037k66229K54436N9219L54718K66535l38753J76190O17232
$$ 11714127 11607445 11435408 11169179 11423615 11482834 11837552 12104087 11765334 11941524 12558756
5914A2558756N71043K1445L05702P11912N18752P05968P82173J653711Q73968
$$ 12558756 13129799 13151244 13456946 14168858 14687610 15393578 16175751 17829462 18703430
5905A8703430M48162N48140J66335m4920N91815L87924N02832K58839J7888J82710
$$ 18703430 19151592 19699732 19866067 19821147 20412962 20800886 21303718 21562557 21580445 21763155
5895B1763155j1805l5922M12856L89460R02890J151114J750670K386628K201530
$$ 21763155 21751350 21715428 22128284 22517744 23420634 24571748 26322418 28709046 30910576
5886C0910576K225321J267524k64614j372758j288860m62384O10784J012848J918199
$$ 30910576 33135897 34403421 34138807 32766049 31477189 31014805 31625589 32638437 34556636
5877C4556636J569377J86121r20120j646586j679609j595340j600209p61216p26951
$$ 34556636 36126013 36312134 35392014 33745428 32065819 30470479 28870270 28109054 27382103
5868B7382103K18332K28398M41828J147955J599305K244619K826169M084589L716431
$$ 27382103 27600435 27828833 28270661 29418616 31017921 33262540 36088709 40173298 43889729
5859D3889729K124543R69459m41347j257387j361923k852834m421684m255071
$$ 43889729 46014272 46983731 46542384 45284997 43923074 41070240 36648556 32393485
5851C2393485m100283k698422k216791j349787j365379j055116n36788n38890
$$ 32393485 28293202 25594780 23377989 22028202 20662823 19607707 19070919 18532029
5843A8532029k24471n51200l83860o70103p44312o72428m66977o21792o38954
$$ 18532029 18307558 17756358 17372498 16702395 15958083 15285655 14818678 14196886 13557932
5834A3557932K35338J46514l53669k81133j98386q26176p70968j61667l85026
$$ 13557932 13793270 13939784 13586115 13304982 13106596 12280420 11509452 11347785 10962759
5825A0962759j51810j9577j69756j80686L1698j11354M0797m01896k8332j34451
$$ 10962759 10810949 10791372 10621616 10440930 10472628 10361274 10402071 10000175 9971843 9837392
5815I837392K66174J67097L82690j13531O16614Q7608L93971m80741j061107o56262
$$ 9837392 10103566 10270663 10653353 10539822 11156436 11244044 11638015 11157274 10096167 9439905
5805I439905J00371m8375n42991L53440J17199j20160k07927l62288J7460J24942
$$ 9439905 9540276 9491901 8948910 9302350 9419549 9299389 9091462 8729174 8746634 8871576
5795H871576m31512L56958M04779M00651o7366k3611l611l17683l99460k3972
$$ 8871576 8440064 8797022 9201801 9602452 9535086 9511475 9507864 9190181 8790721 8766749
5785H766749J27726m78934n16627J10621J19317R8459k598l76094k15465K99406
$$ 8766749 8894475 8415541 7898914 8009535 8128852 8227311 8224713 7848619 7633154 7932560
5775G932560l130l54310j32378j25441K7020L95455j00565N35804j04916k36067
$$ 7932560 7929430 7575120 7442742 7317301 7344321 7739776 7639211 8175015 8070099 7834032
5765G834032N8120L316o5483K55577p0164m38239L1246M07650K4683j69132L3672
$$ 7834032 7892152 7895468 7829985 8085562 8015398 7577159 7608405 8016055 8040738 7871606 7905278
5754G905278k03136M42828l18831k92073M65287J27406p336N5182j68169Q0283
$$ 7905278 7702142 8144970 7826139 7534066 7999353 8126759 8119423 8174605 8006436 8086719
5744H086719k72503K04070R1122l9184K18447R8706l02325M48568O4156M31323
$$ 8086719 7814216 8018286 8109408 8070224 8288671 8387377 8085052 8533620 8597776 9029099
5734I029099J13944K46788N9265J28152N70297L57033j8340o1858k13389l65316
$$ 9029099 9143043 9389831 9449096 9577248 10147545 10504578 10486238 10424380 10210991 9845675
5724I845675n1074m70408p6019j55838q678Q2606L79753J18829K09275J95427
$$ 9845675 9794601 9324193 9248174 9092336 9083658 9166264 9546017 9664846 9874121 10069548
5714A0069548J20879L58073J001611N56810L74187R97012P33787M15287O74875
$$ 10069548 10190427 10548500 11550111 12106921 12481108 13478120 14211907 14627194 15302069
5705A5302069Q56879P73907n47943o77448j264172j359406j020094o78643m96965
$$ 15302069 16158948 16932855 16384912 15707464 14443292 13083886 12063792 11385149 10888184
5696A0888184j68242J8370o9522j6130J59676K56391L28997O2225Q43497N15354
$$ 10888184 10719942 10738312 10668790 10652660 10812336 11068727 11397724 11459949 12303446 12818800
5686A2818800L68739J203209J403897J411537J051307L90047J0180k90963p46078
$$ 12818800 13187539 14390748 15794645 17206182 18257489 18647536 18657716 18366753 17620675
5677A7620675j006571j169799j140676j213145j310081l81932p50977n19430J19425
$$ 17620675 16614104 15444305 14303629 13090484 11780403 11398471 10647494 10128064 10247489
5668A0247489L3315j49036L44195M2860j87946N39570K04044M27815O54066M68163
$$ 10247489 10280804 10131768 10475963 10518823 10330877 10870447 11074491 11502306 12156372 12624535
5658A2624535O28395P00105K16981j93296p88041p33859p04284j010929n1695
$$ 12624535 13252930 13953035 14170016 13976720 13188679 12454820 11750536 10739607 10687912
5649A0687912p39500r76365o24375J73388j41916j31208l29525j06749N1368j83789
$$ 10687912 9948412 8972047 8347672 8521060 8379144 8247936 7918411 7811662 7863030 7679241
5639G679241R644K29225j35538J25884K56023l74140K53781N74788K69115k85130
$$ 7679241 7688885 7918110 7782572 7908456 8164479 7790339 8044120 8618908 8888023 8602893
5629H602893l46963o06301J80876K47870p3198J29451j7850n08838K17921k81358
$$ 8602893 8255930 7649629 7830505 8078375 8005177 8134628 8116778 7607940 7825861 7544503
5619G544503J66286j95215M96526K5176M70004j22906L00377o0840K9402K21647
$$ 7544503 7710789 7515574 8012100 8037276 8507280 8384374 8684751 8623911 8653313 8874960
5609H874960m13514l78499o7437J80272n9263n01289j46389K49393K62560J25733
$$ 8874960 8461446 8082947 8015510 8195782 8136519 7635230 7488841 7738234 8000794 8126527
5599H126527k90688l79744j24126M58205J39018k70240p4092k11083m34207K60728
$$ 8126527 7835839 7456095 7331969 7790174 7929192 7658952 7584860 7373777 6939570 7200298
5589G200298j08816k80433j80615j91678j38220l86515P0714N1360L29598n92061
$$ 7200298 7091482 6811049 6630434 6438756 6300536 5914021 5984735 6036095 6365693 5773632
5579E773632o9173q6841m84695O24942m9236K87441k17995n12122J59619J53415
$$ 5773632 5704459 5617618 5132923 5757865 5708629 5996070 5778075 5265953 5425572 5578987
5569E578987J93996J66140J47905N5895J55594K9596J23973k41116j18689K18578
$$ 5578987 5772983 5939123 6087028 6142923 6298517 6328113 6452086 6210970 6092281 6310859
5559F310859K04613m9543k68542J07072J08892L80888J33785J44723j42745J82048
$$ 6310859 6515472 6465929 6197387 6304459 6413351 6794239 6928024 7072747 6930002 7112050
5549G112050K27509l17512J87026j67018M82713O6246k12443j02725n3389j36779
$$ 7112050 7339559 7022047 7209073 7042055 7524768 7591014 7378571 7275846 7222457 7085678
5539G085678l4291k09466Q8519k0656l75465K27362j55401j36749l51912K89175
$$ 7085678 7051387 6841921 6930440 6909784 6534319 6761681 6606280 6469531 6117619 6406794
5529F406794L19526K60762l3473J27087j15029K27619K93329N44000J26129n1957
$$ 6406794 6726320 6987082 6953609 7080696 6965667 7193286 7486615 8030615 8156744 8104787
5519H104787J80595M32949J43278k25363l02190j22670o3069k55578j07849j69013
$$ 8104787 8285382 8718331 8861609 8636246 8334056 8211386 8148317 7892739 7784890 7615877
5509G615877m45340j00250j24884J15008p7044M32806M28195q5431k13118j79477
$$ 7615877 7170537 7070287 6945403 7060411 6983367 7416173 7844368 7758937 7545819 7366342
5499G366342o2909K27099q512l02634j69110K88011J89220M76818M14554J60865
$$ 7366342 7303433 7530532 7522020 7219386 7050276 7338287 7527507 8004325 8418879 8579744
5489H579744o19968k15180N46102O51823k10533m78700o00372R8408n41779J69990
$$ 8579744 7959776 7744596 8290698 8942521 8731988 8253288 7652916 7751324 7209545 7379535
5479G379535j00232K37553N38428J3266k41063n24242J84100o3327K54124j50384
$$ 7379535 7279303 7516856 8055284 8068550 7827487 7303245 7487345 7424018 7678142 7527758
5469G527758m2444j75945J00682L6015j18912P1099J4637J8554L26086L58350
$$ 7527758 7485314 7309369 7410051 7446066 7327154 7398253 7412890 7431444 7757530 8115880
5459H115880L55419J42981K99316J82963M13105L78680k46710o54527k29051J34465
$$ 8115880 8471299 8614280 8913596 9096559 9509664 9888344 9641634 8987107 8758056 8892521
5449H892521k0982m29709K73041L56512m71267p4718J62294j3145L59986K0255
$$ 8892521 8871539 8441830 8714871 9071383 8600116 8525398 8687692 8674547 9034533 9054788
5439I054788j80095k87020J00510J07995L53925j27425k09364L38344N2346J53312
$$ 9054788 8874693 8587673 8688183 8796178 9150103 9022678 8813314 9151658 9204004 9357316
5429I357316K02214J4046J87095o44860k31194m23620L13537J70735k17666k93470
$$ 9357316 9559530 9573576 9760671 9115811 8884617 8460997 8774534 8945269 8727603 8434133
5419H434133j51162R3121J53138l0365J26740J57880l66663m39589J63582L29037
$$ 8434133 8282971 8376092 8529230 8498865 8625605 8783485 8416822 7977233 8140815 8469852
5409H469852Q4427L56113L07592L05780r6641p92330l8303R224k88124o3618K51909
$$ 8469852 8554279 8910392 9217984 9523764 9427123 8634793 8596490 8605714 8317590 8253972 8505881
5398H505881r9160j92650K10355L87180j66951N52223M91762N10085M55629m20641
$$ 8505881 8406721 8214071 8424426 8811606 8644655 9196878 9688640 10198725 10654354 10233713
5388A0233713l63727J27131N77093j56395K88208j95996k3072J65254j51120j31865
$$ 10233713 9869986 9997117 10574210 10417815 10706023 10510027 10486955 10652209 10501089 10369224
5378A0369224m46367j35953L10577J33223l8931M75314K44314n9269M0891K51635
$$ 10369224 9922857 9786904 10097481 10230704 10191773 10667087 10911401 10852132 10893023 11144658
5368A1144658O49470K52333r7355m4383L84777j60203P6174L17563L10950j24503
$$ 11144658 11794128 12046461 11949106 11904723 12289500 12129297 12205471 12523034 12833984 12709481
5358A2709481K16719J39504j92534l27736n14569l32367Q4015k7969L3886q3216
$$ 12709481 12926200 13065704 12873170 12545434 12030865 11698498 11782513 11754544 11788430 11705214
5348A1705214N23511o9742j57728J99053j40344O99436O26246M70520K17303J490884
$$ 11705214 12228725 12158983 12001255 12200308 12059964 12759400 13385646 13856166 14073469 15564353
5338A5564353R41378Q44733J112382N26107P8341n40594j259469o28485J36237
$$ 15564353 16505731 17350464 18462846 18988953 19067294 18526700 17267231 16638746 16774983
5329A6774983J76237j3496k9468J74894J34964M26287R50794J74413k67870n09709
$$ 16774983 16951220 16937724 16908256 17083150 17218114 17644401 18595195 18769608 18501738 17992029
5319A7992029m78122n34945l43231M01225j21308N29204N15762L25796O75510
$$ 17992029 17513907 16978962 16635731 17036956 16915648 17444852 17960614 18286410 18961920
5310A8961920J434242J583874J038550k9127j90785k79025l40202k18180p52041
$$ 18961920 20396162 21980036 23018586 22989459 22798674 22519649 22179447 21961267 21209226
5301B1209226r81078p26488j009942k29135o05804p82847n52552m83524l42290
$$ 21209226 20228148 19501660 18491718 18262583 17656779 16873932 16321380 15837856 15495566
5292A5495566O1996k69071L40265n5999j439j44647m63417J77926K51494O96095
$$ 15495566 15557562 15288491 15628756 15572757 15571318 15426671 14963254 15141180 15392674 16088769
5282A6088769n1368n68049m32092o30517o66037n60334l81409m07668r9093M13956
$$ 16088769 16037401 15469352 15037260 14406743 13740706 13180372 12798963 12391295 12292202 12706158
5272A2706158l35067l70659n87148k39219j28127k13755r5174j83901J26133K48025
$$ 12706158 12371091 12000432 11413284 11174065 11045938 10832183 10737009 10553108 10679241 10927266
5262A0927266K57568M16219M1712m23925m40050j63203k49977P5186j59355m92770
$$ 10927266 11184834 11601053 11642765 11218840 10778790 10615587 10365610 10440796 10281441 9788671
5252I788671j91240M3417k06903j67726j91655j07176j22135j31798N52936l13387
$$ 9788671 9597431 9640848 9433945 9266219 9074564 8967388 8845253 8713455 9266391 8953004
5242H953004j37288M41471j26350P3972l48517k52638l54004R6498N85746L47843
$$ 8953004 8815716 9257187 9130837 9204809 8856292 8603654 8249650 8346148 8931894 9279737
5232I279737K2054N3868K00951j49798J92797l02453J8232J03880k52621o27944
$$ 9279737 9301791 9355659 9556610 9406812 9599609 9297156 9315388 9419268 9166647 8538703
5222H538703R01255K66769J14713K4n3868J5859n0131L77616J52780j88175J56920
$$ 8538703 9439958 9706727 9821440 9821464 9767596 9783455 9733324 10110940 10263720 10075545 10232465
5211A0232465J58371J58101Q7033J53147Q11332J69257L49907K32391L41121O31886
$$ 10232465 10390836 10548937 10635970 10789117 11600449 11769706 12119613 12352004 12693125 13325011
5201A3325011J067204P92629O24304n40491j34587P8932M22873M57200k7967M47097
$$ 13325011 14392215 15184844 15809148 15268657 15134070 15213002 15635875 16093075 16065108 16512205
5191A6512205J141943P93001R40680J731571K000699K507852L380630L911438
$$ 16512205 17654148 18447149 19387829 21119400 23120099 25627951 29008581 32920019
5183C2920019L909912J815432j821154m525648l243610j910100j441519j099941
$$ 32920019 36829931 38645363 36824209 32298561 29054951 27144851 25703332 24603391
5175B4603391r76669j201071j088573o20469o00670Q4593N20434P282J60713N78998
$$ 24603391 23626722 22425651 21337078 20716609 20115939 20200532 20720966 20728248 20888961 21467959
5165B1467959J432509J851882K049960J906419J464910J023796P15664P39571
$$ 21467959 22900468 24752350 26802310 28708729 30173639 31197435 31913099 32652670
5157C2652670L03423O62419J061378J203711Q65714j34651k787909l299997l301708
$$ 32652670 32956093 33618512 34679890 35883601 36749315 36614664 33826755 30526758 27225050
5148B7225050k244787j311054j302343o31196j79277k07204n29515L09216K37656
$$ 27225050 24980263 23669209 22366866 21735670 21556393 21349189 20819674 21128890 21366546
5139B1366546N34752O79075P05093J210026J788400K449089L458499L745831L760930
$$ 21366546 21901298 22580373 23285466 24495492 26283892 28732981 32191480 35937311 39698241
5130C9698241K819884N50286k258001m088070m357625l548214k693643j960474
$$ 39698241 42518125 43068411 40810410 36722340 32364715 28816501 26122858 24162384
5122B4162384j591456j296623r99354j297181l38441n70823n47067m23807r9273
$$ 24162384 22570928 21274305 20274951 18977770 18639329 18068506 17521439 17097632 16998359
5113A6998359K45604K77689N76558R00474Q01549J683007J670068J887060J919843
$$ 16998359 17243963 17521652 18098210 18998684 19800233 21483240 23153308 25040368 26960211
5104B6960211P23709r24505k520981k168971j626256j071162k23613n71043j223117
$$ 26960211 27683920 26759415 24238434 22069463 20443207 19372045 19148432 18577389 17354272
5095A7354272j94786m36538n75641r19323n93196k07947n02721J31715j10501
$$ 17354272 17159486 16722948 16147307 15227984 14634788 14426841 13924120 14055835 13945334
5086A3945334p2689J79301L74830M05441k2619p77549r47159l97139k85113m47532
$$ 13945334 13872645 14051946 14426776 14832217 14809598 14032049 13084890 12687751 12402638 11955106
5076A1955106m65329J45677k75604l06632J06837J93990j20870N81580P99046
$$ 11955106 11489777 11635454 11359850 11053218 11160055 11354045 11233175 11814755 12613801
5067A2613801J11379k96172l54038j12618k87073j11107N4848O21399K17864N88233
$$ 12613801 12725180 12429008 12074970 11962352 11675279 11564172 11619020 12240419 12458283 13046516
5057A3046516R6438l51212k12332r46382n18104L3886m46790j54587M7720L43743
$$ 13046516 13142954 12791742 12579410 11633028 11114924 11148810 10702020 10547433 10595153 10938896
5047A0938896l49317L05935k69228k45168k60285k66276P2226K84827J55662m05042
$$ 10938896 10589579 10895514 10626286 10381118 10120833 9854557 9926783 10211610 10367272 9962230
5037I962230j30499L08048J29356k78670J67655K7439j76247K93731Q4506K93370
$$ 9962230 9831731 10139779 10269135 9990465 10158120 10185559 10009312 10303043 10387549 10680919
5027A0680919l89499k11086J38915J61782q55o34493M06717K06507j71196k95336
$$ 10680919 10291420 10080334 10219249 10381031 10380176 9745683 10152400 10358907 10187711 9892375
5017I892375J63987j2297r5030J58826k33652K81815k60899k29290J08034j1265
$$ 9892375 10056362 10044065 9949035 10107861 9874209 10156024 9895125 9665835 9773869 9762604
5007I762604L94604k53203J72380L99820j97776j52968J39192k37310j87581j6871
$$ 9762604 10157208 9904005 10076385 10476205 10278429 10125461 10264653 10027343 9839762 9822891
4997I822891o9060J00449l60526J26959M0435j64040k16501k44594N03878m52198
$$ 9822891 9753831 9854280 9493754 9620713 9661148 9497108 9280607 9036013 9539891 9087693
4987I087693M04059P9025M08544l7091k58580n8793l58560M91663J46587o28749
$$ 9087693 9491752 9570777 9979321 9942230 9683650 9624857 9266297 9757960 9904547 9275798
4977I275798k49997J27974J00649J75552o6939M05032q8328l83558j05096K88890
$$ 9275798 9025801 9153775 9254424 9429976 9363037 9768069 9679741 9296183 9191087 9479977
4967I479977N31588m8759j43639L8116j1031M8542k01820n9178p9991J49174J52624
$$ 9479977 10011565 9962806 9819167 9857283 9846252 9894794 9692974 9633796 9553805 9702979 9855603
4956I855603M350J92853r2608k13759q914q2172L18752p9671L837R0940l91410
$$ 9855603 9859953 10052806 9960198 9746439 9737525 9655353 9974105 9894434 9898271 9989211 9597801
4945I597801j11414l98454J50455L4581J76414J40415K4260L07322k00072k67683
$$ 9597801 9486387 9087933 9238388 9272969 9449383 9589798 9614058 9921380 9721308 9453625
4935I453625L37853m7097j46468m89376J94945L37517j37898J91314l0394n7818
$$ 9453625 9791478 9744381 9597913 9108537 9303482 9640999 9503101 9694415 9664021 9606203
4925I606203P4364k39730L01526L2157l19557L28607J70417m67001j3111m99649
$$ 9606203 9680567 9440837 9742363 9774520 9454963 9783570 9953987 9486986 9473875 8974226
4915H974226L63443M36230k0596m9132k57460q630k9213L54020j15366k71958
$$ 8974226 9337669 9773899 9753303 9704171 9446711 9438081 9408868 9762888 9647522 9375564
4905I375564l1790l27174L33898K19428J38382j54300k00132q4120L10719Q5311
$$ 9375564 9343774 9016600 9350498 9569926 9708308 9554008 9353876 9269756 9580475 9665786
4895I665786P4490j54644j25447L23770k14443j92086l9664m484J30449M50357
$$ 9665786 9740276 9585632 9460185 9783955 9569512 9377426 9337762 9333278 9463727 9914084
4885I914084J86393l41064J9234L90010p25804l7258L20791k90983o7552j55703
$$ 9914084 10100477 9759413 9778647 10168657 9442853 9405595 9726386 9435403 9367851 9212148
4875I212148K33020K35080l13524O34588L49559l19676n26015Q75905J9809l07257
$$ 9212148 9445168 9680248 9366724 10001312 10350871 10031195 9505180 10381085 10400894 10093637
4865A0093637P5676N220j77839K35969K18673L22320q7687J7140j89859M39346
$$ 10093637 10169313 10174533 9996694 10232663 10451336 10773656 10685969 10703109 10513250 10952596
4855A0952596k61701l66328O9886k47918O77330n4291m8875K00194N1223J15417
$$ 10952596 10690895 10324567 10394453 10146535 10823865 10769574 10720699 10920893 10972116 11087533
4845A1087533l72444J20552J56706N07907J7556k70127j14832p4332k52492k0833
$$ 11087533 10715089 10835641 10992347 11500254 11517810 11247683 11132851 11058519 10806027 10785194
4835A0785194J1215K16880K57475p94l36731m64849L37597j85839k28054k13740
$$ 10785194 10796409 11013289 11270764 11269970 10933239 10468390 10805987 10620148 10392094 10178354
4825A0178354K84455n2569j95253L04045K17332Q009j01055J2416N05121J59249
$$ 10178354 10462809 10410240 10214987 10519032 10736364 10744373 10643318 10655734 11160855 11320104
4815A1320104m56474j76932L47775K89630K4907j37007j87180l79654L08958J16182
$$ 11320104 10863630 10686698 11034473 11324103 11349010 11212003 11024823 10645169 10954127 11070309
4805A1070309l54127L20649k22058k70825r765K87123j46196N47432O6498j46265
$$ 11070309 10716182 11036831 10814773 10543948 10534183 10821306 10675110 11222542 11289040 11142775
4795A1142775j1934M9999M9402N6519J94296j70186k21651m2930r9668m16195
$$ 11142775 11130841 11180840 11230242 11286761 11481057 11310871 11089220 11046290 10946622 10530427
4785A0530427K74527m4918N55818K65325O917O1109J05299n69677j70797K86956
$$ 10530427 10804954 10760036 11315854 11581179 11588096 11649205 11754504 11184827 11014030 11300986
4775A1300986K90945k47975L52069J35816j83681r932O5503j11839M8144k24044
$$ 11300986 11591931 11343956 11696025 11831841 11648160 11638228 11703731 11591892 11640036 11415992
4765A1415992r9781L01450n45011p0292L74976L62431J44736j66202r4214k7556
$$ 11415992 11316211 11617661 11072650 11002358 11377334 11739765 11884501 11718299 11624085 11596529
4755A1596529K92520K70059K23497O8918k96521L9688m5010j77987R4059J87921
$$ 11596529 11889049 12159108 12382605 12451523 12155002 12194690 12149680 11971693 12065752 12253673
4745A2253673M01902l46329k4316J11445o188q0225r3225m0434M78061p0993J8727
$$ 12253673 12655575 12309246 12284930 12396375 12390187 12309962 12216737 12176303 12654364 12583371 12602098
4734A2602098j699j03836K59412P9171K06499l14822j38030J9526l070j27947
$$ 12602098 12600399 12496563 12755975 12835146 13041645 12726823 12588793 12608319 12605249 12477302
4724A2477302j20828k54445L31017N3961r8656K49193K35735o47624o4950k46089
$$ 12477302 12356474 12102029 12433046 12487007 12388351 12637544 12873279 12225655 12160705 11914616
4714A1914616J66848K82455m8312N164l77417j06769j39044K44853L12857L72737
$$ 11914616 12081464 12363919 12315607 12320771 11943354 11836585 11697541 11942394 12255251 12627988
4704A2627988R5227j20803o7905M07392k00439k4421J84914J4456j11205K01131
$$ 12627988 12723215 12602412 12534507 12941899 12741460 12717039 12901953 12916409 12805204 13006335
4694A3006335k61414l70993m84473J54033l2529m44493O3537j61646N3634M08777
$$ 13006335 12744921 12373928 11889455 12043488 12010959 11566466 11630003 11468357 11521991 11930768
4684A1930768k9553J92981q4654l30888O1771M5150m01862m75742L37587M5656
$$ 11930768 11901215 12094196 12009542 11678654 11740425 11785575 11383713 10907971 11245558 11291214
4674A1291214K0007K02691J60733m15210n3768J55020K24223j71358L58375N1416
$$ 11291214 11311221 11513912 11674645 11259435 11205667 11360687 11584910 11413552 11771927 11823343
4664A1823343M72729j32718L15491O8467o80905Q25459O4900J40693j63538m46233
$$ 11823343 12296072 12163354 12478845 12547312 11866407 12691866 12756766 12897459 12733921 12287688
4654A2287688M97044J09999j56702j18638j95845k06666j91538L56066n96345
$$ 12287688 12784732 12894731 12738029 12619391 12423546 12216880 12025342 12381408 11785063
4645A1785063m80831P2877k34240n5123L17226j64047o04992j83509j41640J7960
$$ 11785063 11304232 11377109 11142869 11087746 11404972 11240925 10635933 10452424 10310784 10328744
4635A0328744j99970K20327l87443j29060N256K02427K69849J22364N2920K71401
$$ 10328744 10128774 10349101 9961658 9832598 9837854 10040281 10310130 10432494 10485414 10756815
4625A0756815j92868K6045l11174j29246L39931P3622J13106k10877l21338M31161
$$ 10756815 10563947 10589992 10278818 10149572 10489503 10563125 10676231 10465354 10144016 10575177
4615A0575177J54933l75382K51134R2143m22510j24489J76674L07125J76485k40505
$$ 10575177 10730110 10354728 10605862 10698005 10275495 10151006 10327680 10634805 10811290 10570785
4605A0570785j37733l54388K79406K34904k2787j20946k66119P8678l46331J72668
$$ 10570785 10433052 10078664 10358070 10592974 10570187 10449241 10183122 10261800 9915469 10088137
4595A0088137L68665M9147n58207q88951l82631N48416J62769j391M69486o81811
$$ 10088137 10456802 10505949 9947742 9058791 8676160 9224576 9387345 9385954 9855440 9173629
4585I173629N08620K929k77924r0226k56301o1763K37557o062j79890k66892P5588
$$ 9173629 9682249 9685178 9407254 9317028 9060727 8998964 9236521 9230459 9050569 8783677 8859265
4574H859265L57713m81993L56597P8198k68532k74038J46427J75183l06394N56420
$$ 8859265 9216978 8734985 9091582 9169780 8901248 8627210 8773637 8948820 8642426 9198846
4564I198846K88416j84988K08359J05024O6044O76681r2121J9333K26908m9640
$$ 9198846 9487262 9302274 9510633 9615657 9681701 10358382 10266261 10285594 10512502 10462862
4554A0462862J01210j22855j8629j24196N55762j75725l11845j27624J38237J76394
$$ 10462862 10564072 10441217 10422588 10298392 10854154 10678429 10366584 10238960 10377197 10553591
4544A0553591m22885k6483l94133R6916L30548j53018j34679j11634l25563M3901
$$ 10553591 10130706 10104223 9710090 9807006 10137554 9984536 9849857 9738223 9412660 9456561
4534I456561J12385k80803m45117K86848P2793L32793l43867N45916j00397m09149
$$ 9456561 9568946 9288143 8843026 9129874 9202667 9535460 9191593 9737509 9637112 9227963
4524I227963K38416L44343L41427J73107J24289j15846J09609K61859k0814k33148
$$ 9227963 9466379 9810722 10152149 10325256 10449545 10333699 10443308 10705167 10684353 10451205
4514A0451205K70005N44460M38451J58147M03377Q80240n878l25590O75930N87864
$$ 10451205 10721210 11265670 11704121 11862268 12265645 13145885 13140007 12814417 13490347 14078211
4504A4078211J87899M22327K99031J81360R572O75170J617780J323055J860900
$$ 14078211 14266110 14688437 14987468 15168828 15178400 15853570 17471350 18794405 20655305
4495B0655305Q27562Q78936J01371m64408o39368j497826j697867j779967j102183
$$ 20655305 21482867 22361803 22463174 21998766 21359398 19861572 18163705 16383738 15281555
4486A5281555r82351j004980p44781n32206j17235n73501k81097n94337o39981
$$ 15281555 14299204 13294224 12549443 12017237 11900002 11326501 11045404 10451067 9811086
4477I811086K90681J61242k06463O5557j79410P8132M50090r0230M4304j11213
$$ 9811086 10101767 10263009 10056546 10122103 9942693 10020825 10470915 10380685 10424989 10313776
4467A0313776m24415l44274K01331p0826K81150L61821q5769j23849r2230N3920
$$ 10313776 9889361 9545087 9746418 9675592 9956742 10318563 10232794 10108945 10016715 10070635
4457A0070635j06623j8477N73963K86404j66615l6751l40943M0366N79392j29580
$$ 10070635 9964012 9945535 10519498 10805902 10639287 10602536 10261593 10301959 10881351 10751771
4447A0751771N6209J96401M96281L26710l29215o97111o23859l3290J7618l29854
$$ 10751771 10807980 11004381 11500662 11827372 11498157 10801046 10177187 10143897 10161515 9831661
4437I831661l36082m85613p4783L50165J4446Q2917k61208L44882m07967K48202
$$ 9831661 9495579 9009966 8935183 9285348 9299794 9382711 9121503 9466385 9058418 9306620
4427I306620p7281N92981L77777m65820k41686j46135p9984n31312L38346J10434
$$ 9306620 9229339 9822320 10200097 9734277 9492591 9346456 9266472 8735160 9073506 9183940
4417I183940k2373K53298j00276j27883l8042M79440k35810k59595j10098k2770
$$ 9183940 9161567 9414865 9314589 9186706 9148664 9628104 9392294 9132699 9022601 8999831
4407H999831L72132Q9583n4882n19449J57952K98491N39176l13232n60713M529
$$ 8999831 9371963 9461546 9406664 8887215 9045167 9343658 9882834 9569602 9008889 9013418
4397I013418k68962L75820j13183L01284K40716p16618J46755j10228K02445n005
$$ 9013418 8744456 9120276 9007093 9308377 9549093 8832475 8979230 8869002 9071447 9066442
4387I066442j63520L75370K94608J49852k42268P7315J35380J71874j27307N2043
$$ 9066442 8902922 9278292 9572900 9722752 9480484 9557799 9693179 9865053 9737746 9789789
4377I789789l4576N76274J31185K15765R7792J66369m7697l2624J67783k03196
$$ 9789789 9755213 10331487 10462672 10678437 10776229 10942598 10894901 10862277 11030060 10826864
4367A0826864J40203j1395N86956j19574j34328l59516L4852O5143l02521K9324
$$ 10826864 10967067 10955672 11542628 11423054 11288726 10929210 10964062 11029205 10726684 10756008
4357A0756008O10564K07242m49476P06198K62081l16098K88911j58041J26744
$$ 10756008 11366572 11573814 11124338 11830536 12092617 11776519 12065430 11907389 12034133
4348A2034133M2295n7193k30531l01394L69756K88625O73302J91376j56685o5730
$$ 12034133 12076428 12019235 11788704 11487310 11857066 12145691 12818993 13010369 12853684 12787954
4338A2787954j88795K84552J69364K09620L38034j16695J44805J41514r0964K90517
$$ 12787954 12599159 12883711 13053075 13262695 13600729 13484034 13628839 13770353 13679389 13969906
4328A3969906j80512K07242j5029K58279N86488K17563m0434L51596N24035K90233
$$ 13969906 13789394 13996636 13981607 14239886 14826374 15043937 15003503 15355099 15879134 16169367
4318A6169367M62367R96271J206583N02731l4059j38720o89805l83402q79382
$$ 16169367 16631734 17628005 18834588 19337319 19303260 19164540 18474735 18091333 17211951
4309A7211951j67754J50154k22723j2482M74K56444k26496n24114l30563n25708
$$ 17211951 17044197 17194351 16971628 16959146 16959620 17216064 16989568 16465454 16134891 15609183
4299A5609183J21538J3218k06459j6872m0267K673K34265Q3155M05168O54308
$$ 15609183 15730721 15743939 15537480 15520608 15480341 15483014 15717279 15800434 16205602 16859910
4289A6859910J34245j39369L21450P10700N35314K00833j43252k31011L47455
$$ 16859910 16994155 16854786 17176236 17886936 18422250 18623083 18479831 18248820 18596275
4280A8596275k89164o93259M86981M99888k24427j18619J021621N98572P52595
$$ 18596275 18307111 17613852 18100833 18600721 18376294 18257675 19279296 19877868 20630463
4271B0630463Q67764M22940J461717J510151L07360K01085l13525l99823p89832
$$ 20630463 21498227 21921167 23382884 24893035 25200395 25401480 25087955 24688132 23898300
4262B3898300n00456j55201M74048J80759j61165r39847l82913k39180o6316j63371
$$ 23898300 23397844 23242643 23716691 23897450 23736285 22796438 22413525 22174345 22108029 21944658
4252B1944658j20095K11336j44390K08785L79785K50029J53001L37370N44240
$$ 21944658 21824563 22035899 21891509 22100294 22480079 22730108 22883109 23220479 23764719
4243B3764719K96283K68584J01714M08307J08955J47960L88015J19996M10886
$$ 23764719 24061002 24329586 24431300 24839607 24948562 25096522 25484537 25604533 26015419
4234B6015419M6995j3520Q04206O61985K11975N20447k34286K72565M73417k44346
$$ 26015419 26062414 26048894 26853100 27515085 27727060 28247507 28013221 28285786 28759203 28514857
4224B8514857P40101P33823M52273P2400M51276N13074O66098N74577P02566J375170
$$ 28514857 29254958 29988781 30441054 30513454 30964730 31477804 32143902 32718479 33421045 34796215
4214C4796215P06728Q68780N16027N31255P79516O97567N41738O05464J097635
$$ 34796215 35502943 36371723 36887750 37419005 38198521 38896088 39437826 40043290 41140925
4205D1140925P52456P43034R33326J597802J508775N99856P30998J315152J947052
$$ 41140925 41893381 42636415 43569741 45167543 46676318 47276174 48007172 49322324 51269376
4196E1269376J431461J254989J733667J720962J784261J988689K349966J797859
$$ 51269376 52700837 53955826 55689493 57410455 59194716 61183405 63533371 65331230
4188F5331230J900431L200057L270222K651500K702211L414802L808608L562072
$$ 65331230 67231661 70431718 73701940 76353440 79055651 82470453 86279061 89841133
4180H9841133L872898M856478M280245N160188O247303P494846Q479216R862297
$$ 89841133 93714031 98570509 102850754 108010942 114258245 121753091 130232307 140094604
4172A40094604J1170754J4509540J8230770K3582677K8795806L0830953K3986239
$$ 140094604 151265358 165774898 184005668 207588345 236384151 267215104 291201343
4165B91201343J2801812Q74069m264237k32931Q908481K0632638L1950845L4495255
$$ 291201343 304003155 304877224 300612987 300380056 309288537 329921175 361872020 396367275
4157C96367275K1462170N379376n765022n306028m489040l2563289n8571645n5134585
$$ 396367275 417829445 423208821 417443799 412137771 407648731 375085442 316513797 261379212
4149B61379212m2427793k9488993k1839214j5292258j1378961r153521p597570
$$ 261379212 218951419 189462426 167623212 152330954 140951993 131798472 124200902
4142A24200902o131689n938348n454595n458076n457696n870462m991119l727203
$$ 124200902 118069213 112130865 106676270 101218194 95760498 89890036 84898917 81171714
4134H1171714k775613k788271k374602k165781j740296j622729j299916j592334
$$ 81171714 78396101 75607830 73233228 71067447 69327151 67704422 66404506 64812172
4126F4812172j637039q43054j304145j255653q58144o60815n36108q87805r32039
$$ 64812172 63175133 62332079 61027934 59772281 58914137 58253322 57717214 56829409 55897370
4117E5897370k11835p67140p43575p60904m31593l26668q94399p32388l99840
$$ 55897370 55685535 54918395 54174820 53413916 52982323 52655655 51761256 51028868 50629028
4108E0629028n32538o48630n21777r29979o27743q44042l01077o52293j057305
$$ 50629028 50096490 49447860 48926083 47996104 47368361 46524319 46223242 45570949 44513644
4099D4513644j67372m64918k29693k54070l26871k73756j85096K72991M53245
$$ 44513644 44346272 43881354 43651661 43397591 43070720 42796964 42611868 42884859 43338104
4090D3338104M02922J381725P11480P93948O70835M20461R23317K033720K543414
$$ 43338104 43741026 45122751 45834231 46628179 47299014 47719475 48642792 50676512 53219926
4081E3219926L626382L141284K271935J500339q71996j360385q91508j374490
$$ 53219926 56846308 59987592 62259527 63759866 62887870 61527485 60635977 59261487
4073E9261487l876447m874603l982342k359186j281055q22561q13903r97775m99489
$$ 59261487 55385040 50510437 46528095 44168909 42887854 42065293 41251390 40253615 39754126
4064C9754126p77923p76502m68283n62636l35416n06166q29563l72780j90182
$$ 39754126 38976203 38199701 37731418 37168782 36833366 36327200 35497637 35124857 34934675
4055C4934675m69963j47904L51208l80721q16577l78937L2159l91910n20704J8129
$$ 34934675 34464712 34316808 34668016 34287295 33470718 33091781 33123940 32732030 32211326 32229455
4045C2229455J62592l47763n91013l26479l57996N334k57503q9633R1463j39633
$$ 32229455 32392047 32044284 31453271 31126792 30768796 30774130 30516627 30426994 30518457 30378824
4035C0378824j56897o21617j57677n61078l18596p2880o82099J03751K04948n61007
$$ 30378824 30221927 29600310 29442633 28881555 28562959 28490079 27807980 27911731 28116679 27555672
4025B7555672p25367k48893j43589J36302k57161j50749J45860n9108j73365m78110
$$ 27555672 26830305 26581412 26437823 26574125 26316964 26166215 26312075 26252967 26079602 25601492
4015B5601492m31828l94264p02910J3839j04018k96040k15018j92546l55577k75196
$$ 25601492 25169664 24775400 24072490 24086329 23982311 23686271 23471253 23278707 22923130 22647934
4005B2647934j88230o27634o6583k30884j66933J44751m17930m74919L52543m60448
$$ 22647934 22459704 21832070 21765487 21534603 21367670 21512421 21094491 20619572 20972115 20511667
3995B0511667j41440J89670n01152l17569l6731K92720J31660o3335K15718m23506
$$ 20511667 20370227 20559897 20058745 19741176 19704445 19997165 20128825 20065490 20281208 19857702
3985A9857702q55001j80492l70042K97103o84619K62616l5691k43276J46524j63137
$$ 19857702 19002701 18822209 18452167 18749270 18064651 18327267 18291576 18048300 18194824 18031687
3975A8031687j84148j61517k85415k93457j13801k29534j13749L23006J90758
$$ 18031687 17847539 17686022 17400607 17107150 16993349 16763815 16650066 16973072 17163830
3966A7163830l11750q7473q5387K86666K40482q668J10968J92876l24517m06142
$$ 17163830 16852080 16764607 16679220 16965886 17206368 17197700 17308668 17501544 17177027 16770885
3956A6770885k77009n8885P1738L93313m06546J26225L31538K28969k16284q0827
$$ 16770885 16493876 16434991 16506729 16900042 16493496 16619721 16951259 17180228 16963944 16883117
3946A6883117k73034N93162K14458q7232j49315J39426M4267M50642R93062M813
$$ 16883117 16610083 17203245 17417703 17330471 17181156 17320582 17364849 17815491 18808553 18813366
3936A8813366m24191l58445L92594J65134K08986L78563j57116L21152M52472
$$ 18813366 18389175 18030730 18423324 18588458 18797444 19176007 19018891 19340043 19792515
3927A9792515L7815L89242O65585K26399L31187k34790o75985m67332m00659l63282
$$ 19792515 19830330 20219572 20885157 21111556 21442743 21207953 20531968 20064636 19663977 19300695
3917A9300695R917L66751j42737j69518j34730j12035j52144K7477o31252n9509
$$ 19300695 19310612 19677363 19534626 19365108 19230378 19118343 18966199 18993676 18362424 18302915
3907A8302915n9840J56504j72032k71755j40643o5921k18303L02799J45074l39970
$$ 18302915 18243075 18399579 18227547 17955792 17815149 17749228 17530925 17833724 17978798 17638828
3897A7638828m84494M82338J04001n23957j78510j22259J3182j41739j53678M1296
$$ 17638828 17154334 17636672 17740673 17216716 17038206 16915947 16929129 16787390 16633712 16675008
3887A6675008J62899L74006L57552j35238p7100Q9523J5765o4103J74628K13655
$$ 16675008 16837907 17211913 17569465 17434227 17357127 17446650 17462415 17398312 17572940 17786595
3877A7786595N99074l7681N42192M59947J83477N50116k46467L34909N02865O98932
$$ 17786595 18385669 18347988 18890180 19350127 19533604 20083720 19837253 20172162 20675027 21373959
3867B1373959m01136p2158K67347j89006m1772k10409M54067q8692l2058k66294
$$ 21373959 20972823 20900665 21168012 20979006 20937234 20726825 21180892 21092200 21060142 20793848
3857B0793848n79656n0035L50933o42503M1351L30287L63626j06938K5301J26245
$$ 20793848 20214192 20164157 20515090 19872587 19913938 20244225 20607851 20500913 20526214 20652459
3847B0652459j92397K83899O5216M05598J68174J51650R04633P7588L16971O44169
$$ 20652459 20460062 20743961 20809177 21214775 21382949 21534599 22439232 22516820 22833791 23477960
3837B3477960K00063L18391K32127M24960O6123N36055l7456j05050J26722R7735
$$ 23477960 23678023 23996414 24228541 24653501 24719624 25255679 25218223 25113173 25239895 25337630
3827B5337630J82041R2928M0209l83270l38517p03489m73645o16766n83507l54682
$$ 25337630 25519671 25612599 25652808 25269538 24931021 24227532 23753887 23137121 22553614 22198932
3817B2198932O365o1693J3105K323k29283J57264o120j3058N9344J6451j87005
$$ 22198932 22205297 22143604 22156709 22159032 21929749 22087013 22080893 22067835 22127179 22143630 21956625
3806B1956625Q8670k84000R0943L94200K04300L22930N1981k51454l57454k1402
$$ 21956625 22045295 21761295 21852238 22246438 22450738 22773668 22825649 22574195 22216741 22195339
3796B2195339O1854K87284o545M66746l6787l9381j37228J26629M29890k46942
$$ 22195339 22257193 22544477 22537932 23004678 22967891 22928510 22791282 22917911 23347801 23100859
3786B3100859K74605r3225k75219j55956K33307K79330J58012J77795o72655k65188
$$ 23100859 23375464 23282239 23007020 22851064 23084371 23363701 23521713 23699508 23026853 22761665
3776B2761665M55573J57036J24971q878J63202l16477M25578M0486l00065m46600
$$ 22761665 23217238 23374274 23499245 23490367 23653569 23337092 23762670 23803156 23503091 23056491
3766B3056491o746O71316L76913m60075k00767L10961Q7430m02127p4977j8019
$$ 23056491 23049745 23721061 24097974 23637899 23437132 23748093 23835523 23433396 23358419 23340400
3756B3340400M60820K47823k88927k06931k00771q6872K04503P2676j18821k05511
$$ 23340400 23801220 24049043 23760116 23553185 23352414 23265542 23470045 23542721 23423900 23218389
3746B3218389j91729J49422j59841J21199M39213k3141K26007m4261k40870K31114
$$ 23218389 23026660 23176082 23016241 23137440 23576653 23553512 23779519 23735258 23494388 23725502
3736B3725502l24123K40625K79062N65890M0239J17913r7780K3913j68750j37303
$$ 23725502 23401379 23642004 23921066 24486956 24527195 24645108 24547328 24571241 24402491 24265188
3726B4265188J43748p8035K66519L197l9640L43559P2343L99399j01258l4813
$$ 24265188 24408936 24330901 24597420 24600617 24560977 24904536 24976879 25376278 25275020 25240207
3716B5240207L38382L03193R5257k6961K95740M14759K43178J89812M79209K70290
$$ 25240207 25578589 25881782 25977039 25950078 26245818 26660577 26903755 27093567 27572776 27843066
3706B7843066L07147J91429J89220M44090J338O06447J86460q07K48595N4679
$$ 27843066 28150213 28341642 28530862 28974952 28976290 29582737 29769197 29768390 30016985 30071664
3696C0071664M57558L06028J0486k09903j65206K17981K0632M6221N4114L02100
$$ 30071664 30529222 30835250 30845736 30635833 30470627 30688608 30709240 30755461 30809575 31111675
3686C1111675M09682m0534K03804J37554K54901L82391j13556m51286M13247q2324
$$ 31111675 31521357 31480823 31684627 31822181 32077082 32459473 32345917 31894631 32307878 32225554
3676C2225554j0724o0500j15330K02245l80765N0375M77209j59818J46619K57761
$$ 32225554 32214830 32154330 32039000 32241245 31860480 31910855 32388064 32228246 32374865 32632626
3666C2632626l58416M387j74017p6058j33608k89m81333L64542O6016n65188P5287
$$ 32632626 32274210 32278597 32104580 32028522 31894914 31894625 31413292 31777834 31843850 31278662 31353949
3655C1353949K83458K15887l77040L15817j75258l01949k2536M43046K27633r8603
$$ 31353949 31637407 31853294 31476254 31792071 31616813 31314864 31292328 31735374 31963007 31864404
3645C1864404J59347l0619J83574O59089K34484O0396N70306K4938j8641K94432
$$ 31864404 32023751 31993132 32176706 32835795 33070279 33130675 33700981 33725919 33707278 34001710
3635C4001710l04033J23755N40598N05467o81698j89815J97513m1238m154J60761
$$ 34001710 33697677 33821432 34362030 34867497 34185799 33995984 34193497 34152259 34148105 34308866
3625C4308866L77314J91873l81720j55385P37053l76595m49177P7869M7809j75565
$$ 34308866 34686180 34878053 34496333 34340948 35078001 34701406 34252229 34330098 34377907 34202342
3615C4202342m34522J56631N01526l930J77185j41077J78588L49078P495J14134
$$ 34202342 33767820 33924451 34425977 34422047 34599232 34458155 34636743 34985821 34993316 35107450
3605C5107450K48105M40520k9932k54286J47841k31225m17805L31441K28543n7035
$$ 35107450 35355555 35796075 35766143 35511857 35659698 35428473 35010668 35342109 35570652 35513617
3595C5513617L53161k38175k26366N96851K54172j51204J52791j8757J53986K22668
$$ 35513617 35866778 35628603 35402237 35999088 36253260 36102056 36254847 36236090 36390076 36612744
3585C6612744M35646L79548j83859J91777k00708J40817O883K06090J81537J14401
$$ 36612744 37048390 37427938 37244079 37435856 37235148 37375965 37382848 37588938 37770475 37884876
3575C7884876M7116J33071p9979q6601m0863j22141l51870L46935m92424l36426
$$ 37884876 37931992 38065063 37985084 37898483 37857620 37735479 37383609 37730544 37238120 36901694
3565C6901694K3749l51871k43436j8296k90230k53917k99194m48962M5962m74747
$$ 36901694 36925443 36573572 36330136 36311840 36021610 35767693 35468499 35019537 35065499 34590752
3555C4590752l72133J1667L3352j2802R4997l78792K12347j1716L10066L85348
$$ 34590752 34218619 34230286 34263638 34250836 34345833 33967041 34179388 34167672 34477738 34863086
3545C4863086J24222j511N41703j5968J22131J61966M02911O15894P9607K74624
$$ 34863086 34987308 34985797 35527500 35511532 35633663 35795629 36198540 36814434 36894041 37168665
3535C7168665L65715K17941J44582K81158L29242j21441J52171N27741K04252
$$ 37168665 37534380 37752321 37896903 38178061 38507303 38385862 38538033 39065774 39270026
3526C9270026N33190O07186J44445O784K03925J41914J22490L50618M00133L74889
$$ 39270026 39803216 40410402 40554847 40561631 40765556 40907470 41029960 41380578 41780711 42155600
3516D2155600K48161Q30295k5996r3771M52026K99838K16046J95049J00369J02536
$$ 42155600 42403761 43234056 43208060 43114289 43566315 43866153 44082199 44277248 44377617 44480153
3506D4480153Q7131N8249n4198K32836L35309K94742j55975o69847K20368L44849
$$ 44480153 44567284 44625533 44571335 44804171 45139480 45434222 45278247 44608400 44828768 45173617
3496D5173617n55979n86794N574q7123K12308l84786j67022j02158Q1846L9602
$$ 45173617 44617638 44030844 44036418 43949295 44161603 43776817 43609795 43507637 43589483 43629085
3486D3629085j71264l38586o9077J82792j39019n7443J58939J77050l04699K3538
$$ 43629085 43457821 43119235 43050158 43232950 43093931 43036488 43195427 43372477 43067778 43091316
3476D3091316J93600r0553N6741K5870K76022L96543k18043j20476m46357Q987
$$ 43091316 43284916 43194363 43251104 43276974 43552996 43949539 43731496 43611020 43164663 43173650
3466D3173650M22007j57966P5901l4181N21441J3451j49746j68410l51877K30035
$$ 43173650 43595657 43437691 43513592 43479411 44000852 44014303 43864557 43696147 43344270 43574305
3456D3574305K49850K34835q89957K96110L50047l30755K34258K57996k7721K39103
$$ 43574305 43824155 44058990 43169033 43465143 43815190 43484435 43718693 43976689 43948968 44188071
3446D4188071M98642P77521M57850M25594Q38972K52324R16924M11568m32732
$$ 44188071 44686713 45464234 45922084 46347678 47186650 47438974 48355898 48767466 48334734
3437D8334734l80088n25498L69535K79403M32585J62936O0864L19731K91631J31538
$$ 48334734 47954646 47429148 47798683 48078086 48510671 48673607 48734471 49054202 49345833 49477371
3427D9477371m5592O50372M87133J91693K80485N73530P65219L80973O33562M24703
$$ 49477371 49431779 50082151 50569284 50760977 51041462 51614992 52380211 52761184 53394746 53819449
3417E3819449M35975Q23241Q17296R64412J528479J495734J992209K155096K043578
$$ 53819449 54255424 55078665 55895961 56860373 58388852 59884586 61876795 64031891 66075469
3408F6075469J666483M09289n46894j008278j061415r18748l09989j00568J004192
$$ 66075469 67741952 68151241 67604347 66596069 65534654 64615906 64305917 64205349 65209541
3399F5209541Q62194J908489K606574K807463J873025m16141j768777l29225p06816
$$ 65209541 66071735 67980224 70586798 73394261 75267286 74851145 73082368 72753143 72046327
3390G2046327K22676o499N44768N03712P79747J421432J132483Q28651Q06155
$$ 72046327 72269003 72262504 72807272 73310984 74090731 75512163 76644646 77473297 78279452
3381G8279452O30818O14356Q92459R46696J280370M92784L50830K20789M87513
$$ 78279452 78910270 79524626 80417085 81363781 82644151 83136935 83487765 83708554 84196067
3372H4196067j21013L74931M42592N91080L06990P75442J125140R79834J210101
$$ 84196067 84075054 84449985 84892577 85483657 85790647 86566089 87691229 88671063 89881164
3363H9881164Q45498P65395M27621K63213R2222N09660M02954Q1869M59554J98672
$$ 89881164 90726662 91492057 91919678 92182891 92275113 92784773 93187727 93269596 93729150 93927822
3353I3927822J031693R60854L73750L27581P05003N71186O42001J141059J097831
$$ 93927822 94959515 95920369 96294119 96621700 97326703 97897889 98539890 99680949 100778780
3344A00778780R23679O89791O99242M77294P38650R58047J162258M74319P30968
$$ 100778780 101702459 102392250 103091492 103568786 104307436 105265483 106427741 106902060 107633028
3335A07633028N86924P48496N76989L55082L30803K54384J82680K08842O06279
$$ 107633028 108219952 108968448 109545437 109900519 110231322 110485706 110668386 110877228 111483507
3326A11483507j00548N58682j31186K11521O30111L95921J5338l31419j08775
$$ 111483507 111382959 111941641 111810455 112021976 112652087 113048008 113063346 112731927 112623152
3317A12623152M87246Q75563N97995k35910J65307P6677L15114J12311l98313
$$ 112623152 113110398 113985961 114583956 114348046 114513353 114590030 114905144 115017455 114619142
3308A14619142L59082Q89525N19027L84425R61851R38293N77741J309289J596910
$$ 114619142 114978224 115867749 116386776 116771201 117733052 118671345 119249086 120558375 122155285
3299A22155285R76888J168622J795165J454113J350878J789630J989989J183740
$$ 122155285 123132173 124300795 126095960 127550073 128900951 130690581 132680570 133864310
3291A33864310J467396J647627J675099J188574J270817J071042J177858J835522
$$ 133864310 135331706 136979333 138654432 139843006 141113823 142184865 143362723 145198245
3283A45198245J485647J583416J751600J275933J591750J587724J737812J765259
$$ 145198245 146683892 148267308 150018908 151294841 152886591 154474315 156212127 157977386
3275A57977386K367234K429771K325327K106956J921204K088851J842696K274822
$$ 157977386 160344620 162774391 165099718 167206674 169127878 171216729 173059425 175334247
3267A75334247J791490K035756K050234J667361K354560L275772L478686L715747
$$ 175334247 177125737 179161493 181211727 182879088 185233648 188509420 191988106 195703853
3259A95703853L726748M570354N279664M814513M505341M005563L553534K175021
$$ 195703853 199430601 204000955 209280619 214095132 218600473 222606036 226159570 228334591
3251B28334591K218176K707176J839295K563203K098855K290398L623282M788069
$$ 228334591 230552767 233259943 235099238 237662441 239761296 242051694 245674976 250463045
3243B50463045O611173P136754N982889J811235p897080j4817079j6977836j5429754
$$ 250463045 257074218 264210972 270193861 272005096 264108016 249290937 232313101 216883347
3235B16883347j2694964j0237634q224274p491871p127761o775967o079162n409100
$$ 216883347 204188383 193950749 185726475 178234604 171106843 164330876 158251714 152842614
3227A52842614m048002l001175k715366k068889j776865k798567m580035m064379
$$ 152842614 148794612 145793437 143078071 141009182 139232317 136433750 131853715 127789336
3219A27789336l378650k621351k628449k448607j996802j541822k018404j316390
$$ 127789336 124410686 121789335 119160886 116712279 114715477 113173655 111155251 109838861
3211A09838861q44189p78862r06533j356716r23146l92201l34386M60861J760343
$$ 109838861 108994672 108215810 107309277 105952561 105029415 104637214 104302828 104763689 106524032
3202A06524032J475099J378447k13162k422968k717873k241203j962019j526425
$$ 106524032 107999131 109377578 109164416 106741448 104023575 101782372 99820353 98293928
3194I8293928j290260q17820m96877p87756j009657j669069j669842j612577j393459
$$ 98293928 97003668 96185848 95688971 94901215 93891558 92222489 90552647 88940070 87546611
3185H7546611j130424j142465n56622j111806q31859o97152m38984n94380p94863
$$ 87546611 86416187 85273722 84717100 83605294 82773435 82076283 81637299 81042919 80248056
3176H0248056o14062q31447o32807o65091L5498J60333J64351L1161o44142j331026
$$ 80248056 79633994 78802547 78169740 77504649 77540147 77700480 77864831 77895992 77251850 75920824
3166G5920824j694812j952987k018212j375441j037864j329291j059754o39008
$$ 75920824 74226012 72273025 70254813 68879372 67841508 66512217 65452463 64813455
3158F4813455q78897r23837r39306r43197m67833l11012k65152n90820m11690
$$ 64813455 63934558 63010721 62071415 61128218 60660385 60349373 60084221 59493401 59081711
3149E9081711q3972j82093l49975n91950j63096n44907j43019j66442L43376j69337
$$ 59081711 58997739 58815646 58465671 57873721 57710625 57165718 57022699 56856257 57199633 57030296
3139E7030296n24422J27103J62759K6398k31516l53506j56757m17323N51224q9462
$$ 57030296 56505874 56632977 56795736 56822134 56590618 56237112 56080355 55663032 56214256 56124794
3129E6124794j41533j46645q23194l02418j14960l77620l40367j90946k08553
$$ 56124794 55983261 55836616 55013422 54711004 54596044 54218424 53878057 53687111 53478558
3120E3478558j84474n02577o22014M6428j21279m23186O9714k95960N2721m27963
$$ 53478558 53294084 52791507 52169493 52215921 52094642 51671456 51741170 51445210 51497931 51069968
3110E1069968o29218J00234M8127q664l29444p11976q14837k01835n468m55385
$$ 51069968 50440750 50540984 50589111 50580447 50251003 49539027 48724190 48522355 48516887 48061502
3100D8061502l96678l98433n58308l28086j13695r98146m5448o66549n16715Q636
$$ 48061502 47664824 47266391 46708083 46379997 46266302 45268156 45222708 44556159 44039444 44048080
3090D4048080l27350l32961K21622n6426m96763K17515K17046Q5340n84326n69736
$$ 44048080 43720730 43387769 43609391 43552965 43056202 43273717 43490763 43576103 42991777 42422041
3080D2422041m37924o47605m26149n87195r56588p97975m99273n44108r99056
$$ 42422041 41984117 41336512 40910363 40323168 39366580 38568605 38069332 37525224 36526168
3071C6526168j011051n08451m85648n42883m10765q13781l48923j06557q09111
$$ 36526168 35515117 35006666 34521018 33978135 33567370 32753589 32404666 32298109 31488998
3062C1488998n32054j33525o79692m50113l49650l99536k61858k53263M0839K37969
$$ 31488998 30956944 30823419 30143727 29693614 29343964 28944428 28682570 28429307 28470146 28708115
3052B8708115j24190k76946n5459m54902k32748j81942j55097m5509j7542j37403
$$ 28708115 28583925 28306979 28251520 27796618 27563870 27381928 27226831 27181322 27163780 27026377
3042B7026377k73782j52501j00626N41988j12951J86004O4809J32908k57000L26927
$$ 27026377 26752595 26600094 26499468 27041456 26928505 27114509 27179318 27312226 27055226 27382153
3032B7382153m09112N4241J97318j88062L22107L11927J49540l12462J57344m0404
$$ 27382153 26973041 27027282 27224600 27036538 27358645 27670572 27820112 27507650 27664994 27624590
3022B7624590L2933J13931N7990j3828K63551K53513M42943N30195L50735l29714
$$ 27624590 27657523 27771454 27829444 27815616 28079167 28332680 28775623 29305818 29656553 29326839
3012B9326839P6935L71542L57614N01112N35551O39344M67328J40279O83621M82987
$$ 29326839 29403774 29775316 30132930 30634042 31169593 31808937 32276265 32416544 33100165 33583152
3002C3583152Q49337O62721M12498L85211N08871K17663N40025O92928L85969
$$ 33583152 34432489 35095210 35507708 35892919 36401790 36619453 37159478 37852406 38238375
2993C8238375N87210K16825K79824L18170O22770O311L05594O03806O99899N28882
$$ 38238375 38825585 39042410 39322234 39640404 40263174 40269485 40575079 41178885 41878784 42407666
2983D2407666P59219P71224N95064P02546J340383J102540R88658J380720J189781
$$ 42407666 43166885 43938109 44533173 45235719 46576102 47678642 48667300 50048020 51237801
2974E1237801J911063J616371P92589Q40401J439534J534826J315942J173174
$$ 51237801 53148864 54765235 55557824 56398225 57837759 59372585 60688527 61861701
2966F1861701J824644K035383K296243K253288J762649K418892K962588K014640
$$ 61861701 63686345 65721728 68017971 70271259 72033908 74452800 77415388 79430028
2958G9430028K392454K575952K734624K306514K129038J554220J005531R73473
$$ 79430028 81822482 84398434 87133058 89439572 91568610 93122830 94128361 95101834
2950I5101834K022285J816823K087230K512076L468244L794587K757327K065380
$$ 95101834 97124119 98940942 101028172 103540248 107008492 110803079 113560406 115625786
2942A15625786J201280J246934J605054J863839K002700J981891K625456L443824
$$ 115625786 116827066 118074000 119679054 121542893 123545593 125527484 128152940 131596764
2934A31596764L835660L764343L400673M361188L989038L901923L800569L720026
$$ 131596764 135432424 139196767 142597440 146958628 150947666 154849589 158650158 162370184
2926A62370184L752583L970839M385432L640602L020241K743557J750525R60604
$$ 162370184 166122767 170093606 174479038 178119640 181139881 183883438 185633963 186594567
2918A86594567k1816r92285o71865n69821j168477j163638k94225M38797J122060
$$ 186594567 186572751 185580466 184908601 184338780 183170303 182006665 181712440 182151237 183273297
2909A83273297J136250R25426J688159K612538K903153L358276K265073j485230
$$ 183273297 184409547 185334973 187023132 189635670 192538823 195897099 198162172 196676942
2901A96676942l472791l919092l265523k990867k320533j716480j743528r99431
$$ 196676942 193204151 189285059 186019536 183028669 180708136 178991656 177248128 176248697
2893A76248697j58280Q0792P35908J480167K283491K183582K805088K382631P59947
$$ 176248697 176090417 176171209 176907117 178387284 180670775 182854357 185659445 188042076 188802023
2884A88802023M50732o91937k85450k5295L50501J105483R69730J372460J329266
$$ 188802023 189252755 188560818 188275368 188250073 188600574 189706057 190675787 192048247 193377513
2875A93377513j95125j680102k192327l713200m270981m489413m511947m272016
$$ 193377513 193182388 191502286 189309959 185596759 181325778 176836365 172324418 168052402
2867A68052402l821131l163703k234556k393090j821243j721627k288439k904195
$$ 168052402 164231271 161067568 158833012 156439922 154618679 152897052 150608613 147704418
2859A47704418m354575m574401m811205m470279l933427l058274l339687l237028
$$ 147704418 143349843 138775442 133964237 129493958 125560531 122502257 119162570 115925542
2851A15925542l263614l624686l344080l645852l693619l256612k203967k461681
$$ 115925542 112661928 109037242 105693162 102047310 98353691 95097079 92893112 90431431
2843I0431431k207817k353096k881612l738351l819297l186171k980951k289949
$$ 90431431 88223614 85870518 82988906 79250555 75431258 72245087 69264136 66974187
2835F6974187j915250k781206k223355j979871j718171j216008j897687j928774
$$ 66974187 65058937 62277731 60054376 58074505 56356334 55140326 53242639 51313865
2827E1313865j190877j540958j813201j627520j081300p90878j306629j317502
$$ 51313865 50122988 48582030 46768829 45141309 44060009 43269131 41962502 40645000
2819D0645000j298840m10247q08269r88929j044083j211614m58538o49703j154640
$$ 40645000 39346160 38935913 38127644 37138715 36094632 34883018 34424480 33774777 32620137
2810C2620137l94645n38189m82808j017587j75060n81310p92176k79898n94700
$$ 32620137 32225492 31687303 31204495 30186908 30011848 29430538 28638362 28358464 27763764
2801B7763764m31047l33589j19231p81493n07432m79039q95250q79295J4943o29950
$$ 27763764 27332717 26999128 26879897 26098404 25590972 25111933 24216683 23337388 23352331 22722381
2791B2722381o16446l40619r27882j98910K26635O5527o22458L5515m06320p61658
$$ 22722381 22105935 21765316 20837434 20638524 20865159 20930686 20308228 20343743 19937423 19175765
2781A9175765J40629k86665l25226n56875o35229R235l30975k59367j80647j60122
$$ 19175765 19316394 19029729 18704503 18147628 17512399 17521634 17190659 16931292 16750645 16590523
2771A6590523l55982l38126J43968m66760m96752m8714k49349j65953j34214m3336
$$ 16590523 16234541 15896415 16040383 15573623 15076871 15028157 14778808 14612855 14478641 14435305
2761A4435305k54143k19651j37604K0937l35885k41985j00312P5062k26930P6096
$$ 14435305 14181162 13961511 13823907 13844844 13508959 13266974 13166662 13241724 13014794 13090890
2751A3090890K59110n94568j69747m7652J13182l89339n26877J14660k7476m27468
$$ 13090890 13350000 12755432 12585685 12538033 12651215 12261876 11734999 11849659 11822183 11394715
2741A1394715k26267L2647j20417J16984P2325l45874l1612k77017l80292k22693
$$ 11394715 11168448 11201095 11080678 11197662 11269987 10924113 10892501 10615484 10235192 10012499
2731A0012499J87854O19802l19190l46325j92315K8778M69357j33709j01593m11832
$$ 10012499 10200353 10820155 10500965 10154640 9962325 9991103 10460460 10326751 10225158 9813326
2721I813326j35032j44926r4754Q071j67154l13894j85399K51045p1281K91491
$$ 9813326 9678294 9533368 9438614 9446685 9279531 8965637 8780238 9031283 8960002 9251493
2711I251493L11780j89875L16538J67293K87491P2599K40459N9274m67899k7683
$$ 9251493 9563273 9373398 9689936 9857229 10144720 10217319 10457778 10517052 10049153 10021470
2701A0021470m65165o97371l61928m03648m85939L58593m73569m76255m04378
$$ 10021470 9556305 8858934 8497006 8093358 7607419 7966012 7492443 7016188 6611810
2692F611810O4903P8033k26858l62961N4006j67090K6884j04646o0869o5495K11867
$$ 6611810 6676713 6754746 6527888 6164927 6218933 6051843 6078727 5974081 5913212 5847717 6059584
2681F059584k09374k02299J24468j6338M47785j74514q99705l52142O1337J62336
$$ 6059584 5850210 5647911 5772379 5756041 6203826 6029312 5129607 4777465 4838802 5001138
2671E001138L31430M1495k38423k15294k53132r0456K97787J5481k3453m63513
$$ 5001138 5332568 5374063 5135640 4920346 4667214 4576758 4874545 4890026 4866573 4403060
2661D403060L07060R0862j09595k21773N00670p2026P8753j0067k51309j41847
$$ 4403060 4710120 4800982 4691387 4469614 4970284 4898258 4977011 4966944 4715635 4573788
2651D573788p5272M3855K75892L30118n04852L89421K5178j02332J4112p1051
$$ 4573788 4498516 4542371 4818263 5148381 4643529 5032950 5058128 4955796 4969908 4898857
2641D898857o8592k19291l2117l89145J03607O68366k58781k90069N98506J12254
$$ 4898857 4830265 4610974 4578857 4189712 4293319 4961685 4702904 4412835 5011341 5123595
2631E123595m88540j48026K71901J37340l18805m54415M22521J04850Q7401m2006
$$ 5123595 4635055 4487029 4758930 4896270 4577465 4123050 4545571 4650421 4737822 4695816
2621D695816k41067R4774j11711J13510P217k46469K30207l59743J99029N81298
$$ 4695816 4454749 4549523 4437812 4551322 4558539 4312070 4542277 4182534 4381563 4962861
2611D962861K9362k30921l23342r4252L24656k44845k82637p3882M86837K96420
$$ 4962861 4992223 4761302 4437960 4343708 4668364 4423519 4140882 4067000 4553837 4850257
2601D850257q399l12727k71198j73215J52590q2788N9034k79368l09392M15409
$$ 4850257 4841858 4529131 4257933 4084718 4237308 4154520 4213554 3934186 3624794 4040203
2591D040203J14913J36359K79630k10308K14583l037k4416K2330j29471q8825
$$ 4040203 4155116 4291475 4571105 4360797 4575380 4572343 4547927 4570257 4440786 4351961
2581D351961L5823J00719m05725K75649j31596j91218j63389m39706k67743k78729
$$ 4351961 4387784 4488503 4082778 4358427 4226831 4035613 3872224 3432518 3164775 2886046
2571B886046N83782K64658m05334K54492q6440l42749K24646K86096l74205L6263
$$ 2886046 3469828 3734486 3329152 3583644 3497204 3154455 3379101 3665197 3290992 3327255
2561C327255P9121J68438n64347j4918L5825K30365J2238l62170K13714K3208
$$ 3327255 3406376 3574814 3010467 2995549 3031374 3261739 3273977 2911807 3125521 3148729
2551C148729j15820k67691N1385j91036P702J4121J59611L44173p86687J61635
$$ 3148729 3032909 2765218 2816603 2625567 2633269 2647390 2807001 3151174 2364487 2526122
2541B526122k02183Q9769K96636m75706m97875N21548J37655p45720j2446L04003
$$ 2526122 2323939 2413708 2710344 2234638 1736763 2258311 2395966 1650246 1637800 1941803
2531A941803j41677j29956O3110M49064m30841m00895m45206M04329J41450l96201
$$ 1941803 1800126 1670170 1733280 2182344 1751503 1350608 905402 1309731 1451181 1054980
2521A054980M1230K76275M0087K18768j11790m7685L12119m12923l60040J57566
$$ 1054980 1096210 1372485 1412572 1631340 1519550 1471865 1783984 1371061 1011021 1168587
2511A168587K43488l86090K10026j13674l13281J35253k23069k03894R7430K40827
$$ 1168587 1412075 1025985 1236011 1122337 809056 944309 721240 517346 614776 855603
2501H55603L64689l17011K31091K40615j73910P4729j32804k04174n2212j81187
$$ 855603 1220292 903281 1134372 1374987 1201077 1275806 1143002 938828 886616 705429
2491G05429j8627K60078K05124p0777k54495L14365j56096n57241O2707l50778
$$ 705429 686802 946880 1152004 1081227 826732 1141097 985001 427760 490467 139689
2481A39689K46842J00036M46870j25297n04820K97370k03995R4590j37573k17843
$$ 139689 386531 486567 933437 808140 303320 600690 396695 491285 353712 135869
2471A35869J39749N17829p2445k62991P8669l70591J07294K30408L31644j77928
$$ 135869 275618 793447 721002 458011 536680 166089 273383 503791 835435 657507
2461F57507o30616K62742J70477k74045q7533M13158J20108N5034J070r8722l31770
$$ 657507 26891 289633 460110 186065 98532 511690 631798 686832 687902 589180 257410
2450B57410L24738M26273O2020l44745n35022Q2153L3113P225j35907J86097Q3847
$$ 257410 582148 1008421 1070441 725696 190674 272827 305940 313165 177258 363355 447202
2439D47202K10188r6741j04105O6012J8898n11648M51361L147k26547N12716j9537
$$ 447202 657390 560649 456544 522556 541454 29806 481167 484314 257767 770483 750946
2428G50946l49414j44985L13792K8910m60904J04717N7155j54902J64716j52938
$$ 750946 401532 256547 570339 599249 138345 243062 300217 145315 310031 157093
2418A57093k72172M3423M02034J23190J0958J4054o56509j02327R2362m4648M14162
$$ 157093 -115079 -71656 330378 453568 464526 478580 -177929 -280256 -187894 -232542 181620
2407A81620O61435m05763l88356K4218L86785j95207R3391k06964l2409Q5411
$$ 181620 843055 437292 48936 73154 459939 264732 358123 151159 118750 204161
2397B04161j499K11001j81811O0540N21467n26115L7327o0779n27956K7528L90621
$$ 204161 202662 413663 231852 292392 813859 287744 325071 264292 -263664 -236136 154485
2386A54485k99252K0842J22938M21727J72890r5145j47914n9730J21504j17771
$$ 154485 -144767 -123925 -987 420740 593630 498485 350571 290841 412345 294574
2376B94574J83814J82846l96877m20000P79019K95757k31866l00786L24732r3300
$$ 294574 478388 661234 264357 -155643 623376 919133 687267 386481 711213 617913
2366F17913k84025k02643N00642j71115k88025j24750R9700q8866J46717j0007
$$ 617913 333888 131245 631887 460772 172747 47997 147697 58831 205548 195541
2356A95541K64466l79486J5412k77131Q93226J32769l34897J13606o3091l04307
$$ 195541 460007 80521 95933 -181198 712028 844797 509900 623506 560415 256108
2346B56108m35774j20274J47872M05015m353l04654o580m04806K03381K87907
$$ 256108 -179666 -299940 -152068 252947 248594 -56060 -62640 -467446 -264065 23842
2336B3842K75531J9676k81397J94943M4245L0163J16395j03607p2684k29761l41945
$$ 23842 299373 319049 37652 232595 276840 307003 423398 319791 247107 17346 -324599
2325c24599K77435k24391L92066k08745J22194J45777k94315N9015L23277j68846
$$ -324599 -47164 -271555 120511 -88234 33960 179737 -114578 -55563 267714 98868
2315I8868k72970P8481O3856K15994j64004m2107M0865P1090M04258j23102j38902
$$ 98868 -174102 -95621 -31765 184229 20225 -21882 18983 90073 494331 371229 232327
2304B32327J01876j10956j16887j15713K78756L30399m03438Q7744K21619l92773
$$ 232327 334203 223247 106360 -9353 269403 599802 196364 284108 505727 112954
2294A12954O18325j16943o78145L43027Q7508l35301L19644n4756k24044K32415
$$ 112954 731279 614336 -63809 279218 366726 31425 351069 296313 72269 304684
2284C04684N64231K1758o2012l83632n27641p0229L32669K27037o78522J66600
$$ 304684 868915 890673 828661 445029 -82612 -152841 179828 406865 -271657 -105057
2274a05057O3900k74224M55607M32891J84486j24764j04466J4503k17801p4632
$$ -105057 -41157 -315381 140226 573117 757603 632839 528373 542876 325075 250443
2264B50443L42532k52377l7735K98955k16844q552l65813M63081K55619p47861
$$ 250443 592975 340598 302863 601818 384974 376422 10609 473690 729309 -18552
2254a8552L1705K83729k93841j64835q1486M20879Q586L73296j32503k79572J52810
$$ -18552 13153 296882 3041 -161794 -243280 177599 186185 559481 426978 147406 300216
2243C00216J42283r7831N3106M29773q7883k44371k7765K44241j15603K30936
$$ 300216 442499 344668 397774 827547 739664 495293 467528 711769 596166 827102
2233H27102m9722J13723J12406k96111j03917j45384j54148n2338k8082J27595
$$ 827102 777380 891103 1003509 707398 603481 458097 303949 251611 223529 351124
2223C51124j44382l94435M27275K29478J72376P2909j21516k19725M8947J65092
$$ 351124 206742 -187693 239582 469060 641436 714345 592829 373104 422051 587143
2213E87143k04303K72589m8379N1391J83874Q6397K84031n4982k1685l48731M30347
$$ 587143 382840 655429 607050 658441 842315 928712 1212743 1157761 1136076 787345 1217692
2202A217692j82336J4490k2k83406M03419K35778k39817K560K69415k87228P0205
$$ 1217692 1035356 1049846 1049824 766418 1169837 1405615 1165798 1168358 1437773 1150545 1220750
2191A220750M78508j7252J69553l93890K48931L86923j24296J51326m33593j09974
$$ 1220750 1699258 1682006 1851559 1457669 1706600 2093523 1969227 2120553 1686960 1576986
2181A576986P44916n7514j15050J82726L5140K21438j62198L41080N7917L4169
$$ 1576986 2321902 2264388 2149338 2332064 2367204 2588642 2426444 2767524 2825441 2859610
2171B859610O343j24038L65790m6730K77254R8179q6126K70569j63596K87189
$$ 2859610 2865953 2741915 3107705 3060975 3338229 3436408 3350282 3620851 3457255 3744444
2161C744444M17349n63028K75480J21343M2647j35971L61464L14964Q5899k4030
$$ 3744444 4161793 3598765 3874245 3995588 4038235 3902264 4263728 4578692 4664591 4640561
2151D640561R8431K96275J35643J75792Q0982P5006k45356K84288J46177J11577
$$ 4640561 4738992 5035267 5170910 5346702 5427684 5502690 5257334 5541622 5687799 5799376
2141E799376R3723J76351O48273L10151n4645L7091P70741O62375L62238R58831
$$ 5799376 5893099 6069450 6717723 7027874 6973229 7010320 7781061 8443436 8805674 9764505
2131I764505O11560j26579J31503P22403L18596M47551L48058Q02615N53262R53373
$$ 9764505 10376065 10249486 10380989 11103392 11421988 11869539 12217597 13020212 13573474 14526847
2121A4526847R65482J735274J620727J936564J702958J616518M88628J585838
$$ 14526847 15492329 17227603 18848330 20784894 22487852 24104370 24592998 26178836
2113B6178836J554954K786521K897410L629331M694032O595472Q366316J1729133
$$ 26178836 27733790 30520311 33417721 37047052 41741084 48336556 56702872 68432005
2105F8432005J5450972K3872079K7674497K8036026j382850l3177399l1412910
$$ 68432005 83882977 107755056 135429553 163465579 162082729 128905330 97492420
2098I7492420k3667643j4419837j0827182p904040o726005m338013l811952k693598
$$ 97492420 73824777 59404940 48577758 40673718 33947713 29609700 25797748 23104150
2090B3104150k094305j216915r10013k7895r29611j874059j301524j707812j038134
$$ 23104150 21009845 19792930 18882917 18855022 17925411 16051352 14749828 13042016 12003882
2081A2003882m13591j025350m43165o91917l13312l62795n27403k87482q5614
$$ 12003882 11590291 10564941 10121776 9429859 9116547 8753752 8226349 7938867 7853253
2072G853253n52717m53609k59462M2853l93984k73576n49752m83087j06359L12485
$$ 7853253 7300536 6846927 6587465 6630318 6236334 5962758 5413006 4929919 4823560 5136045
2062E136045l00017k01044K44569j82943m56136q58023q7069K70624j89634j97202
$$ 5136045 4836028 4634984 4879553 4696610 4240474 3382451 3295382 3566006 3376372 3179170
2052C179170N1506J14619m57651K83888k45594k28862j62291o4325J188j89389
$$ 3179170 3230676 3345295 2887644 3171532 2925938 2697076 2534785 2470460 2471648 2282259
2042B282259N51145m8408o89577k37155k9238j7869L28991k17424L723j10367
$$ 2282259 2833404 2784996 2095419 1858264 1829026 1811157 2140148 1922724 1926447 1816080
2032A816080l1237k69888k62225L2455j7209M40985p4735j30178J24931L0428
$$ 1816080 1784843 1514955 1252730 1285185 1267976 1708961 1634226 1504048 1628979 1659407
2022A659407M1838m70914l9149M93701L5157p49180J0781O7904K15648j07849
$$ 1659407 1701245 1230331 1191182 1684883 1720040 970860 981641 1049545 1265193 1157344
2012A157344J6820K2621j1608j80309k60767n380q6772L79449j73299K50486J97608
$$ 1157344 1174164 1196785 1185177 1004868 744101 738721 651949 1031398 858099 1108585 1306193
2001A306193p7292l17877j38870j40074K15769j198n2189M64071p27600K07016
$$ 1306193 1228901 911024 772154 632080 847849 846651 794462 1258533 530933 737949
1991G37949K58595m92444j41795J73916k60561P9794L0842k52615N14028k0091
$$ 737949 996544 504100 362305 536221 275660 355454 386296 133681 647709 627618
1981F27618j40285R2372j08161r3120j45680J05141k10089K55410L02176K991
$$ 627618 487333 579705 471544 378424 232744 337885 127796 383206 685382 688373
1971F88373M38196m70404q9646q7229j18506j19738K43281K22582r3514k52725
$$ 688373 1126569 656165 566519 479290 360784 241046 484327 706909 613395 360670
1961C60670L29109K02022j33668p63014J01976K31634k01495L24993J5174k37831
$$ 360670 689779 891801 758133 -4881 97095 328729 127234 452227 467401 229570
1951B29570J16222k06025K4730J32586J44174J6625l92772K97018J40212m1370
$$ 229570 345792 139767 164497 297083 441257 457882 65110 362128 502340 460970
1941D60970m33158L32606k7758P2859m25439J14983m14949L52172J0608J60869
$$ 460970 27812 360418 332660 405519 -19920 95063 -319886 32286 42894 203763
1931B03763m06328L9161R3465K37054k32866m7595P1712N251L86582l05092l02895
$$ 203763 -202565 -163404 -69939 167115 -65751 -113346 -41634 -36383 350199 45107 -257788
1920b57788L8520k9421k49525K14018K7147N87778k16281q5572M9920J68734O461
$$ -257788 -219268 -248689 -498214 -284196 -257049 330729 114448 28876 78796 247530 253991
1909B53991k32062k01476j5338J28563l49563k086J48208K41500J53295k25538
$$ 253991 21929 -179547 -194885 -66322 -415885 -417971 -269763 -28263 125032 -100506
1899a00506J28024O9930k41997m12339M52366J44418j51329j73911j48999N52134
$$ -100506 27518 97448 -144549 -556888 -104522 39896 -111433 -285344 -434343 117791
1889A17791J56616k19594L00656J33335O2990l82224r1012K08671N6356O1370
$$ 117791 274407 54813 355469 488804 551794 169570 78558 287229 343585 404955
1879D04955J39007J19559j30228k11064K00262n64366j15410J57065P625K82326
$$ 404955 543962 663521 533293 322229 522491 -41875 -157285 -220 7405 289731
1869B89731L09196n86826j00681L8585N1811K05999o979l7466l4121R9589K64509
$$ 289731 598927 12101 -88580 -49995 1816 207815 200836 163370 129249 228838 493347
1858D93347m32827l16871M69359q758r3281k56366l5240L88560K42060m84997
$$ 493347 60520 -256351 213008 204250 110969 -145397 -180637 207923 449983 -35014
1848c5014L33561r4247j04674J76842j53635K25551J94912n21106k2396L35355
$$ -35014 298547 204300 99626 276468 122833 348384 543296 22190 -206 335149
1838C35149j35182R8882j40372P7191K88981R9202M81603o56090K58826L87020
$$ 335149 199967 298849 158477 235668 524649 623851 1105454 449364 708190 1095210
1828A095210n00594M2576k17539p0454k30253q3917R5247J02709k60888k63930
$$ 1095210 594616 637192 419653 349199 118946 35029 130276 232985 -27903 -291833
1818b91833j62708K68349J21063O9420j39679k14249P4237K84036K4818K67847
$$ -291833 -454541 -186192 -65129 4291 -135388 -349637 -275400 8636 33454 301301
1808C01301n0783M3307M4143o82948j02267K28779K14819q4029k00186n6097o8982
$$ 301301 250518 293825 337968 -344980 -447247 -218468 -3649 -87678 -287864 -343961 -412943
1797d12943J42521m621L48871M70835k76706l86855j65166L54056l2048n4748
$$ -412943 -270422 -275043 73828 544663 267957 -118898 -284064 69992 37944 -16804
1787a6804k57981J10782L21540M2429K00186k34770q1785n72401q2275L06133
$$ -16804 -274785 -164003 157537 199966 400152 165382 83597 -488804 -571079 -264946
1777b64946k84715M82839K02767K96357l9033k11317l310m7117k23505L30575
$$ -264946 -549661 -66822 135945 432302 393269 181952 178642 131525 -91980 238595
1767B38595j08628m22295k3523j66943n7179J38800k60557p9435L54025K41086
$$ 238595 129967 -292328 -315851 -482794 -539973 -401173 -661730 -741165 -387140 -146054
1757a46054J49465k31048J3184J72083k71829J25784l6159J81659j25166r7402
$$ -146054 3411 -227637 -214453 -42370 -314199 -188415 -224574 -42915 -168081 -265483
1747b65483J69556j94551K88226K43172m4528k51067J421K1484L19897k8591m99111
$$ -265483 -95927 -290478 -2252 240920 196392 -54675 -53254 -31770 288127 259536 -239575
1736b39575J35017j72808l1712J54328j96643j0651L49019J76411n9912m72202
$$ -239575 -104558 -277366 -309078 -154750 -351393 -362044 -13025 163386 103474 -368728
1726c68728L6430J82872K17649j29675k00724M79018Q8649n09569k74351K39296
$$ -368728 -332298 -149426 68223 -61452 -262176 216842 305491 -204078 -478429 -239133
1716b39133j61246L00964K86297j25697L47474M56239q03624l93280K15002J49645
$$ -239133 -400379 -99415 186882 61185 408659 864898 61274 -332006 -117004 32641
1706C2641l8526K34955m41957J7165K52734l0602J73693J37763n15732j46208
$$ 32641 -5885 229070 -212887 -195722 57012 26410 200103 337866 -177866 -324074
1696c24074P0432L29211l39335m02859K60798K41619L1482L85190l34413k85316
$$ -324074 -253642 75569 -263766 -666625 -405827 -164208 -132726 252464 -81949 -367265
1686c67265L02739P3908m25864k4190N78394K85682l77764j65937k46090k76651
$$ -367265 -64526 9382 -416482 -440672 137722 423404 45640 -120297 -366387 -643038
1676f43038O90460J91157J6201l23763j62999O9325J45824l60471L39135K80178
$$ -643038 47422 238579 254780 -68983 -231982 -162657 -16833 -377304 -38169 242009
1666B42009j7135n60801m59407J2484O6025k410j55508K55803N54172K29890J52473
$$ 242009 224874 -335927 -795334 -782850 -716825 -719235 -874743 -618940 -64768 165122 317595
1655C17595k82202k28061k03559l47784K58194q1155l7829J58222l52008L87170
$$ 317595 35393 -192668 -396227 -744011 -485817 -566972 -604801 -446579 -798587 -411417
1645d11417L28517K21034l81515j24315K27238Q6451j60914L27661j06896j07216
$$ -411417 -82900 138134 -243381 -367696 -140458 -54007 -214921 112740 5844 -101372
1635a01372M53617J4414m40436l5281O13673j57640n33031k60629M13073k2111
$$ -101372 352245 366659 -73777 -109058 504615 346975 -186056 -446685 -33612 -55723
1625e5723J94303j02466k754l31134Q3807L60270k61898J20207k62014K6152M5408
$$ -55723 138580 36114 33360 -297774 -213967 146303 -115595 4612 -257402 -231250 -185842
1614a85842J99050k89051k77423N4919N79548q1571k28297O7227R2954J55082
$$ -185842 13208 -275843 -553266 -498347 81201 -370 -228667 -161440 -68486 86596
1604H6596q1807k3221j50557J18435m50445N34883j0836l93745L89612k62188
$$ 86596 4789 -18432 -168989 -50554 -500999 33884 23048 -370697 18915 -243273
1594b43273m48078N91091O26689j68374k35832K8271l32343J04860P1671j19898
$$ -243273 -691351 -100260 526429 358055 122223 150494 -181849 -76989 -5318 -125216
1584a25216j93216l49016N13314K24584M8244J04301l25247K07077k59869m2354
$$ -125216 -318432 -667448 -154134 70450 118694 222995 -102252 104825 -155044 -197398
1574a97398J34225j2426k84387k25114Q5830M21351J24935J68075O2019k92923
$$ -197398 -63173 -75599 -359986 -585100 -499270 -77919 47016 215091 277110 -15813
1564a5813k18015Q1681K92351n09361m5088k05862L61768N34689j9699r7864l44489
$$ -15813 -233828 -152147 140204 -369157 -414245 -620107 -258339 276350 256651 158787 -185702
1553a85702R2112j45620l64481M00848P4947K498K29284k82731L47023K17290
$$ -185702 -93590 -239210 -603691 -202843 -127896 -125398 103886 -178845 168178 385468
1543C85468j23192o4700j48722J46499k25093j66846j18195l119J81915K17257
$$ 385468 262276 197576 48854 195353 -29740 -196586 -314781 -317900 -135985 81272
1533H1272J78729n83491m07724L07707j39443J89927K36872m4558K93635J08729
$$ 81272 260001 -323490 -731214 -423507 -562950 -373023 -136151 -180709 112926 221655
1523B21655L3802m8571m70187K12319k03640l58625L02185J49286r7480N1728
$$ 221655 255457 206886 -263301 -50982 -254622 -613247 -311062 -161776 -259256 -207528
1513b07528M8085q6697m909j9655L58517P191q5492j84636j69535j31847K15639
$$ -207528 -159443 -246140 -251049 -270704 87813 95004 9512 -175124 -344659 -476506 -260867
1502b60867K07542j97858r8082J50890L50686j7490l8942j64858k1661l56906
$$ -260867 -53325 -251183 -349265 -198375 152311 134821 95879 -68979 -90640 -447546
1492d47546J06626K90894m2178j33203J42992k61715N8550L0862J16684L16547
$$ -447546 -340920 -50026 -92204 -225407 -82415 -344130 -285580 -254718 -138034 178513
1482A78513j634k16999L14441k21977m15655M69361r7784J22292j56340o058J16058
$$ 178513 176879 -40120 274321 52344 -363311 106050 8266 130558 -25782 -31840 84218
1471H4218J18943n68151M1796J43366k1569K16958J64692j50546K43212R2449
$$ 84218 203161 -364990 -323194 -179828 -201397 15561 180253 29707 272919 365368
1461C65368j44017M3608l4192k09213o5531K04598K1782m81801k37404J5581N00515
$$ 365368 221351 264959 230767 21554 -43977 160621 182403 -299398 -536802 -521221 -20706
1450b0706L96117m47716J01239j34356j08821M70333k30290j13389J72793j20592
$$ -20706 375411 -72305 28934 -105422 -214243 256090 25800 -87589 85204 -35388
1440c5388k1959m9871J65301J04031j65521m42342L60423P0099L61775L3636k43333
$$ -35388 -57347 -107218 58083 162114 -3407 -445749 -85326 -15227 346548 380184 136851
1429A36851K0136J84861J92750l46913l86112q6930K63460J51581K82534j55816
$$ 136851 156987 341848 534598 187685 -198427 -285357 -21897 129684 412218 256402
1419B56402k70570k44115p0166p3766J35692j92997N5647O04007J6005k11198
$$ 256402 -14168 -258283 -328449 -402215 -266523 -459520 -403873 200134 216139 4941
1409D941r6720o3310l12599L9341K8362k0573K22777o987q6781j41160J07534
$$ 4941 -91779 -155089 -467688 -428347 -399985 -420558 -197781 -204768 -291549 -432709 -325175
1398c25175L80632j21168J75003K12230J5649K47144J5587l45596k36547m46788
$$ -325175 55457 -65711 109292 321522 337171 584315 599902 254306 17759 -429029
1388d29029k73517L57716J06563J40158j49350J13143p9350l39199L39362M23400
$$ -429029 -702546 -344830 -238267 -98109 -247459 -134316 -213666 -552865 -213503 209897
$$ [...]
##END NTUPLES=NMR SPECTRUM
##END=
