##TITLE=1H_TG-2307-Ia
 CDCl3
 8 sc, 
 5.7.2023
##JCAMPDX= 6.0         $$ Bruker NMR JCAMP-DX V2.0
##DATA TYPE= NMR SPECTRUM
##DATA CLASS= NTUPLES
##ORIGIN= UXNMR, Bruker Analytische Messtechnik GmbH
##OWNER= root
$$ XWIN-NMR		Version 3.5
$$ Wed Jul  5 14:36:27 2023 Russian Standard Time (UT+4h)  she@DPX200
##.OBSERVE FREQUENCY= 200.13135
##.OBSERVE NUCLEUS= ^1H
##.ACQUISITION MODE= SIMULTANEOUS
##.ACQUISITION SCHEME= undefined
##.AVERAGES= 8
##.DIGITISER RES= 18
##SPECTROMETER/DATA SYSTEM= spect
##.PULSE SEQUENCE= zg30
##.SOLVENT NAME= CDCl3
##.SHIFT REFERENCE= (INTERNAL, CDCl3, 0, 15.737)
##AUDIT TRAIL= $$ (NUMBER, WHEN, WHO, WHERE, WHAT)
$$ ##TITLE= Audit trail, XWIN-NMR		Version 3.5
$$ ##JCAMPDX= 5.01
$$ ##ORIGIN= Bruker BioSpin GmbH
$$ ##OWNER= she
$$ F:/spectra/data/she/nmr/H-F/1/pdata/1/auditp.txt
$$ ##AUDIT TRAIL=  $$ (NUMBER, WHEN, WHO, WHERE, WHAT)
(   1,<2023-07-05 14:35:23.51 +0400>,<she>,<DPX200>,
      <created by zg, POWCHK disabled, PULCHK disabled
       configuration hash MD5:
       00 E9 B6 7A A2 85 ED C7 34 08 36 98 17 FE 4E 26
       data hash MD5: 16K
       57 51 B2 23 6D BD C5 A4 50 86 44 65 62 4B 26 73>)
(   2,<2023-07-05 14:35:25.65 +0400>,<she>,<DPX200>,
      <Start of raw data processing
       efp BC_mod = 2 LB = 0.24 FT_mod = 6 PKNL = 1 PHC0 = -20785.87 PHC1 = 10.65272 SI = 16K 
       data hash MD5: 16K
       C6 78 8A 5A 26 DB 78 DA 31 0B 8A 3C DB 77 C0 C0>)
(   3,<2023-07-05 14:35:43.03 +0400>,<she>,<DPX200>,
      <pk PHC0 = -5.316696 PHC1 = 7.4 
       data hash MD5: 16K
       FE C7 7F A2 CE 8A 3D E9 C0 EC 5D 82 20 70 30 07>)
(   4,<2023-07-05 14:35:46.28 +0400>,<she>,<DPX200>,
      <abs ABSG = 5 
       data hash MD5: 16K
       60 B3 6C 22 C2 45 03 E8 86 5D 52 D0 C9 4A CD 50>)
$$ ##END=
$$ 
$$ hash MD5
$$ F4 85 BA C1 11 25 E9 F6 A6 A8 7D 32 3E 24 4B BD
##$RELAX= 
##$RELAX= 
##$RELAX= 
##$RELAX= 
##$RELAX= 
##$RELAX= 
$$ Bruker specific parameters
$$ --------------------------
##$DU= <F:/spectra>
##$EXPNO= 1
##$NAME= <H-F>
##$PROCNO= 1
##$TYPE= <nmr>
##$USER= <she>
##$AMP= (0..31)
100 100 100 100 100 100 100 100 100 100 100 100 100 100 100 100 100 100 
100 100 100 100 100 100 100 100 100 100 100 100 100 100 
##$AQSEQ= 0
##$AQ_mod= 1
##$AUNM= <au_zg>
##$AUTOPOS= <>
##$BF1= 200.13
##$BF2= 200.13
##$BF3= 200.13
##$BF4= 200.13
##$BF5= 200.13
##$BF6= 200.13
##$BF7= 200.13
##$BF8= 200.13
##$BYTORDA= 1
##$CFDGTYP= 0
##$CFRGTYP= 5
##$CHEMSTR= <none>
##$CNST= (0..31)
1 1 145 1 1 1 1 1 1 1 1 1 1 1 1 1 1 1 1 1 1 1 1 1 1 1 1 1 1 1 1 1 
##$CPDPRG= <>
##$CPDPRG1= <>
##$CPDPRG2= <>
##$CPDPRG3= <>
##$CPDPRG4= <mlev>
##$CPDPRG5= <mlev>
##$CPDPRG6= <mlev>
##$CPDPRG7= <mlev>
##$CPDPRG8= <mlev>
##$CPDPRGB= <>
##$CPDPRGT= <>
##$D= (0..31)
0 1.2 0 0 0 0 0 0 0 0.06 0 0.03 0 0 0 0 0.0002 0 0 0 0 0 0 0 0 0 0 0 0 
0 0 0 
##$DATE= 1688553322
##$DBL= (0..7)
120 120 120 120 120 120 120 120 
##$DBP= (0..7)
150 150 150 150 150 150 150 150 
##$DBP07= 0
##$DBPNAM0= <>
##$DBPNAM1= <>
##$DBPNAM2= <>
##$DBPNAM3= <>
##$DBPNAM4= <>
$$ [...]
##$SUBNAM3= <"">
##$SUBNAM4= <"">
##$SUBNAM5= <"">
##$SUBNAM6= <"">
##$SUBNAM7= <"">
##$SUBNAM8= <"">
##$SUBNAM9= <"">
##$SW= 18.05172834244
##$SWIBOX= (0..15)
0 0 2 0 0 0 0 0 0 0 0 0 0 0 0 0 
##$SW_h= 3612.71676300578
##$TD= 16384
##$TD0= 1
##$TE= 0
##$TE2= 300
##$TE3= 300
##$TEG= 300
##$TL= (0..7)
0 120 120 120 120 120 120 120 
##$TP= (0..7)
150 150 150 150 150 150 150 150 
##$TP07= 0
##$TPNAME0= <>
##$TPNAME1= <>
##$TPNAME2= <>
##$TPNAME3= <>
##$TPNAME4= <>
##$TPNAME5= <>
##$TPNAME6= <>
##$TPNAME7= <>
##$TPOAL= (0..7)
0.5 0.5 0.5 0.5 0.5 0.5 0.5 0.5 
##$TPOFFS= (0..7)
0 0 0 0 0 0 0 0 
##$TUNHIN= 0
##$TUNHOUT= 0
##$TUNXOUT= 0
##$USERA1= <user>
##$USERA2= <user>
##$USERA3= <user>
##$USERA4= <user>
##$USERA5= <user>
##$V9= 5
##$VALIST= <valist>
##$VCLIST= <CCCCCCCCCCCCCCC>
##$VD= 0
##$VDLIST= <DDDDDDDDDDDDDDD>
##$VPLIST= <PPPPPPPPPPPPPPP>
##$VTLIST= <TTTTTTTTTTTTTTT>
##$WBST= 1024
##$WBSW= 4
##$XGAIN= (0..3)
0 0 0 0 
##$XL= 0
##$YL= 0
##$YMAX_a= 84581
##$YMIN_a= -68082
##$ZGOPTNS= <>
##$ZL1= 120
##$ZL2= 120
##$ZL3= 120
##$ZL4= 120
##$ABSF1= 15.7524
##$ABSF2= -2.299449
##$ABSG= 5
##$ABSL= 3
##$ALPHA= 0
##$AQORDER= 0
##$ASSFAC= 0
##$ASSFACI= 0
##$ASSFACX= 0
##$ASSWID= 0
##$AUNMP= <proc_1d>
##$AZFE= 0.1
##$AZFW= 0.1
##$BCFW= 0
##$BC_mod= 2
##$BYTORDP= 0
##$COROFFS= 0
##$CY= -3
##$DATMOD= 1
##$DC= 0
##$DFILT= <>
##$DTYPP= 0
##$F1P= 0
##$F2P= 0
##$FCOR= 1
##$FTSIZE= 16384
##$FT_mod= 6
##$GAMMA= 0
##$GB= 0
##$INTBC= 1
##$INTSCL= 3.70164e-10
##$ISEN= 128
##$LB= 0.24
##$LEV0= 0
##$LPBIN= 0
##$MAXI= 10000
##$MC2= 0
##$MEAN= 0
##$ME_mod= 0
##$MI= 1.114404
##$NCOEF= 0
##$NC_proc= -9
##$NLEV= 6
##$NOISF1= 3.799351
##$NOISF2= 2.8
##$NSP= 0
##$NTH_PI= 0
##$NZP= 0
##$OFFSET= 15.73697
##$PC= 1
##$PHC0= -20791.19
##$PHC1= 18.05272
##$PH_mod= 1
##$PKNL= yes
##$PPARMOD= 0
##$PSCAL= 0
##$PSIGN= 0
##$REVERSE= no
##$SF= 200.130006918499
##$SI= 16384
##$SIGF1= 3
##$SIGF2= 2
##$SINO= 5.538805
##$SIOLD= 16384
##$SREGLST= <1H.CDCl3>
##$SSB= 0
##$STSI= 16384
##$STSR= 0
##$SW_p= 3612.71676300578
##$SYMM= 0
##$S_DEV= 0
##$TDeff= 16384
##$TDoff= 0
##$TI= <>
##$TILT= no
##$TM1= 0
##$TM2= 0
##$TOPLEV= 0
##$USERP1= <user>
##$USERP2= <user>
##$USERP3= <user>
##$USERP4= <user>
##$USERP5= <user>
##$WDW= 1
##$XDIM= 16384
##$YMAX_p= 335170609
##$YMIN_p= -1964543
$$ End of Bruker specific parameters
$$ ---------------------------------
##NTUPLES= NMR SPECTRUM
##VAR_NAME=  FREQUENCY,     SPECTRUM/REAL,   SPECTRUM/IMAG
##SYMBOL=    X,             R,               I
##VAR_TYPE=  INDEPENDENT,   DEPENDENT,       DEPENDENT
##VAR_FORM=  AFFN,          ASDF,            ASDF
##VAR_DIM=   16384,         16384,           16384
##UNITS=     HZ,            ARBITRARY UNITS, ARBITRARY UNITS
##FACTOR=    0.220516191357247, 1,           1
##FIRST=     3149.43990453241, 0,            0
##LAST=      -463.276858473365, 0,           0
##MIN=       -463.276858473365, -1964543,    0
##MAX=       3149.43990453241, 335170609,    0
$$ Real data points
##PAGE= N=1
##DATA TABLE= (X++(R..R)), XYDATA
$$ [...]
5664E573633m41623k11583j88611l1264k52679r0754q2967N42128J59514k14358
$$ 5573633 5132010 4920427 4731816 4700552 4447873 4357119 4274152 4816280 4975794 4761436
5654D761436j33698N25993J53975j29192k36795m35635K23659n92272J1489J29859
$$ 4761436 4627738 5153731 5307706 5178514 4941719 4506084 4729743 4137471 4148960 4278819
5644D278819L23592J30899k29654j64533P5790j5662l79367K3408J72962j72850
$$ 4278819 4602411 4733310 4503656 4339123 4414913 4399251 4019884 4043292 4216254 4043404
5634D043404J80134M17516k01024M0253J13007O7334K95007J114797K61643p60022
$$ 4043404 4223538 4641054 4440030 4480283 4593290 4660624 4955631 6070428 6332071 5572049
5624E572049M3849q1411n93279m32696P9443o6974j84103n730P8732J08824j16030
$$ 5572049 5615898 5534487 4941208 4508512 4587955 4520981 4336878 4331148 4409880 4518704 4402674
5613D402674O02140K99605k07922P8116L76650l03003l35354N2232j66357k55023
$$ 4402674 5004814 5304419 5096497 5174613 5551263 5248260 4912906 4965138 4798781 4543758
5603D543758L13753j40619k67677k68601M10311k86754n88847J44479M1865K74275
$$ 4543758 4857511 4716892 4449215 4180614 4590925 4304171 3715324 3859803 3901668 4175943
5593D175943k6214N577l30286J12318L26568l06960l57169R2982k86818k2471
$$ 4175943 4149729 4155306 3825020 3937338 4263906 3956946 3599777 3692759 3405941 3383470
5583C383470q1157O5851J68959k06929R9783j37j73006L11652L99217K50112j7533
$$ 3383470 3302313 3368164 3537123 3330194 3429977 3429840 3256834 3568486 3967703 4217815 4200282
5572D200282n08861j2931N02619l36447q2431K08141l55819K97568L54020l43865
$$ 4200282 3691421 3678490 4181109 3844662 3762231 3970372 3614553 3912121 4266141 3922276
5562C922276k73812O0666J892J1619J60755M35513J2153k33262m86924L35115
$$ 3922276 3648464 3709130 3711022 3722641 3883396 4318909 4331062 4097800 3610876 3945991
5552C945991K8936L53196j01388K73281J00527j22556K2284k06390k49890l25752
$$ 3945991 3974927 4328123 4226735 4500016 4600543 4477987 4500271 4293881 4043991 3718239
5542C718239M31941O30643K5456o58616m0715R6984j30085M04960J74333l72527
$$ 3718239 4150180 4780823 4806279 4147663 4106948 4203932 4073847 4478807 4653140 4280613
5532D280613M09923N6895M71246K29196J1951j94532k86774J51647L26341J18836
$$ 4280613 4690536 4747431 5218677 5447873 5459824 5265292 4978518 5130165 5456506 5575342
5522E575342j42531O99375K04722j29968k45900q5424M53582m24685l86013l57862
$$ 5575342 5432811 6132186 6336908 6206940 5961040 5875616 6329198 5904513 5518500 5160638
5512E160638q9550J67192J48182M79541J38338o93922J08239J07052M53970J91872
$$ 5160638 5071088 5238280 5386462 5866003 6004341 5310419 5418658 5525710 5979680 6171552
5502F171552k40119j04422M3746R6542k27224L14285L50539J27690K05758M16138
$$ 6171552 5931433 5827011 5870757 5967299 5740075 6054360 6404899 6532589 6738347 7154485
5492G154485N11213K78315L41470P0375l37203o96465j95202k35469n89247n85782
$$ 7154485 7665698 7944013 8285483 8355858 8018655 7322190 7126988 6891519 6302272 5716490
5482E716490n11916p1222J46739N85434K46630k63085o2666j04814j99143N01928
$$ 5716490 5204574 5133352 5280091 5865525 6112155 5849070 5786404 5681590 5482447 5984375
5472E984375m46144k90576o7378l67070k79190J27892M41805Q0950N34547L67854
$$ 5984375 5538231 5247655 5180277 4813207 4534017 4661909 5103714 5184664 5719211 6087065
5462F087065m09044M39326O07610Q76589N43360m81518q21204j193397j04118
$$ 6087065 5678021 6117347 6724957 7601546 8144906 7663388 6842184 5648787 5544669
5453E544669J78467j36075j12005l10306p0620K28745k9332r4232n47117k91993
$$ 5544669 5723136 5587061 5475056 5164750 5094130 5322875 5293543 5199311 4652194 4360201
5443D360201j82425L63989R5628m43477L42851M95690m5742j31865j31920k74503
$$ 4360201 4177776 4541765 4637393 4193916 4536767 5032457 4986715 4854850 4722930 4448427
5433D448427M49249J42186o83188m9573M03352R07035m63601l21514O0786M30614
$$ 4448427 4897676 5039862 4356674 4307101 4710453 5617488 5153887 4832373 4893159 5323773
5423E323773p60853M895P5971n71767N3047o3227J30428O6890m70867L686M34979
$$ 5323773 4562920 4567815 4643786 4072019 4125066 4061839 4192267 4259157 3788290 3791976 4226955
5412D226955k85582K13481m0837K28917M00195O7233n63321K63093n42834Q6293
$$ 4226955 3941373 4154854 4114017 4342934 4743129 4810362 4247041 4510134 3967300 4053593
5402D053593J90508L57003m62130j93376L19703J99158j94552N9549j0047K25914
$$ 4053593 4244101 4601104 4138974 3945598 4265301 4464459 4269907 4329456 4319409 4545323
5392D545323O8234N3576j93204k49847R2787l39104p5151J94209j61182j00836
$$ 4545323 4613557 4667133 4473929 4224082 4316869 3977765 3902614 4096823 3935641 3834805
5382C834805n4571l35696P2094K05425N88539r8636J11648j01646K01358L58389
$$ 3834805 3780234 3444538 3516632 3722057 4310596 4211960 4323608 4221962 4423320 4781709
5372D781709R3495p1376l01060n2671K19420o3748m18928k53291O516M51412K69822
$$ 4781709 4875204 4803828 4502768 4450097 4669517 4605769 4186841 3933550 3940066 4391478 4661300
5361D661300N575J06825l62653J16688j92379j06005J11794j66692M7289Q3487
$$ 4661300 4666875 4773700 4411047 4527735 4335356 4229351 4341145 4174453 4221742 4305229
5351D305229O6795L9014p12m96516L81185k3810l31129L98251n8739M5260P44583
$$ 4305229 4372024 4411038 4410326 3913810 4294995 4271185 3940056 4338307 4279568 4324828 5069411
5340E069411K57225O42329J13720J39732l39258l44446K75288R8091o51710m46794
$$ 5069411 5326636 5968965 6082685 6222417 5883159 5538713 5814001 5912092 5260382 4813588
5330D813588J4194J01419P57987K41239J58401J58517l77429J58477M115m59870
$$ 4813588 4827782 4929201 5687188 5928427 6086828 6245345 5867916 6026393 6030508 5570638
5320E570638o694j71184k89452j43374M78835Q7808P7579j33603N58431K81752
$$ 5570638 5563944 5392760 5103308 4959934 5438769 5526577 5604156 5470553 6028984 6310736
5310F310736l99390m50853L01807j15363J6490K55704Q3104J94445J7491o94592
$$ 6310736 5911346 5460493 5762300 5646937 5663427 5919131 6002235 6196680 6214171 5519579
5300E519579p32699Q4007L70773r5524o087R32461J10276j85969o25818p68105
$$ 5519579 4786880 4870887 5241660 5146136 5140049 6072510 6182786 5996817 5370999 4602894
5290D602894K86880k45588N06870m28546k37095j64312j78373L69958O2987J8071
$$ 4602894 4889774 4644186 5151056 4722510 4485415 4321103 4142730 4512688 4575675 4593746
5280D593746m27039J85275K09711m68707l16045K10152o1836K03920O5684j4317
$$ 4593746 4166707 4351982 4561693 4092986 3776941 3987093 3925257 4129177 4194861 4180544
5270D180544r1037K06114l40351L65082k25610O7626L64490L42896m76421k19567
$$ 4180544 4089507 4295621 3955270 4320352 4094742 4162368 4526858 4869754 4393333 4173766
5260D173766K22864n36052l95142L25984N79193l32454J74998k10547o24681L85695
$$ 4173766 4396630 3860578 3465436 3791420 4370613 4038159 4213157 4002610 3377929 3763624
5250C763624L74920n0374r1751J14216M78094N9300j44437m5317L89316j65062
$$ 3763624 4138544 4088170 3996419 4110635 4588729 4648029 4503592 4458275 4847591 4682529
5240D682529M57035j29706j04763m60995k58897p49592K19176P16430j0402j36495
$$ 4682529 5139564 5009858 4905095 4444100 4185203 3435611 3654787 4371217 4360815 4224320
5230D224320L32560J2993K8736m40894l243n53472j83073J39786Q8563O37627
$$ 4224320 4556880 4569873 4598609 4157715 4154472 3601000 3417927 3557713 3646276 4283903
5220D283903m94793j00401J10527K45050k93563J56227J58365k7780P54498k54680
$$ 4283903 3789110 3688709 3799236 4044286 3750723 3906950 4065315 4037535 4792033 4537353
5210D537353r6206o4658q1465L39821J80287J80025k6017N8703j24560L11078
$$ 4537353 4441147 4376489 4295024 4634845 4815132 4995157 4969140 5027843 4903283 5214361
5200E214361J50686J74224k12388L80003N05520M86984M91453Q93295J015124
$$ 5214361 5365047 5539271 5326883 5706886 6212406 6699390 7190843 8084138 9099262
5191I099262N25186o8671l01892j065390l76873p60720L2555K2741n73j322510
$$ 9099262 9624448 9555777 9253885 8188495 7811622 7050902 7083457 7106198 7105625 5783115
5181E783115k93925K35551P0779L56301L48171n9348N31048J80578J5959O03559
$$ 5783115 5489190 5724741 5795520 6151821 6499992 6440644 6971692 7152270 7168229 7771788
5171G771788K45742O85817M36898K8954M04513q494P31932R03270J75808k61050
$$ 7771788 8017530 8703347 9140245 9169199 9573712 9565218 10297150 11200420 11376228 11115178
5161A1115178j01875q25653j121340q35282o61842j44316m3683L86109o9091l91019
$$ 11115178 11013303 10187650 9066310 8231028 7569186 7424870 7381187 7767296 7698205 7307186
5151G307186p5481K28358J08319Q6635Q6057O57802J57550J197262J290202J023160
$$ 7307186 7231705 7460063 7568382 7655017 7741074 8398876 8556426 9753688 11043890 12067050
5141A2067050J180251L15741K1634p83624j017399r37302j025098j185175m59259
$$ 12067050 13247301 13563042 13584676 12801052 11783653 10846351 9821253 8636078 8176819
5132H176819j84620K45140j7674j54124O16724l47384j03190m07189K54481o2358
$$ 8176819 7992199 8237339 8219665 8065541 8682265 8334881 8231691 7824502 8078983 8016625
5122H016625l75019m45705R11797Q14705L28183O23231M74733J96973L8760n78208
$$ 8016625 7641606 7195901 8107698 8922403 9250586 9873817 10348550 10545523 10584283 10006075
5112A0006075l56865l51361k84383k49043K22028j50600M3436O3967n5887L13675
$$ 10006075 9649210 9297849 9013466 8764423 8986451 8835851 8879287 8943254 8887367 9201042
5102I201042N11932l02932P67180N25738j51483M07743J00350O90997R0387n597
$$ 9201042 9712974 9410042 10177222 10702960 10551477 10959220 11059570 11750567 11840954 11835357
5092A1835357k10920R1664L92650j77344j9213k57927J78553q43415j915K60084
$$ 11835357 11624437 11716101 12108751 11931407 11912194 11654267 11832820 10989405 10987490 11247574
5082A1247574k01595M22562k86233k60005j93449N2014P14418K11558m01546K42355
$$ 11247574 11045979 11468541 11182308 10922303 10728854 10780868 11495286 11706844 11305298 11547653
5072A1547653o7268m37331L32571p66108j3500M35767l58158l78248N37777j38577
$$ 11547653 11480385 11043054 11375625 10609517 10596017 11031784 10673626 10295378 10833155 10694578
5062A0694578p49068K84524K22222K93601j97829j71078m7533J59140J96067J25029
$$ 10694578 9945510 10230034 10452256 10745857 10548028 10376950 10329417 10488557 10684624 10809653
5052A0809653o4261J31271P32080J97382m15046O99130J94291L40669O94841K90008
$$ 10809653 10745392 10876663 11608743 11806125 11391079 12090209 12284500 12625169 13320010 13610018
5042A3610018k95472N87743N43379Q7374K90177P44748j52455O6929k38041K74862
$$ 13610018 13314546 13902289 14445668 14533042 14823219 15567967 15415512 15482441 15244400 15519262
5032A5519262M58130l33375O13707L74505l01628L19943K47405k64798L65174
$$ 15519262 15977392 15644017 16257724 16632229 16330601 16650544 16897949 16633151 16998325
5023A6998325Q71034n5777k7015O99672N2641R9700J31990P5011k13997l29946
$$ 16998325 17869359 17813582 17786567 18486239 18538880 18638580 18770570 18845581 18631584 18301638
5013A8301638J18962p56330j003938M31587K26066j88012k58539q8261n5316J55858
$$ 18301638 18420600 17664270 16660332 17091919 17317985 17129973 16871434 16783173 16727857 16883715
5003A6883715j74916p95931m37032j008346n6550j80628l82801o98006o6926l15841
$$ 16883715 16708799 15912868 15475836 14467490 14410940 14230312 13847511 13149505 13082579 12766738
4993A2766738j34595M5754l81391M9872J53770r1316n30758N1085k03404J80107
$$ 12766738 12632143 12677897 12296506 12346378 12500148 12408832 11878074 11929159 11725755 11905862
4983A1905862J89799l5636j34899J57162N85577n56198l857J05927K07817P09073
$$ 11905862 12095661 12060025 11925126 12082288 12667865 12111667 12107810 12213737 12421554 13130627
4973A3130627J8432M40602K67211O04707K77667k07844J300118O91196Q36658
$$ 13130627 13149059 13589661 13856872 14461579 14739246 14531402 15831520 16522716 17359374
4964A7359374R01108L03760Q9878J00786l03415L82858m35187l32447j94556p6736
$$ 17359374 18260482 18564242 18654120 18754906 18451491 18834349 18399162 18066715 17872159 17795423
4954A7795423N47496n28561L45454j04264r6099K37310o16018o47023p89799J13344
$$ 17795423 18342919 17814358 18159812 18055548 17959449 18196759 17580741 16933718 16143919 16257263
4944A6257263p01354j105361n66933p11876k28502q79064p25090n07703k70687
$$ 16257263 15555909 14450548 13883615 13171739 12943237 12064173 11339083 10831380 10560693
4935A0560693L05547l78079n01084J21394l57430J86209n05786j55750p5976K97466
$$ 10560693 10866240 10488161 9987077 10108471 9751041 9937250 9431464 9275714 9199738 9497204
4925I497204K3818l35990l36710P4599k2021k63915k89999p1854k89532J23790
$$ 9497204 9521022 9185032 8848322 8922921 8900900 8636985 8346986 8275132 7985600 8109390
4915H109390l53102k52960N55344K94611m81887L76600L86105m31568k10522P9875
$$ 8109390 7756288 7503328 8058672 8353283 7871396 8247996 8634101 8202533 7992011 8071886
4905H071886K15464L66726l9099l84831k91347m2659K81217K52503j45211J043
$$ 8071886 8287350 8654076 8614977 8230146 7938799 7896140 8177357 8429860 8284649 8285692
4895H285692Q28142j9022J468K99227K73669j18888j08821L88240j18517Q38601
$$ 8285692 9113834 9094812 9096280 9395507 9669176 9550288 9441467 9829707 9711190 10549791
4885A0549791Q9969m04012J03142K26928O2635M23111O40449p6326J29662Q85955
$$ 10549791 10639760 10235748 10338890 10565818 10628453 11051564 11692013 11615687 11745349 12631304
4875A2631304k46463J67958P06037O18146L10881K09308Q00019R50294J153187
$$ 12631304 12384841 12552799 13258836 13876982 14187863 14397171 15197190 16147484 17300671
4866A7300671O97125Q68872L02646K56372K76293m68824J48425k48106j80851
$$ 17300671 17997796 18866668 19169314 19425686 19701979 19233155 19381580 19133474 18952623
4857A8952623o0826m77930J31150O17915m67104j66717K91456k29658L44284M7022
$$ 18952623 18891797 18413867 18545017 19162932 18695828 18529111 18820567 18590909 18935193 18982215
4847A8982215K38039l01830J059636M69501o5507M13293K4647j36572n3691r10583
$$ 18982215 19220254 18918424 19978060 20447561 20382054 20795347 20819994 20683422 20629731 19719148
4837A9719148p8451r2671k32404J44914O1290j52721N40880m31704P5374O09878
$$ 19719148 19640697 19548026 19315622 19460536 19521826 19369105 19909985 19478281 19553655 20163533
4827B0163533N20188P54943k909O17370P09848N51992J80978M91490J359650M0631
$$ 20163533 20683721 21438664 21435755 22053125 22762973 23314965 23495943 23987433 25347083 25387714
4817B5387714L88776o7029j88982j94901K6723J75337j86316L64454j28017j55790
$$ 25387714 25776490 25709461 25520479 25325578 25352301 25527638 25341322 25705776 25577759 25421969
4807B5421969n48716O5603l78361n92842j036754o45272l21825k93697m54608
$$ 25421969 24873253 24938856 24560495 23967653 22930899 22285627 21963802 21670105 21215497
4798B1215497o56441N45402K14364K59639k2181M78325R09696Q73229J274591
$$ 21215497 20559056 21104458 21318822 21578461 21556280 22034605 22944301 23817530 25092121
4789B5092121J413465Q549p45821j161099j827896k090529j114701r64414j113421
$$ 25092121 26505586 26514135 25768314 24607215 22779319 20688790 19574089 18609675 17496254
4780A7496254n37887l51825k08573l52589k24118J70977k27716L42036J90128
$$ 17496254 16958367 16606542 16397969 16045380 15821262 15992239 15764523 16106559 16296687
4771A6296687O2070j2949k38928J57245J02301J050470j66928o4142O9910K04490
$$ 16296687 16358757 16345808 16106880 16264125 16366426 17416896 17249968 17185826 17255736 17460226
4761A7460226k64540K3887k80314k29998j20932k89648o06421L15875p2974j081303
$$ 17460226 17195686 17219573 16939259 16709261 16588329 16298681 15692260 16008135 15935161 14853858
4751A4853858o26446j77223k0923r035m28737m89562k60426l65200k35055M17372
$$ 14853858 14227412 14050189 14029266 14020231 13591494 13101932 12841506 12476306 12241251 12658623
4741A2658623q9894l47906m63765k02204j07495j00714L30555J63046r1504J1598
$$ 12658623 12568729 12220823 11757058 11554854 11447359 11346645 11677200 11840246 11748742 11760340
4731A1760340l7854N27575P16380r5692l79536n04647Q3858M44031M56372P67287
$$ 11760340 11722486 12250061 12966441 12870749 12491213 11986566 12070424 12514455 12970827 13738114
4721A3738114N14394L20021O54625J344630O52327J195399J642984N82808p85033
$$ 13738114 14252508 14572529 15227154 16571784 17224111 18419510 20062494 20645302 19860269
4712A9860269o84350p92754j723649j346661r49554l22815k13221j59535q96870
$$ 19860269 19175919 18383165 16659516 15312855 14363301 14040486 13827265 13667730 12770860
4703A2770860l0843l52490L21371J15870J97921P3829L09766J92298n7361J22339
$$ 12770860 12740017 12387527 12708898 12824768 13022689 13096518 13406284 13598582 13541221 13663560
4693A3663560o35773K02356K24590n39620P906J34621J51891l6996m09564M90238
$$ 13663560 13027787 13230143 13454733 12915113 12923019 13057640 13209531 13172535 12762971 13253209
4683A3253209J40627l65602o2118k32622M60741J05651j52650k28249l05188j57936
$$ 13253209 13393836 13028234 12966116 12733494 13194235 13299886 13147236 12918987 12613799 12455863
4673A2455863Q2967p23538j91837J55711l98589M14833J83444l57870m77693J4433
$$ 12455863 12538830 11815292 11623455 11779166 11380577 11795410 11978854 11620984 11143291 11157724
4663A1157724P3325l32330k40346M87505J72866J47058J86249L52930L64032k80491
$$ 11157724 11231049 10898719 10658373 11145878 11318744 11465802 11652051 12004981 12369013 12088522
4653A2088522j67900L0472L64098J27483p5889J69645k9783l8214n96010k50550
$$ 12088522 11920622 11951094 12315192 12442675 12366786 12536431 12506648 12468434 11872424 11621874
4643A1621874j61359j19593O1319m2493m56899o85516m4708o2263j24495M97734
$$ 11621874 11460515 11340922 11402241 11359748 10902849 10217333 10172625 10110362 9985867 10483601
4633A0483601l84505K433r6159N13973K9575j06487j66921l02280l98907o74855
$$ 10483601 10099096 10101529 10005370 10519343 10548918 10442431 10275510 9973230 9574323 8899468
4623H899468k24630J8502q1702k13518j88147o76608J91298M43600O8532r4981
$$ 8899468 8674838 8693340 8611638 8398120 8209973 7533365 7724663 8168263 8236795 8141814
4613H141814o58462J59166k45174j77800M66939j19109K93501j2676k11825p01490
$$ 8141814 7483352 7642518 7397344 7219544 7686483 7567374 7860875 7848199 7636374 6934884
4603F934884K18382j74526N65726L38616J25316j40272P3119M6957n66402p5020
$$ 6934884 7153266 6978740 7544466 7883082 8008398 7868126 7941245 7988202 7421800 7346780
4593G346780j71100k38711J84270O55559J2479j51845k0644j8121R1955l56521
$$ 7346780 7175680 6936969 7121239 7776798 7789277 7637432 7616788 7598667 7690622 7334101
4583G334101k78814R8219J6145L39040Q4482n53278n07608l84790N3838m86915
$$ 7334101 7055287 7153506 7169651 7508691 7593173 7039895 6532287 6147497 6201335 5714420
4573E714420o0690M06009q638K9127K12771o01717k55601K71184K29285K18786
$$ 5714420 5653730 6059739 6051101 6080228 6292999 5691282 5435681 5706865 5936150 6154936
4563F154936m47641M9739L30357M92105l72323n61k91163P3085k54262k44724
$$ 6154936 5707295 5757034 6087391 6579496 6207173 6206612 5915449 5988534 5734272 5489548
4553E489548M34100K35489m27248L72880J95692j55769m64487L55156N63161m13278
$$ 5489548 5923648 6159137 5731889 6104769 6300461 6144692 5680205 6035361 6598522 6185244
4543F185244m3694N3059J7314K04791O2023m71537L97807j0251k42893n9694K9851
$$ 6185244 6141550 6194609 6211923 6416714 6478737 6007200 6405007 6394756 6151863 6092169 6122020
4532F122020l73850L27363K97038K88175Q28468l49211p48272Q1876N22438N67555
$$ 6122020 5748170 6075533 6372571 6660746 7489214 7140003 6391731 6473607 6996045 7563600
4522G563600j49660q77055j89061K64555J31155m17848p4988J17041j42790K50866
$$ 7563600 7413940 6536885 6347824 6612379 6743534 6325686 6250698 6367739 6224949 6475815
4512F475815k14665j27722L52348K6519j14274K66610k26236l49288L24584Q33131
$$ 6475815 6261150 6133428 6485776 6512295 6398021 6664631 6438395 6089107 6413691 7246822
4502G246822L09312N39152J60016O25239J38737L68324j88891K08708k82772M3640
$$ 7246822 7556134 8095286 8255302 8880541 9019278 9387602 9198711 9407419 9124647 9168287
4492I168287q61082l822k26102o42224o69144o53924P38703J18311k77396J55575
$$ 9168287 8307205 8303383 8077281 7435057 6765913 6111989 6850692 6969003 6691607 6847182
4482F847182j43477l89588O86496P4751l87694k49851R1324k56190K60617r8607
$$ 6847182 6703705 6314117 7000613 7075364 6687670 6437819 6529143 6272953 6533570 6434963
4472F434963n8110l63195J444j42137J75758k26445N68964K72639n04619K0968
$$ 6434963 6376853 6013658 6015102 5872965 6048723 5822278 6391242 6663881 6159262 6180230
4462F180230m32378n38437O69397L987j82978l5490L90223l60255k42372k9833
$$ 6180230 5747852 5209415 5878812 5882799 5699821 5664331 6054554 5694299 5451927 5422094
4452E422094N27371J00073J23777k68398K1513J52140j52419O37447k99621r4121
$$ 5422094 5949465 6049538 6173315 5904917 5926430 6078570 5926151 6563598 6263977 6169856
4442F169856J32595K35937m19592k0663J60365m94834L89238k6855k97325P7137
$$ 6169856 6302451 6538388 6118796 6098133 6258498 5763664 6152902 6126047 5828722 5905859
4432E905859p8275j37480L13749R823j97625m0111L43609n62145O05299l0472
$$ 5905859 5827584 5690104 6003853 6013676 5816051 5775940 6119549 5557404 6162703 6132231
4422F132231j26927m91187M72952N11801p25436j90538J87628J57305m09978J40016
$$ 6132231 6005304 5514117 5987069 6498870 5773434 5582896 5770524 5927829 5517851 5657867
4412E657867r1876N24820l00280J83016j42610m53816k76341J54752J564j40113
$$ 5657867 5565991 6090811 5790531 5973547 5830937 5377121 5100780 5255532 5257096 5116983
4402E116983L19379j10930l9404K6254j88133K05647m30303k60213k74299L61218
$$ 5116983 5436362 5325432 5286028 5312282 5124149 5329796 4899493 4639280 4364981 4726199
4392D726199o9984j213M14681J47016J33111m93407m86476K28320J5302j81472
$$ 4726199 4656215 4655002 5069683 5216699 5349810 4856403 4369927 4598247 4613549 4432077
4382D432077J45537L28434m94959L83522N172k79997P2652j12509J08454J86205
$$ 4432077 4577614 4906048 4411089 4794611 4799783 4519786 4592438 4479929 4588383 4774588
4372D774588J95254j2010o37913K68051J3145m13798R0367M67952j97863J879
$$ 4774588 4969842 4957832 4319919 4587970 4601115 4187317 4277684 4745636 4547773 4549652
4362D549652J35571j00645M09033l56123l90260N38526k09375n62896M20790M33458
$$ 4549652 4685223 4584578 4993611 4637488 4247228 4785754 4576379 4013483 4434273 4867731
4352D867731r7393l0507j94151J09036M06522k52823K82061o2573L3920P1183
$$ 4867731 4770338 4739831 4545680 4654716 5061238 4808415 5090476 5027903 5061823 5133006
4342E133006K92063m9478j02427l79689k7182L61738J64575J13782j04412J94745
$$ 5133006 5425069 5375591 5273164 4893475 4866293 5228031 5392606 5506388 5401976 5596721
4332E596721J1580K78548m44058l99363L36489M28642K83980K15993Q6357r8873
$$ 5596721 5608301 5886849 5442791 5043428 5379917 5808559 6092539 6308532 6394889 6296016
4322F296016N26003L3865m5927L34841j137353l4071M93733l61565K90126l46784
$$ 6296016 6822019 6855884 6809957 7144798 6007445 5973374 6467107 6105542 6395668 6048884
4312F048884m689j98922K13891L82100N49542M84551n28518l09939l99668L96387
$$ 6048884 6044195 5845273 6059164 6441264 6990806 7475357 6946839 6636900 6237232 6633619
4302F633619j75788N50703m7208m37281M39468j17579k0334L43424j84730m45118
$$ 6633619 6457831 7008534 6961326 6524045 6963513 6845934 6825600 7169024 6984294 6539176
4292F539176N6622j70241K12232M55758l19928J08226L03091k39059M68271K68040
$$ 6539176 6595798 6425557 6637789 7093547 6773619 6881845 7184936 6945877 7414148 7682188
4282G682188k20796m6176J39336j20610k02312J39870N77094J83668L27340n86681
$$ 7682188 7461392 7415216 7554552 7433942 7231630 7371500 7948594 8132262 8459602 7872921
4272G872921J57751M71411P11809L50632L05192k08918l71411k88708N67109J83217
$$ 7872921 8030672 8502083 9213892 9564524 9869716 9660798 9289387 9000679 9567788 9751005
4262I751005k70577K39520M32511j10339k11302K99518l05837M0289j03303q3967
$$ 9751005 9480428 9719948 10152459 10042120 9830818 10130336 9824499 9864788 9761485 9677518
4252I677518M5015o7930K53006J03728J46869N30815M62125k02796L86147M0419
$$ 9677518 9722533 9654603 9907609 10011337 10158206 10689021 11151146 10948350 11334497 11374916
4242A1374916M42366Q8459j94271J25585J58963L38202k11493K12675R6578K15941
$$ 11374916 11817282 11905741 11711470 11837055 11996018 12334220 12122727 12335402 12431980 12647921
4232A2647921O83434L2525p13573L29480K42971l59078L49544L24175J70084K97929
$$ 12647921 13331355 13363880 12650307 12979787 13222758 12863680 13213224 13537399 13707483 14005412
4222A4005412j78613Q38636M40355O27393M70636M28941N41951j42852J76481
$$ 14005412 13826799 14665435 15105790 15733183 16203819 16632760 17174711 17031859 17208340
4213A7208340P70031K64181L76287Q94221N65491N09013N64459K30417M20645
$$ 17208340 17978371 18242552 18618839 19513060 20078551 20587564 21152023 21382440 21803085
4204B1803085J10617N00906P77039J023977L92244M30346M22544L40068J274548
$$ 21803085 21913702 22414608 23191647 24215624 24607868 25038214 25460758 25800826 27075374
4195B7075374Q47408M88583P90619R28348J118495J719740J457301Q74512J303705
$$ 27075374 27922782 28411365 29201984 30130332 31248827 32968567 34425868 35300380 36604085
4186C6604085J240234J322560J676700J806901J799786J184596J873427K069281
$$ 36604085 37844319 39166879 40843579 42650480 44450266 45634862 47508289 49577570
4178D9577570K644200L192813L457763L588550M160935M939444O290470P640883
$$ 49577570 52221770 55414583 58872346 62460896 66621831 71561275 77851745 85492628
4170H5492628Q500778J0375803J2538188J2337047J0321675P893275P130667Q925316
$$ 85492628 93993406 104369209 116907397 129244444 139566119 147459394 154590061 163515377
4162A63515377J2848261J7498111K2231271K5165143K3012656J3356924l277501
$$ 163515377 176363638 193861749 216093020 241258163 264270819 277627743 274350242
4155B74350242k1319791l3076167l2329790k4833976j6339155j0816915p465927
$$ 274350242 253030451 219954284 187624494 162790518 146451363 135634448 128168521
4148A28168521m870515k889350l335075m867127n941140o533045o797320n259837
$$ 128168521 123298006 120408656 117073581 112206454 106265314 99732269 92934949 87675112
4140H7675112m367992l789445l184421k315746k433140j597078j189906j563388
$$ 87675112 83307120 79517675 76333254 74017508 71584368 69987290 68797384 67233996
4132F7233996j473972p92512l99335j202873o85909j089246q17420J8834o64612
$$ 67233996 65760024 64967512 64568177 63365304 62679395 61590149 60772729 60791563 60126951
4123F0126951o8730q03952q83858l59538o15910k53101J37324O43239m4315j83819
$$ 60126951 60058221 59254269 58370411 58010873 57394963 57141862 57279186 57922425 57878110 57694291
4113E7694291k7252M39773l18516k5165M46493R29111J204169J495500K238457
$$ 57694291 57667039 58106812 57788296 57763131 58209624 59138735 60342904 61838404 64076861
4104F4076861J785395p38101l196900m211583l238296k632021k182560j520657
$$ 64076861 65862256 65124155 61927255 57715672 54477376 51845355 49662795 48142138
4096D8142138j070751j099119j170939q12323o13681p50090j33091m20277K15771
$$ 48142138 47071387 45972268 44801329 43989006 43375325 42625235 42492144 42071867 42287638
4087D2287638N17800M19773j10332J239755K071486J827334K530455K996815L831134
$$ 42287638 42805438 43225211 43114879 44354634 46426120 48253454 50783909 53780724 57611858
4078E7611858O602507R527868P680315k39201j0744023j3371970q741486n186736
$$ 57611858 64214365 73742233 81422548 81183347 70439324 57067354 48325868 43139132
4070D3139132m101801k545893j825777j784138j367705q41550j202125r49422
$$ 43139132 39037331 36491438 34665661 32881523 31513818 30672268 29470143 28520721
4062B8520721r87394q70307o36408l59503K67665k75643o43732o27947l40009
$$ 28520721 27533327 26663020 26026612 25667109 25934774 25659131 25015399 24387452 24047443
4053B4047443n405K33772m64846p9634k45571l37309M49265L72314l40953q21912
$$ 24047443 24042038 24275810 23810964 23731330 23485759 23148450 23597715 23970029 23629076 22807164
4043B2807164q38307q39163q04122p5216j87305j86744J35794o23761j73729l31355
$$ 22807164 21968857 21129694 20325572 20250356 20063051 19876307 20012101 19388340 19214611 18883256
4033A8883256m75892n24826n6491j66650n26089l2800q1525m62218l73885l7789
$$ 18883256 18407364 17882538 17826047 17659397 17133308 17100508 17018983 16556765 16182880 16145091
4023A6145091J5565j89701j47862j92279l42457l99551k85376k43769K51890m09834
$$ 16145091 16160656 15970955 15823093 15630814 15288357 14888806 14603430 14359661 14611551 14201717
4013A4201717m58259L53129k19581l89752p28505L46405K19277l37957l10143
$$ 14201717 13743458 14096587 13877006 13487254 12758749 13105154 13324431 12986474 12676331
4004A2676331K67149n9736j83107n85683j5873j4876j36579J99013n49455L37400
$$ 12676331 12943480 12883744 12700637 12114954 12099081 12084205 11947626 12146639 11597184 11934584
3994A1934584K9683J32095k23917j80667o47536J1521Q19574K9986m70071l44996
$$ 11934584 11964267 12096362 11872445 11691778 11044242 11055763 11875337 11905323 11435252 11090256
3984A1090256K49005r9516l20001J04837k23759j90044k27501l4094M10588K50245
$$ 11090256 11339261 11239745 10919744 11024581 10800822 10610778 10383277 10349183 10759771 11010016
3974A1010016j31586j6641k15274n61151l61559L55678K81394j61189J15062R8167
$$ 11010016 10878430 10861789 10646515 10085364 9723805 10079483 10360877 10199688 10314750 10412917
3964A0412917k9554R43914K54800j66244N69804o15134p21380L22661N817m8693
$$ 10412917 10383363 11327277 11582077 11415833 11985637 11370503 10649123 10971784 10977601 10928908
3954A0928908K57542L7011Q9638m6982l20350L42339J38487K72652l3834m48526
$$ 10928908 11186450 11223461 11313099 11266117 10945767 11288106 11426593 11699245 11665411 11216885
3944A1216885K96833J33909l4540J10552O62465N81459k53912J38698J29447l20993
$$ 11216885 11513718 11647627 11613087 11723639 12386104 12967563 12713651 12852349 12981796 12660803
3934A2660803l5850K37205p2231m0932M41644k50068L70840N68369K46554j04967
$$ 12660803 12624953 12862158 12789927 12748995 13190639 12940571 13311411 13879780 14126334 14021367
3924A4021367K66703j73714m30298L17667K01036j38332O543M8473Q7185k57527
$$ 14021367 14288070 14114356 13684058 14001725 14202761 14064429 14070972 14119445 14206630 13949103
3914A3949103K43726Q5557M5049J5874K05258l58203J10648p70K39254n2968k49552
$$ 13949103 14192829 14278386 14323435 14339309 14544567 14186364 14297012 14296242 14535496 14482528 14232976
3903A4232976N58788l40500j52372j79686J22275J44874K56565k88408m5489k71628
$$ 14232976 14791764 14451264 14298892 14119206 14241481 14386355 14642920 14354512 14309023 14037395
3893A4037395K6870l14380Q0495J38761q0339k85278J42084l79269L2930O78980
$$ 14037395 14064265 13749885 13830380 13969141 13888802 13603524 13745608 13366339 13399269 14078249
3883A4078249L43860O33584r2120l20875O71895N91716M06695k312l12764R517
$$ 14078249 14422109 15055693 14963573 14642698 15314593 15906309 16313004 16310692 15997928 16007445
3873A6007445J71709P98253M28040n48439m26474J063348M92852L0632j40562
$$ 16007445 16179154 16977407 17405447 16857008 16430534 17493882 17986734 18017366 17876804
3864A7876804q9916J84511L15003k8221j27080J05737k00134M76318O69735k44224
$$ 17876804 17786888 17971399 18286402 18258181 18131101 18236838 18036704 18513022 19182757 18938533
3854A8938533N66271L43896K02649M96011K1024M10575K21880m30567N17552N99143
$$ 18938533 19504804 19848700 20051349 20547360 20568384 20978959 21200839 20770272 21287824 21886967
3844B1886967J5569P08983N01010M35736m52167k000M78489k97732M35438O00929
$$ 21886967 21902536 22611519 23112529 23548265 23096098 23094098 23572587 23274855 23710293 24311222
3834B4311222L9159m2561Q3425j94953j41636m03995l98369O4940O25748n09133
$$ 24311222 24350381 24307820 24391245 24196292 24054656 23650661 23252292 23317232 23942980 23433847
3824B3433847k34349q1663L8655K21722l82208k1521J54117J57899J68527j40678
$$ 23433847 23199498 23117835 23156490 23378212 22996004 22974483 23128600 23286499 23455026 23314348
3814B3314348M8709L47139K57918N31742l48610L19846N16197R78395L71997N08557
$$ 23314348 23363057 23710196 23968114 24499856 24151246 24471092 24987289 25965684 26337681 26846238
3804B6846238M42771K42808J043103O1245R20817O37642Q54232J124533Q69776
$$ 26846238 27289009 27531817 28574920 28636165 29556982 30194624 31048856 32173389 33043165
3795C3043165J371096Q86325O64430j33539N23345J601797J339385N81100M89829
$$ 33043165 34414261 35300586 35965016 35831477 36354822 37956619 39296004 39877104 40366933
3786D0366933M21740M95156O59345J1033j3704R32020p2717m38237O32953j84212
$$ 40366933 40788673 41283829 41943174 41954207 41940503 42872523 42799806 42361569 42994522 42810310
3776D2810310M02083m3650L7172o08937n49131K64764J58959K2927L1274j23899
$$ 42810310 43212393 43168743 43205915 42596978 42047847 42312611 42471570 42494497 42525771 42401872
3766D2401872j006077J05733r5974j3805K72957K76062o4856K21984O02648M01604
$$ 42401872 41395795 41501528 41405554 41391749 41664706 41940768 41875912 42097896 42700544 43102148
3756D3102148k2691N11804P9068m69840N72861m1709n81332p77382l3104K59892
$$ 43102148 43079457 43591261 43670329 43200489 43773350 43731641 43150309 42372927 42339823 42599715
3746D2599715M2021l61494m72317o7041l92298p12915l87783o69624p63823k54842
$$ 42599715 42641736 42280242 41807925 41740884 41348586 40635671 40247888 39578264 38814441 38559599
3736C8559599n85338q30213J08606q71605j572974j127330m88889k61524r75478
$$ 38559599 37974261 37144048 37252654 36381049 34808075 33680745 33191856 32930332 31954854
3727C1954854p00358m84418n65805j83268n13614j31377m03820l21140J55482
$$ 31954854 31254496 30770078 30204273 30021005 29507391 29376014 28972194 28651054 28806536
3718B8806536j28864K43701l7129m83893L06257L98268m21134J72046K30958L93486
$$ 28806536 28677672 28921373 28884244 28400351 28706608 29104876 28683742 28855788 29086746 29480232
3708B9480232J61663K21430J19582Q0392J50675J04403L22007N8807M89016L71492
$$ 29480232 29641895 29863325 29982907 30063299 30213974 30318377 30640384 30699191 31188207 31559699
3698C1559699N28203K98646m12808K94497M42416J20270J76617M36641O9498m26653
$$ 31559699 32087902 32386548 31973740 32268237 32710653 32830923 33007540 33444181 33513679 33087026
3688C3087026M1255L18265n5911n08093l94545N86984j87462J63702m90510j19368
$$ 33087026 33128281 33446546 33390635 32882542 32487997 33074981 32887519 33051221 32560711 32441343
3678C2441343L32090k09836j55743Q0808l57581j8592M91790O46866L36133M18276
$$ 32441343 32773433 32563597 32407854 32488662 32131081 32112489 32604279 33251145 33587278 34005554
3668C4005554N6948j21745M23833K43981J71314M96482K87353K42501j16505N02181
$$ 34005554 34062502 33940757 34364590 34608571 34779885 35276367 35563720 35806221 35689716 36191897
3658C6191897J30623m77485l1901J39219Q01154O80590L38177l28564N63630M73150
$$ 36191897 36322520 35845035 35813134 35952353 36753507 37434097 37772274 37443710 38007340 38480490
3648C8480490K06164j20826K80041k3918o0087M34395P26239q1902p61049K69753
$$ 38480490 38686654 38565828 38845869 38821951 38761864 39196259 39922498 39840596 39079547 39349300
3638C9349300K71122m18229j62706k09785J34051l76454l54391l82684n7734K54246
$$ 39349300 39620422 39202193 39039487 38829702 38963753 38587299 38232908 37850224 37792490 38046736
3628C8046736K06725k51147J07340k56745j8775L40582k85486K38976l81524o17647
$$ 38046736 38253461 38002314 38109654 37852909 37834134 38174716 37889230 38128206 37746682 37129035
3618C7129035K58650M49955k09817M321N76846M24957J063370M93809O41534J158615
$$ 37129035 37387685 37837640 37627823 37632144 38208990 38633947 39697317 40191126 40832660 41991275
3608D1991275M52323P78664O57801J293037P52648N23150J079309J075876J408579
$$ 41991275 42443598 43222262 43880063 45173100 45925748 46448898 47528207 48604083 50012662
3599E0012662R99139R21084J343702J061978J56933L25474P54434Q4065l0521
$$ 50012662 51011801 51932885 53276587 54338565 54495498 54820972 55575406 55659471 55628950
3590E5628950N11237N15349K51510K19434L72589K71537j83377k23214L51017
$$ 55628950 56140187 56655536 56907046 57126480 57499069 57770606 57587229 57364015 57715032
3581E7715032j85941M3876L35398O28275Q21212O38821P12287N4316N63553J135268
$$ 57715032 57529091 57572967 57908365 58536640 59357852 59996673 60708960 60763276 61326829 62462097
3571F2462097J679181P73673P80437Q84401M56305Q02733K4760N44924K02052
$$ 62462097 64141278 64914951 65695388 66579789 67036094 67838827 67863587 68408511 68610563
3562F8610563m62844m11841l79854n01513k13096l56655j128024j6395n6228m80578
$$ 68610563 68147719 67735878 67356024 66854511 66641415 66284760 65156736 65140341 65084113 64603535
3552F4603535L45448O55764P20759O25018L08716J102122J466623K043338J014813
$$ 64603535 64948983 65604747 66325506 66950524 67259240 68361362 69827985 71871323 72886136
3543G2886136P55459J587783Q52136M77918K21954m36960m85515r2224p48217
$$ 72886136 73641595 75229378 76081514 76559432 76781386 76344426 75858911 75766687 75018470
3534G5018470j217713j776433j497961j652156j671287k099558j593125j215402
$$ 75018470 73800757 72024324 70526363 68874207 67202920 65103362 63510237 62294835
3526F2294835j488803j487758j216295p07021j159744j343748p26867j040513
$$ 62294835 60806032 59318274 58101979 57394958 56235214 54891466 54164599 53124086
3518E3124086j484441k28279p11237j043273n32401j402448n44228k53800m46126
$$ 53124086 51639645 51411366 50700129 49656856 49124455 47722007 47177779 46923979 46477853
3509D6477853o67236j199385o99884k35784m2156m03344P0885J0589K19348M9791
$$ 46477853 45810617 44611232 43911348 43675564 43633408 43230064 43300949 43311538 43530886 43580677
3499D3580677K41583j24634l34779P00016J53528N52134P19853j25906K79594
$$ 43580677 43822260 43697626 43362847 44062863 44216391 44768525 45488378 45362472 45642066
3490D5642066J34129N10878K37207J46806j09459j88882j93541l48901J58143
$$ 45642066 45776195 46287073 46524280 46671086 46561627 46372745 46179204 45830303 45988446
3481D5988446r11599n92378J59574p44378q68706k26815k55473o43600k95965
$$ 45988446 45076847 44484469 44644043 43899665 43030959 42804144 42548671 41905071 41609106
3472D1609106l93024n9272j213656n89477K3563l66836n74802k00293L768o70085
$$ 41609106 41216082 41156810 39943154 39353677 39377240 39010404 38435602 38235309 38239077 37568992
3462C7568992j318318j10549P6365l11909m09455J68466p58231p13030r511o20314
$$ 37568992 36250674 36140125 36216490 35904581 35495126 35663592 34905361 34192331 34182820 33562506
3452C3562506K12599J15881L09372N36530l3521K31226O25732J94265M83200R0738
$$ 33562506 33775105 33890986 34200358 34736888 34703367 34934593 35560325 35754590 36237790 36328528
3442C6328528l27649m93755J00860R72547k30654Q4902J36262l89571L8698k54839
$$ 36328528 36000879 35507124 35607984 36580531 36349877 36434779 36571041 36181470 36220168 35965329
3432C5965329J89137J42236n22618q56189j39722L1664P2428m95658M22375K36413
$$ 35965329 36154466 36296702 35774084 34917895 34778173 34809837 34882265 34386607 34808982 35045395
3422C5045395m67978o85527m12183q21019K60417M9374M25066N54288O73622k36615
$$ 35045395 34577417 33891890 33479707 32658688 32919105 32968479 33393545 33947833 34621455 34384840
3412C4384840p95873O36373R61768k72234L12684J26060P870m91901m00001L10447
$$ 34384840 33588967 34225340 35187108 34914874 35227558 35353618 35361488 34869587 34469586 34780033
3402C4780033m6550L89411L76648M15298M2424M64352j04262L54619L38554J02589
$$ 34780033 34733483 35122894 35499542 35914840 35957264 36421616 36317354 36671973 37010527 37113116
3392C7113116Q16857N41127J144287J045362K31059O55542N46352N62706L36218
$$ 37113116 37929973 38471100 39615387 40660749 40891808 41547350 42093702 42656408 42992626
3383D2992626Q88466J377782L17100K38192L35570O59810J151819J107308K89851
$$ 42992626 43881092 45258874 45575974 45814166 46149736 46809546 47961365 49068673 49358524
3374D9358524J75904J482204J253539R14869M54622N59582M79947J179717J379988
$$ 49358524 49534428 51016632 52270171 53185040 53639662 54199244 54679191 55858908 57238896
3365E7238896J139328J381153J644706J463460J169146J311567J499370J698866
$$ 57238896 58378224 59759377 61404083 62867543 64036689 65348256 66847626 68546492
3357F8546492J085258J342390R79328J832688J258803J486365J570670J082833
$$ 68546492 69631750 70974140 71953468 73786156 75044959 76531324 78101994 79184827
3349G9184827J780015J047320K120639J839784J866105J783504J179123J416451
$$ 79184827 80964842 82012162 84132801 85972585 87838690 89622194 90801317 92217768
3341I2217768J465824J800663K065285J387810K064468K456015K167977K468007
$$ 92217768 93683592 95484255 97549540 98937350 101001818 103457833 105625810 108093817
3333A08093817K452507K542104K503033K489066K851598K715740K429165L057399
$$ 108093817 110546324 113088428 115591461 118080527 120932125 123647865 126077030 129134429
3325A29134429K931714K847167K566677K704244L492621L042697K025825K603369
$$ 129134429 132066143 134913310 137479987 140184231 143676852 146719549 148745374 151348743
3317A51348743L288212K289799K777495K538615K230214J766633N64178J96820
$$ 151348743 154636955 156926754 159704249 162242864 164473078 166239711 166803889 167000709
3309A67000709Q66527O9019r24533j097052j731626j591291j863046k292255j792449
$$ 167000709 167867236 167936255 167011722 165914670 164183044 162591753 160728707 158436452 156644003
3300A56644003j785577j894658k343945k138147k524489k544801k737520l428587
$$ 156644003 154858426 152963768 150619823 148481676 145957187 143412386 140674866 137246279
3292A37246279l098929l484550l238151k371040l280420l064440l042004l291231
$$ 137246279 134147350 130662800 127424649 125053609 121773189 118708749 115666745 112375514
3284A12375514k381293j744603j499849j309574j545132j565575m93242p15690
$$ 112375514 109994221 108249618 106749769 105440195 103895063 102329488 101836246 101120556
3276A01120556j39576n48948p82378l81522m86668l64216q23824n95657J01344
$$ 101120556 100980980 100432032 99649654 99268132 98781464 98417248 97593424 96997767 97099111
3267I7099111J02032J85204o64145j71033R76660O13605L60995K99379O61773
$$ 97099111 97201143 97386347 96722202 96551169 97527829 98141434 98502429 98801808 99463581
3258I9463581R82254R25889K04367l93912K91451M36311n7785L00908J043570
$$ 99463581 100445835 101371724 101576091 101182179 101473630 101909941 101852156 102153064 103196634
3249A03196634J012258R33325J464463J062723J445260K199681K406428J932623
$$ 103196634 104208892 105142217 106606680 107669403 109114663 111314344 113720772 115653395
3241A15653395J196233k67697j765724l007275k319432k646962k040377j943620
$$ 115653395 116849628 116581931 114816207 111808932 109489500 106842538 104802161 102858541
3233A02858541k319540j600202j653453j289454j233804q80401l10436N12569
$$ 102858541 100539001 98938799 97285346 95995892 94762088 93881687 93571251 94083820
3225I4083820q36384j759802k744992k876093k600532k123323j281371j651272
$$ 94083820 93247436 91487634 88742642 85866549 83266017 81142694 79861323 78210051
3217G8210051j859702j016977j064986j240268q18216o69065o04583j120517r7168
$$ 78210051 76350349 75333372 74268386 73028118 72209902 71540837 70936254 69815737 69718569
3208F9718569k31007j181398r13940o40763O70775j31259l68425J90327P17054
$$ 69718569 69487562 68306164 67392224 66751461 67422236 67290977 66922552 67112879 67829933
3199F7829933L77486l09272M28226J17615R30583K91073O02067N87444k35491
$$ 67829933 68207419 67898147 68326373 68443988 69374571 69665644 70267711 70855155 70619664
3190G0619664J91451m15114K38021N47731P04778L99951O24521L10292Q14204
$$ 70619664 70811115 70396001 70634022 71181753 71886531 72286482 72911003 73221295 74035499
3181G4035499Q2156R99236K40468L64314j06486J01995Q29779K73534N19095N50132
$$ 74035499 74117655 75116891 75357359 75721673 75615187 75717182 76546961 76820495 77339590 77889722
3171G7889722O24792P30102R69759R63499N59788J102434R83709P25042M57271
$$ 77889722 78514514 79244616 80214375 81177874 81737662 82840096 83823805 84548847 85006118
3162H5006118N12374J256539N51620N75236R46488K06829j18774j89137m31669
$$ 85006118 85518492 86775031 87326651 87901887 88848375 89055204 88936430 88747293 88315624
3153H8315624j49369j07172r09923j380706r77797j256852j451880j149044j071914
$$ 88315624 88166255 88059083 87149160 85768454 84790657 83533805 82081925 80932881 79860967
3144G9860967j373418j108324j433529j378204j376176j245109j743986j551739
$$ 79860967 78487549 77379225 75945696 74567492 73191316 71946207 70202221 68650482
3136F8650482k326996j643541j952250k354363j755814k128464j549150j668982
$$ 68650482 66323486 64679945 62727695 60373332 58617518 56489054 54939904 53270922
3128E3270922j696163j377020j467397r66315j790103r25337q53892j030199r39253
$$ 53270922 51574759 50197739 48730342 47764027 45973924 45048587 44194695 43164496 42225243
3119D2225243q50379r7838l50025r19172r6709p40715p38117n79944j92290m02769
$$ 42225243 41374864 41277026 40927001 40007829 39911120 39170405 38432288 37852344 37660054 37257285
3109C7257285p146q47228j23898k71787m19145Q014r93237k22799k6404l96047
$$ 37257285 37250139 36402911 36279013 36007226 35588081 35596095 34602858 34380059 34353655 33957608
3099C3957608o36913l96727k20665k44326p05321J09742q984p15837j70889K37165
$$ 33957608 33320695 32923968 32703303 32458977 31753656 31863398 31854414 31138577 30967688 31204853
3089C1204853j89492k35224r6892k77572l46346L33591N19432j83564l50153p1158
$$ 31204853 31015361 30780137 30683245 30405673 30059327 30392918 30912350 30728786 30378633 30307475
3079C0307475j71303j55903n07677q08563m50581q33272n70190o28809m25349
$$ 30307475 30136172 29980269 29472592 28664029 28213448 27380176 26809986 26181177 25755828
3070B5755828J2910o31086n97174n13285k13527j95670J74811k6023j28439k4251
$$ 25755828 25768738 25137652 24540478 24027193 23813666 23617996 23792807 23766784 23638345 23614094
3060B3614094o55377n66956k66249m89709K43592R20300L11456j36677p07236
$$ 23614094 22958717 22391761 22125512 21635803 21879395 22799695 23111151 22974474 22267238
3051B2267238p47152J58479R7312J42002k79733j48586L72802m55059Q094K30152
$$ 22267238 21520086 21678565 21775877 21917879 21638146 21489560 21862362 21407303 21415397 21645549
3041B1645549q06753L59506l48234l84679L6489k58156m94580L25648J19053l77266
$$ 21645549 20838796 21198302 20850068 20465389 20501878 20243722 19749142 20074790 20193843 19816577
3031A9816577m08089m83435k69149k13738R93558j70915k09992J83358M49806
$$ 19816577 19408488 18925053 18655904 18442166 19435724 19264809 19054817 19238175 19687981
3022A9687981k98375k27855L15405n0413m7573l08724L75639L75825l96461p8332
$$ 19687981 19389606 19161751 19477156 19426743 19379170 19070446 19446085 19821910 19425449 19347117
3012A9347117M03145l68924K7921K04155P18105r7316K21739n65768M20532K05297
$$ 19347117 19750262 19381338 19409259 19613414 20331519 20234203 20455942 19890174 20310706 20516003
3002B0516003M70110N09491Q7809K87202K74851J26870o4219Q58288L12852k4987
$$ 20516003 20986113 21495604 21583413 21870615 22145466 22272336 22208117 23066405 23379257 23354270
2992B3354270N582M18361o0667L36606M54474N47361J08008J08245M99776L44593
$$ 23354270 23359852 23778213 23717546 24054152 24508626 25055987 25163995 25272240 25772016 26116609
2982B6116609N10877K78466K55484P61674Q19294j28109M20253J195770J082191
$$ 26116609 26627486 26905952 27161436 27923110 28742404 28614295 29034548 30230318 31312509
2973C1312509M7070L83868P88155J093358M32753Q75857N52031N95843J552361
$$ 31312509 31359579 31743447 32531602 33624960 34057713 34933570 35485601 36081444 37633805
2964C7633805O69155J502790J388535J007044J297787J610687J666403J966236
$$ 37633805 38302960 39805750 41194285 42201329 43499116 45109803 46776206 48742442
2956D8742442J485564J671870K189197J473583J046014J999585K179178K027253
$$ 48742442 50228006 51899876 54089073 55562656 56608670 58608255 60787433 62814686
2948F2814686K313347K802153L031385K667369K213072J975583J148527J390945
$$ 62814686 65128033 67930186 70961571 73628940 75842012 77817595 78966122 80357067
2940H0357067J409205J880172J595266Q87521J565924K499179J995135K492094
$$ 80357067 81766272 83646444 85241710 86129231 87695155 90194334 92189469 94681563
2932I4681563L550641L904354M361849M099625M237604M888153M578914M512692
$$ 94681563 98232204 102136558 106498407 110598032 114835636 119723789 124302703 128815395
2924A28815395M692088N008675M891537N179539M935754N305470M556123N405790
$$ 128815395 133507483 138516158 143407695 148587234 153522988 158828458 163384581 168790371
2916A68790371N413212M405522M428920M441842M252313L805040M111944M407884
$$ 168790371 174203583 178609105 183038025 187479867 191732180 195537220 199649164 204057048
2908B04057048L878363M718072N230824P035662P392149Q429108J0353211J1086345
$$ 204057048 207935411 212653483 217884307 224919969 232312118 240741226 251094437 262180782
2900B62180782J0877907R051445P284656M460968K020893k62720m34066O83597
$$ 262180782 273058689 282110134 289394790 293855758 295876651 295613931 295179865 295863462
2892B95863462J406919L722994N440978O083515N650652J972635k868453q326784
$$ 295863462 297270381 300993375 306434353 312517868 318168520 320141155 317272702 308945918
2884C08945918j2775944j5249407j6867929j6265438j5446465j3607811j1862608
$$ 308945918 296169974 280920567 264052638 247787200 232340735 218732924 206870316
2877B06870316j1238709r841358q768099q292130q425163o828544o651756o466056
$$ 206870316 195631607 185790249 177022150 168730020 160304857 153476313 146824557 140358501
2869A40358501n575831m555877l992973l372655l250444k753877k705715k371596
$$ 140358501 134782670 130226793 126233820 122861165 119610721 116856844 114151129 111779533
2861A11779533j956944j945368j124779r57121j231056j211622o72362m41575
$$ 111779533 109822589 107877221 106752442 105795321 104564265 103352643 102680281 102238706
2853A02238706j610678q08069p97266j206072j584785j642830j812890j592391
$$ 102238706 100628028 99819959 99022693 97816621 96231836 94589006 92776116 91183725
2845I1183725j698052k024856j610236j782424k493483l305651l067094k246882
$$ 91183725 89485673 87460817 85850581 84068157 81574674 78269023 75201929 72955047
2837G2955047k133144j758803j790959j867899j589452j617874j730603j795058
$$ 72955047 70821903 69063100 67272141 65404242 63814790 62196916 60466313 58671255
2829E8671255k286294k331133k329976j595339k399773j827897k004296j862489
$$ 58671255 56384961 54053828 51723852 50128513 47728740 45900843 43896547 42034058
2821D2034058j665834j665439j585658j458777j189302j526241p89766j091922
$$ 42034058 40368224 38702785 37117127 35658350 34469048 32942807 32153041 31061119
2813C1061119p88368p31588j464781m94198j41309m68754j129823n10208j62334
$$ 31061119 30272751 29541163 28076382 27582184 27440875 26972121 25842298 25332090 25169756
2804B5169756j10825o91955j153869m52930p24212l51695n54169o23057q39480
$$ 25169756 25058931 24366976 23213107 22760177 22035965 21684270 21130101 20507044 19667564
2795A9667564k59462K9369m87353o01529n85120j35511M6049m6373n04543l60946
$$ 19667564 19408102 19437471 18950118 18348589 17763469 17627958 17674007 17627634 17123091 16762145
2785A6762145m3339Q72j166135p55015j06005K19874k69171k24298l0333m03111
$$ 16762145 16718806 16719678 15553543 14798528 14692523 14912397 14643226 14418928 14388595 13985484
2775A3985484K10210o73933n05953r86994J152789j25375p73159n59572L97756
$$ 13985484 14195694 13521761 13015808 12028814 13181603 13056228 12283069 11723497 12121253
2766A2121253m06779L37498o7585n60040j77891k85573n25137L12641k20858l30068
$$ 12121253 11714474 12051972 11984387 11424347 11246456 10960883 10435746 10748387 10527529 10197461
2756A0197461M3216k23102k77718N25702m14765J10097n7606o98673j58509k74982
$$ 10197461 10240677 10017575 9739857 10265559 9850794 9960891 9903285 9204612 9046103 8771121
2746H771121M81990l96551j8665j93724m4032K42993J18438l02405p345j52617
$$ 8771121 9253111 8856560 8837895 8644171 8600139 8843132 8961570 8659165 8651820 8499203
2736H499203p08739l92052J299796K74574n7372o19971l23375m04061J53071J75876
$$ 8499203 7790464 7398412 8698208 8972782 8915410 8295439 7972064 7568003 7721074 7896950
2726G896950j67515k49596J60546k49496L31901J51220k62106j69497o25515l2951
$$ 7896950 7729435 7479839 7640385 7390889 7722790 7874010 7611904 7442407 6816892 6783941
2716F783941j80291n69792k58431J118510O2424p78750o9426K18428L01669j37206
$$ 6783941 6603650 6033858 5775427 6893937 6956361 6177611 6108185 6326613 6628282 6491076
2706F491076J05037J085018j84243K27613l30309l85630k37805K31602l54384
$$ 6491076 6596113 7681131 7496888 7724501 7394192 7008562 6770757 7002359 6647975
2697F647975k77275o08112m64689j9290m207P49738k87966l88404k49124O52674
$$ 6647975 6370700 5762588 5297899 5278609 5274402 6024140 5736174 5347770 5098646 5751320
2687E751320N774l52912k55016j85246J09006j93140L73463m6593m63723L49254
$$ 5751320 5757094 5404182 5149166 4963920 5072926 4879786 5253249 5206656 4742933 5092187
2677E092187K02411l53599n11008L26457L07900j20931o98974j07399j22222o8853
$$ 5092187 5294598 4940999 4429991 4756448 5064348 4943417 4244443 4137044 4014822 3945969
2667C945969K0904J64044J73054K48976k02230k49560l15896l53818K59894N92679
$$ 3945969 3966873 4130917 4303971 4552947 4350717 4101157 3785261 3431443 3691337 4284016
2657D284016m3585m02825m73548P4942O7458K77497L34686k36414M852k67523
$$ 4284016 4240431 3837606 3364058 3439000 3506458 3783955 4118641 3882227 3887079 3619556
2647C619556M9543L55416j05949j11223l72097K37156L08599K53443o10652K33162
$$ 3619556 3669099 4024515 3918566 3807343 3435246 3672402 3981001 4234444 3623792 3856954
2637C856954j23797j27547j22326L25735L44408L53196n21551l50595K2977j82082
$$ 3856954 3733157 3605610 3483284 3809019 4153427 4506623 3985072 3634477 3657454 3475372
2627C475372N93529n27315k44013o6648J76916J71979J641L47182j16681m30547
$$ 3475372 4068901 3541586 3297573 3230925 3407841 3579820 3581461 3928643 3811962 3381415
2617C381415K80557M66467M18866j84978j60406o18411N1280j23437K91785P2699
$$ 3381415 3661972 4128439 4547305 4362327 4201921 3583510 3634790 3511353 3803138 3875837
2607C875837j04568j30585K98141L40772p39522k66273N37309n30459M91993j26230
$$ 3875837 3771269 3640684 3938825 4279597 3540075 3273802 3811111 3280652 3772645 3646415
2597C646415q77413J88255M89032R4104j05815k02621l52930K2566J18544O9375
$$ 3646415 2769002 2957257 3446289 3540393 3434578 3231957 2879027 2901593 3020137 3089512
2587C089512k59802n16685K21285k10665o411K62287O45075l04845m8755K4572
$$ 3089512 2829710 2313025 2534310 2323645 2317234 2579521 3224596 2919751 2870996 2895568
2577B895568m70471k33198j65393L09822J98622M9695k83474K86376r0713l19357
$$ 2895568 2425097 2191899 2026506 2336328 2534950 2584645 2301171 2587547 2496834 2177477
2567B177477J16669N8797L06671r2663l41763j76548N57613j4978j9459l00203
$$ 2177477 2294146 2352943 2659614 2566951 2225188 2048640 2606253 2591275 2571816 2271613
2557B271613N71338l34514l08103j9936K20372l34762l67198P68400K11709n93629
$$ 2271613 2842951 2508437 2200334 2180398 2400770 2066008 1698810 2467210 2678919 2085290
2547B085290j67167L17974j69310K83823l69311O9065N137j39094m84705J75894
$$ 2085290 1918123 2236097 2066787 2350610 1981299 2050364 2055501 1916407 1431702 1607596
2537A607596j6875O06703K41835k75145o60798L15454M116j49858M4586Q4722
$$ 1607596 1590721 2197424 2439259 2164114 1503316 1818770 1822886 1673028 1717614 1802336
2527A802336J97314k8859j60536L9519m9928k55897k42439k45286L3838N62837
$$ 1802336 1999650 1970791 1810255 1849774 1799846 1543949 1301510 1056224 1090062 1652899
2517A652899J96209j42516j57160n9021j49780j13312J0465M90372m86184k09207
$$ 1652899 1849108 1706592 1549432 1490411 1340631 1227319 1237784 1728156 1241972 1032765
2507A032765O8890J97649k92788p712o0570k47974k079J12431J99293k61212N4627
$$ 1032765 1101655 1299304 1006516 998804 938234 690260 688181 800612 999905 738693 793320
2496G93320M31353m2259K09743n26632K68833N50557j36104n88937J95756L95346
$$ 793320 1224673 1182414 1392157 865525 1134358 1684915 1548811 959874 1155630 1550976
2486A550976q8102K7043J22818K91532n81469k563m16644K63110K83389J19425
$$ 1550976 1462874 1489917 1612735 1904267 1322798 1320235 903591 1166701 1450090 1569515
2476A569515l37663L23887J89360l3465N9116M94861p32900j17436p0252o8080
$$ 1569515 1231852 1555739 1745099 1711634 1770750 2265611 1532711 1415275 1345023 1276943
2466A276943K46327k97956K80253M2766R6744m59271n2925K75946k8107K13920
$$ 1276943 1523270 1225314 1505567 1548333 1645077 1185806 1132881 1408827 1380720 1594640
2456A594640k55871o4117O07374O6733o90063K19459j52257k264j03800l51723
$$ 1594640 1338769 1274652 1882026 1948759 1258696 1478155 1325898 1323634 1219834 868111
2446H68111P1437P7666l68540m2567K56387N72454l36751K60480l01443j38711
$$ 868111 939548 1017214 648674 606107 862494 1434948 1098197 1358677 1057234 918523
2436I18523k10407M42280r9447j68939N835n61505j23081O26576L30867k454j98465
$$ 918523 708116 1150396 1050949 882010 887845 326340 203259 829835 1160702 1158248 959783
2425I59783k15223J40977m50173l97069l15372M49639P8963Q51111k18011L76314
$$ 959783 744560 885537 435364 38295 -277077 172562 251525 1102636 884625 1260939
2415A260939k53114O4930j71997k58569k50275J35302L91684n18498j70076R11156
$$ 1260939 1007825 1072755 900758 642189 391914 527216 918900 400402 230326 1141482
2405A141482n45569Q5433n2305j65921J78170k28223Q5889p2770Q5749N68319
$$ 1141482 595913 681346 629041 463120 641290 413067 498956 426186 511935 1080254
2395A080254l96931R91j19152k34371L39536k23523K58020k88207M37473K99376
$$ 1080254 683323 684314 565162 330791 670327 446804 704824 416617 854090 1153466
2385A153466m45513J51251j55917q8273K27133K3764j27388L01980K86897k61142
$$ 1153466 707953 859204 703287 615014 842147 865911 738523 1040503 1327400 1066258
2375A066258r9013j65431J05172N72129k63043j99749K54695l53372K2864k70134
$$ 1066258 967245 801814 906986 1479115 1216072 1016323 1271018 917646 940510 670376
2365F70376J43342O86660m0209k50973L6183m56692j2862n1918J61020J90206
$$ 670376 813718 1500378 1460169 1209196 1245379 788687 775825 723907 884927 1075133
2355A075133K43767k71290l2149p0266n04844O08944N4985m31244k52902M62123
$$ 1075133 1318900 1047610 1015461 945195 440351 1049295 1104280 673036 420134 882257
2345H82257j05930N2280K10538k24183J25631m44816J1591M50992M2155l76085
$$ 882257 776327 828607 1039145 814962 940593 495777 507368 958360 1000515 624430
2335F24430M20576l11201K14697k44023N08420r9886l15072M9783m72602l05321
$$ 624430 1045006 733805 948502 704479 1212899 1113013 797941 847724 375122 69801
2325F9801K29449N9558K98427j33409m43786J2385M42136K83594L25871r8976
$$ 69801 299250 358808 657235 523826 80040 92425 534561 818155 1144026 1045050
2315A045050k76594p9993l5591M3655L52991J15366n54529m6775K18724k3255
$$ 1045050 768456 688463 652872 696527 1049518 1164884 610355 563580 782304 759049
2305G59049j65315l00791K37401Q3251J97071k89871m36499R16162n97636K88144
$$ 759049 593734 292943 530344 613595 810666 520795 84296 1000458 402822 690966
2295F90966M62952J68091O0612K35153p44149k07485L004L10217n30448m9757
$$ 690966 1153918 1322009 1382621 1617774 873625 666140 669144 979361 448913 399156
2285C99156M80926k91344M7001m84902N47467O2835j42438K78720j73435j03709
$$ 399156 880082 588738 635739 150837 698304 761139 618701 897421 723986 620277
2275F20277k26648J98228L51146J79248k97978J04201K02756K58843k33998J54591
$$ 620277 393629 591857 943003 1122251 824273 928474 1131230 1390073 1156075 1310666
2265A310666n85002M9295q3298K04274K26837m15963l16847Q6730J95747k56826
$$ 1310666 725664 774959 691661 895935 1122772 706809 389962 476692 672439 415613
2255D15613Q6030K42640M83474j25236J47270K87747j44019l55576R7897J33209
$$ 415613 501643 744283 1227757 1102521 1249791 1537538 1393519 1037943 1135840 1269049
2245A269049o50491K14255M72434l0825k54934m30464J07066K20589j90475N06986
$$ 1269049 618558 832813 1305247 1274422 1019488 589024 696090 916679 726204 1233190
2235A233190L16782J22215m56250J18453K51748L59269k66887m24356l76004n87266
$$ 1233190 1549972 1672187 1215937 1334390 1586138 1945407 1678520 1254164 878160 290894
2225B90894R5762L30313N51403j7280j239L01092K67558n12435o30096l3918M8247
$$ 290894 386656 716969 1268372 1251092 1249853 1550945 1818503 1306068 675972 642054 690301
2214F90301R9814L55948j8549L04726J4810K39198M5153l34931p96122M68114
$$ 690301 790115 1146063 1127514 1432240 1447050 1686248 1731401 1396470 600348 1068462
2204A068462L46114j02121r9830L43751o8961m23433o46997O04344N63949L53506
$$ 1068462 1414576 1312455 1212625 1556376 1487415 1063982 416985 1021329 1585278 1938784
2194A938784N12808l37395k02641n47113q6537R55621M0901q4763R4630L33267
$$ 1938784 2451592 2114197 1911556 1364443 1277906 2233527 2274428 2189665 2284295 2617562
2184B617562p85714j09732N727P72123p5196j20721K7391n12741q4732M45206
$$ 2617562 1831848 1722116 1727843 2499966 2424770 2304049 2331440 1818699 1733967 2179173
2174B179173J2741k3536O11401k73573J254O1593k58984J67743J63150j07045
$$ 2179173 2191914 2168378 2779779 2506206 2507460 2569053 2310069 2477812 2640962 2533917
2164B533917L71232J94153K5323k00581r5622k71888J70378O87313M90330K50469
$$ 2533917 2905149 3099302 3124625 2924044 2828422 2556534 2726912 3414225 3904555 4155024
2154D155024k11421q80523R88628K50509J58201K81100L55153J27254l65989j15776
$$ 4155024 3943603 3063080 4051708 4302217 4460418 4741518 5096671 5223925 4857936 4742160
2144D742160J4209M63500l43447M63565M79653j60653M4242M93061L43114L25157
$$ 4742160 4756369 5219869 4876422 5339987 5819640 5658987 5703229 6196290 6539404 6864561
2134F864561K82698k8053M7155N68348R05024J08748M88400O86636L26360Q21436
$$ 6864561 7147259 7119206 7166361 7734709 8639733 8748481 9236881 9923517 10249877 11071313
2124A1071313M02210K28669R61643P67332N59984J118321R47690J476495K340080
$$ 11071313 11473523 11702192 12663835 13431167 13991151 15109472 16057162 17533657 19873737
2115A9873737J996622J377741P49454J151777K465061L037038L758570N181210
$$ 19873737 21870359 23248100 23997554 25149331 27614392 30651430 34410000 39591210
2107C9591210O596183Q020208J0790504J5081573K2915634L3439283L2546761
$$ 39591210 46187393 54207601 64998105 80079678 102995312 136434595 168981356
2100A68981356J0628979k6289394m0349841l0438161j9191488j2824011q481199
$$ 168981356 179610335 153320941 112971100 82532939 63341451 50517440 42036241
2093D2036241o354534m398915l649104k294759j838365j925723j126353k73639
$$ 42036241 35681707 31282792 27633688 25338929 23500564 21574841 20448488 20174849
2085B0174849k18210j515932k105498j022431j194352j359394n53135p31176l38814
$$ 20174849 19956639 18440707 16335209 15312778 14118426 12759032 12205897 11474721 11135907
2076A1135907n84581o63098n45295J09972J28251r2994j054024m36621p11247
$$ 11135907 10551326 9888228 9342933 9452905 9581156 9488162 8434138 7997517 7286270
2067G286270q44343j22034J06964j65463L25515k1070l13998l51529p34657K87663
$$ 7286270 6441927 6319893 6426857 6261394 6586909 6565839 6251841 5900312 5165655 5453318
2057E453318K2158j053810k77953k84319L19811o8773o8638L04954k13233n42129
$$ 5453318 5475476 4421666 4143713 3859394 4179205 4110432 4041794 4346748 4133515 3591386
2047C591386K4099p274j51400K13362l54608K72418r4639m55896j19197L61123
$$ 3591386 3615485 3608211 3456811 3670173 3315565 3587983 3493344 3037448 2918251 3279374
2037C279374l03724O6646m8858n49506J50058k41897L17051K3942r5254m14351
$$ 3279374 2975650 3042296 2993438 2443932 2593990 2352093 2669144 2693086 2597832 2183481
2027B183481L7502j27823L03012j3975m04857j30513J56813k32149K31288j78335
$$ 2183481 2220983 2093160 2396172 2382197 1977340 1846827 2003640 1771491 2002779 1824444
2017A824444M90285j87076q3747l98694l74531M50406k13122J37487K09762m14378
$$ 1824444 2314729 2127653 2043906 1645212 1270681 1721087 1507965 1645452 1855214 1440836
2007A440836l48496J10175L19490R8591n1521j67899q6585R8058o2827J01405
$$ 1440836 1092340 1202515 1522005 1620596 1569075 1401176 1314591 1412649 1349822 1451227
1997A451227m25559J72741n0470O51j43808l66365J32107R8641K06044P0011J41031
$$ 1451227 1025668 1198409 1147939 1148590 1004782 638417 770524 869165 1075209 1145220 1286251
1986A286251q5782k8323M1132j27927k97657L43581M8508q92775M09420L93046
$$ 1286251 1200469 1172146 1213278 1085351 787694 1131275 1179783 287008 696428 1089474
1976A089474j38532J93535L91788o57838p05245l95471O85578N98989O9387o2221
$$ 1089474 950942 1144477 1536265 878427 173182 -222289 463289 1062278 1131665 1069444
1966A069444j36440K4053K17612o07034k39475O321N15054L8747n41204P3343
$$ 1069444 933004 957057 1174669 567635 328160 334481 849535 888282 347078 420421
1956D20421q3230k38175L5718J96294R5012m1737P2918K59250o0424l06937K70678
$$ 420421 337191 99016 134734 331028 426040 384303 457221 716471 656047 349110 619788
1945F19788L71065K58407J04807j93669m04774K07230j96828m78423P9050M28299
$$ 619788 990853 1249260 1354067 1160398 755624 962854 766026 287603 366653 794952
1935G94952K50991l60150o4682k66444J40337q3165l22106j51734L50315P23771
$$ 794952 1045943 685793 621111 354667 495004 411839 89733 -62001 288314 1012085
1925A012085K3430o77084J03912j72903K97551L55227l40300l40085m9647K58388
$$ 1012085 1035515 358431 462343 289440 586991 942218 601918 261833 212186 470574
1915D70574J25399P6671N21991p70789l64811J49492m15442M08889j72508M05490
$$ 470574 595973 672644 1194635 423846 59035 208527 -206915 201974 29466 434956
1905D34956O30907r1890j73628L80380j10348J04253J32594m67836m14024k39304
$$ 434956 1065863 973973 800345 1180725 1070377 1174630 1307224 839388 425364 186060
1895A86060M62548J08730j51499m32417j06850Q30368K82059n37041l65137N74123
$$ 186060 648608 757338 605839 173422 66572 896940 1178999 641958 276821 850944
1885H50944m63187j19326K12224J06516J20172m07621k33954P08062k71932l09084
$$ 850944 387757 268431 480655 587171 707343 299722 65768 773830 501898 192814
1875A92814o6141m58080N46371j63123J75501J99546K03145R9331m8253o66920
$$ 192814 126673 -331407 214964 51841 227342 426888 630033 729364 681111 14191
1865A4191M22816K64771o0920J40262J20143l42631k72299j33167K56900o8146
$$ 14191 437007 701778 640858 781120 901263 558632 286333 153166 410066 341920
1855C41920j96657j21872j65162J43891J64804M69440l95009o1181N13093L82233
$$ 341920 145263 23391 -141771 2120 166924 636364 241355 180174 693267 1075500
1845A075500k61144o09029K89822L42675m82964O48798r1384J31929k14206k19246
$$ 1075500 814356 205327 495149 837824 354860 1003658 912274 1044203 829997 610751
1835F10751M35872J20861l02622J11536l5631j2880j12554m29793l33174j96448
$$ 610751 1046623 1167484 864862 976398 940767 927887 815333 385540 52366 -144082
1825a44082o8302J97888L93197p4474R4612R7491M79099L7560n67227j46961o1656
$$ -144082 -212384 -14496 378701 304227 398839 496330 975429 1012989 445762 298801 237145
1814B37145J0540N17257n52077n12650N58923j02857k7040L39426O3757N4947
$$ 237145 247685 764942 212865 -299785 259138 156281 129241 468667 532424 587371
1804E87371J01723J38708k67625j40031M0193L28886m77860l95012K40512L29686
$$ 587371 689094 827802 560177 420146 460339 789225 311365 -83647 156865 486551
1794D86551R1553m89524K36301N0399l14648M12532k12458k31394L82786m8818
$$ 486551 578104 88580 324881 375280 60632 473164 260706 29312 412098 363280
1784C63280j71164L5113m49112l14539K98624o4433L48721K78289p476L5285J01595
$$ 363280 192116 227229 -221883 -536422 -237798 -302231 46490 324779 317303 352588 454183
1773D54183M26354K65314k95729J8313l45405n8677J72085K90237k13334l28524
$$ 454183 880537 1145851 850122 868435 523030 464353 636438 926675 713341 384817
1763C84817l17539L08669M58381k09439j75873J46702O78369l19616j27890l79498
$$ 384817 67278 375947 834328 624889 449016 595718 1274087 954471 826581 447083
1753D47083N0215o83574K56438J3290j15521K40721J39869k62605K33829j7065
$$ 447083 497298 -186276 70162 83452 -32069 208652 348521 85916 319745 302680
1743C02680l06824Q7375k68421K07672K07404o8831K59230L0846j26661J76986
$$ 302680 -4144 83231 -185190 22482 229886 161055 420285 451131 324470 501456
1733E01456j81486N9464q7132K48262K9072k50644j92371l32306P06367k53473
$$ 501456 319970 379434 292302 540564 569636 318992 126621 -205685 500682 247209
1723B47209j54655K88284m52486J80071j88148M43987Q7493l26670k1682n1946
$$ 247209 92554 380838 -71648 108423 -79725 364262 451755 125085 103403 51457
1713E1457N0551N48363j79743j68147K25521k57202K72769j37121k07814L86258
$$ 51457 102008 650371 470628 302481 528002 270800 543569 406448 198634 584892
1703E84892L31976k67794o82743k0174Q8634N13052k07429m1336K18729J23809
$$ 584892 916868 649074 -33669 -53843 34791 547843 340414 299078 517807 641616
1693F41616j64684j32435m75451r66544K15523O72203L07248L24974m02860n25888
$$ 641616 476932 344497 -130954 -1097498 -881975 -209772 97476 422450 19590 -506298
1683e06298L87866j25203Q8753Q93239k93417o90987J14911Q15781n4318q72622
$$ -506298 -118432 -243635 -154882 738357 444940 -246047 -131136 684645 630327 -242295
1673b42295N97790M92605k77416j91099j15431p82087L33447O90611J29594n19959
$$ -242295 355495 848100 570684 379585 264154 -517933 -184486 506125 635719 115760
1663A15760p90480R8237k64055L3850K61653L29177k57625l00565K81544L46120
$$ 115760 -674720 -576483 -840538 -806688 -545035 -215858 -473483 -774048 -492504 -146384
1653a46384J77139k90498l32591P95971L07075J70315Q5077p07431m06447K61989
$$ -146384 30755 -259743 -592334 203637 510712 681027 766104 58673 -347774 -85785
1643h5785k79975M16399J45369k10154K09923L3545k44266N45195P0673p04046
$$ -85785 -365760 50639 196008 -14146 195777 229322 -14944 530251 600924 -103122
1633a03122j33008J6025l40596J66687L72964J86804o9170K13755k77670m43332
$$ -103122 -236130 -220105 -560701 -394014 -21050 165754 96584 310339 32669 -410663
1623d10663M28466O0670J86339p08896m6773R6540p7283j47446M37864L20805
$$ -410663 17803 78473 264812 -444084 -490857 -394317 -471600 -619046 -181182 139623
1613A39623j83228l88748L57366Q33816j53594o87302m07647K31582M43815m58889
$$ 139623 -43605 -432353 -74987 758829 605235 -82067 -489714 -258132 185683 -273206
1603b73206j95163L62542L97610J45123p3615k14719L00027J44035K5853p41250
$$ -273206 -468369 -105827 291783 436906 363291 148572 448599 592634 618487 -122763
1593a22763o5088j68677K31096O29605N09239o09952Q4293q27897l80730M61283
$$ -122763 -187851 -356528 -125432 504173 1013412 403460 487753 -340144 -720874 -259591
1583b59591n0906L88577j56410J07518o162N9863R5302j603j12473P1317k82664
$$ -259591 -310497 78080 -78330 29188 23026 82889 178191 176588 64115 135432 -147232
1572a47232L8544K16745n5000J71178j13655l75762M07636k35976k19938N8068
$$ -147232 -108688 108057 53057 224235 110580 -265182 142454 -93522 -313460 -255392
1562b55392K63419J84342o2379n43241O16851J44774j03784o99839l96228N54181
$$ -255392 8027 192369 129990 -413251 203600 348374 244590 -455249 -851477 -297296
1552b97296J77039Q1205N9822j802n0315M3845l06044K41659K58246j5782N9K67909
$$ -297296 -120257 -39052 20770 18968 -31347 12498 -293546 -51887 206359 190577 190636 458545
1540D58545o84367m14668L93200J69346J79808j65571j98636J25871M19891j14876
$$ 458545 -225822 -640490 -247290 -77944 101864 -63707 -262343 -136472 283419 168543
1530A68543k4210Q121K45619j72728l04940o8022J35085K50610j7910J17985K73935
$$ 168543 144333 152454 398073 225345 -79595 -147617 -12532 238078 220168 338153 612088
1519F12088k79765J83738r7034n25342L67651L82427j31210j26843J00241k59150
$$ 612088 332323 516061 419027 -106315 261336 643763 512553 385710 485951 226801
1509B26801l54628k85125k22466O00492M68841l83372o9209K76855k13120n8569
$$ 226801 -127827 -412952 -635418 -34926 433915 50543 -18666 258189 45069 -13500
1499a3500J22289J98341l65612p2959J98538j50081N44183P7483o09888J48432
$$ -13500 108789 307130 -58482 -131441 67097 -82984 461199 538682 -71206 77226
1489G7226o4049L35355J09140j80283l18915j25583K4498J01986J81817K48667
$$ 77226 13177 348532 457672 277389 -41526 -167109 -142611 -40625 141192 389859
1479C89859L15881k65355n89551j03663K43432K09019N27480M50427k17308n47768
$$ 389859 705740 440385 -149166 -252829 -9397 199622 727102 1177529 960221 412453
1469D12453k28984j60850J4169j27505L74126k33339K69210K04528L6938l03188
$$ 412453 183469 22619 36788 -90717 283409 50070 319280 523808 560746 257558
1459B57558j76071j56698J28561M57305k95243o42015P68892m21007m95339M26648
$$ 257558 81487 -75211 53350 510655 215412 -426603 342289 -78718 -574057 -147409
1449a47409K65972J57199k01525N939Q6919k59061M49212O42202l24955j86370
$$ -147409 118563 275762 74237 80176 167095 -91966 357246 999448 674493 488123
1439D88123J92823m55669l52988L03000r3209j18228R7893P63140j2190n86983
$$ 488123 680946 225277 -127711 175289 82080 -36148 61745 824885 812695 225712
1429B25712l64630K58837J63542J05806k6582k91758o1469l54455J10200N25982
$$ 225712 -138918 119919 283461 389267 362685 70927 9458 -344997 -234797 291185
1419B91185j12257o06872j62878J87024r0813K10511K76545j9336M86303j66966
$$ 291185 178928 -427944 -590822 -403798 -494611 -284100 -7555 -26891 459412 292446
1409B92446k23668o8406M68962k42815J49298j75401j54511K35377J391l98425
$$ 292446 68778 372 469334 226519 375817 200416 45905 281282 282673 -115752
1399a15752m13408K95651j92212L39050o6922o6135J82856r2113J91505k59884
$$ -115752 -529160 -233509 -425721 -86671 -153593 -219728 -36872 -128985 62520 -197364
1389a97364K13459Q5836M29172j58742k01358k16036m4091O29698j13791l3088
$$ -197364 16095 101931 531103 372361 171003 -45033 -89124 540574 426783 393695
1379C93695m48972K70708j91780M02095k68495J05089j63785L34283j27340l51776
$$ 393695 -55277 215431 23651 425746 157251 262340 98555 432838 305498 -46278
1369d6278l95670L11206L6799J16367q0674K73544q1797o64158O29078r2452K39585
$$ -46278 -441948 -130742 -93943 22424 -58250 215294 133497 -530661 98417 5965 245550
1358B45550l41028m10488L66113R3483k9006M20765Q6587k33483j80622P8506
$$ 245550 -95478 -505966 -139853 -46370 -75376 345389 431976 198493 17871 96377
1348I6377k20850p6154M4143k90029J37534L44994N81006m83018K92357o5380
$$ 96377 -124473 -200627 -156484 -446513 -308979 36015 617021 134003 426360 360980
1338C60980k24211l82369L7668J52313M0512j81311m4315N10092j6462q5217l47543
$$ 360980 136769 -245600 -207932 -55619 -15107 -196418 -240733 269359 252897 167680 -179863
1327a79863K27321O7032k44969M592Q2233R3364k5935k53657r9359J16648K56662
$$ -179863 47458 114490 -130479 -125887 -43654 49710 23775 -229882 -329241 -212593 44069
1316D4069p6082O63632k43360l86154k29510L08444N85162m05582q20888L38381
$$ 44069 -32013 631619 388259 2105 -227405 81039 666201 260619 -560269 -221888
1306b21888O52509o81309Q6092K21213l64804J4825m9594M33721K55423L88859
$$ -221888 430621 -250688 -164596 56617 -308187 -293362 -342956 90765 346188 735047
1296G35047K26440o18368q52602M40703K7785K25805o5353J81527J32289K6174
$$ 735047 961487 343119 -509483 -68780 -40995 184810 119457 300984 433273 459447
1286D59447K55004m48472O1372n14309l02679P8972p9359k33003N46688J74102
$$ 459447 714451 265979 327351 -186958 -489637 -410665 -490024 -723027 -176339 -2237
1276b237k53239O60735l93999j78966M93289m3664M09729M16763r82205l55152
$$ -2237 -255476 405259 11260 -167706 325583 281919 691648 1108411 126206 -228946
1266b28946J6337O00008k16018m22209J96606O98193j45560j89798j79237l69442
$$ -228946 -212609 387399 171381 -250828 -54222 643971 498411 308613 129376 -240066
1256b40066K51104K95403j14664J41086K46999l54719l13378M66402k27606j01324
$$ -240066 11038 306441 191777 332863 579862 225143 -88235 378167 150561 49237
1246D9237j68065K9721Q5919K45311L92542j20659p70297L78234K90473n92775
$$ 49237 -118828 -89107 -3188 242123 634665 514006 -256291 121943 412416 -180359
1236a80359l1492l2508j79327l65786O23599R7488M91961R8638P7807l74407l85833
$$ -180359 -211851 -244359 -423686 -789472 -165873 -68385 423576 522214 600021 225614 -160219
1225a60219J12666O5760L07382J41942R0920l3793k50474M44819j22463j15856
$$ -160219 -47553 18207 325589 467531 558451 524658 274184 719003 596540 480684
1215D80684k00608k30501J19124J90701k04129j69344o40249J09110O65760J67712
$$ 480684 280076 49575 168699 359400 155271 -14073 -654322 -545212 120548 288260
1205B88260q44566L95438R7644N1762j95557M37244K66837k25629n53523J89959
$$ 288260 -556306 -160868 -63224 -11462 -207019 230225 497062 271433 -282090 -92131
1195i2131Q5743j0870k10354M7803j31320p1259N31367j60160q4010J37795L80629
$$ -92131 -6388 -17258 -227612 -179809 -311129 -382388 148979 -11181 -95191 42604 423233
1184D23233N6058R2461l60578L41733k93452p58717j8426m5670K51197j9179K96322
$$ 423233 479291 571752 211174 552907 259455 -499262 -517688 -563358 -312161 -331340 -35018
1173c5018M18867k6754l89394l39080k12639k6182J37403L66274r3100O251J3832
$$ -35018 383849 357095 -32299 -371379 -584018 -610200 -472797 -106523 -199623 -193372 -179540
1162a79540L4016L57639Q1713J34510R150K19951j58084k88499k76032j25657
$$ -179540 -145524 212115 293828 428338 437488 657439 499355 210856 -65176 -190833
1152a90833j79449J57221k23504o7287R6063j9612K19401J46333K35445q8725
$$ -190833 -370282 -213061 -436565 -503852 -407789 -427401 -208000 -61667 173778 85053
1142H5053k68281J37126j91291L56730J89650j37552R0750m52477M3315K35582
$$ 85053 -183228 -46102 -237393 119337 308987 171435 262185 -190292 -146977 88605
1132H8605J98597L80235l26277m16961j93908j88339k49964O64334j02146J30596
$$ 88605 287202 667437 341160 -75801 -269709 -458048 -708012 -43678 -145824 -15228
1122a5228o4794R8307L88709K92948m54585o7470m2455k90628k16484L97982j66646
$$ -15228 -80022 18285 406994 699942 245357 177887 135432 -155196 -371680 26302 -140344
1111a40344k41697Q3835j84684M41197j65494k2790l30038k17120M63108P02493
$$ -140344 -382041 -298206 -482890 -41693 -207187 -229977 -560015 -777135 -314027 388466
1101C88466M99006j0500p2770m4035k81461k7576n56637k40407K04647Q3065l84594
$$ 388466 887472 876972 804202 760167 478706 451130 -105507 -345914 -141267 -58202 -442796
1090d42796L5341p4859R3621K22054k20360R31885K29920L6483j071090q0654
$$ -442796 -407455 -482314 -388693 -166639 -386999 544886 774806 811289 -259801 -340455
1080c40455j4787J15957l23495n9086K78270j27486M08329K39381M4063j61455
$$ -340455 -355242 -239285 -562780 -621866 -343596 -471082 -62753 176628 220691 59236
1070E9236L30172m09802l52523J59996n65035N42058J42135M01258j61651k85386
$$ 59236 389408 -20394 -372917 -212921 -777956 -235898 -93763 307495 145844 -139542
1060a39542J46879J32205r1599O2134P333L26246K04000k79968m80661m20485
$$ -139542 7337 139542 47943 110077 117410 443656 647656 367688 -112973 -533458
1050e33458M82837m12031k36601L8016L15693r0393k14756o7158P75530K54718
$$ -533458 -50621 -462652 -699253 -661237 -345544 -435937 -650693 -717851 57679 312397
1040C12397J4879k21972Q4663n49444L68644l34683j07143r094J23985L01133
$$ 312397 327276 105304 189967 -359477 9167 -325516 -432659 -441753 -317768 -16635
1030a6635j14552n95954R9145K01110o30386K35020Q14555K85324l57812n17426
$$ -16635 -131187 -727141 -627996 -426886 -1057272 -822252 -7697 277627 -80185 -597611
1020e97611J92830j42217L18794L62453m05462j43564J20506j35324M6957M0949
$$ -597611 -404781 -546998 -228204 134249 -271213 -414777 -294271 -429595 -382638 -341689
1010c41689O56512N17731k97912l11748K33665j18460m03240N09868j64987l35475
$$ -341689 314823 832554 534642 222894 456559 338099 -65141 444727 279740 -55735
1000e5735L71723R3544r8452k09181m52646J73269N51273K9235l6080L0184k1238
$$ -55735 315988 409532 311080 101899 -350747 -177478 373795 403030 366950 397134 375896
989C75896J61903N32946l28091j17466m51234l6308L63640j3242j5683N54877
$$ 375896 537799 1070745 742654 625188 173954 137646 501286 488044 472361 1027238
979A027238l95292j08127O90183p01494n97023k87462K26847j56773J71005k87694
$$ 1027238 631946 523819 1214002 512508 -84515 -371977 -145130 -301903 -130898 -418592
969d18592m0764K65464m99710M54962L48567m45178n0277P81232n7079n93123
$$ -418592 -459356 -193892 -693602 -238640 109927 -335251 -385528 395704 338625 -254498
959b54498k03212l16695M11632K86263L62782m46051J56458m76806J95354o0290
$$ -254498 -457710 -774405 -362773 -76510 286272 -159779 -3321 -480127 -284773 -345063
949c45063P58438l07577J3034O1655l56301K54564j52234J74793m92037K03846
$$ -345063 413375 105798 118832 180487 -175814 78750 -73484 101309 -390728 -186882
939a86882L34434o5638k34594n7912J01476J34730k71808Q4270k09202p2983Q40254
$$ -186882 147552 81914 -152680 -210592 -109116 25614 -246194 -161924 -371126 -444109 396145
928C96145J18255l90834j91736n9936J55839k4542J70356L31850j18370k67532
$$ 396145 514400 123566 -68170 -128106 27733 3191 173547 505397 387027 119495
918A19495K7036k63334N51889l04922k94579j20495N0511K38731m29940M26589
$$ 119495 146531 -116803 435086 130164 -164415 -284910 -234399 4332 -425608 981
908I81o38185M43513M62649r6010k31739m2008j02398L58550k03166J59484l34970
$$ 981 -637204 -193691 268958 172948 -58791 -100799 -203197 155353 -47813 111671 -223299
897b23299l06210M3048L19974k56307j98291M88386l8659Q5751K82955K38412
$$ -223299 -529509 -486461 -166487 -422794 -621085 -132699 -171358 -85607 197348 435760
887D35760j79702J1284j70972k1766k0656M45795P3504j11039o30569o7763l6603
$$ 435760 256058 267342 96370 74604 53948 499743 573247 462208 -168361 -236124 -272727
876b72727J16478L13703L07456m27995J0537N32421l32831j58651j69111r5262
$$ -272727 -156249 157454 464910 36915 47452 579873 247042 88391 -80720 -175982
866a75982j14117J39213k30001j82854K93198L21375j39925j03254N37918m09328
$$ -175982 -290099 -150886 -380887 -563741 -270543 50832 -89093 -192347 345571 -63757
856f3757l50149k38513L4259p7736Q233L24628l38530K53033L53605m06731N47009
$$ -63757 -413906 -652419 -618160 -695896 -687663 -363035 -701565 -448532 -94927 -501658 45351
845D5351K99536q5300k66156j34293l38218K12174K63138m90782K84204m40831
$$ 45351 344887 259587 -6569 -140862 -479080 -266906 -3768 -494550 -210346 -651177
835f51177r7492M45877l80871M16421k83046O67839M88945p39540l54197N00775
$$ -651177 -748669 -302792 -683663 -267242 -550288 117551 606496 -133044 -487241 13534
825A3534M33176m2537j27978K43596k06169k85714o4331J87498j53440o5781J10642
$$ 13534 446710 404173 276195 519791 313622 27908 -36423 151075 -2365 -68146 42496
814D2496J77724O28622o59160n34448j41876L01842K38413J19350J95366J95652
$$ 42496 220220 848842 189682 -344766 -486642 -184800 53613 172963 368329 563981
804E63981j34897k77382j75421J10209k93757N4491L84108k09106k92755m09017
$$ 563981 429084 151702 -23719 86490 -207267 -152776 231332 22226 -270529 -679546
794f79546N9418L1893M12897L20922K84057K82950o03011M1687k01095o30214
$$ -679546 -620128 -588235 -175338 145584 429641 712591 109580 151267 -49828 -680042
784f80042k3865K85939r6320N07866j76136R1779K03495n80420N17535l78003
$$ -680042 -703907 -417968 -514288 -6422 -182558 -90779 112716 -467704 49831 -328172
774c28172l55429K48826O29686k18829j34676N46630o97538m708N0974k3732o1586
$$ -328172 -683601 -434775 194911 -23918 -158594 388036 -309502 -314210 -263236 -286968 -348554
763c48554M73714J39282j88365j58260J32531j87649K65582m0515k75495K69668
$$ -348554 125160 264442 76077 -82183 50348 -137301 128281 87766 -187729 81939
753H1939J38731m65601J71738J96660j66938J5011M48196n6598j40269Q4784o84242
$$ 81939 220670 -244931 -73193 123467 -43471 -28460 419736 363138 222869 307653 -376589
742c76589n5574K3034M35020L97976o4518o25449m23059q1822N50607j77460L90002
$$ -376589 -432163 -409129 25891 423867 359349 -266100 -689159 -770981 -220374 -397834 -7832
731g832J89780l75860l90761K9860j53213L21748J07333L19015r4271K73726K12661
$$ -7832 181948 -193912 -584673 -554813 -708026 -386278 -278945 40070 -54201 219525 432186
720D32186m49347J64745j5241k85125n43569K50433N02946K7655l8581L0591p6922
$$ 432186 -17161 147584 132343 -152782 -696351 -445918 57028 84683 46102 76693 -229
709b29r8349n363n10110j25814P42044L04278K04977p82162J82537j43474p69159
$$ -229 -98578 -103941 -614051 -739865 2179 306457 511434 -270728 -88191 -231665 -1000824
698a000824O24708K87815j95169l90330J66142N16212m68824L47889P4224m09796
$$ -1000824 -376116 -88301 -283470 -673800 -507658 8554 -460270 -112381 -38157 -447953
688d47953K73403k049j40144j62376k28426K35371j83854P86489j57396j11539
$$ -447953 -174550 -176599 -316743 -479119 -707545 -472174 -656028 130461 -26935 -138474
678a38474P2473L81428l831l37752o0900j19450M8154j87599m13354J39514K93435
$$ -138474 -66001 315427 311596 -26156 -87056 -206506 -158352 -345951 -759305 -619791 -326356
667c26356k10587R1954Q2692J72992L11917j53725M47441l84384n31294J08441
$$ -326356 -536943 -444989 -362297 -189305 122612 -31113 416328 31944 -499350 -390909
657c90909K47229P9578k31530l91726j120M93835J3414k1032m58634L21767N93485
$$ -390909 -143680 -64102 -295632 -687358 -688478 -194643 -181229 -202261 -660895 -339128 254357
646B54357k16034r0676K13401l73814m06789L98269K81058j1598K68337l28531
$$ 254357 38323 -52353 161048 -212766 -619555 -221286 59772 48174 316511 -12020
636a2020M5819j68596L95795P1383J3326l89665J57356K58446k45880j63492p5082
$$ -12020 33799 -134797 260998 332381 345707 -43958 113398 371844 125964 -37528 -112610
625a12610K0808k98029m4643M21330Q7359J70672m94850q1954n849l4799R2685
$$ -112610 -91802 -389831 -434474 -13144 74215 244887 -249963 -331917 -337766 -372565 -279880
614b79880M9917n17782K41688N04319k98673J65193M31724j95335O76845l47237
$$ -279880 -229963 -747745 -506057 -1738 -300411 -135218 296506 101171 778016 430779
604D30779j54196o34334j14250K21561o57641O62282K00683K32263j27617J05284
$$ 430779 276583 -357751 -472001 -250440 -908081 -245799 -45116 187147 59530 164814
594A64814n561k15952J71272k15415n7879K41680k25401o7826l06247O0991K30768
$$ 164814 159253 -56699 114573 -100842 -158721 82959 -142442 -210268 -516515 -455524 -224756
583b24756N19627j00974m72056L75027j55979k25722k86848j36527O53976k36410
$$ -224756 294871 193897 -278159 96868 -59111 -284833 -571681 -708208 -54232 -290642
573b90642N477L41413L55081n61660k92698R1598L14465N98159l81894p8372M6787
$$ -290642 -285165 56248 411329 -150331 -443029 -351431 -36966 561193 179299 100927 147714
562A47714m53213L5033l94460j642L78495N52321N8327J83513j01647o37469J44759
$$ 147714 -305499 -270466 -664926 -666568 -288073 264248 322575 506088 404441 -233028 -88269
551h8269M43878l5394m829m35626K6633L4523R0589M9011K5330j54855j28935
$$ -88269 355609 320215 315386 -120240 -93607 -59084 31505 80516 105846 -49009 -177944
540a77944L95874K13835n84769p89674J063723j40685j88041K78872J56347j40365
$$ -177944 217930 431765 -153004 -942678 121045 -19640 -207681 71191 227538 87173
530H7173m48082k35725P6958K25759n92461P11732j17730l81863P0067K89376
$$ 87173 -360909 -596634 -519676 -293917 -886378 -174646 -292376 -674239 -604172 -314796
520c14796J33930m80772o38741O60594L19681k12967M81849K47961J07874L97614
$$ -314796 -180866 -661638 -1300379 -639785 -320104 -533071 -51222 196739 304613 702227
510G02227m90831q9921L20075m62243M04885l56257K2997k7161j01707j47101
$$ 702227 211396 121475 441550 -20693 384192 27935 50932 23771 -77936 -225037
500b25037K01882k94847K71214q5620k47597P6418P1265l72896L43885P44870
$$ -225037 -23155 -318002 -46788 -132408 -380005 -303587 -232322 -605218 -261333 483537
490D83537k69291p60558Q1552K91709P880N73452J11446k77956l59851k62731
$$ 483537 214246 -546312 -464760 -173051 -165171 408281 519727 241771 -118080 -380811
480c80811k33807J07942K36177J84690k03353j85375L8518K32677J72004k1455
$$ -380811 -614618 -506676 -270499 -85809 -289162 -474537 -436019 -203342 -31338 -52793
470e2793n67297l58574J50924O31647R119k37622j39437L3227M31072P3252K90304
$$ -52793 -620090 -978664 -827740 -196093 -186974 -424596 -564033 -530806 -99734 -26482 263822
459B63822j6232j74549N0475n7217n83319O9456L56238K0201L02419O9386k24199
$$ 263822 247590 73041 123516 66299 -517020 -447564 -91326 -71125 231294 300680 76481
448G6481n1352r8652j31353j48646M24771K55124o75133j47802K50127K880j87446
$$ 76481 25129 -73523 -204876 -353522 71249 326373 -348760 -496562 -246435 -243555 -431001
437d31001L18355J43858n03105J5991M81107K32565m45990k94379L35035L20380
$$ -431001 -112646 31212 -471893 -455902 25205 257770 -188220 -482599 -147564 172816
427A72816m88476j48367j68955N3511K63010J91962j94242J20522K15718J42399
$$ 172816 -315660 -464027 -632982 -579471 -316461 -124499 -318741 -198219 17499 159898
417A59898m84974l53682N33617J82092K3499p59221K73540L4790k28884j47973
$$ 159898 -325076 -678758 -145141 36951 60450 -698771 -425231 -390441 -619325 -767298
407g67298K83548L9386j22669j90884J84740l3149q5645k99123n693N60350J42919
$$ -767298 -483750 -444364 -567033 -757917 -573177 -606326 -691971 -991094 -996787 -436437 -293518
396b93518P9943j66801R2771O6769j24987J63704L46192j15305m1755l7934J10565
$$ -293518 -213575 -380376 -287605 -220836 -345823 -182119 164073 48768 7013 -30921 79644
385G9644O4372n88988j23901L61725K38405o9586n890L0605o20120J33108l07591
$$ 79644 144016 -444972 -568873 -207148 31257 -38329 -44219 -13614 -633734 -500626 -808217
374h08217K53818M01740L27295l64426J60594J22892k06312K57081m16208k86681
$$ -808217 -554399 -152659 174636 -189790 -29196 93696 -112616 144465 -271743 -558424
364e58424J55700O75021J52538l76333k72597k69372q8947M38361m90841N1683
$$ -558424 -402724 272297 424835 48502 -224095 -493467 -582414 -144053 -634894 -583211
354e83211j5748J93971n5832M15697N09672q55259o86950M77241K54831k94472
$$ -583211 -598959 -404988 -460820 -45123 464549 -390710 -1077660 -600419 -345588 -640060
344f40060j1243M46189r6314l54006Q7020L0452K85155Q5188k05086l75416Q2962
$$ -640060 -651303 -205114 -301428 -655434 -568414 -537962 -252807 -167619 -372705 -748121 -665159
333f65159K60987l94088K5875L74509m5372J07291K57046k91614K10272j12416
$$ -665159 -404172 -798260 -772385 -397876 -443248 -335957 -78911 -370525 -160253 -272669
323b72669n24683L795j09718j4133n85437Q55522L48954J22197K63313J32051
$$ -272669 -797352 -793557 -903275 -917408 -1502845 -647323 -298369 -176172 87141 219192
313B19192n71879J22673K06831p4866J21743J31102q32121j5407K49542n69571
$$ 219192 -352687 -230014 -23183 -98049 23694 154796 -677325 -692732 -443190 -1012761
303a012761O01491j49093N42018j28360J50015k08567j97365L64501j08577k18540
$$ -1012761 -411270 -560363 -18345 -146705 3310 -205257 -402622 -38121 -146698 -365238
293c65238j47798m13547M77107R0775j09187q6908O7663n37541M8648J04147R0992
$$ -365238 -513036 -926583 -449476 -358701 -467888 -554796 -487133 -1024674 -976026 -871879 -780887
282g80887P27189j59511L03563o64478k40906k07075J48681M6090K75315K78660
$$ -780887 -53698 -213209 90354 -574124 -815030 -1022105 -873424 -827334 -552019 -273359
272b73359j19366K29045J24644j2366J20337n40401O60330j42922m55361P2363
$$ -273359 -392725 -163680 -39036 -51402 68935 -471466 188864 45942 -409419 -337056
262c37056O9918o06039K84608Q89155m29356n39592k37726K99116L30690K74736
$$ -337056 -267138 -873177 -588569 300586 -128770 -668362 -906088 -606972 -276282 -1546
252a546k25988J89546m65683k89449K17438O17559l67110p4638k25664L88247
$$ -1546 -227534 -37988 -503671 -793120 -575682 41877 -325233 -399871 -625535 -237288
242b37288L36123p1188l55869L0709J58407k36921j32496k20656L48451K45271
$$ -237288 98835 27647 -328222 -297513 -139106 -376027 -508523 -729179 -380728 -135457
232a35457M8201l65187o10193K27433J80291k20999J42866M9103j63428K58165
$$ -135457 -87256 -452443 -1062636 -835203 -654912 -875911 -733045 -683942 -847370 -589205
222e89205J01499k18195K91835j96435M1740J12465K14372j27998k10701M804
$$ -589205 -487706 -705901 -414066 -610501 -568761 -456296 -241924 -369922 -580623 -575819
212e75819P7453M9209k20827J34184J8568P4058N47139K90558q16349K87669M67878
$$ -575819 -498366 -449157 -669984 -535800 -517232 -443174 103965 394523 -421826 -134157 333721
201C33721k23517n98010J92607j31864m01123N63144J55961K22734j51387o12303
$$ 333721 110204 -487806 -295199 -427063 -828186 -265042 -109081 113653 -37734 -650037
191f50037L3378K35592p7675l3740q2998M59204l78129j91262P4127L58385q0666
$$ -650037 -616659 -381067 -458742 -492482 -575480 -116276 -494405 -685667 -611540 -253155 -333821
180c33821L25904k73517J22820o4641p5314l61833Q0936M10406p4559n84399k5020
$$ -333821 -7917 -281434 -158614 -223255 -298569 -660402 -579466 -169060 -243619 -828018 -853038
169h53038J89987J5748P71303r3830Q9818n167j96775P4963o38767m7335N66829
$$ -853038 -663051 -647303 124000 30170 119988 114821 -81954 -6991 -645758 -693093 -126264
158a26264k16628m68996J10867L73013k6627J34340l36314k09720K95120j16374
$$ -126264 -342892 -811888 -701021 -328008 -354635 -220295 -556609 -766329 -471209 -587583
148e87583J12640J42486k53479J91904M41044K23619n76692j81165j5423M03980
$$ -587583 -474943 -332457 -585936 -394032 47012 270631 -306061 -487226 -502649 -98669
138i8669L9438L88943l44599J21366j29190m34030m4222n620J31216m26074K89758
$$ -98669 -59231 329712 -14887 106479 -22711 -456741 -500963 -506583 -375367 -801441 -511683
127e11683J5512l73458M33464m09361J27918O17054j70837o8983r0471q4229J24770
$$ -511683 -496171 -869629 -436165 -845526 -717608 -100554 -271391 -340374 -430845 -515074 -390304
116c90304k13211Q0071j9919L42229L59763m78707P2833l68809Q3669L8708m17734
$$ -390304 -603515 -523444 -543363 -201134 158629 -320078 -247245 -616054 -532385 -493677 -911411
105i11411J44056L41637N67156L65927l18301q92078l23713J36098L08855J14747
$$ -911411 -767355 -425718 141438 507365 189064 -703014 -1026727 -890629 -581774 -467027
95d67027p5724j2173j70280K91598j15715k6098L82366j14360j99732J00964l32101
$$ -467027 -542751 -554924 -725204 -433606 -549321 -575419 -193053 -307413 -507145 -406181 -738282
84g38282j85928J19335M16501J18747l05781m5848n5130j04940j50102J04409
$$ -738282 -924210 -804875 -388374 -269627 -575408 -621256 -676386 -781326 -931428 -827019
74h27019J99807K17837l6859Q9176k8693j21968m3566J74256k0077k00555L47992
$$ -827019 -627212 -409375 -446234 -357058 -385751 -507719 -551285 -377029 -397106 -597661 -249669
63b49669l775l00052m90613K68155L26582J61683l46402k37160p9079O12800J39971
$$ -249669 -253444 -553496 -1044109 -775954 -449372 -287689 -634091 -871251 -950330 -337530 -197559
52a97559k12472J24797j93260K82462k04301J80027o4898j24480P8045L5723L4446
$$ -197559 -410031 -285234 -478494 -196032 -400333 -220306 -285204 -409684 -331639 -295916 -261470
41b61470o9891k48552M53088J87230n29455K32095R567k49149J51303l010Q123
$$ -261470 -331361 -579913 -126825 60405 -469050 -236955 -227388 -476537 -325234 -328244 -320121
30c20121k2252l48274J50539l0248L36723L26582k04222m32857J78457q6570p9915
$$ -320121 -342373 -690647 -540108 -570356 -233633 92949 -111273 -544130 -365673 -452243 -532158
19e32158r0819M94112n4438k70251L34005l77671j72636M43762m012j11360j10195
$$ -532158 -622977 -128865 -183303 -453554 -119549 -497220 -669856 -226094 -230106 -341466 -451661
8d51661j03168l5620l94873M41902k22657L4107K85101K5267
$$ -451661 -554829 -590449 -985322 -543420 -766077 -731970 -446869 -421602
0d21602
$$ -421602
$$ Imaginary data points
##PAGE= N=2
##DATA TABLE= (X++(I..I)), XYDATA
16383c081000L7356n1878J4483j63188l4457j59622K93649j07393K50481l5590
$$ -3081000 -3043644 -3095522 -3081039 -3244227 -3278684 -3438306 -3144657 -3252050 -3001569 -3037159
16373c037159m26317M12458J75175n3193K12334J81205O5581L6844m7393j2114
$$ -3037159 -3463476 -3051018 -2875843 -2929036 -2716702 -2535497 -2469916 -2433072 -2480465 -2492579
$$ [...]
##END NTUPLES=NMR SPECTRUM
##END=
