##TITLE=1H_TG-2307-G6
 CDCl3
 8 sc, 
 16.6.2023
##JCAMPDX= 6.0         $$ Bruker NMR JCAMP-DX V2.0
##DATA TYPE= NMR SPECTRUM
##DATA CLASS= NTUPLES
##ORIGIN= UXNMR, Bruker Analytische Messtechnik GmbH
##OWNER= root
$$ XWIN-NMR		Version 3.5
$$ Fri Jun 16 14:30:02 2023 Russian Standard Time (UT+4h)  she@DPX200
##.OBSERVE FREQUENCY= 200.13135
##.OBSERVE NUCLEUS= ^1H
##.ACQUISITION MODE= SIMULTANEOUS
##.ACQUISITION SCHEME= undefined
##.AVERAGES= 8
##.DIGITISER RES= 18
##SPECTROMETER/DATA SYSTEM= spect
##.PULSE SEQUENCE= zg30
##.SOLVENT NAME= CDCl3
##.SHIFT REFERENCE= (INTERNAL, CDCl3, 0, 15.7546)
##AUDIT TRAIL= $$ (NUMBER, WHEN, WHO, WHERE, WHAT)
$$ ##TITLE= Audit trail, XWIN-NMR		Version 3.5
$$ ##JCAMPDX= 5.01
$$ ##ORIGIN= Bruker BioSpin GmbH
$$ ##OWNER= she
$$ F:/spectra/data/she/nmr/H-F/1/pdata/1/auditp.txt
$$ ##AUDIT TRAIL=  $$ (NUMBER, WHEN, WHO, WHERE, WHAT)
(   1,<2023-06-16 14:28:38.28 +0400>,<she>,<DPX200>,
      <created by zg, POWCHK disabled, PULCHK disabled
       configuration hash MD5:
       00 E9 B6 7A A2 85 ED C7 34 08 36 98 17 FE 4E 26
       data hash MD5: 16K
       FF 6E BC 69 F0 47 37 31 3D 2D 63 60 14 6C 69 93>)
(   2,<2023-06-16 14:28:41.96 +0400>,<she>,<DPX200>,
      <Start of raw data processing
       efp BC_mod = 2 LB = 0.24 FT_mod = 6 PKNL = 1 PHC0 = -20619.61 PHC1 = 2.652719 SI = 16K 
       data hash MD5: 16K
       32 AC E6 31 FA 92 6A 86 18 92 89 25 0A EF 03 AE>)
(   3,<2023-06-16 14:29:01.10 +0400>,<she>,<DPX200>,
      <pk PHC0 = -5.945314 PHC1 = 7.8 
       data hash MD5: 16K
       51 26 DC 71 2A F2 2A 10 58 66 1D F0 F2 D7 D0 4A>)
(   4,<2023-06-16 14:29:04.68 +0400>,<she>,<DPX200>,
      <abs ABSG = 5 
       data hash MD5: 16K
       12 27 1F 74 DC 68 B0 06 FA EF 9C 23 AB 51 7E 9A>)
$$ ##END=
$$ 
$$ hash MD5
$$ 3B CF 9E AD 88 F3 6E FD 82 7A 85 BC 3D 79 87 BC
##$RELAX= 
##$RELAX= 
##$RELAX= 
##$RELAX= 
##$RELAX= 
##$RELAX= 
$$ Bruker specific parameters
$$ --------------------------
##$DU= <F:/spectra>
##$EXPNO= 1
##$NAME= <H-F>
##$PROCNO= 1
##$TYPE= <nmr>
##$USER= <she>
##$AMP= (0..31)
100 100 100 100 100 100 100 100 100 100 100 100 100 100 100 100 100 100 
100 100 100 100 100 100 100 100 100 100 100 100 100 100 
##$AQSEQ= 0
##$AQ_mod= 1
##$AUNM= <au_zg>
##$AUTOPOS= <>
##$BF1= 200.13
##$BF2= 200.13
##$BF3= 200.13
##$BF4= 200.13
##$BF5= 200.13
##$BF6= 200.13
##$BF7= 200.13
##$BF8= 200.13
##$BYTORDA= 1
##$CFDGTYP= 0
##$CFRGTYP= 5
##$CHEMSTR= <none>
##$CNST= (0..31)
1 1 145 1 1 1 1 1 1 1 1 1 1 1 1 1 1 1 1 1 1 1 1 1 1 1 1 1 1 1 1 1 
##$CPDPRG= <>
##$CPDPRG1= <>
##$CPDPRG2= <>
##$CPDPRG3= <>
##$CPDPRG4= <mlev>
##$CPDPRG5= <mlev>
##$CPDPRG6= <mlev>
##$CPDPRG7= <mlev>
##$CPDPRG8= <mlev>
##$CPDPRGB= <>
##$CPDPRGT= <>
##$D= (0..31)
0 1.2 0 0 0 0 0 0 0 0.06 0 0.03 0 0 0 0 0.0002 0 0 0 0 0 0 0 0 0 0 0 0 
0 0 0 
##$DATE= 1686911317
##$DBL= (0..7)
120 120 120 120 120 120 120 120 
##$DBP= (0..7)
150 150 150 150 150 150 150 150 
##$DBP07= 0
##$DBPNAM0= <>
##$DBPNAM1= <>
##$DBPNAM2= <>
##$DBPNAM3= <>
##$DBPNAM4= <>
$$ [...]
##$SUBNAM3= <"">
##$SUBNAM4= <"">
##$SUBNAM5= <"">
##$SUBNAM6= <"">
##$SUBNAM7= <"">
##$SUBNAM8= <"">
##$SUBNAM9= <"">
##$SW= 18.05172834244
##$SWIBOX= (0..15)
0 0 2 0 0 0 0 0 0 0 0 0 0 0 0 0 
##$SW_h= 3612.71676300578
##$TD= 16384
##$TD0= 1
##$TE= 0
##$TE2= 300
##$TE3= 300
##$TEG= 300
##$TL= (0..7)
0 120 120 120 120 120 120 120 
##$TP= (0..7)
150 150 150 150 150 150 150 150 
##$TP07= 0
##$TPNAME0= <>
##$TPNAME1= <>
##$TPNAME2= <>
##$TPNAME3= <>
##$TPNAME4= <>
##$TPNAME5= <>
##$TPNAME6= <>
##$TPNAME7= <>
##$TPOAL= (0..7)
0.5 0.5 0.5 0.5 0.5 0.5 0.5 0.5 
##$TPOFFS= (0..7)
0 0 0 0 0 0 0 0 
##$TUNHIN= 0
##$TUNHOUT= 0
##$TUNXOUT= 0
##$USERA1= <user>
##$USERA2= <user>
##$USERA3= <user>
##$USERA4= <user>
##$USERA5= <user>
##$V9= 5
##$VALIST= <valist>
##$VCLIST= <CCCCCCCCCCCCCCC>
##$VD= 0
##$VDLIST= <DDDDDDDDDDDDDDD>
##$VPLIST= <PPPPPPPPPPPPPPP>
##$VTLIST= <TTTTTTTTTTTTTTT>
##$WBST= 1024
##$WBSW= 4
##$XGAIN= (0..3)
0 0 0 0 
##$XL= 0
##$YL= 0
##$YMAX_a= 550020
##$YMIN_a= -739031
##$ZGOPTNS= <>
##$ZL1= 120
##$ZL2= 120
##$ZL3= 120
##$ZL4= 120
##$ABSF1= 15.71384
##$ABSF2= -2.33801
##$ABSG= 5
##$ABSL= 3
##$ALPHA= 0
##$AQORDER= 0
##$ASSFAC= 0
##$ASSFACI= 0
##$ASSFACX= 0
##$ASSWID= 0
##$AUNMP= <proc_1d>
##$AZFE= 0.1
##$AZFW= 0.1
##$BCFW= 0
##$BC_mod= 2
##$BYTORDP= 0
##$COROFFS= 0
##$CY= -3
##$DATMOD= 1
##$DC= 0
##$DFILT= <>
##$DTYPP= 0
##$F1P= 0
##$F2P= 0
##$FCOR= 1
##$FTSIZE= 16384
##$FT_mod= 6
##$GAMMA= 0
##$GB= 0
##$INTBC= 1
##$INTSCL= 3.70164e-10
##$ISEN= 128
##$LB= 0.24
##$LEV0= 0
##$LPBIN= 0
##$MAXI= 10000
##$MC2= 0
##$MEAN= 0
##$ME_mod= 0
##$MI= 1.114404
##$NCOEF= 0
##$NC_proc= -5
##$NLEV= 6
##$NOISF1= 3.799351
##$NOISF2= 2.8
##$NSP= 0
##$NTH_PI= 0
##$NZP= 0
##$OFFSET= 15.7546
##$PC= 1
##$PHC0= -20625.55
##$PHC1= 10.45272
##$PH_mod= 1
##$PKNL= yes
##$PPARMOD= 0
##$PSCAL= 0
##$PSIGN= 0
##$REVERSE= no
##$SF= 200.130003389923
##$SI= 16384
##$SIGF1= 3
##$SIGF2= 2
##$SINO= 5.538805
##$SIOLD= 16384
##$SREGLST= <1H.CDCl3>
##$SSB= 0
##$STSI= 16384
##$STSR= 0
##$SW_p= 3612.71676300578
##$SYMM= 0
##$S_DEV= 0
##$TDeff= 16384
##$TDoff= 0
##$TI= <>
##$TILT= no
##$TM1= 0
##$TM2= 0
##$TOPLEV= 0
##$USERP1= <user>
##$USERP2= <user>
##$USERP3= <user>
##$USERP4= <user>
##$USERP5= <user>
##$WDW= 1
##$XDIM= 16384
##$YMAX_p= 290337001
##$YMIN_p= -189564
$$ End of Bruker specific parameters
$$ ---------------------------------
##NTUPLES= NMR SPECTRUM
##VAR_NAME=  FREQUENCY,     SPECTRUM/REAL,   SPECTRUM/IMAG
##SYMBOL=    X,             R,               I
##VAR_TYPE=  INDEPENDENT,   DEPENDENT,       DEPENDENT
##VAR_FORM=  AFFN,          ASDF,            ASDF
##VAR_DIM=   16384,         16384,           16384
##UNITS=     HZ,            ARBITRARY UNITS, ARBITRARY UNITS
##FACTOR=    0.220516191357247, 1,           1
##FIRST=     3152.96806559674, 0,            0
##LAST=      -459.748697409036, 0,           0
##MIN=       -459.748697409036, -189564,     0
##MAX=       3152.96806559674, 290337001,    0
$$ Real data points
##PAGE= N=1
##DATA TABLE= (X++(R..R)), XYDATA
$$ [...]
5756E9323163m48057k133039l599014m488379m803702m703032m322644l798735
5748C1026561l274976k726585k268018j918563j588162j324538j141464r73459
5740A5810796q39162p09638n77906n45796n51941m43487l95618l77332l11360
5731A1058556j99540k27262k30503k07806j91111j51512j03838j47588j23545
5722I475851r3164K0175M7214K9750K1998M1994J43413J86824J84593K27598K93110
5711A0579356L59405L53240K94281K23503N0576m5922j20143j44893j65353r3088
5701A1290962l0477m04O1389J38154K64269L53080M29742N43086O18769O13627
5691A4282197N74003M60016K52031K3304j86578k42749k40479k11911j73590j28155
$$ y = [59323163, 58875106, 56742067, 53143053, 48654674, 43850972, 39147940, 34825296, 31026561, 27751585, 25025000, 22756982, 20838419, 19250257, 17925719, 16784255, 15810796, 14971634, 14261996, 13684090, 13138294, 12586353, 12142866, 11747248, 11369916, 11058556, 10859016, 10631754, 10401251, 10193445, 10002334, 9850822, 9746984, 9599396, 9475851, 9382687, 9402862, 9450076, 9479826, 9501824, 9543818, 9687231, 9874055, 10058648, 10286246, 10579356, 10938761, 11292001, 11586282, 11809785, 11860361, 11814439, 11694296, 11549403, 11384050, 11290962, 11260485, 11260081, 11321470, 11459624, 11723893, 12076973, 12506715, 13049801, 13668570, 14282197, 14856200, 15316216, 15568247, 15591551, 15404973, 15162224, 14921745, 14709834, 14536244, 14408089]
5681A4408089r7619Q791N9589K18446L24335L54521M34016M78511L65667K38275
5671A6792621J15342j31076k42689l02861k52441k67555k74297k94014k44967
5662A4898063j69804n2240K7472J44928K58983L13137L83389L70633K36692Q317
5652A6419570k88909m37998m62142n07663n53456o10388o11754m97016m64280
5643A1985964m53633k88700k11171j28184K5233J34594J99262J70790J13540P303
5633A1554998j28581k12275l66564m38666m41611n47813o71328n95456n15604
5624G637100m49400l60111l92892l03746k36091j46974q5075j19421n8266l6295
5614E448829k9060j1724q9747o3955j39982k47507k10533k51941k46237k61400
$$ y = [14408089, 14310470, 14319261, 14378850, 14597296, 14921631, 15276152, 15710168, 16188679, 16554346, 16792621, 16907963, 16776887, 16534198, 16231337, 15978896, 15711341, 15437044, 15143030, 14898063, 14728259, 14676019, 14703491, 14848419, 15107402, 15420539, 15803928, 16174561, 16411253, 16419570, 16130661, 15692663, 15230521, 14722858, 14169402, 13559014, 12947260, 12450244, 11985964, 11532331, 11243631, 11032460, 10904276, 10929509, 11064103, 11263365, 11434155, 11547695, 11554998, 11426417, 11214142, 10847578, 10408912, 9967301, 9419488, 8748160, 8152704, 7637100, 7187700, 6827589, 6434697, 6130951, 5894860, 5747886, 5662811, 5543390, 5485124, 5448829, 5419769, 5408045, 5318298, 5254343, 5114361, 4866854, 4656321, 4404380, 4158143, 3896743]
5604C896743j79054j67679j29958j30489j94531q6860j25806j18450p6707j10283
5594B576926q7209o0425p7684m5926J2782q2943m7792q8365o6230k4307k6057
5583A982770j3783o240k7127o1306o9308j2725o9787n5536j0451j3822K5325j0524
5571A657486l9504k3249J3166l5209k3190j6951k8925k2826J765K1369J8365o7088
5559A455209l908K8995o6830m8854L7224j6336r848l688K9319k7028m1251K4783
5547A357787r07j3096o3560J954L0884J6866J8717N401l2777M037K4576j1085
5535A338797n350J9489R959o695k1797N7L651K3666m9211L899O8365N3895J9827
5522A458552k0773m4320j0691J2907K3665J2941N2186j5621L0490J0707J363K6936
$$ y = [3896743, 3717689, 3550010, 3420052, 3289563, 3095032, 3008172, 2882366, 2763916, 2687209, 2576926, 2489717, 2429292, 2351608, 2305682, 2318464, 2235521, 2187729, 2099364, 2033134, 2008827, 1982770, 1968987, 1962747, 1935620, 1874314, 1805006, 1792281, 1722494, 1666958, 1656507, 1642685, 1668010, 1657486, 1617982, 1594733, 1607899, 1572690, 1549500, 1532549, 1503624, 1480798, 1482563, 1503932, 1522297, 1455209, 1451301, 1480296, 1413466, 1364612, 1401836, 1385500, 1375652, 1371964, 1401283, 1374255, 1333004, 1357787, 1356880, 1343784, 1280224, 1282178, 1313062, 1329928, 1348645, 1354046, 1321269, 1325306, 1349882, 1338797, 1333447, 1352936, 1362895, 1356200, 1334403, 1334460, 1338111, 1361777, 1312566, 1316465, 1384830, 1438725, 1458552, 1437779, 1393459, 1382768, 1395675, 1419340, 1432281, 1484467, 1468846, 1499336, 1510043, 1511406, 1538342]
5510A538342n9945N4034r431J0828J6585O192P334q02l8469O1179L320O140o9
5497A595238J1763P7400j2982m8506O9351N0529k2131m4225n0561j2239N5844
5486A669481Q758R3442j3722n849P069j4159j4745L9460L3793j6841k2703l959
5474A760025Q1744j9479m3026j1246j3429p274M5909O738K4367q133N0623j3493
5462A853326K5513J6289P241L4058L7599j8376k2463o5316L2415K8017M2722k0039
5450A950986o688J5567l4638O3859K5693m188l8047L6192L5850k7718l8799Q567
5438A986636L7844m5525l3571L1951O4582O516M0514N607K2989M9775l5850k8140
5426B103328m0519J199N4436m0670j3604m84o2014n7893l8156m0374j6086K5471
$$ y = [1538342, 1478397, 1532431, 1523000, 1533828, 1550413, 1556605, 1563939, 1563137, 1524668, 1585847, 1589167, 1595307, 1595238, 1607001, 1684401, 1671419, 1622913, 1692264, 1742793, 1720662, 1676437, 1625876, 1613637, 1669481, 1678239, 1771681, 1757959, 1752110, 1759179, 1745020, 1730275, 1769735, 1803528, 1786687, 1763984, 1760025, 1841769, 1822290, 1779264, 1768018, 1754589, 1747315, 1793224, 1799962, 1824329, 1816196, 1866819, 1853326, 1878839, 1895128, 1902369, 1936427, 1974026, 1955650, 1933187, 1867871, 1900286, 1928303, 1971025, 1950986, 1944298, 1959865, 1925227, 1989086, 2014779, 2010591, 1972544, 2008736, 2044586, 2016868, 1978069, 1986636, 2024480, 1978955, 1945384, 1977335, 2041917, 2048433, 2088947, 2094554, 2117543, 2167318, 2131468, 2103328, 2062809, 2064008, 2118444, 2077774, 2064170, 2063686, 2001672, 1943779, 1905623, 1865249, 1849163, 1874634]
5414A874634k0971l9333o875j4949k0828p635O430L4851K5445j4462R5273J00373
5402B011953J2777O2095O0513M6919O0549K3739m147N3740J401K5086M1814K048
5390B398487m5342j5306k3525l5956p647J8887j2667N8524r058M4272r548m0035
5378B321086P9349M5602j4452P788J6835j4914N789r539J971r538n409Q96O5519
5365B490983L9714k7800q0693J388m0220n8970q370J3044o8584J7837L6573l5158
5353B279744J2250L613J0785K8521j7404j8750N1095K5971j7438p9955K2214M7979
5341B348625r916J1706K3220q236k0758p7523n4099p9107J8281L9559l735q9160
5329B098857J5075L4080K6906n490k6568j8545k7744K1343P2776L5809k8970o007
$$ y = [1874634, 1853663, 1814330, 1807455, 1792506, 1771678, 1764043, 1770473, 1805324, 1830769, 1816307, 1911580, 2011953, 2024730, 2086825, 2147338, 2194257, 2254806, 2278545, 2274398, 2328138, 2329539, 2354625, 2396439, 2398487, 2353145, 2337839, 2314314, 2278358, 2270711, 2289598, 2276931, 2335455, 2326397, 2370669, 2361121, 2321086, 2400435, 2446037, 2431585, 2439373, 2456208, 2441294, 2447083, 2437544, 2439515, 2429977, 2424568, 2425464, 2490983, 2530697, 2502897, 2422204, 2423592, 2383372, 2324402, 2316032, 2329076, 2260492, 2278329, 2314902, 2279744, 2291994, 2295607, 2306392, 2334913, 2317509, 2298759, 2349854, 2375825, 2358387, 2278432, 2300646, 2348625, 2338709, 2350415, 2373635, 2365399, 2344641, 2267118, 2213019, 2133912, 2152193, 2191752, 2188017, 2098857, 2113932, 2148012, 2174918, 2169428, 2142860, 2124315, 2096571, 2117914, 2190690, 2226499, 2197529, 2191522]
5317B191522K3491J516j725O319J6674k7317k8503M6845J2387M9252J5097j5266
5305B290292k5465M1029L6395J2793J3444q708L2256L9874L694J1414J503K9317
5293B477838M0065J4474L1805n575k1078J9584L3967K810N1858k749l2345K5050
5281B635704Q9627o2418j9410L8969L1176L3878n3093K3768M8823M4415M936L2259
5269B848634L9467O9383j8770J64K4897R568M3520J16347K8679N9274N1010J9399
5257C291572K8633M6568O025M2479N2839M3909M0448J1783O0886M3864N2046Q2585
5245C803637O512K0903O0779P5051J0345L9603M5437L4532L9694J15380O6642
5234D318515J5559O7845N2814O1206O6836P5388J26145N8571O9410J24663N1460
$$ y = [2191522, 2215013, 2216529, 2214804, 2221123, 2237797, 2210480, 2181977, 2228822, 2241209, 2290461, 2305558, 2290292, 2264827, 2305856, 2342251, 2355044, 2368488, 2359780, 2392036, 2431910, 2435604, 2447018, 2448521, 2477838, 2517903, 2532377, 2564182, 2558607, 2537529, 2557113, 2591080, 2593890, 2645748, 2642999, 2610654, 2635704, 2725331, 2662913, 2643503, 2682472, 2713648, 2747526, 2694433, 2718201, 2767024, 2811439, 2816375, 2848634, 2888101, 2957484, 2938714, 2938878, 2963775, 2973343, 3016863, 3133210, 3161889, 3221163, 3272173, 3291572, 3320205, 3366773, 3372798, 3415277, 3468116, 3512025, 3552473, 3564256, 3625142, 3669006, 3721052, 3803637, 3810149, 3831052, 3891831, 3966882, 3977227, 4016830, 4062267, 4096799, 4136493, 4251873, 4318515, 4334074, 4401919, 4454733, 4515939, 4582775, 4658163, 4784308, 4842879, 4912289, 5036952, 5088412]
5223E088412K2948O431P2937J04510O7807N7881M7681Q4409M1449M1510Q0961
5212E716936J15406R2861P4935J04546L1961J29511J25916R4660R8299J08671
5202F693702J02406L7770P7828J71853R0687J15254J63199Q5671J11286J08579
5192G758235J14675J02860J36050J10158J61407J21532J41075J93371J59943J33522
5182I132828J40813J63513J60710K02441J78337J10441J72076K02691K11049J97673
5172A0872572J28192J79287K38676K90242K02662K22650J95995K44776K48540
5163A2823592K46615K60411K97351K44828K43632K85438K94967L17799K88923
5154A5303556K13640K67548L27157L66360L61562K72226K77392L50587L67791
$$ y = [5088412, 5111360, 5117791, 5190728, 5295238, 5363045, 5420926, 5468607, 5553016, 5594465, 5635975, 5716936, 5832342, 5925203, 6000138, 6104684, 6136645, 6266156, 6392072, 6486732, 6585031, 6693702, 6796108, 6833878, 6911706, 7083559, 7174246, 7289500, 7452699, 7538370, 7649656, 7758235, 7872910, 7975770, 8111820, 8221978, 8383385, 8504917, 8645992, 8839363, 8999306, 9132828, 9273641, 9437154, 9597864, 9800305, 9978642, 10089083, 10261159, 10463850, 10674899, 10872572, 11000764, 11180051, 11418727, 11708969, 11911631, 12134281, 12330276, 12575052, 12823592, 13070207, 13330618, 13627969, 13872797, 14116429, 14401867, 14696834, 15014633, 15303556, 15517196, 15784744, 16111901, 16478261, 16839823, 17112049, 17389441, 17740028, 18107819]
5145A8107819L13737L85576L50269L27454M26953L30996L28514L75105L58252
5136B1304675K87646L44248L33385L13646K39563K99819K75178K76321K67361
5127B3941842K61923J82844J47845J94832J99347J73719J38408J38005M9524O8217
5117B5496506J20452l2202l4646l1877k9710o1930q7433j05843j55518j72056
5107B4905743j74463j69236k28521j90254k22457l35679k68735k64103k78303
5098B2773992l15031l17329l10160l43672k65079l53052l61978l45455l49008
5089A9813228l57864l31637l82428l51741l61494l53811l55656m03318l22668
5080A6592611l55375l30267l56312l11384l43918l29239k96022l32083k84258
$$ y = [18107819, 18421556, 18807132, 19157401, 19484855, 19911808, 20242804, 20571318, 20946423, 21304675, 21592321, 21936569, 22269954, 22583600, 22823163, 23122982, 23398160, 23674481, 23941842, 24203765, 24386609, 24534454, 24729286, 24928633, 25102352, 25240760, 25378765, 25428289, 25496506, 25616958, 25584756, 25550110, 25518233, 25488523, 25426593, 25339160, 25233317, 25077799, 24905743, 24731280, 24562044, 24333523, 24143269, 23920812, 23585133, 23316398, 23052295, 22773992, 22458961, 22141632, 21831472, 21487800, 21222721, 20869669, 20507691, 20162236, 19813228, 19455364, 19123727, 18741299, 18389558, 18028064, 17674253, 17318597, 16915279, 16592611, 16237236, 15906969, 15550657, 15239273, 14895355, 14566116, 14270094, 13938011, 13653753]
5071A3653753k66199k11304l21371k86684k73094k61220k94827j68476k46451
5062A1324127k39189k20132k19455k24455k07970k42582k19627k04030j50108
5053I396579j72831j82028j94254j51846j81192j84938j57317j49116r3511j78853
5043G750693j20265j32016j45986j58135j44355j61931r5165q3755j43926j82627
5033F382532j52800m7638n9440r5281j33024j11166m9626n6690q4219j00394j42720
5022E349534r6547j06130q9987j12134m6598N468m6970j12106q1258r1807j05491
5011D465974j00532r276k3837j11442n8591m5621r722n5475p1600j8458p8954
5000C882466o0362m1129K3327p8190n1944o8669J0048k3154q4958l5797m9160
$$ y = [13653753, 13387554, 13176250, 12854879, 12568195, 12295101, 12033881, 11739054, 11570578, 11324127, 11084938, 10864806, 10645351, 10420896, 10212926, 9970344, 9750717, 9546687, 9396579, 9223748, 9041720, 8847466, 8695620, 8514428, 8329490, 8172173, 8023057, 7929546, 7750693, 7630428, 7498412, 7352426, 7194291, 7049936, 6888005, 6792840, 6709085, 6565159, 6382532, 6229732, 6182094, 6122654, 6027373, 5894349, 5783183, 5733557, 5676867, 5592648, 5492254, 5349534, 5252987, 5146857, 5056870, 4944736, 4898138, 4903606, 4856636, 4744530, 4663272, 4571465, 4465974, 4365442, 4356166, 4332329, 4220887, 4162296, 4116675, 4106953, 4051478, 3979878, 3961420, 3882466, 3822104, 3780975, 3804302, 3726112, 3674168, 3605499, 3615547, 3592393, 3507435, 3471638, 3422478]
4989C422478L5348n6917J5181m3014J1229K4136k1278n8113p2850q5955P205M7334
4977C224784n5727p3379m0633o783P827n9677n9841j2072n1105o276k9641l1601
4965B805876K9890r9110k9453j1325l4949n8952q0677j0381j762j2311J6064l589
4953B509321j6456j7350j3738j7454k4468j8739N753j8219l9056K2115r600J605
4941B363714n491m027Q306j5376j5356j6310L0241J3892K5894o8727l638j9719
4929B293403K6152J4304p233N2150l9126O864L9030l0693O6295N3988n5692L724
4917B423166J4211q776o834K7150K1978l1883J357q1340o8670J7833j000J0579
4905B317771q4400p7069p6445l3527L752l4512k8860j577k5404m4942l7111k3860
$$ y = [3422478, 3457826, 3400909, 3416090, 3373076, 3384305, 3408441, 3387163, 3329050, 3256200, 3170245, 3177450, 3224784, 3169057, 3095678, 3055045, 3048262, 3056089, 2996412, 2936571, 2924499, 2873394, 2867118, 2837477, 2805876, 2835766, 2736656, 2707203, 2695878, 2660929, 2601977, 2521300, 2510919, 2509157, 2496846, 2512910, 2509321, 2492865, 2475515, 2461777, 2444323, 2419855, 2401116, 2406869, 2388650, 2349594, 2371709, 2362109, 2363714, 2358223, 2354196, 2362502, 2347126, 2331770, 2315460, 2345701, 2359593, 2385487, 2316760, 2313122, 2293403, 2319555, 2333859, 2326626, 2378776, 2339650, 2346514, 2385544, 2354851, 2421146, 2475134, 2419442, 2423166, 2437377, 2428601, 2421767, 2448917, 2470895, 2439012, 2440369, 2359029, 2290359, 2308192, 2307192, 2317771, 2233371, 2156302, 2079857, 2046330, 2050082, 2015570, 1986710, 1985133, 1959729, 1914787, 1877676, 1853816]
4893A853816j5646k7289j8282o4877j8890K9365m0361l4933L4499j9366k7357
4882A650679l8780k0417n4869K8073N078K4767l4719L1639R261o970n1111n1916
4870A490715J9401L4777m1266J298L5252k1503k8494j4602j0670l7076j5858l3893
4858A378081L9987J2953k248k0779r499L1270j7505j3458K5510M1525N1511J7829
4846A535177p1804m8015Q861R490M2044j546j9914N109M472j4706J038L5902K7719
4833A513827K2026m988m3237K9016K3898J2913o9037P38K4164m9090n2635J6368
4821A423963j3863K5555J1685M3114o0739J010r750M5357J2111j4173L484N732
4809A473486j2233m5655j6255O0606l9245K2910O9387J5336J8091j5341J5889
$$ y = [1853816, 1838170, 1810881, 1792599, 1727722, 1708832, 1738197, 1697836, 1662903, 1697402, 1678036, 1650679, 1611899, 1591482, 1536613, 1564686, 1569764, 1594531, 1559812, 1591451, 1600712, 1593742, 1542631, 1490715, 1510116, 1544893, 1503627, 1504925, 1540177, 1518674, 1490180, 1475578, 1464908, 1427832, 1411974, 1378081, 1418068, 1431021, 1428773, 1407994, 1398495, 1429765, 1412260, 1398802, 1424312, 1465837, 1517348, 1535177, 1463373, 1415358, 1424219, 1433709, 1475753, 1474207, 1454293, 1459402, 1463874, 1449168, 1450206, 1486108, 1513827, 1535853, 1530865, 1487628, 1516644, 1540542, 1553455, 1484418, 1485156, 1509320, 1460230, 1407595, 1423963, 1410100, 1435655, 1447340, 1490454, 1429715, 1430725, 1420975, 1466332, 1478443, 1464270, 1467754, 1473486, 1461253, 1415598, 1399343, 1459949, 1420704, 1443614, 1513001, 1528337, 1546428, 1531087, 1546976]
4798A546976M0465J3427m8070m8821P14Q6300O2696m5215K5444m0982K7842K5786
4786A646562m877J3928J1323L487M5832n788J0679l6816j398O6147J6817l9843
4774A726053N5043p058n304K8130J1214K2680N703N7157J0312m824j604R6229
4762A993731K2582J9672K3751l6658O4848j4570m0498j6921j6397M3251K0387
4751B063178M6366J9038k669K7046N8507L0690N8282o3674Q28L1919N1140L7143
4739B357794L2324j0144J04893N4260P610Q247O4601N2021M3960P5209L8913L5681
4727B865369P3656N9106P8363M6848R7853M3475L6751N7513J11671O3990N0946
4716C585541L6957N2227Q8991O7121R4922J9668P9289J07857L8077O2327J04767
$$ y = [1546976, 1587441, 1600868, 1552798, 1503977, 1504691, 1590991, 1653687, 1608472, 1633916, 1592934, 1620776, 1646562, 1641685, 1655613, 1666936, 1670423, 1716255, 1710467, 1721146, 1684330, 1682932, 1749079, 1765896, 1726053, 1781096, 1774038, 1768734, 1796864, 1808078, 1830758, 1836461, 1893618, 1903930, 1899106, 1897502, 1993731, 2016313, 2035985, 2059736, 2023078, 2087926, 2073356, 2032858, 2015937, 1999540, 2042791, 2063178, 2109544, 2128582, 2125913, 2152959, 2211466, 2242156, 2300438, 2236764, 2237592, 2269511, 2320651, 2357794, 2390118, 2379974, 2484867, 2539127, 2546737, 2554984, 2619585, 2671606, 2715566, 2790775, 2829688, 2865369, 2939025, 2998131, 3076494, 3123342, 3221195, 3264670, 3301421, 3358934, 3470605, 3534595, 3585541, 3622498, 3674725, 3763716, 3830837, 3925759, 3945427, 4024716, 4132573, 4170650, 4232977, 4337744]
4705D337744J02383J37123J04140R0990J51511K09836K32005K10919L26085K36975
4695F139711K78568L78811L70384M36138M93212N29239O30949N78896N37919N08502
4685A0882329L09695Q8703m4358j90883l06362l22172k58013k40391j26085J2578
4675I805041R8595K07974K53378L00385M07701M11732M50073L96221J81887k4690
4665A2488297j88828l49535n05791n65897n10019n30934l67102l63191k45482
4656H861518k08706j42719o6704o8758N5194R3147M5172J01995J72388J89874
4646I032401K31007K82388K93462K98399M31512N06552N86113P03790P24813Q43295
4636A3933732R86845R63324J082148J058158R84858Q29529M22970M3781k19032
$$ y = [4337744, 4440127, 4577250, 4681390, 4772380, 4923891, 5133727, 5365732, 5576651, 5902736, 6139711, 6418279, 6797090, 7167474, 7603612, 8096824, 8626063, 9257012, 9835908, 10373827, 10882329, 11192024, 11280727, 11236369, 11045486, 10739124, 10416952, 10158939, 9918548, 9792463, 9805041, 9903636, 10111610, 10364988, 10665373, 11073074, 11484806, 11934879, 12331100, 12512987, 12488297, 12299469, 11949934, 11444143, 10878246, 10368227, 9837293, 9470191, 9107000, 8861518, 8652812, 8510093, 8443389, 8374631, 8429825, 8522972, 8568144, 8670139, 8842527, 9032401, 9263408, 9545796, 9839258, 10137657, 10569169, 11075721, 11661834, 12365624, 13090437, 13933732, 14920577, 15883901, 16966049, 18024207, 19009065, 19838594, 20261564, 20305345, 20086313]
4627B0086313n24581o46777p71612o92960n41219l41185k56149L5902J85398K57653
4617A6790783L53555N01603M26980L62277J55505j10308m11614p29038r86420
4608A6353323j118419j152920j069676j065807r30014p86115o75467n25375m76944
4599H552586m16853l37794m00336k34140l08421k86311k03219j57076j50846j70049
4589E887541j47894q9479l9849j69829j33127p3368l3874j14801m4615K5811m5708
4578E020808o4591K7969J7711j9115Q543J1939r482J4109J9885L278N8521l8921
4566E050654m4439O5850R1406R8110l5131M5710Q7125L1660J03376K8374P7605
4555E600300J32626J51692Q5663J23992J83763J98234K04804J95889K47010L02590
$$ y = [20086313, 19561732, 18914955, 18143343, 17450383, 16909164, 16567979, 16311830, 16347732, 16533130, 16790783, 17144338, 17645941, 18072921, 18435198, 18590703, 18480395, 18068781, 17339743, 16353323, 15234904, 14081984, 13012308, 11946501, 11016487, 10230372, 9554905, 9029530, 8552586, 8135733, 7797939, 7397603, 7163463, 6855042, 6568731, 6365512, 6208436, 6057590, 5887541, 5739647, 5650168, 5610319, 5440490, 5307363, 5233995, 5200121, 5085320, 5040705, 5066516, 5020808, 4956217, 4984186, 5001897, 4982782, 4991325, 5003264, 4993782, 5007891, 5027776, 5031054, 5089575, 5050654, 5006215, 5072065, 5163471, 5261581, 5226450, 5272160, 5359285, 5390945, 5494321, 5522695, 5600300, 5732926, 5884618, 5970281, 6094273, 6278036, 6476270, 6681074, 6876963, 7123973, 7426563]
4545G426563M53574L94254M16136N02941N95465O98430P84071Q89810R95057J087919
4535A4244220J202289J130596J041221P25291L19734j43879o35578r62088j206429
4526A5715377j166134j047556r35558q61006o54524n05781m46607m22222k73446
4517I402543k05153j54681q2157j6270q718P9901J22620J64646K31012K84190
4507I817933L61697L79691M95692N80467P34016Q57860R53500J057360J039258
4498A6277474Q93058P11846L35907j34242m74894p69279j046185j016005r66767
4489A3810913p66366o38816m65079k96948j75079o1341J02814K02756K28348L34603
4479A2275805L86557L37758K36786o1486k82245o14220p67028p92569p31954n66172
$$ y = [7426563, 7880137, 8274391, 8690527, 9193468, 9788933, 10487363, 11271434, 12161244, 13156301, 14244220, 15446509, 16577105, 17618326, 18343617, 18663351, 18519472, 17883894, 16921806, 15715377, 14549243, 13501687, 12566129, 11705123, 11050599, 10544818, 10098211, 9675989, 9402543, 9197390, 9042709, 8960552, 8944282, 8935564, 9015465, 9138085, 9302731, 9533743, 9817933, 10179630, 10559321, 11055013, 11635480, 12369496, 13227356, 14180856, 15238216, 16277474, 17170532, 17882378, 18218285, 18084043, 17609149, 16839870, 15793685, 14777680, 13810913, 13044547, 12405731, 11940652, 11643704, 11468625, 11407284, 11510098, 11712854, 11941202, 12275805, 12662362, 13000120, 13236906, 13175420, 12893175, 12278955, 11511927, 10719358, 9987404, 9421232]
4469I421232m91981m60997l59077l18776k67034k17607j64846j52923j55745r3385
4459F738861j18076j47710m4293O629L2993N0233J44774J66722J84643K51535
4449G266311L41797M18882M39578M89422N04594M54690M56017K53566J3051l29859
4439A0308049n85014o24458o64799o34712n44455m44265l34623k99306j61378
4430F015039j67682j20622o3962n6944r9920j10003j30525j61986j59728j29237
4420D814430j45229j25931j85234j40180j03671j26559j43392j52289r5708j03664
4410C492573j24734o3134o0625k4420K0348l8934L24m353K2104m0168J8661L4085
4398C231727K4378n7069k6212P7646J1031l5239K8724J2810M6817N9519M3930
$$ y = [9421232, 8929251, 8468254, 8109177, 7790401, 7523367, 7305760, 7140914, 6987991, 6832246, 6738861, 6620785, 6473075, 6428782, 6435411, 6468404, 6518637, 6663411, 6830133, 7014776, 7266311, 7608108, 8026990, 8466568, 8955990, 9460584, 9915274, 10371291, 10624857, 10637908, 10308049, 9723035, 9098577, 8433778, 7799066, 7254611, 6810346, 6475723, 6176417, 6015039, 5847357, 5726735, 5662773, 5605829, 5505909, 5395906, 5265381, 5103395, 4943667, 4814430, 4669201, 4543270, 4358036, 4217856, 4114185, 3987626, 3844234, 3691945, 3596237, 3492573, 3367839, 3304705, 3244080, 3219660, 3240008, 3201074, 3201398, 3197045, 3219149, 3178981, 3197642, 3231727, 3256105, 3199036, 3172824, 3250470, 3261501, 3226262, 3254986, 3267796, 3314613, 3374132, 3418062]
4387C418062j9041J3188l3955J2370J4966l3852O895m5312j9270j0552k8533j1116
4375C263850r3548M509n3165K2811r436L73R180k4754j5696m1172n7462l8636
4363B966854m829K8859o9987L4583J408k7570j163K9145L6464J7546m6475n143
4351B959692J113m5809k4942N2460N8928O2068O7926M8433M7567O4639R4251J10280
4339C496606Q3316J78794J34642J30231R8427P1590M7512K4928j35785j40105
4329C990156j40842j24955j89928r7238m9000m8284l0417l5770j9968j4400j02900
4318C136454l7666o1121l667j540j6682m5200Q724q927J0709P866N112J4830Q957
4305C017849M0596l0263l8770k2102j7982j8247N0024l3099n0038M0249R0921
$$ y = [3418062, 3399021, 3412209, 3378254, 3390624, 3405590, 3371738, 3378633, 3333321, 3314051, 3303499, 3274966, 3263850, 3170302, 3174811, 3121646, 3144457, 3135021, 3135394, 3144574, 3119820, 3104124, 3062952, 3005490, 2966854, 2962025, 2990884, 2920897, 2955480, 2956888, 2929318, 2928155, 2957300, 2993764, 3011310, 2964835, 2959692, 2960805, 2914996, 2890054, 2942514, 3001442, 3063510, 3131436, 3179869, 3227436, 3292075, 3386326, 3496606, 3579922, 3758716, 3893358, 4023589, 4122016, 4193606, 4241118, 4266046, 4130261, 3990156, 3849314, 3724359, 3534431, 3437193, 3388193, 3339909, 3309492, 3273722, 3253754, 3239354, 3136454, 3098788, 3037667, 3034000, 3032460, 3015778, 2970578, 2979302, 2970375, 2981084, 2988950, 2994062, 3008892, 3017849, 3058445, 3028182, 2989412, 2967310, 2949328, 2931081, 2981105, 2948006, 2897968, 2938217, 3029138]
4294C029138k4102K4712q001M9290N9731O3075j4796n4610j9295K0312K8555m1627
4282C112382l6166L2297o065J5360O21p203r393M9827M6108K6830n3361J929J2652
4269C185818J25554j2600O0838J9866P8493P5568N854r034L1239K0049O959O1691
4257C650295M9543L9842J2157J0247M3446M1958M7511M2282Q8574O1982J1266
4246D099103P185P482k0614O1708m0160N5276M6920P2359N3863P2740J04493J17072
4234D637427P2591J05061J49669J03301N5230R3240Q3684R7221M3213R1237M3582
4223E575456k166k8983N9600N8992R0633L8737J02580M3383P1859P8722Q0574
4212F169387N6545R3391J50876Q2790J56687J59464J19039J01842J34397J94399
$$ y = [3029138, 3005036, 3029748, 3021747, 3071037, 3130768, 3193843, 3179047, 3124437, 3105142, 3125454, 3154009, 3112382, 3076216, 3108513, 3102448, 3117808, 3118429, 3111226, 3101833, 3151660, 3197768, 3224598, 3171237, 3173166, 3185818, 3311372, 3298772, 3359610, 3379476, 3457969, 3533537, 3539391, 3530357, 3561596, 3581645, 3588604, 3650295, 3699838, 3739680, 3751837, 3762084, 3805530, 3847488, 3894999, 3937281, 4025855, 4087837, 4099103, 4106288, 4113770, 4093156, 4154864, 4114704, 4169980, 4216900, 4289259, 4343122, 4415862, 4520355, 4637427, 4710018, 4815079, 4964748, 5068049, 5123279, 5216519, 5300203, 5397424, 5440637, 5531874, 5575456, 5573290, 5544307, 5603907, 5662899, 5753532, 5792269, 5894849, 5938232, 6010091, 6088813, 6169387, 6225932, 6319323, 6470199, 6552989, 6709676, 6869140, 6988179, 7090021, 7224418, 7418817]
4202G418817J39288J70751J68909K04320J92734K30534J65716J87159K06282K23621
4192I308131J90666K36962K38025K58278L03546K62154K60396K84903K72343L41836
4182A1957240L66532L65883M22770M83542M84095N34831N73368N29444N08413
4173A6226118N10590M63793M88938N37284M48655N54138N50249N68709N59084
4164B0907558P00481Q45964R34162R73926J090972J299788J469742J565334J752390
4155C1540317K002300K354662K572271K896767L356032L928903M734949N833757
4147E9219958O935958Q325124J0065318J2644909J5245187J6904995J7746565
4140A47088014J6357182J0403489R00003r809032j6596188j9298959j8497576
$$ y = [7418817, 7558105, 7728856, 7897765, 8102085, 8294819, 8525353, 8691069, 8878228, 9084510, 9308131, 9498797, 9735759, 9973784, 10232062, 10535608, 10797762, 11058158, 11343061, 11615404, 11957240, 12323772, 12689655, 13112425, 13595967, 14080062, 14614893, 15188261, 15717705, 16226118, 16736708, 17200501, 17689439, 18226723, 18675378, 19229516, 19779765, 20348474, 20907558, 21608039, 22454003, 23388165, 24362091, 25453063, 26752851, 28222593, 29787927, 31540317, 33542617, 35897279, 38469550, 41366317, 44722349, 48651252, 53386201, 59219958, 66155916, 74481040, 84546358, 97191267, 112436454, 129341449, 147088014, 163445196, 173848685, 174748688, 164939656, 148343468, 129044509, 110546933]
4133A10546933j6263443j3328294j0667708q526379o879482n483774m481868l588535
4125D1327450k920017k354816k066372j771091j667957j437147j361794j113291
4117B6634965j035661r05087q70351o59216o36846m67893n57398n41557m58020
4108B0502936l49878l16935k00452k56294j30063j55284n7214o0273P1044J1685
4098A9059272J22909M8055N4836J7973J05366J6413J28661J84880K82247J91435
4088B0212047L09741L85266M76145M57146N45809M97191N17548N56151M77558
4079B4434602L70009M10188M86159N48568M86736N59849O21370P14222Q51264
4070B9482967R74255J052720J163386J308139J465438J693697K134852K484188
$$ y = [110546933, 94283490, 80955196, 70287488, 61761109, 54881627, 49397853, 44915985, 41327450, 38407433, 36052617, 33986245, 32215154, 30547197, 29110050, 27748256, 26634965, 25599304, 24694217, 23823866, 23164650, 22527804, 22059911, 21502513, 20960956, 20502936, 20153058, 19836123, 19635671, 19379377, 19249314, 19094030, 19036816, 18976543, 19047587, 19059272, 19182181, 19230236, 19285072, 19303045, 19408411, 19424824, 19553485, 19738365, 20020612, 20212047, 20521788, 20907054, 21383199, 21840345, 22386154, 22883345, 23400893, 23957044, 24434602, 24804611, 25214799, 25700958, 26249526, 26736262, 27296111, 27917481, 28631703, 29482967, 30457222, 31509942, 32673328, 33981467, 35446905, 37140602, 39275454, 41759642]
4062D1759642K692068L240976L785107M261652M552934N812698P103348Q855184
4054H2063609J0073216J2931309J6955795K5370511K4879769K3282635L2737605
4047B28294449K8978777n401661k2086391l2660090l3887321k9908311k6371282
4040A06958170j7070326j2838110q979254p258406n184844m684637k950871k498233
4032D5493489j870709j915754j423299j421187j082761j155170p95451q77166
4024C4951992m20089n39490k51258l94153j48299k88620j23615l49786k74509
4015C2162173l83397k39296l51503k60513m17342k05436j32970Q7508R494K05331
4005C0474049J06114O5536j50948j49332m16667m49179o41194o54658p49677o64132
$$ y = [41759642, 44451710, 47692686, 51477793, 55739445, 60292379, 66105077, 73208425, 82063609, 92136825, 105068134, 122023929, 147394440, 172274209, 195556844, 228294449, 257273226, 251871565, 229785174, 197125084, 163237763, 133329452, 106958170, 89887844, 77049734, 68070480, 60812074, 55627230, 50942593, 47991722, 45493489, 43622780, 41707026, 40283727, 38862540, 37779779, 36624609, 35829158, 34951992, 34531903, 33992413, 33741155, 33347002, 33198703, 32910083, 32786468, 32436682, 32162173, 31778776, 31539480, 31187977, 30927464, 30510122, 30304686, 30171716, 30259224, 30268718, 30474049, 30580163, 30645699, 30494751, 30345419, 29928752, 29479573, 28838379, 28183721, 27434044, 26769912]
3995B6769912o53029m87373m59398l08306l75533l28552l89462l17703n14373
3986B2936183n89424p91225p39522r34626q66351q18529o67893o27246n67316
3977A6334051n30304n02698n63833m82705n50809m92561n42771n70700o30321
3968A1467349n47986n22446m43667m50669m09224l99245m52572l28536k61779
3959G651225l27521k88309k25416k67262k60707k18410j62581k04844j68117j52492
3949E375566j31431j61914j47534j67338j97351j48874j86629q6024j58506j32755
3939C857210j22759p2179p6919p4317p665l2549k8450m6204m8920q7592q5933
3928C173723j05228M12j03310q2423r0357m4997M13q555o8710k0285k7516N411
$$ y = [26769912, 26116883, 25629510, 25170112, 24861806, 24486273, 24157721, 23768259, 23450556, 22936183, 22346759, 21555534, 20816012, 19881386, 19015035, 18196506, 17528613, 16901367, 16334051, 15803747, 15301049, 14737216, 14254511, 13703702, 13211141, 12668370, 12097670, 11467349, 10919363, 10396917, 9953250, 9502581, 9093357, 8694112, 8241540, 7913004, 7651225, 7323704, 7035395, 6809979, 6542717, 6282010, 6063600, 5901019, 5696175, 5528058, 5375566, 5244135, 5082221, 4934687, 4767349, 4569998, 4421124, 4234495, 4148471, 3989965, 3857210, 3734451, 3662272, 3585353, 3511036, 3503371, 3470822, 3442372, 3396168, 3347248, 3259656, 3173723, 3068495, 3068907, 2965597, 2883174, 2792817, 2747820, 2748233, 2739678, 2670968, 2650683, 2623167, 2628578]
3916B628578q6158k1949P941k1001p7316o378q0729J4088o6756q5422J3399P6639
3904B294936n8578K7335k3149j4252m6570k0022L0053K9646q89o0593r3936J5957
3892B079938n4658k4320R191N4677q512J0610n7706K2711p0823k3753K595J7138
3880A957088m3168J5502o0784o564r663o861n4386k2170M709M4233q2818o8664
3868A666454r867j2441m4233l2174n7553O1712O9836J7374N387N4697K0811k249
3856A737754j5887o660N2090L9390N3427N5727M8973O8236P330j31798o8229k7630
3844A812723p6424r3993r7931l4915l7188o0937p1015m7849L5725J4247p5089
3833A267354K110P0951l1226k2966K1669k1545l4583l9116j7699j9422M542M4772
$$ y = [2628578, 2542420, 2520471, 2528412, 2507411, 2430095, 2423717, 2342988, 2357076, 2290320, 2204898, 2218297, 2294936, 2236358, 2263693, 2240544, 2226292, 2179722, 2159700, 2189753, 2219399, 2218510, 2157917, 2063981, 2079938, 2025280, 2000960, 2010151, 2064828, 2056316, 2066926, 2009220, 2031931, 1961108, 1937355, 1939950, 1957088, 1913920, 1929422, 1868638, 1862074, 1852411, 1845550, 1791164, 1768994, 1773703, 1817936, 1735118, 1666454, 1656587, 1644146, 1599913, 1567739, 1510186, 1571898, 1641734, 1659108, 1664495, 1719192, 1740003, 1737754, 1721867, 1715207, 1767297, 1806687, 1860114, 1915841, 1964814, 2033050, 2040380, 1908582, 1840353, 1812723, 1736299, 1642306, 1544375, 1509460, 1472272, 1411335, 1340320, 1292471, 1328196, 1342443, 1267354, 1269464, 1340415, 1309189, 1286223, 1307892, 1286347, 1251764, 1212648, 1194949, 1175527, 1180069, 1224841]
3821A224841n9335n1488L0349j9132m5335l061j2735L4596J9680L6906O617L3648
3809A195551m3402j5831l1279l4557M1296p160J4840R797j3948J1856O5930M4105
3797A237198j6803M467j7804n8879j839J1335k2371j8683J6645Q731M849M3553
3785A190399K2594M0210o7527L3172j1809L1414k080Q373p185J7728O0848k0580
3773A295557P255L7399m0542N2067K5010K2947L7814K5974L7248O0837N4166J19247
3761A734979J45775J13628J02919R1374K3638p026n6748j02732j75555p7928n3013
3750A739311q7269p8688n7041o4611p094L6879j0357n8219k959j00922J1733K1368
3738A342131l0161j6569K5684M6408R488l8800j7794l5652p185J7559J921l4553
$$ y = [1224841, 1165506, 1114018, 1144367, 1125235, 1079900, 1076839, 1064104, 1098700, 1118380, 1155286, 1161903, 1195551, 1152149, 1136318, 1105039, 1070482, 1111778, 1104618, 1119458, 1129255, 1115307, 1127163, 1193093, 1237198, 1220395, 1224862, 1207058, 1148179, 1146340, 1157675, 1135304, 1116621, 1133266, 1141997, 1146846, 1190399, 1212993, 1253203, 1185676, 1218848, 1207039, 1238453, 1236373, 1244746, 1237561, 1255289, 1316137, 1295557, 1302812, 1340211, 1299669, 1351736, 1376746, 1399693, 1437507, 1463481, 1500729, 1561566, 1615732, 1734979, 1880754, 1994382, 2097301, 2188675, 2212313, 2205287, 2148539, 2045807, 1870252, 1792324, 1739311, 1652042, 1573354, 1516313, 1451702, 1444608, 1481487, 1471130, 1412911, 1409952, 1309030, 1320763, 1342131, 1311970, 1295401, 1321085, 1367493, 1376981, 1338181, 1320387, 1284735, 1277550, 1295109, 1297030, 1262477]
3726A262477M3508J574l7134p139k3930o178J9937M1330K2933m9718L2568m7093
3714A253135j3514J966j4471M4945K0542n8445K3162m37K9723p873j3796j3749
3702A251188j7214R0292L0988l4653r960L3510L483K3568j4521l4335K4760L1647
3690A378753j205l013k8092N8546K5639l9370j9485J4572j9812K7926K5831P497
3678A427787J526O3029J3224k5546k7437L6072K7840m0853J9714m595j2866Q4796
3666A562691o904J2442k5420p545L9326M5533N6570R9210r9044J2139K6106k8177
3654A686927l655Q1542L3006m1553j0693m325l7669M3036L4371O2939n8486j9095
3642A766345l0637R30N5163P8152j6779j995Q332r901j3536k5055N1332J8888
$$ y = [1262477, 1305985, 1307559, 1270425, 1263286, 1239356, 1233178, 1253115, 1294445, 1317378, 1267660, 1300228, 1253135, 1239621, 1241587, 1227116, 1272061, 1292603, 1234158, 1257320, 1256883, 1286606, 1278733, 1264937, 1251188, 1233974, 1324266, 1355254, 1320601, 1310641, 1344151, 1347634, 1371202, 1356681, 1322346, 1347106, 1378753, 1377548, 1374535, 1346443, 1404989, 1430628, 1391258, 1371773, 1386345, 1366533, 1394459, 1420290, 1427787, 1429313, 1492342, 1505566, 1480020, 1452583, 1488655, 1516495, 1475642, 1495356, 1490761, 1477895, 1562691, 1555787, 1568229, 1542809, 1535264, 1574590, 1620123, 1676693, 1775903, 1676859, 1688998, 1715104, 1686927, 1683272, 1764814, 1797820, 1756267, 1745574, 1741249, 1703580, 1746616, 1780987, 1843926, 1785440, 1766345, 1735708, 1736638, 1791801, 1869953, 1853174, 1851179, 1859511, 1849610, 1836074, 1811019, 1862351, 1881239]
3630A881239j1701K7345L5316N986K7590k7549L558P1648J7780J6698L1379K0617
3618B099906n742N6834k5141M7721J07776P991l6951L360M8984M232O834L8977
3606B354781R188M0855K8051N6372J4855P5331K5205J5467O6071N6743N2215R9815
3594B894949R5201N763N8586N5864J19275Q2588M4609P0668J30587N3670P108
3583C618868K4769M2135J0567J0983N6215M8963k2929L1336K8392j8174l1339
3572C799786l0601k490k3426M777N7052k3002n6248o6190J2292l4826o8794k4144
3560C544186m323m8409l6068L056p1669j164K4512n8490l8908L1819k640o562
3548C335340K0455N1162K8088j3685J5306O1168O7468P0174R1091L8152M5548
$$ y = [1881239, 1869538, 1896883, 1932199, 1938185, 1965775, 1938226, 1941784, 2013432, 2031212, 2047910, 2079289, 2099906, 2094164, 2150998, 2125857, 2173578, 2281354, 2289345, 2252394, 2255754, 2304738, 2308970, 2315804, 2354781, 2363969, 2404824, 2432875, 2489247, 2504102, 2579433, 2604638, 2620105, 2686176, 2742919, 2795134, 2894949, 2990150, 2995913, 3054499, 3110363, 3229638, 3312226, 3356835, 3427503, 3558090, 3611760, 3618868, 3643637, 3685772, 3696339, 3707322, 3763537, 3812500, 3789571, 3820907, 3849299, 3831125, 3799786, 3769185, 3766695, 3743269, 3748046, 3805098, 3782096, 3725848, 3659658, 3671950, 3637124, 3568330, 3544186, 3539863, 3491454, 3455386, 3458442, 3386773, 3385609, 3410121, 3351631, 3312723, 3344542, 3341902, 3335340, 3355795, 3406957, 3435045, 3421360, 3436666, 3497834, 3565302, 3635476, 3726567, 3764719, 3810267]
3537C810267J2656M4485K9697K3424R1972P3604P6340J07210K6311O2292N0379
3526D408637M2859J3784J708N0458N5242L1678R6267k3873L1313J6671L5463J4703
3514D774910Q318P7888N2506j7116j221L5898K5560O253O1207j8614L9329K1136
3502E066054O3692Q174N348m632Q4969M9171N3692j5980O148J53367N0628N870
3490E526501O0178J58732O1809P6833J01007Q5321J65479O1978J44885J43848
3480F586571J25895R5708J31839R3593R9036J48413J73914Q3093Q1377J39247
3470G758686J08103J75889J28615J23344R7160Q2078P4539J19113R4572J32009
3460H894108N5031J09128O4270L0947O9222R0204R5073L7255O0415N5896K1243
$$ y = [3810267, 3822923, 3867408, 3897105, 3920529, 4012501, 4086105, 4162445, 4269655, 4295966, 4358258, 4408637, 4451496, 4465280, 4466988, 4517446, 4572688, 4604366, 4700633, 4676760, 4708073, 4724744, 4760207, 4774910, 4783228, 4861116, 4913622, 4896506, 4895285, 4931183, 4956743, 4962996, 5024203, 5005589, 5044918, 5066054, 5129746, 5137920, 5143268, 5138636, 5223605, 5272776, 5326468, 5310488, 5316636, 5470003, 5520631, 5526501, 5586679, 5745411, 5807220, 5884053, 5985060, 6070381, 6235860, 6297838, 6442723, 6586571, 6712466, 6808174, 6940013, 7033606, 7132642, 7281055, 7454969, 7538062, 7619439, 7758686, 7866789, 8042678, 8171293, 8294637, 8391797, 8473875, 8548414, 8667527, 8762099, 8894108, 8949139, 9058267, 9122537, 9153484, 9222706, 9312910, 9407983, 9445238, 9505653, 9561549, 9582792]
3449I582792M7327J60025q279K3913M919M7393O3828L753P8969R5678P0154Q2109
3437A0252581O9069J7844J25469R5992J35697J20049J35353Q1713J62815J00427
3427A1297009J24746J52713J68143J19324J30145J17232J54273J07343K56974
3418A2627902J76658K82603J94160J52029K00797K36544K05474J78260J98263
3409A4452690K85795K30813K55624K53285L23165L37891L49717L13553L45905
3400A7148438M58293M26791M50678N34492N34107N82318O68456O93684P81620
3391B2278877Q86281R75333J019614J273148J338475J388613J644057J742704
3383C2547102J930864K073680K239195K281069K293651K289867K191077K066374
$$ y = [9582792, 9630119, 9790144, 9781865, 9805778, 9810697, 9858090, 9921918, 9925671, 10004640, 10100318, 10170472, 10252581, 10321650, 10339494, 10464963, 10560955, 10696652, 10816701, 10952054, 11033767, 11196582, 11297009, 11421755, 11574468, 11742611, 11861935, 11992080, 12109312, 12263585, 12370928, 12627902, 12804560, 13087163, 13281323, 13433352, 13634149, 13870693, 14076167, 14254427, 14452690, 14738485, 14969298, 15224922, 15478207, 15801372, 16139263, 16488980, 16802533, 17148438, 17606731, 18033522, 18484200, 19018692, 19552799, 20135117, 20803573, 21497257, 22278877, 23165158, 24140491, 25160105, 26433253, 27771728, 29160341, 30804398, 32547102, 34477966, 36551646, 38790841, 41071910, 43365561, 45655428, 47846505, 49912879]
3375D9912879J847174J540950J273221Q45898N27303K33509J3737j28121k20485
3366E5846065l08144l83875l13650k99046l27728l83900n27179p77814j019290
3357E1505439j348390j618086j916098k145093k271101k270804k258651k242887
3349C5434329k097299j943757j747726j527434j391406j200214j083769r03623
3341B3539101p87967o64785n92868n31377m39684m22579l18578k51864k84630
3332A9244769j33356j24792j43649j20517n6046j7867j6555m4757R6310M8082
3322A8731622J40324Q9077J09964J21706J17232J05753J36413J22837J78518J42374
3312A9995820Q3174J07222K01555K85737K97463K02159K95300L44286L23860L18323
$$ y = [49912879, 51760053, 53301003, 54574224, 55420122, 55947425, 56180934, 56194671, 56066550, 55846065, 55537921, 55154046, 54840396, 54541350, 54213622, 53829722, 53302543, 52524729, 51505439, 50157049, 48538963, 46622865, 44477772, 42206671, 39935867, 37677216, 35434329, 33337030, 31393273, 29645547, 28118113, 26726707, 25526493, 24442724, 23539101, 22751134, 22086349, 21493481, 20962104, 20522420, 20099841, 19781263, 19529399, 19244769, 19111413, 18986621, 18842972, 18722455, 18666409, 18648542, 18631987, 18587230, 18683540, 18731622, 18871946, 18961023, 19070987, 19192693, 19309925, 19415678, 19552091, 19674928, 19853446, 19995820, 20078994, 20186216, 20387771, 20673508, 20970971, 21173130, 21468430, 21812716, 22136576, 22454899]
3302B2454899L32574L69719M39702L29550L84248M57650L92974L95495L73156
3293B5929967L45813M57210L99572L40901M40905M48711M22413M33222N13194
3284B9731908N76672N06476N72608N69741O29579O31422O80290O77704O92499
3275C5268899P19663P09111Q15210Q56597Q63401R37054J101247J070529J124336
3266D3466047J240230J407234J477551J559097J697639J826540J969028K135123
3258E6778489K380918K523962K693301K962316L224559L601890L901383M367125
3250H2433943M792245N121803N469420N664024N666861N528682N040368M387542
3242A24104888L556102K598540J598534P73523Q4221m73164p53952q93406p30992
$$ y = [22454899, 22787473, 23157192, 23596894, 23926444, 24310692, 24768342, 25161316, 25556811, 25929967, 26275780, 26732990, 27132562, 27473463, 27914368, 28363079, 28785492, 29218714, 29731908, 30308580, 30815056, 31387664, 31957405, 32586984, 33218406, 33898696, 34576400, 35268899, 35988562, 36697673, 37512883, 38369480, 39232881, 40169935, 41271182, 42341711, 43466047, 44706277, 46113511, 47591062, 49150159, 50847798, 52674338, 54643366, 56778489, 59159407, 61683369, 64376670, 67338986, 70563545, 74165435, 78066818, 82433943, 87226188, 92347991, 97817411, 103481435, 109148296, 114676978, 119717346, 124104888, 127660990, 130259530, 131858064, 132631587, 132715808, 132242644, 131488692, 130595286, 129864294]
3233A29864294o07336m33136l79663n57883q08851j303476j961125k627253l346471
3224A17839100m071184m560796m956166n024597m913063m711221m379066l989137
3216H1233870l556490l312096l032231k597488k348617j976346j688138j371058
3208F1351406j146889r52859p82008n89724m74475k24945q5876J24910K99829
3199E7519369M87826P32462R49417J151572J380862J466258J653074J850478J890469
3190F9081787K056253K208252K276639K377246K420630K409354K405794K393598
3182H7629553K255420K192267J931405J855777J639491J394182J208127Q33850
3174A00940072M46213Q3996l99944r72849j436306j857498k193374k514680k754974
$$ y = [129864294, 129256958, 128823822, 128444159, 127886276, 127077425, 125773949, 123812824, 121185571, 117839100, 113767916, 109207120, 104250954, 99226357, 94313294, 89602073, 85223007, 81233870, 77677380, 74365284, 71333053, 68735565, 66386948, 64410602, 62722464, 61351406, 60204517, 59251658, 58469650, 57879926, 57405451, 57180506, 57094630, 57219540, 57519369, 58007195, 58739657, 59689074, 60840646, 62221508, 63687766, 65340840, 67191318, 69081787, 71138040, 73346292, 75622931, 78000177, 80420807, 82830161, 85235955, 87629553, 89884973, 92077240, 94008645, 95864422, 97503913, 98898095, 100106222, 100940072, 101386285, 101470281, 101070337, 100097488, 98661182, 96803684, 94610310, 92095630, 89340656]
3165H9340656k788471k766580k796774k728484k574749k374053k306664k223284
3157F8781597k160339k172808k158381k159261k133541k106335k164428k067992
3149E1658512j937256j929881j801495j682925j478907j511842j398296j290952
3141C8626958j272783j164638j062032j093015j048575q91064r72114q21749p94813
3132B9506175o57228n97679n13994m79854m00850l30272k41598j84009j10796
3123B5989895r7605P510K6515J04295J95149J95140K12115K36868K27491K19841
3113B7317214K36572K60791K05887J70130K32867K33991K29226L14090K98207
3104B9498975L60507L61293L79172L99987M53291N15536O31693O82885P54142
$$ y = [89340656, 86552185, 83785605, 80988831, 78260347, 75685598, 73311545, 71004881, 68781597, 66621258, 64448450, 62290069, 60130808, 57997267, 55890932, 53726504, 51658512, 49721256, 47791375, 45989880, 44306955, 42828048, 41316206, 39917910, 38626958, 37354175, 36189537, 35127505, 34034490, 32985915, 32094851, 31122737, 30300988, 29506175, 28848947, 28251268, 27737274, 27257420, 26856570, 26526298, 26284700, 26100691, 25989895, 25892290, 25899800, 25926315, 26030610, 26225759, 26420899, 26633014, 26869882, 27097373, 27317214, 27553786, 27814577, 28020464, 28190594, 28423461, 28657452, 28886678, 29200768, 29498975, 29859482, 30220775, 30599947, 30999934, 31453225, 31968761, 32600454, 33283339, 34037481]
3095C4037481Q98061J069849J245873J327122J422424J426038J394238J353518
3087D4174604J241600J042262Q49124N84144L00183P5638k66881n75453q76462
3078D6548759j115734j281437j251282j174415j031676r50850o87447l30727j20777
3069C8604414J43670L69509N38475O65851P25561O69636O15519L29940N3856j99382
3059D2517049n53567r73730j303592j522519j755573j922942j945931j970503
3051C0568692j964918j809620j704313j500062j413017j316676j157959j016630
3043A8685497q84322p87488o89919o00412n42129m86768m37163l66549l33912
3034A3556835k62959l05404k36780k21675j73751k06386k21700j73807k02020
$$ y = [34037481, 34935542, 36005391, 37251264, 38578386, 40000810, 41426848, 42821086, 44174604, 45416204, 46458466, 47307590, 47891734, 48191917, 48267555, 48000674, 47425221, 46548759, 45433025, 44151588, 42900306, 41725891, 40694215, 39743365, 39055918, 38725191, 38604414, 38748084, 39117593, 39656068, 40321919, 41047480, 41717116, 42332635, 42662575, 42716431, 42517049, 41963482, 40989752, 39686160, 38163641, 36408068, 34485126, 32539195, 30568692, 28603774, 26794154, 25089841, 23589779, 22176762, 20860086, 19702127, 18685497, 17801175, 17013687, 16323768, 15723356, 15181227, 14694459, 14257296, 13890747, 13556835, 13293876, 12988472, 12751692, 12530017, 12356266, 12149880, 11928180, 11754373, 11552353]
3025A1552353j04896j34550j05941j41680q6735j8485l0587k4284j4217j1942
3015A0879036M2916N1409P5354J01634J46214J81608J12355J35415R2796j6966
3005A1801771L0314J5563q2927k32507k68220k61633l23369l98920m05415l80698
2995I493959m09100l53730l16455k94552k14253k35463k21859j75231j36138j41583
2985F995595o8856l9663p420j02307j14763l9376M285j13942m4065J9290P7131
2974F565909J9655k385l8042k6101J9189K4927K7826L6860L7703P8445M4767J6595
2962F805348J0627J43044K2317O1685N1169J04471L4842O2080Q6495j9309O5139
2951G427908J9259J7553O9630J32303J09539L5704K8787J22599Q4491O6155R2169
$$ y = [11552353, 11447457, 11312907, 11206966, 11065286, 10978551, 10960066, 10929479, 10905195, 10890978, 10879036, 10921952, 10973361, 11048715, 11150349, 11296563, 11478171, 11590526, 11725941, 11818737, 11801771, 11832085, 11847648, 11764721, 11532214, 11263994, 11002361, 10678992, 10280072, 9874657, 9493959, 9084859, 8731129, 8414674, 8120122, 7905869, 7670406, 7448547, 7273316, 7137178, 6995595, 6926739, 6887076, 6879656, 6777349, 6662586, 6623210, 6627495, 6513553, 6469488, 6488778, 6565909, 6585564, 6583179, 6545137, 6519036, 6538225, 6563152, 6590978, 6627838, 6665541, 6743986, 6788753, 6805348, 6815975, 6959019, 6981336, 7043021, 7094190, 7198661, 7233503, 7295583, 7382078, 7362769, 7427908, 7447167, 7464720, 7534350, 7666653, 7776192, 7811896, 7840683, 7963282, 8047773, 8113928, 8206097]
2940H206097L5238J7266O0262K7744J37997R9562Q9393J42535J92687J59408K19369
2929I387558J84438J26885J83297J96756K29673K85283J84028J93597K67353K43834
2919A1482702J59183J84343J67707K33246K40606K57451K94557K48859L01698
2910A3570352L60063K81596K55252L08362L37840K93402L48544L78573M08925
2901A6542909L85924M86539M52340M90943N16104N04372N26400N50965N46893
2892B1003389N41082N20695N18850O08090O40270O42060P52986P68317P62707
2883B6758446Q76419R06891J015680J014270J101406J252821J300096J328457
2875C5554486J386908J361092J166180R44488P63544P26885O65025P10541P00781
$$ y = [8206097, 8241335, 8258601, 8318863, 8346607, 8484604, 8584166, 8673559, 8816094, 9008781, 9168189, 9387558, 9571996, 9698881, 9882178, 10078934, 10308607, 10593890, 10777918, 10971515, 11238868, 11482702, 11641885, 11826228, 11993935, 12227181, 12467787, 12725238, 13019795, 13268654, 13570352, 13930415, 14212011, 14467263, 14775625, 15113465, 15406867, 15755411, 16133984, 16542909, 16928833, 17415372, 17867712, 18358655, 18874759, 19379131, 19905531, 20456496, 21003389, 21544471, 22065166, 22584016, 23192106, 23832376, 24474436, 25227422, 25995739, 26758446, 27634865, 28541756, 29557436, 30571706, 31673112, 32925933, 34226029, 35554486, 36941394, 38302486, 39468666, 40413154, 41176698, 41903583, 42568608, 43279149, 43979930]
2866D3979930P72459J000724J141122J244406J417498J654982J905202K065179
2858E5181502K276352K606092K885712L206379L470688L838702M280165M729737
2850H2475329N105786N674588O103331O662800P273548Q068409R037465J0292773
2842A40694029J1739621J3514248J5686874J8077130K0334241K1541884K0915435
2835B62503462J7504403J0329136n41104j2108220k1052739k5726656k6321338
2828B04586944k4335081k1041583j7461345j4376597j1933150r905152q333216
2821I7200820p146964o103524n361702m780070m342654l955077l609564l383063
2813E8518202l182166k884458k745140k588541k475839k382068k246212k125574
$$ y = [43979930, 44752389, 45753113, 46894235, 48138641, 49556139, 51211121, 53116323, 55181502, 57457854, 60063946, 62949658, 66156037, 69626725, 73465427, 77745592, 82475329, 87581115, 93255703, 99359034, 106021834, 113295382, 121363791, 130401256, 140694029, 152433650, 165947898, 181634772, 199711902, 220046143, 241588027, 262503462, 280007865, 290337001, 289795897, 277687677, 256634938, 230908282, 204586944, 180251863, 159210280, 141748935, 127372338, 115439188, 105534036, 97200820, 90053856, 83950332, 78588630, 73808560, 69465906, 65510829, 61901265, 58518202, 55336036, 52451578, 49706438, 47117897, 44642058, 42259990, 40013778, 37888204]
2805C7888204k016702j912677j760241j664280j504300j365739j245425j171029
2797B5247811j108773j014975q65718q15478q22087o86826o27978p30811p31888
2788A7843277o92534o39769n76709n91709n15153n54050n09614n25165m13512
2779A2825062m19487l39068l14879l63024l50399k95793k99684k51977j78902
2770A0011849l26255k92775k56471k51794k12495k20476k70753k45299k11525
2761G724006k15183k31889j66536k37093j49553j45798j43171j59831j76831j69337
2751E928784j63556j55384j47085j20110j03502j17310j44796p0926q6318j15046
2741D704751p5828q8530m3977n6573q5400j24275o0779n5635j14981q1517n7092
$$ y = [37888204, 35871502, 33958825, 32198584, 30534304, 29030004, 27664265, 26418840, 25247811, 24139038, 23124063, 22258345, 21442867, 20620780, 19933954, 19305976, 18575165, 17843277, 17150743, 16510974, 15934265, 15342556, 14827403, 14273353, 13763739, 13238574, 12825062, 12405575, 12066507, 11751628, 11388604, 11038205, 10742412, 10442728, 10190751, 10011849, 9685594, 9392819, 9136348, 8884554, 8672059, 8451583, 8180830, 7935531, 7724006, 7508823, 7276934, 7110398, 6873305, 6723752, 6577954, 6434783, 6274952, 6098121, 5928784, 5765228, 5609844, 5462759, 5342649, 5239147, 5121837, 4977041, 4906115, 4819797, 4704751, 4628923, 4540393, 4496416, 4439843, 4354443, 4230168, 4169389, 4113754, 3998773, 3917256, 3860164]
2730C860164j48749q5407p8551q5782r7125p7785l5627n6648l2410m7929n8949
2719C055202m7111l6268o8592m6100k9989j05267l0618l7488m0024p7153r231
2708B527361r469l3895l706l0197Q56l1098k9804j6055j0661k0944n173n5946
2696B281269k4879J6579k2833j6987L069o2200m5608k7090k7383l2435J3366k625
2684B052243j9195qn785n0164O538j4007l7979K1242l5330k2292j5950L1687n607
2671A905393o6520m5053m8856m8119m4602M343j8477o9817m9596L1775l9655l3060
2659A477756j3624k7916o1665o0311j14265m6163K8661k6777m4231l29k1901l6320
2647A052915J8310L9605k8001o5924k554o4711l3948P330J9139q383m2706l4957
$$ y = [3860164, 3711415, 3626008, 3547457, 3461675, 3364550, 3286765, 3251138, 3194490, 3162080, 3114151, 3055202, 3008091, 2971823, 2903231, 2857131, 2827142, 2721875, 2691257, 2653769, 2613745, 2536592, 2527361, 2517892, 2483997, 2480291, 2450094, 2450950, 2419852, 2390048, 2373993, 2363332, 2342388, 2337215, 2281269, 2256390, 2272969, 2250136, 2233149, 2236218, 2174018, 2128410, 2101320, 2073937, 2041502, 2054868, 2052243, 2033048, 2033040, 2027255, 1977091, 1983629, 1969622, 1931643, 1952885, 1917555, 1895263, 1879313, 1911000, 1905393, 1838873, 1793820, 1744964, 1696845, 1652243, 1656586, 1638109, 1568292, 1518696, 1550471, 1510816, 1477756, 1464132, 1436216, 1374551, 1314240, 1199975, 1153812, 1182473, 1155696, 1111465, 1111136, 1089235, 1052915, 1071225, 1110830, 1082829, 1016905, 1014351, 949640, 915692, 923022, 942161, 933778, 891072, 856115]
2635H56115o6248m3818Q23J1903J692k4871L0782m2887o1773L4103Q940L1029
2623G35790j1536m73L8248j8088k7660O40Q113k6462M0395k6703j2431M8440m1306
2610G06967o958J7524j7313l0859m7637J9070O1320m1352k5154j4152n642J9419
2598F35233P0123n5570J3913K7689j0367j0860J6896J8929m142j3111m534K7901
2586G12100Q639l5983N326O8263R470k1175n1329O60M1544K7629K5993K674O50
2573G94461j9211Q2324J6472m218j9523J218Q3079k464j4413K6560N7435N2009
2561A053729L8259M9698N6345j4335O2018M9796J30073J54677N0064K4954l2582
2550A622696k5458J7624j22944j28493j24586j13004j11481l9074j5887m7498
$$ y = [856115, 789867, 746049, 746872, 758775, 760467, 735596, 766378, 723491, 661718, 695821, 704761, 735790, 724254, 723781, 762029, 743941, 716281, 716921, 725034, 698572, 738967, 712264, 699833, 748273, 706967, 700009, 717533, 700220, 669361, 621724, 640794, 702114, 660762, 635608, 621456, 615814, 635233, 705356, 649786, 663699, 691388, 681021, 670161, 687057, 705986, 701844, 688733, 684199, 712100, 720739, 684756, 690082, 758345, 767815, 746640, 695311, 695971, 737515, 765144, 791137, 793811, 794461, 775250, 857574, 874046, 869828, 850305, 851523, 934602, 932138, 917725, 944285, 1001720, 1053729, 1091988, 1141686, 1198031, 1183696, 1245714, 1295510, 1425583, 1580260, 1630324, 1655278, 1622696, 1597238, 1614862, 1491918, 1363425, 1238839, 1125835, 1014354, 975280, 959393, 911895]
2540I11895p0647l7129m3925j7108n1459m8544k3559J1220L5913n3730j9241p6175
2528E17511l9148M611K9341k330l7127l8344o3411o046J201k3266k5561R643m450
2515C22624j0639j5342l111p2918L2772Q464l7903q345J2733L4183K1929j047
2503B83400l5691o0711J2536k8444j0836j8597L31k4278j9146p940Q010J576j2965
2490H7245M9767j6077m4894N87j6774K5336J658J8017M1967j7183L434j8599M615
2477A19099k867L557j2723L3140k7940M3927k7214k3201m490l077J8131m6031
2465G0311j9616M6801l3536j3788k1997o945J7595k995n138J8131K4407m8069
2453B5161m3752N0713P8425N382k8310R580J2704j8126j9429L946j8696J4213
$$ y = [911895, 841248, 804119, 760194, 743086, 691627, 643083, 619524, 630744, 666657, 612927, 593686, 517511, 478363, 482974, 512315, 509985, 472858, 434514, 371103, 365057, 366258, 342992, 317431, 327074, 322624, 311985, 296643, 293532, 220614, 253386, 261850, 223947, 215602, 228335, 262518, 284447, 283400, 247709, 186998, 199534, 171090, 160254, 141657, 141988, 117710, 98564, 90624, 98634, 100210, 87245, 137012, 120935, 76041, 76628, 59854, 85190, 86848, 104865, 146832, 129649, 133083, 114484, 119099, 116232, 119789, 107066, 140206, 112266, 156193, 128979, 105778, 101288, 98211, 116342, 70311, 50695, 97496, 63960, 50172, 28175, 21230, 38825, 35830, 30692, 48823, 73230, 25161, -18591, 32122, 110547, 115929, 87619, 97199, 109903, 91777, 72348, 76294, 57598, 71811]
2441G1811l1928L3889Q202n3072N6426M1747o3892q33j1252k5928j1229L4028
2429D7969n224Q121m403m611L3549q142N5528l3090r521R942L142n23k3807k1686
2415D7244J5674K6599l2639j3305j8083k0703P4235K3684m7469q736L407j8733
2403C1175k211K35j4076j0573j1306M4307j7870l192K5072L8017o9390j7572N2526
2390D5142L7809J7415p1641m334l129K5246L9681O537o3697n8324J0165K9415
2378A0285P3511L0941l6838j0782j3342l4332L5641p829j2451M3170L5918m6714
2366F7178k2309M8478L541L0286l4872p630p1440M7028n005K0021k103P298j2264
2353F8207M5745k5448r692l0089j1292M1715l8412n4159m776M3351q930l95J0803
$$ y = [71811, 39883, 73772, 81974, 28902, 85328, 127075, 63183, 62350, 51098, 25170, 13941, 47969, 42745, 50866, 46463, 41852, 75401, 67259, 122787, 89697, 80176, 90118, 93260, 92737, 68930, 47244, 62918, 89517, 56878, 43573, 25490, 4787, 79022, 102706, 55237, 46501, 49908, 31175, 28964, 29199, 15123, 4550, -6756, 37551, 19681, 16489, 41561, 79578, 10188, -7384, 45142, 82951, 100366, 28725, 24391, 21262, 46508, 86189, 92726, 29029, -29295, -19130, 10285, 83796, 114737, 77899, 67117, 53775, 19443, 55084, 47255, 34804, 77974, 113892, 67178, 44869, 93347, 96888, 127174, 92302, 84672, 13232, 60260, 55255, 75276, 73173, 80471, 68207, 113952, 88504, 78812, 48723, 37431, 79146, 40734, -13425, -18201, 25150, 16220, 15825, 26628]
2340B6628k9376k8616J3111K2986M5925l4747j9716m9587n7402K013L3744R9627
2328B4590M3533m377o3916K0095J2017m0825K3701J6623L1436k7006n8787n954
2316b8870K9148L2685j7273l5745N0105P5857K2060j05305n9272o356J7736m0977
2304f6207J8566K5231R833k2801p038P064N8158J0773p999k9625l1383l99j2685
2291d8512M672j7855K2172R941J7985N397L1008l8795l9313Q0420K0330j9044
2279B8406p535J2646j5884j6806m2987l0637n209M1189j3239j1567K7727L7014
2267C118P186l7427k0288O9715L4760n3954p1141K2018K0068M151n467J2087L4850
2254A9676k1911o6205L1017J9313J6897K7431j4130k0450o651l2642L3087q218
$$ y = [26628, -2748, -31364, -18253, 4733, 50658, 15911, -3805, -53392, -110794, -108781, -75037, 24590, 68123, 63746, -170, 19925, 31942, -8883, 14818, 31441, 62877, 35871, -22916, -28870, 278, 32963, 15690, -20055, 30050, 105907, 127967, 22662, -36610, -42966, -25230, -66207, -47641, -22410, -12577, -35378, -42416, -35352, 22806, 33579, 25580, -4045, -35428, -35827, -48512, -43840, -61695, -39523, -29582, -11597, -6200, 24808, -13987, -53300, 27120, 47450, 28406, 20871, 33517, 17633, 827, -42160, -72797, -78006, -36817, -50056, -61623, -33896, 3118, 10304, -27123, -47411, 22304, 57064, 3110, -68031, -46013, -25945, -21794, -27261, -15174, 19676, -2235, -68440, -37423, -18110, -1213, 26218, 12088, -8362, -15013, -47655, -14568, -22786]
2242b2786Q134J3784l3619O1007J0060n2917l291j9117k4957K0412R867Q4390
2230E0967o0501j7915M205O4542j9981L1690R918o9906N745J9616N2941J7253
2218H8574o8500L8291o2674k2061N4957j9919O614l9279K3284P9591O438m0185
2206D5131N2138k4367P283K0793Q665l1999k372L7435R163l2561N407l1083o92
2193F2941J9627m7620M9804l1097l550j5024O9654j2774k1827J0002O303J3355
2181I9794M3162K8432P277p067o5713P8429J1176j8615J443r433K9276j8795L951
2168A83317J9929J3165k4200k0253O049k7998p714J5522M0759M8957J2879M13
2156B60825k9808J2399j232R783O6168N89j1404J6768K1316J1303j582K0922L5159
$$ y = [-22786, -14652, -868, -34487, 26520, 36580, -16337, -19628, -38745, -63702, -43290, -33423, 50967, -9534, -27449, -23244, 41298, 21317, 53007, 62925, -6981, -1236, 18380, 71321, 88574, 20074, 58365, -4309, -26370, 28587, 8668, 15282, -23997, -713, 78878, 85316, 45131, 97269, 72902, 80185, 100978, 109643, 77644, 75272, 112707, 121870, 89309, 94716, 63633, 62941, 82568, 34948, 84752, 53655, 50105, 35081, 104735, 91961, 70134, 80136, 86439, 99794, 142956, 171388, 178665, 171598, 105885, 184314, 195490, 176875, 178318, 168885, 198161, 179366, 183317, 203246, 216411, 192211, 171958, 178007, 150009, 142295, 157817, 198576, 247533, 260412, 260825, 231017, 243416, 242184, 251967, 318135, 318724, 307320, 324088, 345404, 356707, 355125, 376047, 411206]
2143D11206m719m0513K4431K2832J3019J1129L9095K1626M7994j1380P0774K4750
2131F30244m767L4797K1464O0564J8139J1889N1322O6365L715K8217P2120M1909
2119A035978l9602R5704P2630N043K7749j3192L6453R1580O6720N0471J0520J28049
2107A568103J66874J42453J21603J33194J68987J11829K14250K64744J64258J68175
2097C224470K43650K76120M49075N18409O41816P32043J098913J419865K095236
2088A0699597K190579K196107K488136L55492k242835l151218k660252k166356
2080G709250j476673j083293p87280o10590m81110l48021k50010j92926j14396
2071B364951r0774r8849j11664j81279k15244r4582j22879p4855j07840j56723
$$ y = [411206, 406487, 365974, 390405, 413237, 426256, 437385, 476480, 498106, 546100, 534720, 605494, 630244, 625477, 660274, 681738, 742302, 760441, 772330, 823652, 890017, 893732, 921949, 994069, 1035978, 996376, 1092080, 1164710, 1169753, 1197502, 1184310, 1220763, 1312343, 1379063, 1429534, 1440054, 1568103, 1734977, 1877430, 1999033, 2132227, 2301214, 2413043, 2627293, 2892037, 3056295, 3224470, 3468120, 3744240, 4193315, 4711724, 5353540, 6085583, 7184496, 8604361, 10699597, 12890176, 15086283, 17574419, 17929911, 15687076, 12535858, 9875606, 7709250, 6232577, 5149284, 4362004, 3751414, 3270304, 2922283, 2672273, 2479347, 2364951, 2274177, 2175328, 2063664, 1882385, 1667141, 1572559, 1449680, 1374825, 1266985, 1110262]
2061A110262q2716m4597o510k6060j10401j07466J5372k1500o3702l3042l5224
2050E94416j0224K1607p0206k5932k2038j3735K2275J8555n4975n4134j9071k9882
2038C56656M0593k6694l9089P844n6069j0318k2736m1481L949N0363K2307j3753
2026B71572m3938P445o376o0804J4475O2789k7745o5944m1325L2397J0990J4433
2014A67969m0165j0139m9521J4682l8467Q6007J2771l3706j2040L8273j0096k7874
2002I7694r104k0204m4476M2508J8636l5340K1902J4783J8579j2705k2103k9244
1990D0926r188J818l5714L500L7977M819k7910K035J8453L914m5140j1506O3610
1977D7594K8284L5591l9699n6681k2703N7180l487o8459J120N0962m2570J3324
$$ y = [1110262, 1027546, 982949, 976439, 950379, 839978, 732512, 747884, 726384, 662682, 629640, 594416, 584192, 605799, 535593, 509661, 487623, 473888, 496163, 514718, 459743, 405609, 386538, 356656, 397249, 370555, 331466, 339310, 283241, 272923, 250187, 208706, 212655, 263018, 285325, 271572, 227634, 235079, 228703, 167899, 182374, 245163, 217418, 151474, 110149, 142546, 153536, 167969, 127804, 117665, 68144, 82826, 44359, 130366, 143137, 109431, 97391, 135664, 125568, 97694, 88590, 68386, 23910, 66418, 85054, 49714, 71616, 86399, 104978, 92273, 70170, 40926, 31738, 33556, -2158, 1342, 39319, 44138, 16228, 18263, 36716, 40630, -4510, -16016, 47594, 75878, 111469, 71770, 15089, -7614, 49566, 46079, -22380, -21260, 29702, -12868, 456]
1965D56j9579l4400Q290M4454j7241J4436O4168p694q026j5966q986K2422L1229
1952G3563J090n5644J347J3153L174j4239l3308O696K5479p773J4887m2064K3071
1939I432L9222p3200p088j2933l8588M0902L9000n7678K6775K0235k590m6086
1927f2597L1829P2805k9901n9787p295L0559N68l9146N65j1613L4544M0750o980
1914e699k3044L2335J7000k1622p459j7359j9159m6883L9820l9389L3122Q969
1902d9368J5819J4079L4607n419m630j4582q518Q263k5352P82n220K8779P803
1889b957l8935j7222K7790J3106p00q512J0904l5990J7260q894l9923m804l4733
1876a23610J8194L1372K3453N6454j5695p644n4799Q335J7374j4353M9515q445
$$ y = [456, -19123, -53523, -45233, -779, -18020, -3584, 60584, 52890, 44864, 28898, 19912, 42334, 73563, 74653, 19009, 20356, 33509, 36683, 22444, -10864, -4168, 21311, 13538, 28425, -13639, 9432, 48654, -24546, -31634, -44567, -83155, -42253, -3253, -60931, -34156, -13921, -16511, -62597, -30768, 42037, 12136, -47651, -54946, -24387, -23819, -62965, -62400, -74013, -39469, 1281, -5699, -28743, 3592, 20592, -1030, -8489, -25848, -45007, -91890, -52070, -91459, -58337, -49368, -33549, -19470, 15137, 9718, 5088, -9494, -18012, -9749, -35101, -34319, -39539, -10760, -2957, -41892, -59114, -31324, -18218, -18918, -27430, -16526, -52516, -35256, -44150, -84073, -88877, -123610, -105416, -74044, -50591, 5863, -9832, -17476, -72275, -63940, -46566, -60919, -11404, -19849]
1864a9849k3989k1518m0513P9181k6384m039L1183o1145K7300j5689L3705R477
1852c2280J3515N2289K1991m6564k6037l8499M513J8150N728k204m3390M0394
1840c2394N4786r2377m9658L5028Q694L1901K7481r255J0198k7466J4246L3514
1828D698N673q1531J3754j1592L5671Q4121j4436n1646j4993l566N1066N3090
1816G0309J027m6120n1553l046M2367j7417n5026N6563j8384j7774p385R477k5650
1803f2612L4776K1427j0638l0516l8059K7421J8481N4487k760m0408j0347q936
1791d7684O845J8979l7804J2524L0377l2259j5272k7463J4732j9492j3500J7054
1779i2963N0972J650K6587k5138J3064M0100k8m8951k7584k2273k0745j2684L6915
$$ y = [-19849, -43838, -65356, -105869, -26688, -53072, -57111, -25928, -87073, -59773, -75462, -41757, -32280, -18765, 33524, 55515, 8951, -17086, -55585, -51072, -32922, -27194, -29398, -72788, -32394, 22392, -69985, -119643, -84615, -75921, -44020, -16539, -25794, -15596, -43062, -28816, 4698, 10371, -71160, -57406, -68998, -33327, 50794, 36358, -15288, -30281, -33847, 17219, 70309, 71336, 25216, -26337, -29383, 12984, -4433, -59459, -2896, -21280, -39054, -46439, -36962, -62612, -27836, -6409, -17047, -47563, -85622, -58201, -39720, 14767, 12007, -28401, -38748, -47684, -40839, -21860, -59664, -47140, -16763, -49022, -64294, -91757, -77025, -96517, -110017, -92963, -41991, -40341, -13754, -38892, -25828, 14272, 14244, -34707, -62291, -84564, -105309, -117993, -81078]
1766h1078l917j5181j2525M4112M4682l9541j8695K4543M4J3952J3891Q951k3008
1753d3770Q317p853j8410r613j955j2280J2011M7431r330P037m7135J9716K0945
1740c4889p645k8771l3518O2290L8028k1857n0686N5779m99l5886M2530k5303
1728d0427l2413k6704K1858p850K6933K6266r453k2542k3420r621K9676k1892
1716h9589P350L5563K1073j8963l9691n424k2872L2255j0286M9792l543j1215
1704e5550N7424o0900m7387O578M6701L0454m1138M8311n5173K2108N787J5705
1692b7080J9198k7577o587Q70K5898n1016p529K2771p820Q695K3932k3342K9532
1679b0055k518l6871j5537L6256N379m3032M3110J7719j03325M1620p607o497
$$ y = [-81078, -84995, -100176, -112701, -68589, -23907, -63448, -82143, -57600, -57556, -43604, -29713, -20762, -43770, -35453, -43306, -61716, -71329, -73284, -85564, -73553, -26122, -35452, -28415, -75550, -55834, -34889, -42534, -71305, -104823, -42533, -4505, -26362, -77048, -21269, -21768, -57654, -15124, -40427, -72840, -99544, -77686, -85536, -58603, -32337, -41790, -64332, -87752, -97373, -67697, -89589, -82239, -46676, -25603, -44566, -84257, -89681, -112553, -80298, -90584, -40792, -44335, -55550, 1874, -59026, -106413, -99835, -53134, -22680, -63818, -15507, -70680, -48572, -42785, -27080, -7882, -35459, -42046, -41176, -15278, -66294, -73823, -51052, -58872, -50177, -26245, -49587, -20055, -22573, -59444, -74981, -38725, -33346, -76378, -33268, -15549, -118874, -77254, -84861, -91358]
1667i1358J2567j6313k9336M6542L3146j9498m0021k183k7404l553L2145J9200
1655h6066m0209J0583P5910J4167j5257j1249n1360J2640L3950j7612J631N2616
1643b0256O9502l6022l9336l378n891k2827l7191L3449J0956n1678L0533M2712
1631b9427O394K5237l9337n8736K3420M9887o154j9142K5628j3843k9377k8602
1619i4052K0983K8403M91k0701K93j1936m572k183J9671o061n1111O4712K8198
1606b7865j0384k6995j5528p403L4346L6216K2357j3888j5417m4624K4789N2568
1594H172n758k7182o0038o432J4333K041j3446Q3179N995j1380m078K8801m7073
1581c2866p9010N4210k2522j9833J892L6310M2747K1973K6193k5760J3507P568
$$ y = [-91358, -78791, -95104, -124440, -77898, -44752, -64250, -104271, -106454, -133858, -137411, -105266, -86066, -126275, -115692, -39782, -25615, -40872, -52121, -103481, -90841, -56891, -74503, -72872, -20256, 49246, 13224, -26112, -29490, -35381, -58208, -95399, -61950, -50994, -102672, -72139, -29427, -23033, 2204, -37133, -95869, -72449, -22562, -28716, -47858, -22230, -36073, -65450, -94052, -73069, -44666, -44175, -64876, -64583, -76519, -81091, -83274, -63603, -69664, -120775, -56063, -27865, -38249, -65244, -80772, -88175, -53829, -17613, 4744, -9144, -24561, -69185, -44396, 8172, 2414, -24768, -84806, -91238, -76905, -74864, -88310, -5131, 864, -10516, -14594, 14207, -32866, -111876, -57666, -80188, -100021, -98129, -61819, -19072, 2901, 29094, 3334, 16841, 24409]
1569B4409m4275m4360o193L3502j8656l4034M3150n060l106M4167K751p197K8210
1556A3308n0281R878J4470J511k687J9015k3158p415J4921o2952Q071L5871M6753
1543A7305J723o9460o297J8016L0623k0637j6098q5746N7842L1435l6100L7239
1531d0155Q65J415Q331o300K5009j3602j5572L458O025K6051K117J1608n806L3300
1517C6744m9790M997R603l0055n781k951K2581P868l2201J2163m56L1631q642
1504d289l9294R392k4291j0272l6662M6382J6656K13J5527l3208R436L5535j9817
1491c4692p318j8717K7517K6533m7896k5690N9459J1502j6992o657o542k243m7701
1478h9437M2746L2530O3752m3648n0847q026m309l4392j054M8214l9178m662L5552
$$ y = [24409, -19866, -64226, -70419, -36917, -55573, -89607, -46457, -51517, -54623, -10456, -7705, -14902, 13308, -36973, -27095, -12625, -11114, -13801, 5214, -17944, -25359, -10438, -73390, -65319, -29448, 17305, 19028, -50432, -56729, -38713, -8090, -28727, -44825, -130571, -72729, -41294, -77394, -40155, -39290, -37875, -29544, -35844, -10835, -24437, -40009, -36551, -30526, -4475, -2358, 9250, 3444, 36744, -13046, -8049, 1554, -28501, -34282, -37233, -14652, -6784, -38985, -26822, -27278, 4353, -4289, -43583, -34191, -58482, -68754, -105416, -59034, -42378, -42165, -26638, -59846, -50410, -14875, -34692, -42010, -60727, -33210, -6677, -54573, -80263, -20804, -9302, -26294, -32951, -39493, -41736, -89437, -46691, -14161, 49591, 5943, -44904, -52930, -57239, -91631, -92685, -44471, -83649, -88311, -52759]
1465e2759k833l5921J6377M1760N4422k0403o7317M0323k8110j4008J5186J2421
1453d0862J2103J1487k4744k3142K7771j4263j6624j4139M2505J1342j2280Q588
1441c2258J7863l7100k9065O615l395N1621n416j6060n7765O3847P3537m6685
1429a4261K6593K6185k9663m8164p738r304J6131J0417p676N2728k3815n973J2576
1416a964k4578o3622N172J2005O010k1865J2652R469n216o91M9142j8352K5223
1403a6615L1921o5214r422j9311K4514O842M3421j6096M5115l2587m2341j6234
1391f6007L8716J9570l5615l9950O977N8046k2638m3571J4446N2399l1981L8934
1379a0674j5504j1341P455k8725j1635M9807K5382K925n0556L7929L6733q793
$$ y = [-52759, -55592, -91513, -75136, -33376, 21046, 643, -66674, -26351, -54461, -68469, -53283, -40862, -28759, -17272, -42016, -65158, -37387, -51650, -68274, -82413, -39908, -28566, -40846, -32258, -14395, -51495, -80560, -73945, -77340, -25719, -31135, -47195, -104960, -41113, 32424, -14261, 12332, 38517, 8854, -39310, -47048, -56352, -40221, -29804, -37480, 15248, -8567, -14540, -1964, -26542, -90164, -84992, -72987, -66977, -88842, -76190, -66721, -71937, -72628, -23486, -41838, -16615, 15306, -49908, -59330, -78641, -54127, -47285, -3864, -19960, 25155, -7432, -49773, -66007, -27291, -7721, -43336, -83286, -76309, -18263, -40901, -84472, -70026, -17627, -49608, -10674, -26178, -37519, -30064, -58789, -70424, -20617, 4765, 7690, -42866, -4937, 31796, 23003]
1367B3003k3688n9922M6075K0816j9523m3188K7166L9384j3866m6842L5578L8992
1355B3985j8391n392o83m1056J852j761M2094N3627n4996L0723m5155k3592J1726
1342b7019n6226M294M4604j6346l6350q423M0306L8306k552k6033k7924M2652
1330c0711o123L2032j6953j0725M6073L2188L7570L0190o4394j9337n6402M3170
1318A6578m0789r8515K2599M4428L4585M4341o837l0890M3260o4559k7858O5567
1306A910J4444r1271J1344J7469K8280j0362L9477q1409R671O9039l7936J6671
1294a2673j8752n2946m559K1696j9779Q540N3680K1393j2338l1005K852K4614
1282a9277j0880M2260o0906N5135p902l5636K2466L3192J4809O946m0160m2271
$$ y = [23003, -685, -60607, -14532, 6284, -13239, -56427, -29261, 10123, -3743, -50585, -15007, 23985, 5594, 202, -481, -41537, -39685, -41446, 648, 54275, -721, 30002, -15153, -38745, -27019, -83245, -78951, -34347, -50693, -87043, -95466, -55160, -16854, -19406, -45439, -73363, -30711, -36834, -4802, -21755, -32480, 13593, 45781, 83351, 113541, 49147, 29810, -26592, 16578, -24211, -122726, -100127, -55699, -21114, 23227, 16390, -14500, 28760, -35799, -63657, 1910, 16354, -74917, -63573, -46104, -17824, -28186, 11291, -70118, -60447, 8592, -29344, -12673, -31425, -84371, -88930, -67234, -87013, -78473, -24793, -3400, -15738, -46743, -43891, -19277, -30157, 12103, -48803, 6332, -1570, -37206, -14740, 18452, 33261, 40207, 47, -42224]
1270d2224N3352o26k3027J5940l0206L2009l9721L7953L708j9132K6663l5744
1258b1055m4462J2542j668O9207P71k0174M17p286k1642m1956M25M3996J2641
1245a8244N954j5183N183n105P720J1634o2643j0132j9962M4313j1912r054L7747
1232c9684O8679j7851Q642K8232n95l6513J3828j9741m4730m7456O4947M8269
1220B6027O097j2196j4868l0136J2156j1700K8214m6195L8656J5587m325m9177
1208d1860M035L2998j0734L649J4181M258p8585M2370n496m3034N6743K8267k3363
1195a6571p505P565k2407J7109P2479n9312j0461N4040M17l7792j8313k4371R697
1182c5425k2732M2483P3820o4621l5368J9961J4025J4197j1515J0153M5417l0497
$$ y = [-42224, 11128, 10502, -12525, 3415, -26791, 5218, -34503, 3450, 7158, -11974, 14689, -21055, -65517, -52975, -54643, 14564, 15335, -4839, -4422, -11708, -33350, -75306, -74881, -30885, -18244, -12290, -27473, -22290, -27395, -19675, -8041, -70684, -80816, -100778, -56465, -68377, -77431, -39684, 28995, 11144, 19786, 48018, 47423, 10910, 24738, 4997, -39733, -87189, -22242, 26027, 32124, 19928, 5060, -25076, -12920, -24620, 3594, -42601, -3945, 11642, 7317, -41860, -37825, -4827, -15561, -11912, 2269, 6527, -72058, -29688, -35184, -78218, -21475, 6792, -16571, -24076, -16511, -38918, -21809, 50670, -8642, -19103, 34937, 35354, -2438, -20751, -45122, -35425, -58157, -15674, 58146, -6475, -41843, -21882, -7857, 6340, -5175, 4978, 50395, 19898]
1170A9898l0355L149o923L4652k2522m1871M57K7324J8893N939k3016P881m7o5286
1156g1827K7435K2566j87p0161J5856L4708K5212k7709M8738k6564l2621J5929
1144c8625K0372J0961l2952M950n907K6305q692L0282N0223l1278l3082J2191
1132D748n4020L2521L4397M189m2660J6864L5410p4648l8542R3020p977l3880
1120c0578J3527J9306R650J572j8729J0721l0424J9174P394K9342J9647M072l1970
1107B2704q8567j0939M2781M0423j3903M772r46J7034o567J1439J6298l1738j1688
1094h897m1299J048M6869L9435L268l1459j0907K3752J0854M4349k3479l2802
1082B0732q635l1965J0229k8155J8328K6863j2729L3700k1600p292k272l3403
$$ y = [19898, -10457, -7308, -14231, 20421, -2101, -43972, -43515, -16191, 2702, 8641, -14375, -6494, -6541, -71827, -44392, -21826, -22013, -92174, -76318, -41610, -16398, -44107, 4631, -21933, -54554, -38625, -18253, -7292, -40244, -35294, -41201, -14896, -23588, 6694, 56917, 25639, -7443, 4748, -49272, -16751, 17646, 21835, -20825, -3961, 31449, -43199, -81741, 11279, 3302, -30578, -17051, 2255, 11905, 13477, -5252, 5469, -24955, -5781, 1613, 30955, 50602, 54674, 22704, -65863, -76802, -34021, 6402, -7501, -2729, -3675, 13359, 6792, 18231, 34529, 2791, -8897, -50196, -49148, -2279, 37156, 40424, 8965, -1942, 21810, 32664, 77013, 53534, 20732, 12097, -19868, -9639, -37794, -19466, 7397, -5332, 28368, 6768, -524, -2796, -36199]
1070c6199K4981k6617K7837J4221o644J503k3633J9226J4179L4695J0490k1698
1058C2341k2432k2209j4674J236K2221N8300k4764k4380q282j4600q217L1277
1046E817j9533p089M671M2147J6229K8674r196l7705l4695k5958L2433j981K9012
1033B2826q485k9812k7115k532J9441K1257M783J484j6339M8744k6994k5042L3614
1020A5830J8672k1597j1623j4417r742K1965K1282m0j0923N024k0367l8473j2488
1007e6897m0965J3768O3252J9298j6631l2373M4791n2581L6836J2906J833J9056
995A2293J5413Q953k6417k5764J8922K0138O947K2061n6133j9408m8036K3377
983d7654j0631Q83M4213K3943k3789j4219l2646P7627j6209l9830j5143m013K1395
$$ y = [-36199, -11218, -37835, -9998, 4223, -2421, -918, -24551, -5325, 8854, 43549, 54039, 32341, 9909, -12300, -26974, -25738, -3517, 54783, 30019, 5639, -2643, -17243, -25460, 5817, -13716, -20805, -16134, 26013, 42242, 70916, 61720, 24015, -10680, -36638, -4205, -6186, 22826, 14341, -15471, -42586, -45118, -25677, -4420, 363, 1847, -14492, 34252, 7258, -17784, 15830, 34502, 12905, 1282, -13135, -22877, -912, 20370, 20330, 9407, 14431, -5936, -44409, -56897, -97862, -84094, -20842, -1544, -18175, -50548, -5757, -58338, -21502, -8596, -6763, 12293, 27706, 36659, 10242, -15522, 3400, 23538, 30485, 52546, -3587, -22995, -71031, -47654, -58285, -57402, -13189, 10754, -13035, -27254, -59900, 17727, 1518, -38312, -53455, -57468, -36073]
970c6073J5052j0556K0249l9086J9382M0595r895j1809K867n2469L5125K1765
958d853n403j4679j943L9383k1750K5268L7918j8097k5945J385k135M676j7012
945c187M670L0960m1096Q232L7737j9304o1555L8724K7873k2085J1284L3329n1695
932f113q1853L1937o72M4057L3461j5509o0129M2420K8648N5311l7328k8662q484
919b916k7365m1800J2179Q3429K9224m2561m612n0292L0174L1040j7793K5902
907B4609m0673Q563L7014r805P102l908j3571j9717j2047L0419M6115o3030k1414
894c0343K7055O631r017K6974K0717M52j212m2678j5682M3306n507l5865k7361
881d2530L7876K4359r688M2656J148P001n1496k2694P4716l6175l0636k584J5039
$$ y = [-36073, -21021, -31577, -11328, -50414, -31032, 9563, -332, -12141, -9274, -61743, -26618, -4853, -10256, -24935, -26878, 12505, -9245, 16023, 53941, 35844, 9899, 11284, 9149, 13825, -3187, 1483, 32443, -8653, -421, 37316, 18012, -43543, -4819, 23054, 969, 12253, 45582, -6113, -87966, -56029, -56701, -12644, 20817, 5308, -54821, -12401, 16247, 71558, 34230, 5568, -2916, -30281, -72081, -59902, 23527, 52751, 10190, 5578, -44714, -14540, 16500, -1293, 24609, -16064, -7501, 29513, 19708, 26810, 22902, 9331, -10386, -22433, 7986, 54101, -8929, -30343, -3288, 3343, -5674, 21300, 42017, 42469, 41257, -1421, -17103, 26203, 20696, -15169, -42530, -4654, 19705, 10017, 52673, 53821, 60822, 9326, -13368, 61348, 25173, -5463, -8047, 6992]
868F992N107j2969k33j8114j330P195j0148M4775k7790j0990l4298j4728Q2138
855A5607K2205j7470J4141k836j6579j9703o9873L2628L5803M4733m421K5098
843E9333n1649j4865K5211M727m0956p730K1303L8185l108K8103M8136o5339k295
830C9056l3039K8510j4885J0887K9402k5388j1185K0928l2306N025k9901n8458
818g1354N3450l814K8559P690J0303k4891L1470L9394k5967k2769J7636j9977
806A9730k2727n5028P739L8324K2197k2641N595K3776L188m008j3802k7571q103
793c3331L983O495J3124K216k1562M3649K5539p9304K579m104M0356L566J0209
780A3415Q731J9489k6598R280J3442j3481l4865M21M1512r049Q790K9943m7028
$$ y = [6992, 12099, -870, -1103, -19217, -20547, -13352, -23500, 21275, -6515, -17505, -51803, -66531, 15607, 37812, 20342, 34483, 31647, 15068, -4635, -74508, -41880, -6077, 38656, 34235, 59333, 7684, -7181, 18030, 22757, -18199, -25929, -4626, 33559, 30451, 58554, 106690, 41351, 39056, 6017, 34527, 19642, 30529, 59931, 34543, 23358, 44286, 11980, 17005, -12896, -71354, -17904, -21718, 6841, 14531, 24834, -57, 31413, 70807, 44840, 22071, 39707, 19730, -2997, -58025, -50286, -11962, 10235, -12406, -6811, 16965, 20153, 16145, 2343, -25228, -33331, -29348, -22853, -9729, -7513, -29075, 14574, 40113, -39191, -36612, -40716, -360, 3206, 13415, 22146, 41635, 15037, 24317, 37759, 24278, -10587, -10166, 31346, 22297, 31087, 61030, 14002]
767A4002J690j5763q138k5575n224O2760l1406M402k674N1336J092m2162M735
754I075l1425l0950O8419m566J1892J7052l273j1045L0513K5065l7962j9309j5767
741G719q254M0062K1960n0982K5371r455r438k4244O1730j9296l5993K9671l9955
728a1104J1640L641J6518L231l6277P8M3804q830l0219N987M9144J5171k1892
715D0892M325J4067J3335r858n7921N9525m602M154P206K652M1921n9637l1991
702B4068k9467K3632L806k9208M0175K4297l2986K2870K0680n0460j0261m8179
690d1033K0180L4694j6142J0090m9483J334J667L4263L7497j0110j4119J7379
678B6217l03l3669m3576N3551Q094M4339n2392l8973K2365L3766m747k5575K9121
$$ y = [14002, 15692, -71, -8209, -33784, -39008, 23752, -7654, -3252, -5926, 45410, 46502, 4340, 9075, -22350, -53300, 15119, 10553, 22445, 39497, 36224, 25179, 55692, 80757, 42795, 23486, 7719, -535, 39527, 61487, 10505, 35876, 26421, 16983, -7261, 54469, 35173, -820, 28851, -11104, 536, 4177, 20695, 23926, -12351, -12273, 31531, 22701, -7518, -1531, 47613, 62784, 40892, 45217, 59284, 72619, 62761, 4840, 64365, 59763, 63917, 71123, 73775, 115696, 56059, 24068, -5399, 18233, 22039, -7169, 33006, 57303, 24317, 47187, 67867, 17407, 7146, -41033, -20853, 13841, -2301, 7789, -41694, -40360, -38693, -4430, 33067, 22957, 8838, 26217, 25914, -7755, -51331, 2220, 10314, 54653, 2261, -36712, -14347, 19419, 14672, -10903, 18218]
665A8218k5824p024k1136N5778M632M011l07L1619K72R392J7689l8452o1220k6395
651c8747M9658M9686l9J6054j0550r29L7228k4024m1407l3734l1013M7100M4570
638F3853L5761q12p3338K7705L950j2442q163j8187J7384K683j2542K5972J9189
625G1013o1112O876j4019j0506M3362m0800j6338L4037o2350K3635J0022L9686
613B3506k3109J0270J2567k2205L7457J1028L978j6620k718l7386L649p102M8086
600D1401M5837o75n3069l5911o921K4485O963K4954J7397l6608J7174j3009J1266
587D3284K5256k4558K1209p041N06K803o67j8792j9309k5822j1147M2239K6472
574E4433k6255Q838L9566J3009l4676m9473M204k7150j4779M194j2896J1780K7870
$$ y = [18218, -7606, -14630, -35766, 20012, 24644, 28655, 28348, 59967, 60239, 69631, 87320, 48868, -12352, -38747, 10911, 60597, 60558, 76612, 66062, 65133, 102361, 78337, 36930, 3196, -27817, 19283, 63853, 99614, 98802, 25464, 53169, 57119, 44677, 36514, 18327, 35711, 38394, 25852, 51824, 71013, 9901, 16777, 2758, -7748, 35614, -5186, -21524, 12513, -49837, -26202, -16180, 23506, 397, 10667, 23234, 1029, 38486, 49514, 53492, 36872, 34154, -3232, 417, -6685, 41401, 87238, 86563, 33494, -2417, -9338, 15147, 22110, 47064, 64461, 27853, 45027, 32018, 43284, 68540, 43982, 65191, 58150, 58656, 61459, 60792, 42000, 22691, -3131, -14278, 27961, 54433, 28178, 37016, 76582, 89591, 54915, 5442, 9646, -17504, -32283, -28089, -40985, -29205, -1335]
561a335J7267l3990J4838M98K4774L8834R277n4044J9954L334l2207K6666p008
548B6858R741k3518n4718L5428O8452J9575l8302j2509l5714l4881K1414L3833
536A5659j449P755L671j7503P0564M1154n0441q5425K7961K2654K2446k8484l9173
523a0611M5791o660M3595K598j7266o479r147L4754k0026k7187M2705l7906J9853
510E4014l4542J6956K2218l2904m7477P0285L6849q67l116k7731K2561k1486J1060
497F5820j1627J5898J8173J6489O163l8389o1376Q1619J2023m0239K3646l3779
485E4421l1257P861n2689O1535m1780J276Q462j89M2121n844K274J5786m8423
472A3554Q0044J8892k9467k3359K6806K547o007k0733k160R810m6467m3693L7294
$$ y = [-1335, 15932, -18058, -3220, -2722, 22052, 60886, 70163, 16119, 36073, 39407, 7200, 33866, 26858, 36599, 13081, -41637, -6209, 62243, 81818, 43516, 31007, -4707, -39588, -18174, 15659, 14210, 21965, 25636, 8133, 78697, 119851, 69410, -16015, 11946, 34600, 57046, 28562, -10611, 35180, 28520, 72115, 74713, 57447, 50968, 41821, 76575, 56549, 29362, 72067, 34161, 54014, 19472, 36428, 58646, 25742, -21735, 48550, 85399, 84532, 81416, 53685, 76246, 54760, 65820, 54193, 70091, 88264, 104753, 110916, 72527, 11151, 92770, 104793, 64554, 88200, 54421, 23164, 31025, -21664, 39871, -1909, -633, 7829, 7640, 49761, 43917, 46191, 61977, 13554, 93598, 112490, 83023, 59664, 86470, 89017, 83010, 62277, 60117, 69927, 23460, -20233, 17061]
459A7061L9241m3880K1188P97k5588N2084j5773L5701n6214l8881Q0865L3084
447I9685k3969m5340k3529k1195K8949n849M1113J5553k7758M4567m1376J8782
435E9633m346n4061P184j9927N8344k7488k6334K2131m8329M3193L2280M6408
423H8688M4484J57l3681j640J7901K15j4853l1569j3234l7578N658R734N0701
410H4983k7306Q992P609J2640m8304j3841n544R591J4658K5106m28L0906k0457
397G8605j3608K8009k0501o3668Q802l3596j693K1406L6173L3476j6727l9217
385A7461j1349O6908L8053m5593j3799K8834j1755n550M7586q365J3159N09m4938
372G1161J543J7636n0183J4425m4284O5908o645l0647K2289j299K6751J0115k9162
$$ y = [17061, 56302, 12422, 33610, 34407, 8819, 60903, 45130, 80831, 24617, -14264, 66601, 99685, 75716, 30376, 6847, -14348, 14601, 8752, 49865, 65418, 37660, 82227, 40851, 59633, 55287, 1226, 8410, -11517, 46827, 19339, -6995, 15136, -33193, 10000, 42280, 88688, 133172, 133329, 99648, 98008, 115909, 116124, 101271, 69702, 56468, 18890, 24548, 34282, 84983, 57677, 66669, 74278, 86918, 38614, 24773, 19229, 28820, 43478, 68584, 68156, 99062, 78605, 64997, 93006, 72505, 8837, 17639, -15957, -17650, 3756, 39929, 73405, 56678, 17461, 6112, 73020, 111073, 65480, 51681, 80515, 68760, 63210, 110796, 102431, 115590, 116099, 71161, 72704, 90340, 40157, 54582, 10298, 76206, 69561, 38914, 61203, 59904, 86655, 96770, 67608]
359F7608K402j978L6161m1841k3007L4590l9035J6130K812K8309J0927m10p1899
346B0769K2065p710P413N3065k0438q033L0945p308k4644m4220k756M5721K730
333F7599M147l8287j6052K4922K0531K0409k3802N9793m9169n9714L9525r724
321D0178n4685p139O561K2447K2117J4471L254L8621k0828k683L448k5699k2962
308A7101J2894O7317k4720j5357M3355j60j5745q458O751p2677O714K9074K522
295D8611J1855L3353O078M222j0140k0848m304l4006m43j3182k2105L2197N9782
282I1070j4201k3383K6699N1313m3231m6910P3034j2619k7284L8612n4743m6981
270A1376K4666K2352L3752p9829J3656K0522J4914L273O173n0158o897K0509L5084
$$ y = [67608, 70010, 68032, 104193, 62352, 39345, 73935, 34900, 51030, 53842, 82151, 93078, 92668, 20769, 42834, 35124, 42537, 95602, 75164, 67131, 98076, 90768, 66124, 21904, 19148, 64869, 67599, 71746, 33459, 17407, 42329, 62860, 83269, 59467, 119260, 70091, 10377, 49902, 40178, -14507, -21646, -15085, 7362, 29479, 43950, 47204, 85825, 64997, 62314, 65762, 40063, 17101, 29995, 97312, 72592, 57235, 100590, 100430, 84685, 76227, 82978, 10301, 17015, 46089, 48611, 60466, 93819, 99897, 104119, 93979, 73131, 68827, 34821, 34378, 21196, -909, 31288, 91070, 76869, 53486, 80185, 131498, 88267, 41357, 114391, 101772, 74488, 113100, 58357, 11376, 36042, 58394, 92146, 12317, 25973, 46495, 61409, 64682, 70855, 20697, 13800, 34309, 69393]
257F9393o018n0690J9236M3339J9420J178l0935K0227j1513l9280O1233J6019
245A11609q641k4532j5317J4619k0708l5308L826K5906l2472M0211L4159M716
233I8068J6849k3416Q347K8583j9915q0255J3926N3848m939l4995l948K5618k3157
220E4614R880j4094l5545L5432O7809o5024o041M7649m4088j5530l9809q319J3431
207C65N1029m5029R7318k4182j5278L6781r343l8909J9538j4080K5654j388k4127
194E8349n898k9913m495L6658M8692j2795n5278N2531J8600n485n3505n0632M0588
181C7417K9241L1616O1144k4595n2579j7150l3243K0761k679J4551L6159l9711
169F0932k0589O5472l8499k4989K9190j9271k9668K8924J1335j793n721l9958
$$ y = [69393, 63375, 12685, 31921, 75260, 94680, 95858, 64923, 85150, 73637, 34357, 95590, 111609, 102968, 78436, 63119, 77738, 57030, 21722, 25548, 51454, 18982, 59193, 93352, 98068, 114917, 91501, 99848, 128431, 108516, 28261, 42187, 96035, 91096, 56101, 52153, 77771, 54614, 64494, 50400, 14855, 50287, 118096, 53072, 47031, 94680, 50592, 35062, -4747, -13066, 365, 51394, 6365, 103683, 79501, 64223, 101004, 91661, 52752, 72290, 58210, 83864, 82476, 58349, 52451, 22538, 18043, 54701, 103393, 90598, 35320, 87851, 106451, 100966, 47461, -3171, 37417, 66658, 98274, 159418, 134823, 82244, 65094, 31851, 52612, 49933, 64484, 100643, 60932, 40343, 105815, 67316, 42327, 71517, 52246, 22578, 51502, 62837, 61044, 55323, 15365]
157A5365K8925N409L0348o921j5934N795K6819J2022J8341l150j1112o4849l0360
144A0698O9727J2210m21k7511K3515J4464r548m26k8616J62P208K3686K475l6023
130F1600j9680J7670k1742K1129J7332M367Q129n5308l8232L3939N5728j1764
118G3168j0088J4471M0022m051l9848m983K7399m4815o6458K7824N2576o048p980
105E1189K5524K7989m8833l693l207O659j1205J7641l729J5929n126L1941j0202
92I0877j439l5272N358K0805J1568J9925m3681n0850O0288k1280m31L599j4773
79D4694R59N3174L785k1162L7923k6565j2584p374m5426k9977L0613M2453q230
66F2283m4112q135P2312j2023k3746R577O42J8649j902k2764m8224N0129L2530
$$ y = [15365, 44290, 49699, 80047, 73126, 57192, 62987, 89806, 101828, 120169, 117019, 105907, 41058, 10698, 80425, 92635, 92214, 64703, 88218, 102682, 93134, 92708, 64092, 64254, 71462, 95148, 97623, 61600, 41920, 59590, 37848, 58977, 76309, 80676, 88805, 33497, -4735, 29204, 84932, 73168, 63080, 77551, 117573, 113522, 73674, 68691, 96090, 51275, -15183, 12641, 65217, 59169, 51189, 76713, 104702, 55869, 52176, 48969, 55628, 44423, 62064, 58335, 74264, 69138, 101079, 90877, 89438, 54166, 59524, 80329, 91897, 111822, 68141, 17291, 77579, 56299, 55868, 59467, 44694, 45653, 98827, 102612, 81450, 119373, 92808, 80224, 72850, 27424, -2553, 28060, 70513, 62283, 18171, 10036, 82348, 70325, 46579, 56156, 56798, 75447, 73545, 50781, 2557, 52686, 85216]
53H5216K3405j1859r627k1048J3385k0297M920M5426O941n0162m44O259J1092
40H3207k9730j9491M6993J1455m0776L455K9596j2497M1921k2427j7368Q716K1066
27A04120L0962j0214k8258k0481J7445j9001j1172q973K6608j8449l6416L1935
15E8106M145l6699O1688j8325l3362J2695K021K1991j1196J1996J6404P561k9081
2F7944R978j1160
0F6762
$$ y = [85216, 108621, 96762, 87135, 66087, 79472, 59175, 64095, 109521, 116462, 66300, 65856, 72115, 83207, 53477, 33986, 80979, 92434, 51658, 55113, 84709, 72212, 114133, 91706, 74338, 83054, 104120, 135082, 124868, 96610, 76129, 93574, 74573, 63401, 54428, 81036, 62587, 26171, 58106, 62251, 25552, 87240, 68915, 35553, 48248, 50269, 72260, 61064, 73060, 89464, 97025, 67944, 77922, 66762]
$$ Imaginary data points
##PAGE= N=2
##DATA TABLE= (X++(I..I)), XYDATA
16383a602999K9494O7943M2355K735k2877J9843L5682K4302l126J1370L4580J4568
16371a346130L2923K9688K3090J0705R362K4889N0583J3942N6958N6167l39r537
16359a047699O608K3459N539J2000M1402K0364j6204O982L3988K3034m626N6464
16347h38689N3553N533R96j533M0930K9526l5414L8361M7517o012O0279OK2894
16334e82053O4653K9002J4778M037j2764k32k775Q0014J2096L0036M1564p661
16322c29305l280K8792J4538K6996K3189P239K4054j37M7046J7351M3356j6300
16310a16461J6079M0087J7282P367k891L5688N0026j8444k1216K4390L6337M6786
16298A15030K0879j2479j7863o330L6189N1894J1645R858L3012N6739L2297J4768
$$ y = [-1602999, -1573505, -1505562, -1463207, -1460472, -1483349, -1463506, -1427824, -1403522, -1406648, -1395278, -1360698, -1346130, -1313207, -1283519, -1260429, -1249724, -1240362, -1215473, -1164890, -1150948, -1093990, -1037823, -1038162, -1047699, -1041091, -1017632, -1012093, -1000093, -958691, -938327, -954531, -947549, -913561, -890527, -895153, -838689, -785136, -779603, -778607, -780140, -739210, -709684, -745098, -706737, -659220, -665232, -604953, -604947, -582053, -517400, -488398, -473620, -469583, -482347, -482579, -485354, -405340, -393244, -363208, -321644, -329305, -332585, -303793, -289255, -262259, -239070, -231831, -207777, -207914, -160868, -143517, -100161, -116461, -100382, -60295, -43013, -35646, -38537, -2849, 47177, 28733, 7517, 31907, 68244, 115030, 135909, 123430, 105567, 99237, 135426, 187320, 198965, 208823, 241835, 298574, 330871, 345639]
16286C45639o66P380m717J96M5283P880p725N5941J4973K7187m789O20M9324j8340
16272E18186J7935K6856l667L916L9806O549K7044L3188K225K6586K2370k6718
16260F94276l691R851n226M2521J0325P746J6193M6739j2589l0764m046R519J7142
16247G97996k2057N9097N8245Q629N293M6763l050j5535k3942k2284O0043J3133
16235I62331N520Q2091L3692m5428J5416k1578l5253K0514M6351R463K7905k4186
16223A076838K695K7773R179K0614J9728m422L7622L7919j0517l1278N745k7164
16211A164732l9098Q4579N492r720K0315N2784j2600n175P0597K9057K8991m1948
16199A348006J5195J0087Q038k6477l1368P218L870j9658J2053K0179K6125J7146
$$ y = [345639, 344973, 352353, 347636, 347832, 393115, 400995, 393270, 449211, 464184, 491371, 486582, 487202, 536526, 518186, 536121, 562977, 559310, 563226, 603032, 609581, 636625, 669813, 672038, 698624, 720994, 694276, 690585, 700436, 695210, 737731, 748056, 755802, 771995, 818734, 806145, 775381, 771335, 780854, 797996, 775939, 835036, 893281, 901910, 907203, 953966, 950916, 935381, 911439, 889155, 949198, 962331, 967851, 1049942, 1083634, 1038206, 1053622, 1032044, 996791, 1017305, 1063656, 1073119, 1101024, 1076838, 1079533, 1107306, 1116485, 1137099, 1156827, 1152405, 1190027, 1227946, 1217429, 1186151, 1191896, 1164732, 1125634, 1210213, 1215705, 1205985, 1226300, 1279084, 1266484, 1261309, 1331906, 1360963, 1389954, 1348006, 1363201, 1373288, 1381326, 1354849, 1323481, 1330699, 1334569, 1314911, 1326964, 1347143, 1373268, 1390414]
16187A390414K565K1857K9451K3876L4661Q072j3839M5243l0541J1299o0965j0570
16175A451523J9924N8129j2827P094k4744j4686L7879M5367p146m4374m6804k507
16163A466828R627L7580Q07q343J9038J6512j1005m611J439J8802L7532k06M0175
16150A624175n0245k2496K3119M5051l9707k2057J3779J6022J1890J1001K8238
16139A638770r710P212L9774l7186L7634N0661l8948m812l5721J0189L1478N426
16127A694767J0493J6342m1789m444K6745J0443P126j4346K777j7748M930O460
16115A701756l7702J8607K6446k457J3757m4212L3247q8J4168k3450p954P041
16103A699159L0596r804J1733l4033l2462l801N5902L6523k947k372k7545K1932
$$ y = [1390414, 1392979, 1414836, 1444287, 1468163, 1502824, 1510896, 1497057, 1542300, 1511759, 1523058, 1462093, 1451523, 1471447, 1529576, 1516749, 1523843, 1499099, 1484413, 1522292, 1567659, 1560513, 1516139, 1469335, 1466828, 1476455, 1514035, 1514842, 1506499, 1525537, 1542049, 1531044, 1526433, 1527872, 1546674, 1584206, 1584000, 1624175, 1573930, 1551434, 1574553, 1619604, 1579897, 1557840, 1571619, 1587641, 1599531, 1610532, 1638770, 1629060, 1636272, 1676046, 1638860, 1676494, 1727155, 1688207, 1683395, 1647674, 1657863, 1689341, 1694767, 1705260, 1721602, 1679813, 1675369, 1702114, 1712557, 1719683, 1705337, 1708114, 1690366, 1695296, 1701756, 1664054, 1682661, 1709107, 1706650, 1720407, 1676195, 1709442, 1709354, 1723522, 1700072, 1692118, 1699159, 1729755, 1719951, 1731684, 1697651, 1665189, 1661388, 1717290, 1753813, 1750866, 1748494, 1720949, 1742881]
16091A742881p695j6563J6249L9611m4100M9163j5260k6489k987L393L5188m5920
16079A727471l8142J5871K1863K9517L2778O3893m5540j887L243j7992k6616j0052
16067A754407o503j2676J0653J2482L9655K4146K1662l4883O139K3470n1434j0880
16055A776238j0413k2523M469K7720L7484o103j177m872j8191j0173J4830R725
16043A797014J5550O975j7286K0715j9069Q135L2007n016n1213N293M852K3918
16031A821875k387k7023j7355L410K0715J0268J1926L0388m3452n6228q149M8929
16019A792917K5440o0675j9415L1899L8778k3845m064J3223o559j0037M979j3663
16007A768978K2355j7362M8164j6280L7039N250Q069j8634o5797K4810K79p1870
$$ y = [1742881, 1735186, 1718623, 1734872, 1774483, 1730383, 1779546, 1764286, 1737797, 1734810, 1738203, 1773391, 1727471, 1689329, 1705200, 1727063, 1756580, 1789358, 1853251, 1807711, 1805824, 1809067, 1791075, 1764459, 1754407, 1747904, 1735228, 1745881, 1758363, 1798018, 1822164, 1843826, 1808943, 1815082, 1838552, 1787118, 1776238, 1765825, 1743302, 1747771, 1775491, 1812975, 1806872, 1805695, 1800823, 1782632, 1772459, 1787289, 1797014, 1812564, 1819539, 1802253, 1822968, 1803899, 1812034, 1844041, 1839025, 1787812, 1793105, 1797957, 1821875, 1819488, 1792465, 1775110, 1778520, 1799235, 1809503, 1821429, 1851817, 1808365, 1752137, 1743988, 1792917, 1818357, 1757682, 1738267, 1770166, 1808944, 1785099, 1781035, 1794258, 1787699, 1777662, 1782641, 1768978, 1791333, 1773971, 1822135, 1805855, 1842894, 1848144, 1856213, 1837579, 1771782, 1796592, 1796871, 1725001]
15995A725001Q1905K7258j4524j9735k0890j5972J4458K7661j0753k513k4560
15984A767336J0234L1887r893o6649K2924N3843j1036k9836l393K4864L4795m1633
15972A783443K6583j5826K3019r997N93J4261p768l7463m598L1649l5729n704
15960A762463J6973M6819J8851o2317k545q79j7549J7117k1087M4239j4379j2634
15948A775072l0515J837M2055L5692n7897J9441L4495N89m7480N224M0581j885
15936A817209J9784j1667r658J9136j9277k2003k368J642L5599O869j254m4335
15924A789677K8809j402K6833L6009k7367o4304J0028M2991k4343q941N1105J2258
15912A871353M135k1163n5001j249M544j9476K2732R652J3553K8101o092o7248
$$ y = [1725001, 1806906, 1834164, 1819640, 1799905, 1779015, 1763043, 1777501, 1805162, 1794409, 1791896, 1767336, 1777570, 1809457, 1799564, 1732915, 1755839, 1809682, 1798646, 1768810, 1765417, 1790281, 1825076, 1783443, 1810026, 1794200, 1817219, 1807222, 1807815, 1822076, 1814308, 1776845, 1772247, 1803896, 1768167, 1762463, 1779436, 1826255, 1845106, 1782789, 1780244, 1779365, 1761816, 1778933, 1757846, 1802085, 1787706, 1775072, 1744557, 1746394, 1788449, 1824141, 1766244, 1785685, 1820180, 1820769, 1773289, 1778513, 1819094, 1817209, 1836993, 1825326, 1815668, 1834804, 1815527, 1793524, 1791156, 1792798, 1828397, 1835266, 1834012, 1789677, 1818486, 1817084, 1843917, 1879926, 1852559, 1788255, 1798283, 1841274, 1816931, 1807990, 1859095, 1871353, 1875488, 1854325, 1799324, 1798075, 1802619, 1783143, 1805875, 1815527, 1829080, 1857181, 1851089, 1783841]
15900A783841L2171Q236k2479M4796N5740l4225l7595j8588J38K0357M5937l6140
15888A842189k7351L005K1920r483m3919K2181P876K3787J3639l6880m0259J2619
15876A789324p148K6248K6481L3879k9428l3300P6489r434k7125j8869j9871J1700
15864A818946j1158j315m859J6226P6769k8129k4587m8707Q660K4800R724K2285
15852A858655l6410m727K9074r086O5029m1794l8418j5179L108K1341j0575k9885
15840A791133j0032L2203P90J2290j9532j1595R876P4251k2959J7430k9382k9709
15828A814764O7105j6602r258M966j4719k2376n666m865J5423N1450k5590O721
15816A861353J751q352M8123K1058r7165M088k6283O7791l9553K3698k6912L2507
$$ y = [1783841, 1816012, 1824248, 1801769, 1846565, 1902305, 1868080, 1830485, 1811897, 1812035, 1832392, 1878329, 1842189, 1814838, 1817843, 1839763, 1830280, 1786361, 1808542, 1816418, 1840205, 1853844, 1816964, 1776705, 1789324, 1782176, 1808424, 1834905, 1868784, 1839356, 1806056, 1882545, 1873111, 1845986, 1827117, 1807246, 1818946, 1807788, 1806473, 1801614, 1817840, 1894609, 1866480, 1841893, 1793186, 1801846, 1826646, 1836370, 1858655, 1822245, 1817518, 1846592, 1837506, 1902535, 1860741, 1822323, 1807144, 1810252, 1831593, 1821018, 1791133, 1781101, 1813304, 1814094, 1826384, 1806852, 1795257, 1805133, 1879384, 1856425, 1873855, 1844473, 1814764, 1881869, 1865267, 1856009, 1860975, 1846256, 1823880, 1818214, 1813349, 1828772, 1880222, 1854632, 1861353, 1863104, 1854752, 1902875, 1923933, 1826768, 1830856, 1804573, 1872364, 1832811, 1856509, 1829597, 1862104]
15804A862104l1886k0389n9911K1148O9162J7665l6635l8221J2382K9206l829
$$ y = [1862104, 1830218, 1809829, 1749918, 1771066, 1840228, 1857893, 1821258, 1783037, 1795419, 1824625, 1820796]
$$ [...]
##END NTUPLES=NMR SPECTRUM
##END=
