##TITLE=1H_TG-2307-65
 CDCl3
 8 sc, 
 15.6.2023
##JCAMPDX= 6.0         $$ Bruker NMR JCAMP-DX V2.0
##DATA TYPE= NMR SPECTRUM
##DATA CLASS= NTUPLES
##ORIGIN= UXNMR, Bruker Analytische Messtechnik GmbH
##OWNER= root
$$ XWIN-NMR		Version 3.5
$$ Thu Jun 15 13:54:53 2023 Russian Standard Time (UT+4h)  she@DPX200
##.OBSERVE FREQUENCY= 200.13135
##.OBSERVE NUCLEUS= ^1H
##.ACQUISITION MODE= SIMULTANEOUS
##.ACQUISITION SCHEME= undefined
##.AVERAGES= 8
##.DIGITISER RES= 18
##SPECTROMETER/DATA SYSTEM= spect
##.PULSE SEQUENCE= zg30
##.SOLVENT NAME= Acetone
##.SHIFT REFERENCE= (INTERNAL, Acetone, 0, 15.7469)
##AUDIT TRAIL= $$ (NUMBER, WHEN, WHO, WHERE, WHAT)
$$ ##TITLE= Audit trail, XWIN-NMR		Version 3.5
$$ ##JCAMPDX= 5.01
$$ ##ORIGIN= Bruker BioSpin GmbH
$$ ##OWNER= she
$$ F:/spectra/data/she/nmr/H-F/1/pdata/1/auditp.txt
$$ ##AUDIT TRAIL=  $$ (NUMBER, WHEN, WHO, WHERE, WHAT)
(   1,<2023-06-15 13:53:38.70 +0400>,<she>,<DPX200>,
      <created by zg, POWCHK disabled, PULCHK disabled
       configuration hash MD5:
       00 E9 B6 7A A2 85 ED C7 34 08 36 98 17 FE 4E 26
       data hash MD5: 16K
       FC 15 81 96 DF A5 21 61 FC 49 00 F8 36 34 82 F6>)
(   2,<2023-06-15 13:53:40.95 +0400>,<she>,<DPX200>,
      <Start of raw data processing
       efp BC_mod = 2 LB = 0.24 FT_mod = 6 PKNL = 1 PHC0 = -20786.17 PHC1 = 15.05272 SI = 16K 
       data hash MD5: 16K
       AA 45 FD 92 EC 68 DA ED F4 CD 08 5A 5F 4A 2C 6E>)
(   3,<2023-06-15 13:53:59.04 +0400>,<she>,<DPX200>,
      <pk PHC0 = -3.310716 PHC1 = 5.000001 
       data hash MD5: 16K
       B5 07 0A 16 71 A3 5A 9F 88 0D 17 23 D3 16 8D 85>)
(   4,<2023-06-15 13:54:02.18 +0400>,<she>,<DPX200>,
      <abs ABSG = 5 
       data hash MD5: 16K
       74 DD DF EA 3A 85 28 78 7B E2 A4 E8 10 C0 62 23>)
$$ ##END=
$$ 
$$ hash MD5
$$ C1 5B D3 78 2A A8 D3 03 EF 65 D2 F3 32 CE 1B 04
##$RELAX= 
##$RELAX= 
##$RELAX= 
##$RELAX= 
##$RELAX= 
##$RELAX= 
$$ Bruker specific parameters
$$ --------------------------
##$DU= <F:/spectra>
##$EXPNO= 1
##$NAME= <H-F>
##$PROCNO= 1
##$TYPE= <nmr>
##$USER= <she>
##$AMP= (0..31)
100 100 100 100 100 100 100 100 100 100 100 100 100 100 100 100 100 100 
100 100 100 100 100 100 100 100 100 100 100 100 100 100 
##$AQSEQ= 0
##$AQ_mod= 1
##$AUNM= <au_zg>
##$AUTOPOS= <>
##$BF1= 200.13
##$BF2= 200.13
##$BF3= 200.13
##$BF4= 200.13
##$BF5= 200.13
##$BF6= 200.13
##$BF7= 200.13
##$BF8= 200.13
##$BYTORDA= 1
##$CFDGTYP= 0
##$CFRGTYP= 5
##$CHEMSTR= <none>
##$CNST= (0..31)
1 1 145 1 1 1 1 1 1 1 1 1 1 1 1 1 1 1 1 1 1 1 1 1 1 1 1 1 1 1 1 1 
##$CPDPRG= <>
##$CPDPRG1= <>
##$CPDPRG2= <>
##$CPDPRG3= <>
##$CPDPRG4= <mlev>
##$CPDPRG5= <mlev>
##$CPDPRG6= <mlev>
##$CPDPRG7= <mlev>
##$CPDPRG8= <mlev>
##$CPDPRGB= <>
##$CPDPRGT= <>
##$D= (0..31)
0 1.2 0 0 0 0 0 0 0 0.06 0 0.03 0 0 0 0 0.0002 0 0 0 0 0 0 0 0 0 0 0 0 
0 0 0 
##$DATE= 1686822818
##$DBL= (0..7)
120 120 120 120 120 120 120 120 
##$DBP= (0..7)
150 150 150 150 150 150 150 150 
##$DBP07= 0
##$DBPNAM0= <>
##$DBPNAM1= <>
##$DBPNAM2= <>
##$DBPNAM3= <>
##$DBPNAM4= <>
$$ [...]
##$SUBNAM3= <"">
##$SUBNAM4= <"">
##$SUBNAM5= <"">
##$SUBNAM6= <"">
##$SUBNAM7= <"">
##$SUBNAM8= <"">
##$SUBNAM9= <"">
##$SW= 18.05172834244
##$SWIBOX= (0..15)
0 0 2 0 0 0 0 0 0 0 0 0 0 0 0 0 
##$SW_h= 3612.71676300578
##$TD= 16384
##$TD0= 1
##$TE= 0
##$TE2= 300
##$TE3= 300
##$TEG= 300
##$TL= (0..7)
0 120 120 120 120 120 120 120 
##$TP= (0..7)
150 150 150 150 150 150 150 150 
##$TP07= 0
##$TPNAME0= <>
##$TPNAME1= <>
##$TPNAME2= <>
##$TPNAME3= <>
##$TPNAME4= <>
##$TPNAME5= <>
##$TPNAME6= <>
##$TPNAME7= <>
##$TPOAL= (0..7)
0.5 0.5 0.5 0.5 0.5 0.5 0.5 0.5 
##$TPOFFS= (0..7)
0 0 0 0 0 0 0 0 
##$TUNHIN= 0
##$TUNHOUT= 0
##$TUNXOUT= 0
##$USERA1= <user>
##$USERA2= <user>
##$USERA3= <user>
##$USERA4= <user>
##$USERA5= <user>
##$V9= 5
##$VALIST= <valist>
##$VCLIST= <CCCCCCCCCCCCCCC>
##$VD= 0
##$VDLIST= <DDDDDDDDDDDDDDD>
##$VPLIST= <PPPPPPPPPPPPPPP>
##$VTLIST= <TTTTTTTTTTTTTTT>
##$WBST= 1024
##$WBSW= 4
##$XGAIN= (0..3)
0 0 0 0 
##$XL= 0
##$YL= 0
##$YMAX_a= 198620
##$YMIN_a= -186939
##$ZGOPTNS= <>
##$ZL1= 120
##$ZL2= 120
##$ZL3= 120
##$ZL4= 120
##$ABSF1= 15.73808
##$ABSF2= -2.313769
##$ABSG= 5
##$ABSL= 3
##$ALPHA= 0
##$AQORDER= 0
##$ASSFAC= 0
##$ASSFACI= 0
##$ASSFACX= 0
##$ASSWID= 0
##$AUNMP= <proc_1d>
##$AZFE= 0.1
##$AZFW= 0.1
##$BCFW= 0
##$BC_mod= 2
##$BYTORDP= 0
##$COROFFS= 0
##$CY= -3
##$DATMOD= 1
##$DC= 0
##$DFILT= <>
##$DTYPP= 0
##$F1P= 0
##$F2P= 0
##$FCOR= 1
##$FTSIZE= 16384
##$FT_mod= 6
##$GAMMA= 0
##$GB= 0
##$INTBC= 1
##$INTSCL= 3.70164e-10
##$ISEN= 128
##$LB= 0.24
##$LEV0= 0
##$LPBIN= 0
##$MAXI= 10000
##$MC2= 0
##$MEAN= 0
##$ME_mod= 0
##$MI= 1.114404
##$NCOEF= 0
##$NC_proc= -8
##$NLEV= 6
##$NOISF1= 3.799351
##$NOISF2= 2.8
##$NSP= 0
##$NTH_PI= 0
##$NZP= 0
##$OFFSET= 15.74689
##$PC= 1
##$PHC0= -20789.48
##$PHC1= 20.05272
##$PH_mod= 1
##$PKNL= yes
##$PPARMOD= 0
##$PSCAL= 0
##$PSIGN= 0
##$REVERSE= no
##$SF= 200.130004933886
##$SI= 16384
##$SIGF1= 3
##$SIGF2= 2
##$SINO= 5.538805
##$SIOLD= 16384
##$SREGLST= <1H.CDCl3>
##$SSB= 0
##$STSI= 16384
##$STSR= 0
##$SW_p= 3612.71676300578
##$SYMM= 0
##$S_DEV= 0
##$TDeff= 16384
##$TDoff= 0
##$TI= <>
##$TILT= no
##$TM1= 0
##$TM2= 0
##$TOPLEV= 0
##$USERP1= <user>
##$USERP2= <user>
##$USERP3= <user>
##$USERP4= <user>
##$USERP5= <user>
##$WDW= 1
##$XDIM= 16384
##$YMAX_p= 422378340
##$YMIN_p= -1497128
$$ End of Bruker specific parameters
$$ ---------------------------------
##NTUPLES= NMR SPECTRUM
##VAR_NAME=  FREQUENCY,     SPECTRUM/REAL,   SPECTRUM/IMAG
##SYMBOL=    X,             R,               I
##VAR_TYPE=  INDEPENDENT,   DEPENDENT,       DEPENDENT
##VAR_FORM=  AFFN,          ASDF,            ASDF
##VAR_DIM=   16384,         16384,           16384
##UNITS=     HZ,            ARBITRARY UNITS, ARBITRARY UNITS
##FACTOR=    0.220516191357247, 1,           1
##FIRST=     3151.42518701305, 0,            0
##LAST=      -461.291575992733, 0,           0
##MIN=       -461.291575992733, -1497128,    0
##MAX=       3151.42518701305, 422378340,    0
$$ Real data points
##PAGE= N=1
##DATA TABLE= (X++(R..R)), XYDATA
$$ [...]
$$ plain form
11697 -337480 -172821 102097 -27111 -126406 -267935 -183073 150344 24310 -77002 88130
11687 88130 21635 -207540 -234188 -4505 120516 -28998 82226 177421 22712 16723 171474
11676 171474 77462 -89086 -94158 -330573 -271660 -249559 -301676 -200603 -181271 -301105 -235290
11665 -235290 -395231 -291739 -142118 -245602 92842 -5664 60616 126650 36096 -97286
11655 -97286 -227423 -101057 -53572 -76222 9395 54766 -22984 -163948 -238248 -281891 -110855
11644 -110855 -223328 -246837 -299154 -343121 -324608 -369920 -220885 -338594 -543855 -448973 -472960
11633 -472960 -283798 -140083 -252497 -502163 -268580 -16858 4605 109048 83889 135843
11623 135843 310807 -105730 -251277 -88321 -373965 -496811 -463968 -132503 -34495 -231523
$$ packed form
11697c37480J64659K74918j29208r9295j41529Q4862L33417j26034j01312J65132
11687H8130o6495k29175k6648K29683J25021j49514J11224R5195j54709n989J54751
11676A71474r4012j66548n072k36415N8913K2101n2117J01073J9332j19834O5815
11665b35290j59941J03492J49621j03484L38444r8506O6280O6034r0554j33382
11655i7286j30137J26366M7485k2650Q5617M5371p7750j40964p4300m3643J71036
11644a10855j12473k3509n2317m3967J8513m5312J49035j17709k05261R4882k3987
11633d72960J89162J43715j12414k49666K33583K51722K1463J04443k5159N1954
11623A35843J74964m16537j45547J62956k85644j22846L2843L31465R8008j97028
$$ plain form
11613 -231523 -495157 -222642 129 -175313 -307185 -18539 16559 -201068 -365863 -458904
11603 -458904 -173065 -442577 -316686 -113272 -129103 -186242 -3871 224986 104967 144263
11593 144263 55400 -123537 -344626 -135166 419104 365721 55768 377408 181787 35425
11583 35425 30266 -29400 -107783 -228436 -156750 -53467 -227191 -175074 -223492 -137953 -109156
11572 -109156 -38544 103458 13641 -28373 -150111 -241605 -58514 3973 58996 231633 289584
11561 289584 136094 155514 -99754 -341882 -258712 -318172 143368 -18973 -87970 -294866
11551 -294866 -345784 -152785 -75681 -75937 -121280 -34593 64018 -46671 -207219 -313246 -441906
11540 -441906 -303200 -252528 -51100 -110966 81000 268831 227702 178754 129269 109938 10087
$$ packed form
11613b31523k63634K72515K22771j75442j31872K88646L5098k17627j64795r3041
11603d58904K85839k69512J25891K03414j5831n7139J82371K28857j20019L9296
11593A44263q8863j78937k21089K09460N54270n3383l09953L21640j95621j46362
11583C5425n159n9666p8383j20653P1686J03283j73724N2117m8418Q5539K8797
11572a09156P0612J42002q9817m2014j21738r1494J83091O2487N5023J72637N7951
11561B89584j53490J9420k55268k42128Q3170n9460M61540j62341o8997k06896
11551b94866n0918J92999P7104k56m5343Q6687R8611j10689j60548j06027j28660
11540d41906J38706N0672K01428n9866J91966J87831m1129m8948m9485j9331r9851
$$ plain form
11529 10087 28214 137614 57419 90240 8778 -192047 -214864 -243162 -209654 -238958 -16169
11518 -16169 188692 96023 -20490 -43683 -97563 -242488 -194982 -174649 -36720 -33986 -63598
11507 -63598 -9182 -2239 -204333 -234489 -84028 10016 -1228 70215 30020 102324 -236721
11496 -236721 -314348 -152845 -215805 -331236 -502729 -177254 -156349 -213798 -277131 -14590
11486 -14590 96155 -176689 -276706 -117364 28856 -120883 -254049 -611557 -494819 -307922
11476 -307922 -158974 271942 49839 106828 207828 101891 -151284 -346793 -230486 -149748
11466 -149748 42035 298532 43463 15450 -109918 -29821 9074 163398 -56382 -240865
11456 -240865 96478 276969 536450 360123 36561 -121220 161555 348219 79186 187379
$$ packed form
11529A0087J8127J09400q0195L2821q1462k00825k2817k8298L3508k9304K22789
11518a6169K04861r2669j16513k3193n3880j44925M7506K0333J37929K734k9612
11507f3598N4416O943k02094l0156J50461R4044j1244P1443m0195P2304l39045
11496b36721p7627J61503o2960j15431j71493L25475K0905n7449o3333K62541
11486a4590J10745k72844j00017J59342J46220j49739j33166l57508J16738J86897
11476c07922J48948M30916k22103N6989J01000j05937k53175j95509J16307Q0738
11466a49748J91783K56497k55069k8013j25368Q0097L8895J54324k19780j84483
11456b40865L37343J80491K59481j76327l23562j57781K82775J86664k69033J08193
$$ plain form
11446 187379 218245 107696 -55902 47574 70841 -88650 -5201 -130203 -228121 159463
11436 159463 -48513 71916 269121 74797 262037 43356 -266168 -176825 -36741 3856
11426 3856 49482 106010 -19686 -393557 -259431 -269933 -120613 7533 -66941 -261383 -30512
11415 -30512 -15115 -264953 -239664 -177160 -310047 -65439 93228 102234 -186769 30842 80879
11404 80879 -236338 -331115 -162917 -54470 -120671 -352700 -433210 -197388 -406982 -287387
11394 -287387 -303639 -223350 -24592 53414 37705 3475 -207731 -74526 72945 -76094
11384 -76094 -88392 -7096 -49268 104297 293502 79469 -44635 115996 208377 77499
11374 77499 180678 159705 257255 214157 -95320 -370457 -140018 -264499 -295061 119552
$$ packed form
11446A87379L0866j10549j63598J03476K3267j59491Q3449j25002r7918L87584
11436A59463k07976J20429J97205j94324J87240k18681l09524Q9343J40084M0597
11426C856M5626N6528j25696l73871J34126j0502J49320J28146p4474j94442K30871
11415c0512J5397k49838K5289O2504j32887K44608J58667R006k89003K17611N0037
11404H0879l17217r4777J68198J08447o6201k32029q0510K35822k09594J19595
11394b87387j6252Q0289J98758P8006j5709l4230k11206J33205J47471j49039
11384g6094j2298Q1296m2172J53565J89205k14033j24104J60631R2381j30878
11374G7499J03179k0973R7550m3098l09477k75137K30439j24481l0562M14613
$$ plain form
11364 119552 -160690 106338 72879 134489 -177877 -83939 -127068 -199647 -40660 -135567 -68891
11353 -68891 148166 295318 183420 -139019 -59037 30177 113558 159294 12068 171954
11343 171954 -35476 -200221 89914 127143 39456 -29143 -217010 -16804 -66547 -191492
11333 -191492 -217835 10413 -33939 -54710 -50094 -94756 -4322 117477 39177 -196449 -182543
11322 -182543 -125366 -196598 -54640 188784 87672 -16804 58505 -201617 -361067 -71858
11312 -71858 -346412 -393796 -198862 -249760 -44793 -135676 -364459 -193578 -364059 -327356
11302 -327356 15365 -262742 -331743 -135230 -54287 -73303 -276484 -308454 -258676 -351876 -70163
11291 -70163 -48454 -245738 -418240 -372853 -119008 -223203 -333800 -193454 -134922 35034
$$ packed form
11364A19552k80242K67028l3459O1610l12366R3938m3129p2579J58987r4907O6676
11353f8891K17057J47152j11898l22439P9982Q9214Q3381M5736j47226J59886
11343A71954k07430j64745K90135L7229q7687o8599j87867K00206m9743j24945
11333a91492k6343K28248m4352k0771M616m4662R0434J21799p8300k35626J3906
11322a82543N7177p1232J41958K43424j01112j04476P5309k60122j59450K89209
11312g1858k74554m7384J94934n0898K04967r0883k28783J70881j70481L6703
11302c27356L42721k78107o9001J96513Q0943j9016k03181l1970M9778r3200K81713
11291g0163K1709j97284j72502M5387K53845j04195j10597J40346N8532J69956
$$ plain form
11281 35034 -23406 21259 -173503 -91623 -303941 -466011 -197940 -510522 -404728 -127618
11271 -127618 47872 264280 129755 -116542 -66355 -50121 94227 426962 129797 191344
11261 191344 195328 30598 158593 116553 35559 256858 292476 225822 -8905 -95618 -378184
11250 -378184 -176831 171372 122408 108712 44655 -1324 139116 201036 116429 168017 121241
11239 121241 23523 -21831 -119501 -115741 -302951 -402796 -181639 -111230 -111275 -157258 -119257 -215202
11227 -215202 -223329 -124657 147363 -171053 -51216 -11067 -171553 63171 166013 -28753
11217 -28753 128827 199515 42144 -103521 -84477 -247745 -121615 156581 198980 -136980
11207 -136980 -111846 -238829 -113028 20060 240491 -76465 -304885 -371588 -120210 37051
$$ packed form
11281C5034n8440M4665j94762Q1880k12318j62070K68071l12582J05794K77110
11271a27618J75490K16408j34525k46297N0187J6234J44348L32735k97165O1547
11261A91344L984j64730J27995m2040q0994K21299L5618o6654k34727q6713k82566
11250c78184K01353L48203m8964j3696o4057m5979J40440O1920q4607N1588m6776
11239A21241r7718m5354r7670L760j87210r9845K21157P0409m5m5983L8001r5945
11227b15202q127R8672K72020l18416J19837M0149j60486K34724J02842j94766
11217b8753J57580P0688j57371j45665J9044j63268J26130K78196M2399l35960
11207a36980K5134j26983J25801J33088K20431l16956k28420o6703K51378J57261
$$ plain form
11197 37051 -211176 -154771 -51518 106565 164636 166503 225512 230685 181852 74835 402791
11186 402791 357615 101775 71791 -351708 -256451 31656 73008 172142 317162 149644
11176 149644 36282 -5031 -145160 148999 193439 -106991 -296182 -143548 -210355 -419716
11166 -419716 -229624 -213347 -76219 -244293 -70433 -63945 102784 68365 49345 -44345 -179480
11155 -179480 -305831 93556 257667 332906 243280 213830 -34656 -64742 187341 87506
11145 87506 -167836 -70962 -69073 -24798 146975 251788 118665 158343 -49857 103400 89070
11134 89070 -223617 -126881 -137425 -263708 -200743 117156 -173496 29807 43246 451831
11124 451831 304612 -66852 -35144 -240965 -223272 39778 -12350 -235797 -194143 26125
$$ packed form
11197C7051k48227N6405J03253J58083N8071J867N9009N173m8833j07017L27956
11186D02791m5176k55840k9984m23499R5257K88107M1352R9134J45020j67518
11176A49644j13362m1313j40129K94159M4440l00430j89191J52634o6807k09361
11166d19716J90092J6277J37128j68074J73860O488J66729l4419j9020r3690j35135
11155a79480j26351L99387J64111P5239q9626k9450k48486l0086K52083r9835
11145H7506k55342R6874J889M4275J71773J04813j33123L9678k08200J53257j4330
11134H9070l12687R6736j0544j26283O2965L17899k90652K03303J3439M08585
11124D51831j47219l71464L1708k05821J7693K63050n2128k23447M1654K20268
$$ plain form
11114 26125 -17473 -199741 -6334 126647 330363 316246 186361 -12077 -99464 -126696
11104 -126696 -114378 -79104 -102884 -205461 -468319 -18510 278819 136739 -97140 -163254
11094 -163254 -380609 -250440 -172526 -11090 108741 324545 91797 -109668 107327 -52358
11084 -52358 45394 80970 136025 115967 -150702 -299472 -220380 -40649 18115 -19280 18045
11073 18045 -88408 -317296 -257005 66731 -203771 28698 440104 372017 318432 313013 -41568
11062 -41568 -39915 95051 164211 -180491 -292460 -180349 -2464 76883 -210601 -91036
11052 -91036 -23446 -28579 -179807 -42153 31384 15281 125153 182160 166344 303628 194867
11041 194867 48920 48637 70496 403050 296492 188225 311017 154372 81762 215135
$$ packed form
11114B6125m3598j82268J93407J32981K03716j4117j29885j98438q7387k7232
11104a26696J2318L5274k3780j02577k62858M49809K97329j42080k33879o6114
11094a63254k17355J30169P7914J61436J19831K15804k32748k01465K16995j59685
11084e2358R7752L5576N5055k0058k66669j48770P9092J79731N8764l7395L7325
11073A8045j06453k28888O0291L23736k70502K32469M11406o8087n3585n419l54581
11062d1568J653J34966O9160l44702j11969J12111J77885P9347k87484J19565
11052i1036O7590n133j51228J37654P3537j6103J09872N7007j5816J37284j08761
11041A94867j45947k83K1859L32554j06558j08267J22792j56645p2610J33373
$$ plain form
11031 215135 -73626 -136101 -70615 -269823 -107425 51467 94829 26714 46926 -364687
11021 -364687 -219144 126853 61669 175840 44012 -52837 -103104 -143143 -256203 -64003
11011 -64003 117244 90930 7727 -14442 -26525 -314950 -338900 -275838 -281138 156123 174437
11000 174437 -231708 -130108 -224935 -22744 -112725 120356 -25838 -96055 -102540 -261614
10990 -261614 -343490 19462 270936 47223 98898 4548 -241308 -294199 -203877 -329420
10980 -329420 -139501 -164370 4418 70089 162357 210924 275032 73193 -211200 -116975 -137659
10969 -137659 -98719 68952 -3962 52173 165767 166337 74368 21037 141663 225282 320009
10958 320009 291069 19543 -110106 -399097 -447829 -247315 -68043 66792 57603 -164093
$$ packed form
11031B15135k88761o2475O5486j99208J62398J58892M3362o8115K0212m11613
11021c64687J45543L45997o5184J14171j31828r6849n0267m0039j13060J92200
11011f4003J81247k6314q3203k2169j2083k88425k3950O3062n300M37261J8314
11000A74437m06145J01600r4827K02191q9981K33081j46194p0217o485j59074
10990b61614q1876L62952K51474k23713N1675r4350k45856n2891R0322j25543
10980c29420J89919k4869J68788O5671R2268M8567O4108k01839k84393R4225k0684
10969a37659L8940J67671p2914N6135J13594N70r1969n3331J20626Q3619R4727
10958C20009k8940k71526j29649k88991m8732K00514J79272J34835r189k21696
$$ plain form
10948 -164093 -132207 -166638 -138003 -132874 -254941 144110 403065 159451 249792 185206 137593
10937 137593 206034 132533 146317 -31755 -21620 -382038 -173377 -14450 -289 303022
10927 303022 437626 579931 252110 154998 216612 132796 -14389 -104776 4224 58258
10917 58258 144835 267064 222241 116216 22098 241077 229926 152496 15130 90859 106658
10906 106658 -29395 99144 -163551 -51768 -27330 -175271 -389076 -345712 26101 120898
10896 120898 148956 222201 -67555 103302 133356 107338 312390 -74615 -116180 -242831
10886 -242831 -225949 209703 -31746 -13288 -172949 -220777 -255795 -358854 -60194 80902
10876 80902 -22391 -212060 -47957 160358 -47512 13054 317960 -31453 -65598 -131049
$$ packed form
10948a64093L1886l4431K8635N129j22067L99051K58955k43614R0341o4586m7613
10937A37593O8441p3501J3784j78072J0135l60418K08661J58927J4161L03311
10927C03022J34604J42305l27821r7112O1614q3816j47185r0387J09000N4034
10917E8258Q6577J22229m4823j06025r4118K18979j1151p7430j37366P5729J5799
10906A06658j36053J28539k62695J11783K4438j47941k13805M3364L71813R4797
10896A20898K8058P3245k89756J70857L0054k6018K05052l87005m1565j26651
10886b42831J6882M35652k41449J8458j59661m7828l5018j03059K98660J41096
10876H0902j03293j89669J64103K08315k07870O0566L04906l49413l4145o5451
$$ plain form
10866 -131049 -9893 47244 -301993 -4081 307041 77572 36999 27012 -61248 -49192 49832
10855 49832 288483 12689 -117632 -87489 -114466 -21151 2895 -71608 -119071 -10943 -222554
10844 -222554 87396 121047 -113709 51923 -61473 -289173 -61321 -73646 -69781 62556
10834 62556 21297 -172669 39185 -77834 -145163 -28587 -34 -24208 31320 18424 158480
10823 158480 231487 303160 275129 -96707 134194 82608 68538 -12342 56944 161840 292592
10812 292592 -45602 -89569 -43178 24240 82142 138329 17524 -161141 87219 339681
10802 339681 269520 229749 58229 -16957 -47932 -44443 69105 -25318 -111308 -82741 41253
10791 41253 191486 336640 336744 252767 -69610 -1530 -141641 -216465 148553 219796 21788
$$ packed form
10866a31049J21156N7137l49237K97912L11122k29469m0573r987q8260J2056R9024
10855D9832K38651k75794j30321L0143k6977R3315K4046p4503m7463J08128k11611
10844b22554L09950L3651k34756J65632j13396k27700K27852j2325L865J32337
10834F2556m1259j93966K11854j17019o7329J16576K8553k4174N5528j2896J40056
10823A58480P3007P1673k8031l71836K30901n1586j4070q0880O9286J04896J30752
10812B92592l38194m3967M6391O7418N7902N6187j20805j78665K48360K52462
10802C39681p0161l9771j71520p5186l0975L489J13548r4423q5990K8567J23994
10791D1253J50233J45154J04q3977l22377O8080j40111p4824L65018P1243j98008
$$ plain form
10780 21788 -70357 -167477 -215464 -51843 -70317 -94033 -186787 -165555 -207009 -45790 18303
10769 18303 -23708 -123370 -162842 -87662 -215160 -49722 148204 350562 216308 11547
10759 11547 -112074 103722 84389 -36019 -138618 -379049 -295153 -63901 -3092 107822
10749 107822 -53816 101849 230774 31902 84592 35488 234267 193854 89665 84163
10739 84163 -183201 -2644 280714 115747 158074 171809 253248 111079 -132062 -22191
10729 -22191 -78773 -90593 53230 251766 108610 -209473 -299753 -129387 -24787 194511
10719 194511 194664 130511 555523 230419 219254 350418 -53415 100691 255468 389825
10709 389825 326993 192853 219764 47455 58262 219350 110584 -140236 234959 250474
$$ packed form
10780B1788r2145r7120m7987J63621j8474k3716r2754K1232m1454J61219O4093
10769A8303m2011r9662l9472P5180j27498J65438J97926K02358j34254k04761
10759A1547j23621K15796j9333j20408j02599k40431Q3896K31252O0809J10914
10749A07822j61638J55665J28925j98872N2690m9104J98779m0413j04189n502
10739H4163k67364J80557K83358j64967M2327J3735Q1439j42169k43141J09871
10729b2191n6582j1820J43823J98536j43156l18083r0280J70366J04600K19298
10719A94511J53o4153M25012l25104j1165J31164m03833J54106J54777J34357
10709C89825o2832j34140K6911j72309J0807J61088j08766k50820L75195J5515
$$ plain form
10699 250474 -105639 -76403 -29915 -63743 172160 366591 -153699 -168652 -48338 49427
10689 49427 -123243 -83098 92705 -191737 -285428 -262271 -25333 -140297 -187363 -117583 88615
10678 88615 156211 266140 -34818 19512 133678 127583 152533 -262011 102660 349438 88502
10667 88502 161204 311675 124654 -55923 29519 -329049 -332645 -229288 -180335 -35061 32353
10656 32353 132369 143288 296196 418613 413810 146846 16675 208632 147040 -44310
10646 -44310 -112448 -35245 174786 -51276 -110504 -11330 36886 -372867 -402908 -222518 -29094
10635 -29094 126798 -157200 -180617 -153945 -1462 147556 -113743 -37824 -86606 6973 -94704
10624 -94704 -38728 210318 109277 -143240 -113030 78328 116342 282014 183095 202098 464212
$$ packed form
10699B50474l56113K9236M6488l3828K35903J94431n20290j4953J20314R7765
10689D9427j72670M0145J75803k84442r3691K3157K36938j14964m7066O9780K06198
10678H8615O7596J09929l00958N4330J14166o095K4950m14544L64671K46778k60936
10667H8502P2702J50471j87021j80577Q5442l58568l596J03357M8953J45274O7414
10656C2353J00016J0919J52908J22417m803k66964j30171J91957o1592j91350
10646d4310o8138P7203K10031k26062n9228R9174M8216m09753l0041J80390J93424
10635b9094J55892k83998k3417K6672J52483J49018k61299P5919m8782R3579j01677
10624i4704N5976K49046j01041k52517L0210J91358L8014J65672r8919J9003K62114
$$ plain form
10613 464212 302539 -46649 -294387 -105237 19190 373343 269950 -113869 -89446 -72271
10603 -72271 -52414 -96496 366495 850044 326605 -16688 13820 -17446 250989 250496 218330
10592 218330 41974 -136734 25667 239738 -20909 11723 188885 -122501 -233568 -162471
10582 -162471 187002 292644 86635 27921 -58651 -38134 -220652 58551 141997 3817
10572 3817 4173 1011 42172 29394 -216118 -54389 248056 62274 -24204 56408 -84210
10561 -84210 5133 -130359 -42141 92576 -48885 -174986 -234228 -254474 41712 110180 136685
10550 136685 40950 -92888 -125394 -177042 -56780 117678 -123871 -469932 -229873 -10591
10540 -10591 74767 204067 86883 340222 218194 240617 112016 -54932 -169561 -213435
$$ packed form
10613D64212j61673l49188k47738J89150J24427L54153j03393l83819K4423J7175
10603g2271J9857m4082M62991M83549n23439l43293L0508l1266K68435m93l2166
10592B18330j76356j78708J62401K14071k60647L2632J77162l11386j11067P1097
10582a62471L49473J05642k06009n8714q6572K0517j82518K79203Q3446j38180
10572C817L56l162M1161j2778k45512J61729L02445j85782q6478Q0612j40618
10561h4210Q9343j35492Q8218J34717j41461j26101n9242k0246K96186O8468K6505
10550A36685r5735j33838l2506n1648J20262J74458k41549l46061K40059K19282
10540a0591Q5358J29300j17184K53339j22028K2423j28601j66948j14629m3874
$$ plain form
10530 -213435 -196677 86815 244641 282002 228359 192582 168822 -62087 -96807 -36532 187794
10519 187794 305029 446461 110214 -19699 66454 200554 85458 -58617 -86905 -280664
10509 -280664 -187450 -141447 -155956 208028 1980 43908 33849 -9927 -5920 95392 45693
10498 45693 291808 304062 1692 -173437 139786 -5184 107891 232012 170974 174493
10488 174493 101974 107771 304401 165434 178776 168735 184041 30976 -126731 60697 385886
10477 385886 266940 129938 301524 288399 239022 87671 3799 240871 346461 133506
10467 133506 -97553 -31980 111785 15982 76449 195114 78187 173339 94603 -139455
10457 -139455 -313470 -318157 -246112 -114155 46747 -293458 91464 145279 142385 180667 283642
$$ packed form
10530b13435J6758K83492J57826L7361n3643l5777k3760k30909l4720O0275K24326
10519A87794J17235J41432l36247j29913Q6153J34100j15096j44075k8288j93759
10509b80664R3214M6003j4509L63984k06048M1928j0059m3776M007J01312m9699
10498D5693K46115J2254l02370j75129L13223j44970J13075J24121o1038L519
10488A74493p2519N797J96630j38967J3342j0041J5306j53065j57707J87428L25189
10477C85886j18946j37002J71586j3125m9377j51351q3872K37072J05590k12955
10467A33506k31059O5573J43765r5803O0467J18665j16927R5152p8736k34058
10457a39455j74015m687P2045J31957J60902l40205L84922N3815k894L8282J02975
$$ plain form
10446 283642 264070 70318 -48737 17533 -208145 -159195 154990 -86972 64842 -68010
10436 -68010 -161775 203745 53428 -74019 124107 71201 72372 16748 -50317 -125471 -161928
10425 -161928 94057 -43346 -132735 -93675 259125 396109 302525 150278 252724 214868
10415 214868 251219 217203 169494 -128394 -106124 -128486 124638 152205 506520 547134 357318
10404 357318 258772 9697 73062 23032 -42562 222842 228752 328993 512364 483755 333306
10393 333306 196074 239240 367917 283287 48838 88735 -23446 134725 130497 132939 14258
10382 14258 -231630 -142808 138780 -29907 161140 -26089 -174760 -91385 -49616 128761
10372 128761 141343 20427 -116831 194307 194746 28980 265134 297084 439426 249291
$$ packed form
10446B83642j9572j93752j19055O6270k25678M8950L14185k41962J51814j32852
10436f8010r3765L65520j50317j27447J98126n2906J171n5624o7065p5154l6457
10425a61928K55985j37403q9389L9060L52800J36984r3584j52247J02446l7856
10415B14868L6351l4016m7709k97888K2270k2362K53124K7567L54315M0614j89816
10404C57318r8546k49075O3365n0030o5594K65404N910J00241J83371k8609j50449
10393C33306j37232M3166J28677q4630k34449L9897j12181J58171m228K442j18681
10382A4258k45888Q8822K81588j68687J91047j87229j48671Q3375M1769J78377
10372A28761J2582j20916j37258L11138M39j65766K36154L1950J42342j90135
$$ plain form
10362 249291 113345 157933 326037 132395 -95537 84147 355577 400679 130234 146469
10352 146469 395208 139454 97366 351630 288830 215268 197618 115517 99653 832 -108936
10341 -108936 -93 493920 649165 263518 -11131 168390 303294 235842 15009 175907
10331 175907 4060 100214 -14383 -35292 448363 508426 416747 350358 481599 382339 345583
10320 345583 78151 48190 -75685 72390 54901 -69322 -162816 -314577 -123415 -15760
10310 -15760 -293676 -399148 -45713 195953 246911 185825 -160854 -270892 -217745 -22342
10300 -22342 275311 30201 -63798 141685 64319 214961 146246 -200216 -54823 243567
10290 243567 291158 190414 285311 357511 205593 6607 -12989 166855 298055 371402
$$ packed form
10362B49291j35946M4588J68104j93642k27932J79684K71430M5102k70445J6235
10352A46469K48739k55754m2088K54264o2800p3562j7650q2101j5864r8821j09768
10341a08936J08843M94013J55245l85647k74649J79521J34904o7452k20833J60898
10331A75907j71847R6154j14597k0909M83655O0063r1679o6389J31241r9260l6756
10320C45583k67432k9961j23875J48075j7489j24223r3494j51761J91162J07655
10310a5760k77916j05472L53435K41666N0958o1086l46679j10038N3147J95403
10300b2342K97653k45110r3999K05483p7366J50642o8715l46462J45393K98390
10290B43567M7591j00744R4897P2200j51918j98986j9596J79844J31200P3347
$$ plain form
10280 371402 175579 89524 35637 126996 22708 68937 -3451 68430 66752 -13489 -69955
10269 -69955 200189 168526 -135242 33835 125444 156818 -79023 81540 51112 124538 -115675
10258 -115675 -83936 109018 311070 200483 104916 -106313 -280899 -168359 -31662 50861
10248 50861 95972 81149 180858 -53728 -143283 -29035 843 -44841 89118 89889 -22930
10237 -22930 58619 -117061 -221027 42666 156329 143083 63227 -192016 -41769 229893
10227 229893 121700 -65394 -54573 -15836 167633 135260 161158 3834 108849 66585
10217 66585 128846 237975 6902 -101500 -98370 235341 452738 306681 318757 62810
10207 62810 73824 285163 188696 86428 420963 348462 218631 202832 360752 357370 384418
$$ packed form
10280C71402j95823q6055n3887R1359j04288M6229p2388P1881j678q0241n6466
10269f9955K70144l1663l03768J69077R1609L1374k35841J60563l0428P3426k40213
10258a15675L1739J92954K02052j10587r5567k11229j74586J12540J36697Q2523
10248E0861M5111j4823R9709k34586q9555J14248K9878m5684J33959P71j12819
10237b2930Q1549j75680j03966K63693J13663j3246p9856k55243J50247K71662
10227B29893j08193j87094J0821L8737J83469l2373K5898j57324J05015m2264
10217F6585O2261J09129k31073j08402L130L33711K17397j46057J2076k55947
10207F2810J1014K11339r6467j02268L34535p2501j29831j5799J57920l382K7048
$$ plain form
10196 384418 131840 162055 48479 366857 615324 305219 31671 33228 229473 94050
10186 94050 -78791 80423 234927 210136 234909 277207 434480 217858 198966 294442 234160
10175 234160 291292 500159 127419 188109 451823 322075 25432 158345 162111 -114693
10165 -114693 34664 116806 114652 -207612 1253 100220 111929 396615 236849 347986
10155 347986 11471 72359 237353 281338 127084 95659 48474 65545 14541 76100 236615
10144 236615 139366 342098 203419 -797 -218593 -2918 155720 204663 323078 91275
10134 91275 -6931 2524 215174 315517 321344 244160 139314 224325 331937 64555 -97827
10123 -97827 51141 228157 271012 235684 232950 213154 108086 -10089 121539 274491 233577
$$ packed form
10196C84418k52578L0215j13576L18378K48467l10105k73548J557J96245j35423
10186I4050j72841J59214J54504k4791K4773M2298J57273k16622j8892R5476o0282
10175B34160N7132K08867l72740O0690K63714j29748k96643J32913L766k76804
10165a14693J49357Q2142k154l22264K08865R8967J1709K84686j59766J11137
10155C47986l36515O0888J64994M3985j54254l1425m7185J7071n1004O1559J60515
10144B36615r7249K02732j38679k04216k17796K15675J58638M8943J18415k31803
10134I1275r8206R455K12650J00343N827p7184j04846Q5011J07612k67382j62382
10123i7827J48968J77016M2855l5328k734j9796j05068j18175J31628J52952m0914
$$ plain form
10112 233577 184676 25897 319894 438276 400586 323681 101598 34159 -84652 66727
10102 66727 270477 254363 222671 296995 204094 281340 358795 224758 149888 126303 135012
10091 135012 265725 182530 210930 197467 237677 367464 235420 437751 349873 235283
10081 235283 190927 331096 79561 151184 380106 488058 528791 331962 285669 154833
10071 154833 165215 276765 103600 -41373 316356 581323 484239 357705 335843 158301
10061 158301 292023 88160 178764 292763 252860 153804 -54774 174257 362059 237999
10051 237999 519100 551255 509563 407660 187904 293615 255724 507527 423609 159863
10041 159863 108516 52921 304047 483311 503682 325380 235060 358534 344737 172320
$$ packed form
10112B33577m8901j58779K93997J18382l7690p6905k22083o7439j18811J51379
10102F6727K03750j6114l1692P4324r2901P7246P7455j34037p4870k3585Q709
10091A35012J30713q3195K8400j3463M0210J29787j32044K02331q7878j14590
10081B35283m4356J40169k51535P1623K28922J07952M0733j96829m6293j30836
10071A54833J0382J11550j73165j44973L57729K64967r7084j26534k1862j77542
10061A58301J33722k03863R0604J13999l9903r9056k08578K29031J87802j24060
10051B37999K81101L2155m1692j01903k19756J05711l7891K51803q3918k63746
10041A59863n1347n5595K51126J79264K0371j78302r0320J23474j3797j72417
$$ plain form
10031 172320 287481 515899 427012 373396 556005 480932 396818 240690 216437 276288 304277
10020 304277 257949 257440 337840 497114 213792 163071 141756 75534 -6458 36144 230881
10009 230881 214148 104914 400799 447504 141807 242925 409543 393329 235172 135584
9999 135584 100329 -75774 87548 393402 158556 268017 167186 245318 412743 289498
9989 289498 480428 460514 292850 456791 478879 752197 867674 480158 283045 390205
9979 390205 267472 313121 261400 216812 189090 375942 186199 317999 426995 90071
9969 90071 189368 257990 365177 488558 441789 335059 384992 378266 407489 291720 390125
9958 390125 303343 438436 396066 -32630 184105 477700 433350 276045 328003 63538
$$ packed form
10031A72320J15161K28418q8887n3616J82609p5073q4114j56128k4253N9851K7989
10020C04277m6328n09Q0400J59274k83322n0721k1315o6222q1992M2602J94737
10009B30881j6733j09234K95885M6705l05697J01118J66618j6214j58157r9588
9999A35584l5255j76103J63322L05854k34846J09461j00831P8132J67425j23245
9989B89498J90930j9914j67664J63941K2088K73318J15477l87516j97113J07160
9979C90205j22733M5649n1721m4588k7722J86852j89743J31800J08996l36924
9969I0071R9297O8622J07187J23381m6769j06730M9933o726K9223j15769R8405
9958C90125q6782J35093m2370m28696K16735K93595m4350j57305N1958k64465
$$ plain form
9948 63538 133948 163316 121334 221346 238841 119574 38861 97740 66431 107657 231293
9937 231293 272494 535926 471476 215041 339651 115692 -54525 -17069 38679 574407
9927 574407 469642 503642 436866 263986 379141 428476 304716 415224 284993 463460
9917 463460 532510 317550 329054 108411 351575 290671 381398 452481 194104 -64388 278514
9906 278514 409087 297098 290373 164065 6301 -14530 124671 291727 363224 332288 407144
9895 407144 295795 370429 521742 59030 -9476 384206 373684 456794 550707 491548 457405
9884 457405 342693 137113 -35280 87476 -91286 47267 145791 364328 185913 203929
9874 203929 106363 243020 322965 262475 156132 219712 294312 234361 174094 -18907 59910
$$ packed form
9948F3538P0410K9368m1982J00012J7495j19267q0713N8879l1309M1226J23636
9937B31293M1201K63432o4450k56435J24610k23959j70217L7456N5748N35728
9927E74407j04765L4000o6776j72880J15155M9335j23760J10508j30231J78467
9917D63460O9050k14960J1504k20643K43164o0904R0727P1083k58377k58492L42902
9906B78514J30573j11989o725j26308j57764k0831J39201J67056P1497l0936P4856
9895D07144j11349P4634J51313m62712o8506L93682j0522Q3110R3913n9159l4143
9884D57405j14712k05580j72393J22756j78762J38553R8524K18537j78415J8016
9874B03929r7566J36657P9945o0490j06343O3580P4600n9951o0267j93001P8817
$$ plain form
9863 59910 309145 494599 429903 311763 376073 379829 489738 771447 649600 550044 640985
9852 640985 651548 266226 280344 445211 441294 249132 218475 247526 341957 360134 250922
9841 250922 440310 405711 509371 422930 464691 640978 606830 460364 221330 468682
9831 468682 471804 549275 87105 293809 272400 225635 408198 369849 442381 389421 476667
9820 476667 257924 211187 273442 451978 247975 135373 327922 347314 325421 444788
9810 444788 321390 142072 97713 453755 283305 161682 308393 378055 578242 385872
9800 385872 498775 509750 387946 569441 571673 371474 293065 431568 501610 330599 371360
9789 371360 475747 494349 325957 494201 434193 613620 449045 319771 206665 -51895
$$ packed form
9863E9910K49235J85454o4696j18140O4310L756J09909K81709j21847r9556R0941
9852F40985J0563l85322J4118J64867l917j92162l0657K9051R4431J8177j09212
9841B50922J89388l4599J03660q6441M1761J76287l4148j46466k39034K47352
9831D68682L122P7471m62170K06704k1409m6765J82563l8349P2532n2960Q7246
9820D76667k18743m6737O2255J78536k04003j12602J92549J9392k1893J19367
9810D44788j23398j79318m4359L56042j70450j21623J46711O9662K00187j92370
9800C85872J12903J0975j21804J81495K232k00199p8409J38503P0042j71011M0761
9789C71360J04387J8602j68392J68244o0008J79427j64575j29274j13106k58560
$$ plain form
9779 -51895 207599 553426 661436 582426 446097 347411 601239 794659 635798 590396
9769 590396 693454 709069 537685 351702 710398 879517 695441 769881 554690 681589
9759 681589 879320 1040022 1079399 1017573 957461 1067333 1213801 1070846 1168339 1268560
9749 1268560 1042483 642626 592758 616277 813913 562863 464916 248612 403688 804933
9739 804933 842871 927590 861686 655179 588194 480018 553833 474351 527319 532375 382147
9728 382147 721776 878557 863995 968881 1130666 1061616 954165 943119 773221 659603
9718 659603 751053 852005 986244 1107340 1070383 1035540 998074 795587 705849 653369 607389
9707 607389 544523 718446 503454 395541 539052 622383 682821 775792 816783 731178 594577
$$ packed form
9779e1895K59494L45827J08010p9010j36329r8686K53828J93420j58861m5402
9769E90396J03058J5615j71384j85983L58696J69119j84076P4440k15191J26899
9759F81589J97731J60702L9377o1826o0112J09872J46468j42955R7493J00221
9749A268560k26077l99857m9868K3519J97636k51050r7947k16304J55076M01245
9739H04933L7938Q4719o5904k06507o6985j08176P3815p9482N2968N056j50228
9728C82147L39629J56781j4562J04886J61785o9050j07451j1046j69898j13618
9718F59603R1450J00952J34239J21096l6957l4843l7466k02487q9738n2480m5980
9707F07389o2866J73923k14992j07913J43511Q3331O0438R2971M0991q5605j36601
$$ plain form
9696 594577 588797 878759 655493 538135 602243 644201 537880 331201 583981 621750 430590
9685 430590 671064 523689 541042 705365 448123 427106 817095 421838 299346 260275
9675 260275 441678 624659 684670 536891 487576 773700 585975 592723 599663 538861 509069
9664 509069 506625 796080 558553 468331 593209 514961 640423 591185 501840 499124 646990
9653 646990 657862 556208 451571 556090 335367 369867 674907 949587 857061 753234
9643 753234 806053 571769 418695 682490 721425 616312 609055 618501 622206 589527 369359
9632 369359 781754 704966 467919 433185 434427 513866 322191 388669 815782 719530 485783
9621 485783 471686 755917 845016 815347 783545 307614 580944 730243 746524 831088 912743
$$ packed form
9696E94577n780K89962k23266j17358O4108M1958j06321k06679K52780L7769j91160
9685D30590K40474j47375J7353J64323k57242k1017L89989l95257j22492l9071
9675B60275J81403J82981O0011j47779m9315K86124j87725O748O940o0802k9792
9664E09069k444K89455k37527r0222J24878p8248J25462m9238q9345k716J47866
9653F46990J0872j01654j04637J04519k20723L4500L05040K74680r2526j03827
9643G53234N2819k34284j53074K63795L8935j05113p257R446L705l2679k20168
9632C69359M12395p6788k37047l4734J242P9439j91675O6478M27113r6252k33747
9621D85783j4097K84231Q9099k9669l1802m75931K73330J49299J6281Q4564Q1655
$$ plain form
9610 912743 741822 720442 952820 846483 727331 942137 897864 1082001 1201334 1283994
9600 1283994 1461287 1105935 988414 978851 906438 626520 828257 860907 767200 1098250
9590 1098250 1108931 981891 801377 547402 590052 779583 833416 980549 1020139 931829
9580 931829 935656 913149 792826 839170 1109067 1069342 728666 871425 953900 953239 844199
9569 844199 1029993 1031967 1020263 889662 985154 1277241 1037271 695984 788100 943841 946714
9558 946714 1168384 1107958 932507 815960 1100695 825036 768910 987551 922272 1165386
9548 1165386 1223204 1241682 1337797 1308098 1358012 1427729 1323433 1272904 1254666 1135283 1083209
9537 1083209 974219 1059539 1289093 1086205 1017560 864152 758321 843942 1109866 1266719
$$ packed form
9610I12743j70921k1380K32378j06337j19152K14806m4273J84137J19333Q2660
9600A283994J77293l55352j17521r563p2413k79918K01737L2650r3707L31050
9590A098250J0681j27040j80514k53975M2650J89531N3833J47133L9590q8310
9580I31829L827k2507j20323M6344K69897l9725l40676J42759Q2475o61j09040
9569H44199J85794J974j1704j30601R5492K92087k39970l41287R2116J55741K873
9558I46714K21670o0426j75451j16547K84735k75659n6126K18641o5279K43114
9548A165386N7818J8478R6115k9699M9914O9717j04296n0529j8238j19383n2074
9537A083209j08990Q5320K29554k02888o8645j53408j05831Q5621K65924J56853
$$ plain form
9527 1266719 1124783 878234 1056408 959981 1066278 1317974 1237726 1292145 1002252 879404
9517 879404 949359 1140103 1135346 1234568 1116866 790055 785282 1083224 1192010 893001 788225
9506 788225 1104906 1047133 1108925 978993 1295428 1414165 1284798 1262369 1230751 1282111 1364665
9495 1364665 1465366 1149842 1427129 1827608 1523860 1278210 1368292 1257112 1258439 1540138
9485 1540138 1478603 1441852 1476563 1452148 1451383 1579386 1426002 1362892 1627256 1601677 1221313
9474 1221313 1373026 1322816 1521982 1657058 1671503 1764622 1699471 1693318 1909009 1727412 1553797
9463 1553797 1821378 1770841 2013885 1861868 2030233 1869897 1595101 1765785 1716170 1607466
9453 1607466 1516495 1959134 2248049 2179584 2168750 1862701 2125412 2138681 2169096 1995395
$$ packed form
9527A266719j41936k46549J78174r6427J06297K51696q0248N4419k89893j22848
9517H79404O9955J90744m757R9222j17702l26811m773K97942J08786k99009j04776
9506G88225L16681n7773O1792j29932L16435J18737j29367k2429l1618N1360Q2554
9495A364665J00701l15524K77287M00479l03748k45650R0082j11180J327K81699
9485A540138o1535l6751L4711k4415p65J28003j53384o3110K64364k5579l80364
9474A221313J51713n0210J99166J35076J4445R3119o5151o153K15691j81597j73615
9463A553797K67581n0537K43044j52017J68365j60336k74796J70684m9615j08704
9453A607466r0971M42639K88915o8465j0834l06049K62711J3269L0415j73701
$$ plain form
9443 1995395 2319516 2340197 2577575 2669699 2550637 2512947 2752537 2672062 2620480 2669644 2952819
9432 2952819 2779489 2696119 2537242 2612084 2484525 2531907 2693730 2442076 2397275 2191280
9422 2191280 2308446 2530977 2573065 2603561 2460679 2589533 2562693 2296304 2396622 2543044
9412 2543044 2807698 2730439 3060363 2882957 2748526 2975132 2997922 2962035 3297860 2952145
9402 2952145 3149282 3259950 3211561 3122090 2978047 3130700 3135466 3204468 3358433 3361880 3643968
9391 3643968 3331153 2897787 2894865 3276699 3577033 3371590 3609611 3727104 3638503 3825980
9381 3825980 3799712 4079525 4379027 4424379 4353676 4571536 4722025 4665395 4615966 4663814 4810982
9370 4810982 4661301 4628846 4893918 4711388 4442323 4550788 4800718 4511470 4534214 4513753
$$ packed form
9443A995395L24121K0681K37378R2124j19062l7690K39590q0475n1582M9164K83175
9432B952819j73330q3370j58877P4842j27559M7382J61823k51654m4801k05995
9422B191280J17166K22531M2088L0496j42882J28854k6840k66389J00318J46422
9412B543044K64654p7259L29924j77406j34431K26606K2790l5887L35825l45715
9402B952145J97137J10668m8389q9471j44043J52653M766O9002J53965L447K82088
9391C643968l12815m33366k922L81834L00334k05443K38021J17493q8601J87477
9381C825980k6268K79813K99502M5352p0703K17860J50489n6630m9429M7848J47168
9370D810982j49681l2455K65072j82530k69065J08465K49930k89248K2744k0461
$$ plain form
9360 4513753 4577423 4300112 4001220 4252376 4270271 4344396 4220642 4323783 4610151 4658179
9350 4658179 4847062 4988475 4924545 4750880 5060066 5320143 5343143 5467935 5553593 5828415
9340 5828415 5810896 5661212 5808081 6037455 5950533 5804042 5831018 5608150 5607174 5490233 5411692
9329 5411692 5363743 5291594 5254542 5297819 5300443 5007618 5027612 5000200 5032360 4986816 4790684
9318 4790684 4996822 4992462 5054869 5140844 4863340 5012101 4956421 5067285 4723042 4803212 4814541
9307 4814541 4878033 5244774 5104612 5135724 5362411 5304380 5214132 5315353 5586574 5616843
9297 5616843 5595099 5062272 4959922 5042676 5020138 5136949 5057428 4921941 4941660 4902357 4986439
9286 4986439 5077722 5169039 4997000 5046397 5090373 5088971 4765195 4907910 5075476 5136894 4909824
$$ packed form
9360D513753O3670k77311k98892K51156J7895P4125j23754J03141K86368M8028
9350D658179J88883J41413o3930j73665L09186K60077K3000J24792Q5658K74822
9340E828415j7519j49684J46869K29374q6922j46491K6976k22868r76j16941p8541
9329E411692m7949p2149l7052M3277K624k92825J9994k7412L2160m5544j96132
9318D790684K06138m360O2407Q5975k77504J48761n5680J10864l44243Q0170J1329
9307D814541O3492L66741j40162L1112K26687n8031r0248J01221K71221L0269
9297E616843k1744n32827j02350Q2754k2538J16811p9521j35487J9719l9303Q4082
9286D986439R1283R1317j72039M9397M3976j402l23776J42715J67566O1418k27070
$$ plain form
9275 4909824 4588948 4785753 4938670 4835896 4938725 5253689 5163741 5220666 5347548 5281551
9265 5281551 5653629 5507479 5406838 5643157 5588385 5665159 5542991 5476144 5484226 5608351
9255 5608351 5668789 5396028 5305792 5294108 5131264 5161817 5089532 5116296 4967248 4845048 5112172
9244 5112172 5268471 5144473 5121584 5034065 5297892 5312957 5384078 5268658 5301310 5364369 5363138
9233 5363138 5335512 5415624 5302082 5233134 4944018 5138756 5364834 5245665 5072277 5188343
9223 5188343 5157921 5177508 5228220 5629544 5562714 5261877 5050677 5086310 5142871 5095397 5309902
9212 5309902 5468577 5237210 5155480 5429411 5441346 5135851 5225950 5560520 5639427 5617602
9202 5617602 5482371 5482943 5515203 5553735 5758358 5972267 5657109 5791790 5944829 5952511 5981787
$$ packed form
9275D909824l20876J96805J52917j02774J02829L14964q9948N6925J26882o5997
9265E281551L72078j46150j00641K36319n4772P6774j22168o6847Q082J24125
9255E608351O0438k72761r0236j1684j62844L0553p2285K6764j49048j22200K67124
9244E112172J56299j23998k2889q7519K63827J5065P1121j15420L2652O3059j231
9233E363138k7626Q0112j13542o8948k89116J94738K26078j19169j73388J16066
9223E188343l0422J9587N0712M01324o6830l00837k11200L5633N6561m7474K14505
9212E309902J58675k31367q1730K73931J1935l05495R0099L34570P8907k1825
9202E617602j35231N72L2260L8532K04623K13909l15158J34681J53039P682K9276
$$ plain form
9191 5981787 5832543 5668831 5918841 6033715 5817475 5797666 6089054 6042653 6279274 6324811
9181 6324811 6226566 6271357 6499685 6433223 6353463 6679195 7369408 8004746 8315261 8177514
9171 8177514 7647129 7144872 6636530 6407606 6601762 6641981 6326759 6431056 6364914 6279186
9161 6279186 6641723 6567099 6559187 6859551 7109599 7279128 7300997 7198844 7141520 7085674 7129719
9150 7129719 7258838 7484129 7871526 7934324 8007076 8101167 8461262 8849020 8486111 8459844
9140 8459844 9029191 9103644 9102952 9148571 9426300 9637211 9635401 9977704 10155552 10060258 10236031
9129 10236031 10588335 10695919 11210906 11523462 11770421 12155979 12543527 13018066 13525747
9120 13525747 13979036 14461355 15299536 16407584 17216672 17822875 18712958 19486783 20223901
$$ packed form
9191E981787j49244j63712K50010J14874k16240j9809K91388m6401K36621M5537
9181F324811r8245M4791K28328o6462p9760L25732O90213O35338L10515j37747
9171H177514n30385n02257n08342k28924J94156M0219l15222J04297o6142q5728
9161F279186L62537p4624p912L00364K50048J69529K1869j02153n7324n5846M4045
9150G129719J29119K25291L87397O2798P2752R4091L60095L87758l62909k6267
9140H459844N69347P4453o92M5619K77729K10911j810L42303J77848r5294J75773
9129A0236031L52304J07584N14987L12556K46959L85558L87548M74539N07681
9120A3525747M53289M82319Q38181J108048Q09088O06203Q90083P73825P37118
$$ plain form
9111 20223901 20910979 21494883 21993044 22550455 23812657 24778566 25428225 26154642 26772865
9102 26772865 27393221 27461955 27884769 28733754 29928703 31329643 32429051 33566405 34802798
9093 34802798 36139483 37279514 38261451 38828710 38942269 39389914 40126271 40683151 41244379
9084 41244379 41136146 40805969 40398299 39668624 39357369 39265451 39471535 39861390 40869839
9075 40869839 41644038 42264621 43093307 44325351 45377824 46521943 47782262 49002249 49826338
9066 49826338 50476190 51482417 52975427 54270348 55250329 56068965 56368728 56579506 56934801
9057 56934801 57532969 58157218 58195471 57875424 57644607 56680073 55350778 53847000 52508922
9048 52508922 50898523 49474297 48048057 46212698 44488154 42740146 41507268 40813566
$$ packed form
9111B0223901O87078N83904M98161N57411J262202R65909O49659P26417O18223
9102B6772865O20356O8734M22814Q48985J194949J400940J099408J137354J236393
9093C4802798J336685J140031R81937N67259J13559M47645P36357N56880N61228
9084D1244379j08233l30177m07670p29675l11255r1918K06084L89855J008449
9075D0869839P74199O20583Q28686J232044J052473J144119J260319J219987Q24089
9066D9826338O49852J006227J493010J294921R79981Q18636K99763K10778L55295
9057E6934801N98168O24249L8253l20047k30817r64534j329295j503778j338078
9048E2508922j610399j424226j426240j835359j724544j748008j232878o93702
$$ plain form
9040 40813566 40263606 40325137 40449104 40640226 41019827 41742777 42665988 43396687 44350444 45468171
9030 45468171 46406128 47108127 47373806 47104554 46919502 46917134 46862375 46114788 44855163 43323134
9020 43323134 41316327 39610397 38336223 37360532 35814018 33988500 31952046 29779698
9012 29779698 27717004 26014102 24839065 24272501 23689420 23542270 23420100 22949323 22685249
9003 22685249 22135021 22012677 22300950 22543291 22807857 22905830 22924411 23057863 23003153 22946805
8993 22946805 22479185 21673938 21014804 20527817 20295853 19791304 19529093 19508604 19518804 19816529
8983 19816529 19969817 20126005 20150561 19746822 19168328 18583159 17159793 16063725 14901770
8974 14901770 13437946 12421484 11259311 10209007 9872468 9567561 9135648 8719947 8665447
$$ packed form
9040D0813566n49960O1531J23967J91122L79601P22950R23211P30699R53757J117727
9030D5468171R37957P01999K65679k69252j85052k368n4759p47587j259625j532029
9020D3323134k006807j705930j274174r75691j546514j825518k036454k172348
9012B9779698k062694j702902j175037n66564n83081j47150j22170m70777k64074
9003B2685249n50228j22344K88273K42341K64566R7973J8581J33452n4710n6348
8993B2946805m67620q05247o59134m86987k31964n04549k62211k0489J0200K97725
8983A9816529J53288J56188K4556m03739n78494n85169j423366j096068j161955
8974A4901770j463824j016462j162173j050304l36539l04907m31913m15701n4500
$$ plain form
8965 8665447 8673778 8568897 8065565 7954443 7586075 7171816 7162061 7258263 7075791 6606691
8955 6606691 6426186 6488129 6523655 6645334 6505517 6644017 6292189 6200369 6132654 6233623
8945 6233623 6348898 6014114 6160756 6189190 6297726 6144217 6368979 6288140 6018055 6054873
8935 6054873 6235737 6072592 6097403 6186809 6524924 6621964 6546142 6669478 6772871 6767812 6478254
8924 6478254 6181105 6222144 5997275 6232786 6577767 6501432 6184384 6250295 6378403 6448778
8914 6448778 6770467 6999575 7094673 6948693 6956405 7118402 7048624 7025091 6898164 7186714
8904 7186714 7393096 7549672 7743382 8141347 8133312 8225403 8173895 8568982 8883440 8935429
8894 8935429 9089060 9108335 9186459 9604686 9794873 9555707 9656941 10095836 10246742 10477520
$$ packed form
8965H665447Q331j04881n03332j11122l68368m14259r755R6202j82472m69100
8955F606691j80505O1943L5526J21679j39817J38500l51828r1820o7715J00969
8945F233623J15275l34784J46642K8434J08536j53509K24762q0839k70085L6818
8935F054873J80864j63145K4811Q9406L38115R7040p5822J23336J03393n059k89558
8924F478254k97149M1039k24869K35511L44981p6335l17048O5911J28108P0375
8914F448778L21689K29108R5098j45980P712J61997o9778k3533j26927K88550
8904G186714K06382J56576J93710L97965q035R2091n1508L95087L14458N1989
8894H935429J53631J9275P8124M18227J90187k39166J01234M38895J50906K30778
$$ plain form
8884 10477520 10442800 10544690 11061470 11001133 11666940 11900805 12021253 12426678 12951681 13357926
8874 13357926 13718321 14327553 14966776 15460082 16030479 16362837 17039678 17676855 18288737
8865 18288737 18178789 17886685 17941727 18307395 18620309 18807956 19482062 19922321 20403790 20904553
8855 20904553 21286062 21860799 22222616 22595809 23198694 24220962 24993366 25823259 26696539
8846 26696539 27592440 28972056 30853985 32330115 33882461 35440074 37403050 39425336
8838 39425336 41805421 43994574 45231610 47085950 49088611 50058752 50917923 51273650 51044021
8829 51044021 51326043 51879437 52488512 53152489 53301027 53611295 53868620 53676605 53121444
8820 53121444 52748302 52601535 52597157 52750279 52916150 53217014 53454948 53909809 54287664 54928695
$$ packed form
8884A0477520l4720J01890N16780o0337O65807K33865J20448M05425N25003M06245
8874A3357926L60395O09232O39223M93306N70397L32358O76841O37177O11882
8865A8288737j09948k92104N5042L65668L12914J87647O74106M40259M81469N00763
8855B0904553L81509N74737L61817L73193O02885J022268P72404Q29893Q73280
8846B6696539Q95901J379616J881929J476130J552346J557613J962976K022286
8838C9425336K380085K189153J237036J854340K002661R70141Q59171L55727k29629
8829E1044021K82022N53394O09075O63977J48538L10268K57325j92015n55161
8820E3121444l73142j46767m378J53122J65871L00864K37934M54861L77855O41031
$$ plain form
8810 54928695 55781637 57077345 58388021 60343083 62469151 64541449 66595067 68596837
8802 68596837 70152695 72019343 73765541 75529933 76977815 77831141 78538037 78981508 79350191
8793 79350191 79596124 79424005 78984214 78339875 77427829 76268477 75051622 73351769 71941691
8784 71941691 70813867 69495399 67665872 65723142 64039846 62234360 60658473 59017591
8776 59017591 57746542 56302198 55208965 54726923 54375218 54094803 53767272 53667289 53744664
8767 53744664 53960040 53906727 54085788 54808583 55097909 55411672 55553072 55446396 55351201 55423901
8757 55423901 55341610 54988569 55112230 55217079 54648128 53863598 52892709 51658851 50345255
8748 50345255 49100504 47993962 47041878 46104428 44830268 43440509 41854872 41037757 40074933
$$ packed form
8810E4928695Q52942J295708J310676J955062K126068K072298K053618K001770
8802F8596837J555858J866648J746198J764392J447882Q53326P06896M43471L68683
8793G9350191K45933j72119m39791o44339r12046j159352j216855j699853j410078
8784G1941691j127824j318468j829527j942730j683296j805486j575887j640882
8776E9017591j271049j444344j093233m82042l51705k80415l27531r9983P7375
8767E3744664K15376n3313J79061P22795K89326L13763J41400j06676r5195P2700
8757E5423901q2291l53041J23661J04849n68951p84530r70889j233858j313596
8748E0345255j244751j106542r52084r37450j274160j389759j585637q17115r62824
$$ plain form
8739 40074933 39081846 38478985 38072011 37927763 37564642 37652097 37491108 37394357 37455324 37784230
8729 37784230 38539946 39263674 40146253 40864298 42172275 43028224 44539303 46313153 48284655
8720 48284655 49968473 51315308 53267314 55296346 57051053 58794848 61027786 63451032
8712 63451032 66249893 70623197 76421052 85988064 98664334 113446030 132080694 157949483
8704 157949483 195506804 252842582 333012021 407059485 422378340 376779577 302561820
8697 302561820 224519468 169904878 135314106 112415921 97028692 86470891 78931620
8690 78931620 73479127 68749692 64502482 60958939 58168093 55952930 54009267 51934745
8682 51934745 50118016 48316237 46152025 44385987 43180098 42528199 41916348 41054562 40044102
$$ packed form
8739D0074933r93087o02861m06974j44248l63121Q7455j60989r6751O0967L28906
8729C7784230P55716P23728Q82579P18045J307977Q55949J511079J773850J971502
8720D8284655J683818J346835J952006K029032J754707J743795K232938K423246
8712F3451032K798861M373304N797855R567012J2676270J4781696J8634664K5868789
8704A57949483L7557321N7335778Q0169439P4047464J5318855m5598763p4217757
8697C02561820p8042352n4614590l4590772k2898185j5387229j0557801p539271
8690G8931620n452493m729435m247210l543543k790846k215163j943663k074522
8682E1934745j816729j801779k164212j766038j205889o51899o11851q61786j010460
$$ plain form
8673 40044102 39114733 38400378 37762964 37166707 36994805 36576065 36703241 36910395 36871504 37251719
8663 37251719 37606192 37755834 37797443 37790033 37946357 38092883 38267012 37802068 37112078 36576483
8653 36576483 36423949 36277025 36229812 36237449 36080006 35829597 35416175 34425005 33303269 32248755
8643 32248755 31085642 30474801 30109961 30019159 30140807 29995001 29961607 30054247 30174092 30048139
8633 30048139 29929185 29720949 29137002 28732103 28329993 27791820 27042063 26327666 25798297
8624 25798297 25323233 24777052 24153678 23670890 22854075 22232375 21610223 20953557 20273046
8615 20273046 19532981 19028574 18475255 17956704 17367643 16559439 16131295 15641715 15147480
8606 15147480 14712792 14813101 14716891 14372215 14124271 13689114 13523638 13392174 13169470 12933154
$$ packed form
8673D0044102r29369p14355o37414n96257j71902m18740J27176K07154l8891L80215
8663C7251719L54473J49642M1609p410J56324J46526J74129m64944o89990n35595
8653C6576483j52534j46924m7213P637j57443k50409m13422r91170j121736j054514
8643C2248755j163113o10841l64840r0802J21648j45806l3394R2640J19845j25953
8633C0048139j18954k08236n83947m04899m02110n38173p49757p14397n29369
8624B5798297m75064n46181o23374m82788q16815o21700o22152o56666o80511
8615B0273046p40065n04407n53319n18551n89061q08204m28144m89580m94235
8606A5147480m34688J00309r6210l44676k47944m35157j65476j31464k22704k36316
$$ plain form
8596 12933154 12629669 12397167 12034113 11546540 11020462 10708408 10502220 10157767 9571219
8587 9571219 9216594 8665124 8292663 7948186 7538827 6920677 6569022 6395134 5992569 5648860
8577 5648860 5577005 5614899 5170712 5149259 5627789 5431328 4918965 4856992 4711530 4667679
8567 4667679 4691049 4679597 4907996 4668026 4571021 4682349 4247980 4121394 4174342 4163847
8557 4163847 3946722 3765715 3870468 3850864 3932819 3978642 3763344 3715450 3775861 3914239
8547 3914239 3895512 3602844 3182965 3150524 3130864 3293416 3241800 3185165 3297777 3295660 3177730
8536 3177730 3197496 3208665 3553140 3297917 3016709 3007931 3058840 3189249 3473639 3330280
8526 3330280 3015444 2765989 2464421 2530535 2595938 2500279 2486672 2392332 2185229 2151158 2072310
$$ packed form
8596A2933154l03485k32502l63054m87573n26078l12054k06188l44453n86548
8587I571219l54625n51470l72461l44477m09359o18150l51655j73888m02565l43709
8577E648860p1855L7894m44187k1453M78530j96461n12363o1973j45462m3851
8567D667679K3370j1452K28399k39970r7005J11328m34369j26586N2948j0495
8557D163847k17125j81007J04753j9604Q1955M5823k15298m7894O0411J38378
8547C914239j8727k92668m19879l2441j9660J62552n1616n6635J12612k117j17930
8536C177730J9766J1169L44475k55223k81208q778N0909J30409K84390j43359
8526C330280l14836k49455l01568O6114O5403r5659j3607r4340k07103l4071p8848
$$ plain form
8515 2072310 1958891 1743161 1729945 1705767 1904073 1877891 1819034 1826819 1720708 1684172 1490089
8504 1490089 1662958 1802010 1888021 1772835 1756010 1703511 1849181 1731383 1352172 1534029
8494 1534029 1391491 1421620 1460888 1133037 1030814 1253051 952082 658267 814930 872713
8484 872713 793387 628918 890548 1030213 647463 641320 552915 785983 976471 587476
8474 587476 360616 696186 681788 781327 1054737 1055630 965816 868665 756287 544624 532784
8463 532784 791901 657566 554087 345084 248829 523006 740576 682064 611133 281570
8453 281570 207952 530183 506707 699116 541703 600120 649082 594579 328280 206918 607891
8442 607891 459083 460973 210445 110371 310284 487020 631119 333939 242515 191630
$$ packed form
8515B072310j13419k15730j3216k4178J98306k6182n8857P785j06111l6536j94083
8504A490089J72869J39052Q6011j15186j6825n2499J45670j17798l79211J81857
8494A534029j42538L0129L9268l27851j02223K22237l00969k93815J56663N7783
8484H72713p9326j64469K61630J39665l82750o143q8405K33068J90488l88995
8474E87476k26860L35570j4398R9539K73410Q93q9814r7151j12378k11663j1840
8463E32784K59117j34335j03479k09003r6255K74177K17570n8512p0931l29563
8453B81570p3618L22231k3476J92409j57413N8417M8962n4503k66299j21362M00973
8442F07891j48808J890k50528j00074J99913J76736J44099k97180r1424n0885
$$ plain form
8432 191630 375339 378251 400537 386588 192366 195349 225842 261222 411078 337050 370961
8421 370961 536488 256252 408705 287188 186012 311865 321498 198486 305389 512297
8411 512297 533640 571597 393395 174869 -87952 80830 207069 219047 324179 446082
8401 446082 630059 321447 72583 163917 335578 263465 -159801 65821 134879 -9702
8391 -9702 162748 419462 303640 117183 318773 448902 533067 565470 158285 -140431
8381 -140431 -183861 172994 252781 266266 363941 186813 73475 178798 54129 96858 68890
8370 68890 33542 54754 -249019 -131936 144275 203095 248606 -33527 56808 -182695 -301023
8359 -301023 -108758 -136674 -14692 -13414 37558 -109467 -175573 -46046 16424 3450 50039
$$ packed form
8432A91630J83709K912K2286j3949j94222K983L0493L5380J49856p4028L3911
8421C70961J65527k80236J52453j21517j01176J25853R633j23012J06903K06908
8411E12297K1343L7957j78202k18526k62821J68782J26239J1978J05132J21903
8401D46082J83977l08612k48864R1334J71661p2113m23266K25622O9058j44581
8391i702J72450K56714j15822j86457K01590J30129Q4165L2403m07185k98716
8381a40431m3430L56855P9787J3485R7675j77128j13338J05323j24669M2729k7968
8370F8890l5348K1212l03773J17083K76211N8820M5511k82133R0335k39503j18328
8359c01023J92265k7916J21982J278N0972j47025o6106J29527O2470j2974M6589
$$ plain form
8348 50039 186603 26425 142770 51445 -212953 -165565 92737 117722 -168714 -67407
8338 -67407 -129521 66080 254344 330019 187629 147900 172905 114867 -132564 -142577 -22090
8327 -22090 186294 114295 -5288 -115617 45591 67065 -81967 77952 152435 149274 128658
8316 128658 169797 210419 227710 291835 136879 19682 -107143 -7203 -16732 89370 48470
8305 48470 -28086 -62485 44191 -6143 -208494 -15294 73986 -102279 -157324 -201927 -318185
8294 -318185 61185 197912 122240 3713 123118 212210 56429 -58689 5683 -143103
8284 -143103 -121913 61552 44417 135387 170999 -2839 -137464 -50183 -14133 75251 -21149
8273 -21149 11125 243514 469362 264185 145508 84521 123008 222227 284285 204615 217735
$$ packed form
8348E0039J36564j60178J16345r1325k64398M7388K58302K4985k86436J01307
8338f7407o2114J95601J88264P5675j42390l9729K5005n8038k47431j0013J20487
8327b2090K08384p1999j19583j10329J61208K1474j49032J59919P4483l161k0616
8316A28658M1139M0622J7291O4125j54956j17197j26825R9940r529J06102m0900
8305D8470p6556l4399J06676n0334k02351J93200Q9280j76265n5045m4603j16258
8294c18185L79370J36727p5672j18527J19405Q9092j55781j15118O4372j48786
8284a43103K1190J83465j7135R0970L5612j73838j34625Q7281L6050Q9384r6400
8273b1149L2274K32389K25848k05177j18677o0987L8487R9219O2058p9670J3120
$$ plain form
8262 217735 258200 48505 118842 198931 13120 261853 123342 -134681 29921 244069
8252 244069 561008 518626 620014 290513 424998 234351 270431 425378 167580 367582
8242 367582 595381 510354 543851 758192 846092 780858 641193 534262 715738 636594 586638
8231 586638 607629 969819 1132511 1150080 1226810 1439246 1690363 1965152 2034635 2378609
8221 2378609 1968901 1331934 1267509 1041576 805946 725990 698285 439975 318594 264622
8211 264622 154567 12543 -87715 179929 420504 102620 207138 342990 204697 194465
8201 194465 248054 -108371 183206 303832 476655 730694 468461 422276 1020010 -640687
8191 -640687 -1497128 -807025 -728029 -445193 -437282 -129111 -281826 -149089 -75144 58902
$$ packed form
8262B17735M0465k09695P0337Q0089j85811K48733j38511k58023J64602K14148
8252B44069L16939m2382J01388l29501J34485j90647L6080J54947k57798K00002
8242C67582K27799q5027L3497K14341Q7900o5234j39665j06931J81476p9144m9956
8231E86638K0991L62190J62692J7569P6730K12436K51117K74789O9483L43974
8221B378609m09708o36967o4425k25933k35630p9956k7705k58310j21381n3972
8211B64622j10055j42024j00258K67644K40575l17884J04518J35852j38293j0232
8201A94465N3589l56425K91577J20626J72823K54039k62233m6185N97734j660697
8191f40687q56441O90103P8996K82836P911L08171j52715J32737P3945J34046
$$ plain form
8181 58902 143333 158319 66213 -121304 -54997 -163432 -362382 -298067 -103786 195292 130670
8170 130670 -68437 -276558 -292532 -232385 -89882 85718 -29398 88984 -216351 -134279
8160 -134279 202076 240817 -178840 -26107 84391 106049 89516 40908 50110 28020 364991
8149 364991 -16631 -138481 -269705 -4280 -136775 -249158 46763 37714 -22391 88249
8139 88249 -11529 106579 -109687 -212023 -336268 -264378 -102992 -207305 -123927 -121938 -88415
8128 -88415 -169673 -232502 -318311 -98232 -120441 -313811 -499998 -19111 136406 18695 -28873
8117 -28873 48711 -114113 -206837 -138910 19398 297164 156182 117000 186803 260419 31069
8106 31069 32313 148714 80165 153619 -60157 -186427 -260792 -490061 -496503 -481871 -391249
$$ packed form
8181E8902Q4431J4986r2106j87517O6307j08435j98950O4315J94281K99078o4622
8170A30670j99107k08121j5974O0147J42503J75600j15116J18382l05335Q2072
8160a34279L36355L8741m19657J52733J10498K1658j6533m8608R202k2090L36971
8149C64991l81622j21850j31224K65425j32495j12383K95921r049o0105J10640
8139H8249r9778J18108k16266j02336j24245P1890J61386j04313Q3378J989L3523
8128h8415q1258o2829q5809K20079k2209j93370j86187M80887J55517j17711m7568
8117b8873P7584j62824r2724O7927J58308K77766j40982l9182O9803P3616k29350
8106C1069J244J16401o8549P3454k13776j26270p4365k29269o442J4632R0622
$$ plain form
8095 -391249 -141009 -82094 -120447 -203178 -11453 -294530 -88399 -114375 -82847 86331 -303122
8084 -303122 -433869 -176352 -232969 -158269 -148950 -174460 -83349 56936 -131812 -58336 29326
8073 29326 88068 -92309 -263962 -224326 -114417 63064 -133720 -267966 -122966 120158
8063 120158 -114127 52843 -61931 96989 307265 20633 -223735 -289556 -362549 -164879
8053 -164879 -96156 -320801 -392304 -108980 -151429 -173482 -3214 137773 -73667 -116816 -287870
8042 -287870 -278271 -140438 -250371 -308296 -19226 328833 -13165 -313105 -241006 -155321 -122599
8031 -122599 47087 54191 -80590 -123542 -251047 -53223 -196513 -376582 -500239 -690032
8021 -690032 -471461 -229530 -227535 -82150 -67025 -33974 7676 -202764 -235559 -122927 -179147
$$ packed form
8095c91249K50240N8915l8353q2731J91725k83077K06131k5976L1528J69178l89453
8084c03122j30747K57517n6617P4700R319k5510R1111J40285j88748P3476Q7662
8073B9326N8742j80377j71653L9636J09909J77481j96784j34246J45000K43124
8063A20158k34285J66970j14774J58920K10276k86632k44368o5821p2993J97670
8053a64879O8723k24645p1503K83324m2449k2053J70268J40987k11440m3149j71054
8042b87870R599J37833j09933n7925K89070L48059l41998k99940P2099Q5685L2722
8031a22599J69686P104j34781m2952j27505J97824j43290j80069j23657j89793
8021f90032K18571K41931J995J45385J5125L3051M1650k10440l2795J12632n6220
$$ plain form
8010 -179147 -322489 -158371 108572 132427 140502 -34896 -79991 -71204 -55690 72985 -50624
7999 -50624 -56060 -166631 -200495 -157047 -169151 97720 -44007 -244108 -302037 -206052 -463110
7988 -463110 -427151 -33604 -36308 -298178 -141349 -112810 -115891 -57445 -110518 -264809 -260417
7977 -260417 -182561 -201376 -373265 -493854 -271131 -410337 -305397 -230586 -83899 -107441
7967 -107441 -20802 -128897 -99327 -81977 -371500 -640116 -532557 -403687 -58001 -143412
7957 -143412 -119209 -41303 -221158 -333943 -387521 -424694 -363778 -3991 -226428 -300424 131528
7946 131528 240097 139182 -77089 14039 -61880 -58406 70582 -55131 -221003 26163
7936 26163 -128815 -297169 -171289 28872 19412 25123 181795 53655 145907 306700 200989
$$ packed form
8010a79147j43342J64118K66943K3855Q075j75398m5095Q787J5514J28675j23609
7999e0624n436j10571l3864M3448j2104K66871j41727k00101n7929R5985k57058
7988d63110L5959L93547k704k61870J56829K8539l081N8446n3073j54291M392
7977b60417P7856j8815j71889j20589K22723j39206J04940P4811J46687k3542
7967a07441Q6639j08095K9570J7350k89523k68616J07559J28870L45686q5411
7957a43412K4203P7906j79855j12785n3578l7173O0916L59787k22437p3996M31952
7946A31528J08569j00915k16271R1128p5919L474J28988j25713j65872K47166
7936B6163j54978j68354J25880K00161r460N711J56672j28140R2252J60793j05711
$$ plain form
7925 200989 314387 243832 214295 344070 141176 -13698 8027 66211 110515 -41922 3953
7914 3953 -33878 117582 446785 85830 178637 99780 92169 -94778 -97737 204786 158776
7903 158776 -19138 193470 418667 558323 137276 256151 582659 539513 330299 464534
7893 464534 524538 441097 461971 570337 482588 504394 533248 485559 341529 78200 284435
7882 284435 270564 334534 196086 -70327 -120207 -60476 -233178 42160 251854 299260 -102942
7871 -102942 -216692 58293 120818 329165 66165 -145887 -224403 -199535 8696 160773
7861 160773 132089 -274611 -61061 192359 195676 26732 -12868 95755 100550 -39289 65006
7850 65006 65993 222225 148200 -153158 131820 319271 352723 189736 -41059 -343087 -441999
$$ packed form
7925B00989J13398p0555k9537J29775k02894j54874K1725N8184M4304j52437M5875
7914C953l7831J51460L29203l60955R2807p8857p611j86947k959L02523m6010
7903A58776j77914K12608K25197J39656m21047J18875L26508m3146k09214J34235
7893D64534O0004q3441K0874J08366q7749K1806K8854m7689j44030k63329K06235
7882B84435j3871O3970j38448k66413m9880N9731j72702K75338K09694M7406m02202
7871a02942j13750K74985O2525K08347k63000k12052p8516K4868K08231J52077
7861A60773k8684m06700K13550K53420L317j68944l9600J08623M795j39839J04295
7850F5006R87J56232p4025l01358K84978J87451L3452j62987k30795l02028r8912
$$ plain form
7839 -441999 -239560 48453 -244772 -93716 -200670 -431727 -328912 -263410 -7622 1403
7829 1403 -160236 -417280 -373896 -2048 106542 -125876 -182789 -19946 184578 115738 494722
7818 494722 365300 139211 198899 -26 200748 440535 580252 217357 -668666 -695088
7808 -695088 -369514 -439350 -140645 -409477 -391648 12136 -62676 197231 64048 38116
7798 38116 -75177 -167909 -80002 -373356 -282228 -132948 149844 31817 1179 -62962 -88716
7787 -88716 -85815 172555 99784 126880 216669 355519 251390 104091 156839 7537 -106927
7776 -106927 -121704 -28081 164339 274010 151937 233629 66547 -158600 -336881 -137254
7766 -137254 -37143 -124527 -235375 -262991 -190706 -18182 -31556 19114 144678 188334 21516
$$ packed form
7839d41999K02439K88013k93225J51056j06954k31057J02815O5502K55788R025
7829A403j61639k57044M3384L71848J08590k32418n6913J62843K04524o8840L78984
7818D94722j29422k26089N9688j98925K00774K39787J39717l62895q86023k6422
7808f95088L25574o9836K98705k68832J7829M03784p4812K59907j33183k5932
7798C8116j13293r2732Q7907k93354R1128J49280K82792j18027l0638o4141k5754
7787h8716K901K58370p2771K7096Q9789J38850j04129j47299N2748j49302j14464
7776a06927j4777R3623J92420J09671j22073Q1692j67082k25147j78281J99627
7766a37254J00111q7384j10848k7616P2285J72524j3374N0670J25564M3656j66818
$$ plain form
7755 21516 71524 -35818 -107664 -170791 -16065 -166938 -21183 51315 -649 -112494 -412132
7744 -412132 -287959 -174526 -5782 -249543 -177208 -66907 -134109 -479819 -369584 -58455
7734 -58455 -9816 -178110 -276866 -460247 -291940 46517 -71032 -247947 -148866 12643
7724 12643 214472 -44403 -284383 -89816 -185796 -41629 202915 -11871 -13413 -93847 511
7713 511 56221 155290 633371 107343 -104872 -163894 -121282 310281 75067 137104 42743
7702 42743 149269 254740 234054 379791 253993 -53524 -183921 -56813 -152726 184532
7692 184532 45584 50243 72927 341002 210807 -72361 -52968 -11226 -188129 -90553 60232
7681 60232 256308 165979 29243 -142894 -198316 -363279 14345 230273 -59880 -55020 -254527
$$ packed form
7755B1516N0008j07342p1846o3127J54726j50873J45755P2498n1964j11845k99638
7744d12132J24173J13433J68744k43761P2335J10301o7202l45710J10235L11129
7734e8455M8639j68294r8756j83381J68307L38457j17549j76915R9081J61509
7724A2643K01829k58875k39980J94567r5980J44167K44544k14786j542q0434R4358
7713E11N5710R9069M78081n26028k12215n9022M2612M31563k35214O2037r4361
7702D2743J06526J05471k0686J45737j25798l07517j30397J27108r5913L37258
7692A84532j38948M659K2684K68075j30195k83168J9393M1742j76903R7576J50785
7681F0232J96076r0329j36736j72137n5422j64963L77624K15928k90153M860j99507
$$ plain form
7670 -254527 -18282 171918 -42929 -35356 47723 -58070 32968 212119 265069 153043 343359
7659 343359 295191 236080 137198 305745 52164 66646 -82411 -4694 -23961 -10700 -80490
7648 -80490 -229884 19777 -77975 -35714 304428 157817 178720 143759 126447 192385 115558
7637 115558 64780 131892 -79215 106487 94780 111802 186694 194180 142278 237666 398817
7626 398817 173074 366399 610886 661449 560715 442562 200378 48241 231433 79572
7616 79572 -162392 -79212 192015 266032 -56452 35586 -78021 178017 277128 270700 97852
7605 97852 177369 130219 488253 617793 239527 389112 285273 299384 124551 118737 40747
7594 40747 164454 120896 140460 204579 52611 518021 496322 124702 379855 663713 593387
$$ packed form
7670b54527K36245J90200k14847P573Q3079j05793R1038J79151N2950j12026J90316
7659C43359m8168n9111r8882J68547k53581J4482j49057P7717j9267J3261o9790
7648h0490j49394K49661r7752M2261L40142j46611K0903l4961j7312O5938p6827
7637A15558n0778O7112k11107J85702j1707J7022P4892P486n1902R5388J61151
7626C98817k25743J93325K44487N0563j00734j18153k42184j52137J83192j51861
7616G9572k41964Q3180K71227P4017l22484R2038j13607K56038R9111o428j72848
7605I7852P9517m7150L58034J29540l78266J49585j03839J4111j74833n814p7990
7594D0747J23707m3558J9564O4119j51968M65410k1699l71620K55153K83858p0326
$$ plain form
7583 593387 481264 132664 240624 57984 246555 499410 605367 501540 653669 446724
7573 446724 538909 467986 608154 545759 445304 457737 422834 453512 362925 474116 566788
7562 566788 534651 394126 476567 592287 601375 612542 657007 654801 623971 538874 472772 760664
7550 760664 725926 647885 566214 652385 620897 229314 382316 333173 753129 789010 494902
7539 494902 520207 801615 804070 790241 696572 339698 276852 512370 391169 463143 405332
7528 405332 617530 525703 588376 159663 93929 378387 572181 403431 296966 527112
7518 527112 470920 494328 427713 356545 457686 374546 438679 680924 646056 570195 708610
7507 708610 915450 1159389 848138 794850 766376 760986 733569 657921 800313 1114480 1039344
$$ packed form
7583E93387j12123l48600J07960j82640J88571K52855J05957j03827J52129k06945
7573D46724R2185p0923J40168o2395j00455J2433l4903L0678r0587J11191R2672
7562E66788l2137j40525Q2441J15720R088J1167M4465k206l0830q5097o6102K87892
7550G60664l4738p8041q1671Q6171l1488l91583J53002m9143M19956L5881k94108
7539D94902K5305K81408K455j3829r3669l56874o2846K35518j21201P1974n7811
7528D05332K12198r1827O2673m28713o5734K84458J93794j68750j06465K30146
7518E27112n6192K3408o6615p1168J01141q3140O4133K42245l4868p5861J38415
7507G08610K06840K43939l11251n3288k8474n390k7417p5648J42392L14167p5136
$$ plain form
7496 1039344 904739 799102 1046283 1100921 893086 939233 968844 1068778 1095199 1086185 1171919
7485 1171919 1351572 1180217 949712 1023603 1053190 1036893 809391 681587 876217 899945
7475 899945 1095844 953178 1154845 1025457 1080168 1181402 1208992 985227 1103502 899487
7465 899487 943795 952196 854801 770705 617460 819909 956020 1039926 1031496 864922 900096
7454 900096 1000898 721447 726051 742935 528072 638143 891452 575930 430509 577238
7444 577238 524711 710289 914132 674252 637258 752526 660251 754985 717671 756688 680320
7433 680320 615140 841099 839266 696374 702570 815775 563106 499100 583494 736509 865895
7422 865895 546969 678738 398752 688763 690675 717376 810773 749330 821289 795339 669506
$$ packed form
7496A039344j34605j05637K47181N4638k07835M6147K9611R9934K6421r014Q5734
7485A171919J79653j71355k30505P3891K9587j6297k27502j27804J94630K3728
7475H99945J95899j42666K01667j29388N4711J01234K7590k23765J18275k04015
7465H99487M4308Q401r7395q4096j53245K02449J36111Q3906q430j66574L5174
7454I00096J00802k79451M604J6884k14863J10071K53309l15522j45421J46729
7444E77238n2527J85578K03843k39880l6994J15268r2275R4734l7314L9017p6368
7433F80320o5180K25959j833j42892O196J13205k52669o4006Q4394J53015J29386
7422H65895l18926J31769k79986K90011J912K6701R3397o1443P1959k5950j25833
$$ plain form
7411 669506 805137 817486 809189 1031594 942363 877837 1275020 1281507 1216584 1152351 1183682
7400 1183682 1004819 762661 706441 581492 612457 646163 950932 900584 805714 807270 631441
7389 631441 749799 918084 654738 850126 787618 1054119 842384 744268 1119326 1004781
7379 1004781 825849 752626 687124 394128 252147 431404 423766 510234 508361 507420 411732
7368 411732 989133 1094965 837694 690430 548688 606078 936688 1015227 1074870 963803
7358 963803 833788 639604 570244 751875 808831 743211 246850 392062 718361 542716
7348 542716 462860 416654 521144 612852 466183 521970 611130 706614 942243 830123 1027731
7337 1027731 1125798 911493 857866 982857 750417 850585 601220 516924 851431 913864
$$ packed form
7411F69506J35631J2349q297K22405q9231o4526L97183O487o4923o4233L1331
7400A183682j78863k42158n6220j24949L0965L3706L04769n0348r4870J556j75829
7389F31441J18358J68285k63346J95388o2508K66501k11735r8116L75058j14545
7379A004781j78932p3223o5502k92996j41981J79257p638Q6468j873r41r5688
7368D11732N77401J05832k57271j47264j41742N7390L30610P8539N9643j11067
7358I63803j30015j94184o9360J81631N6956o5620m96361J45212L26299j75645
7348E42716p9856m6206J04490R1708j46669N5787Q9160R5484K35629j12120J97608
7337A027731R8067k14305n3627J24991k32440J00168k49365q4296L34507O2433
$$ plain form
7327 913864 1112111 922744 809130 638696 743763 779803 639394 662074 927096 1006697
7317 1006697 815997 750322 886091 735805 634522 515387 725852 835018 758552 680093
7307 680093 1051629 1170063 1112150 804067 913385 1069435 1084632 1158233 861043 586990
7297 586990 488837 696731 701818 702408 426772 772667 786168 746956 904268 912154 935230 763074
7285 763074 625648 587641 821119 920659 924039 1239053 1711157 1638819 1168875 779140 946895
7274 946895 915632 1110237 1237401 1231835 688400 750728 1091820 1128207 1134174 954921 1170450
7263 1170450 1052465 1000196 1118115 1143786 824150 1098776 1346394 1078033 850905 886122
7253 886122 818998 1056469 1122551 807678 785161 1183214 1301880 1428210 1238341 1280240
$$ packed form
7327I13864J98247j89367j13614j70434J05067L6040j40409K2680K65022P9601
7317A006697j90700o5675J35769j50286j01283j19135K10465J09166p6466p8459
7307F80093L71536J18434n7913l08083J09318J56050J5197P3601k97190k74053
7297E86990r8153K07894N087N90k75636L45895J3501l9212J57312P886K3076j72156
7285G63074j37426l8007K33478R9540L380L15014M72104p2338m69944l89735J67755
7274I46895l1263J94605J27164n566n43435O2328L41092L6387N967j79253K15529
7263A170450j17985n2269J17919K5671l19636K74626K47618k68361k27128L5217
7253H86122o7124K37471O6082l14873k2517L98053J18666J26330j89869M1899
$$ plain form
7243 1280240 1180747 953680 1052288 1064591 1091060 817009 999548 971010 864276 1018251
7233 1018251 1205554 1265012 1274530 1079089 1104100 1159888 916043 1223287 1374877 1429519 1319322
7222 1319322 1499543 1790751 1660861 1476811 1395306 1464897 1338342 1365007 1160580 1261206
7212 1261206 1357344 1455943 1410101 1576910 1338420 1246623 1131355 1328216 1358959 1598919
7202 1598919 1945502 1806271 1695078 1625010 1382164 1311497 1458107 1448556 1551149 1762382
7192 1762382 1977848 1691688 1747129 1959689 1893934 1929198 2143706 1824688 1915472 2282794
7182 2282794 2123546 2089943 2324103 2123421 2361355 2371901 2010710 2076463 2241417 2599986
7172 2599986 2638787 2406919 2386335 2564612 2470012 2168191 2356660 2530349 2472211 2270887
$$ packed form
7243A280240r9493k27067R8608J2303K6469k74051J82539k8538j06734J53975
7233A018251J87303N9458R518j95441K5011N5788k43845L07244J51590N4642j10197
7222A319322J80221K91208j29890j84050q1505O9591j26555K6665k04427J00626
7212A261206R6138R8599m5842J66809k38490r1797j15268J96861L0743K39960
7202A598919L46583j39231j11193p0068k42846p0667J46610r551J02593K11233
7192A762382K15466k86160N5441K12560o5755L5264K14508l19018R0784L67322
7182B282794j59248l3603K34160k00682K37934J0546l61191O5753J64954L58569
7172B599986L8801k31868k0584J78277r4600l01821J88469J73689n8138k01324
$$ plain form
7162 2270887 2391410 2586418 2580166 2634507 2750432 2659985 2960468 2926564 2904773 2962112 3064528
7151 3064528 3338935 3454010 3508108 3377059 3506284 3792786 3925455 3670717 3920594 4122948
7141 4122948 4391784 4642752 4767359 4788154 4755334 5196112 5230238 5442207 5647578 5800124
7131 5800124 6148182 6464888 6671580 7268064 7383428 7564862 7786073 7848593 8239795 8695923
7121 8695923 9105664 9645742 10685652 11329945 11685511 12268647 12763675 12796535 12515782 12355798
7111 12355798 12524077 12414355 12480994 12791416 13258788 13887405 14775800 15595739 16683184
7102 16683184 17772429 18663916 19045771 19517943 20293705 21123344 22097837 23452653 25341622
7093 25341622 27464824 29849420 32543684 35541540 37923552 39810812 41048742 42582507
$$ packed form
7162B270887J20523J95008o252N4341J15925r0447L00483l3904k1791N7339J02416
7151C064528K74407J15075N4098j31049J29225K86502J32669k54738K49877K02354
7141D122948K68836K50968J24607K0795l2820M40778L4126K11969K05371J52546
7131E800124L48058L16706K06692N96484J15364J81434K21211O2520L91202M56128
7121H695923M09741N40078J039910O44293L55566N83136M95028L2860k80753j59984
7111A2355798J68279j09722O6639L10422M67372O28617Q88395Q19939J087445
7102A6683184J089245Q91487L81855M72172P75762Q29639R74493J354816J888969
7093B5341622K123202K384596K694264K997856K382012J887260J237930J533765
$$ plain form
7085 42582507 43977242 44790635 45373195 45079116 43983939 41861217 39094370 36545693 34405727
7076 34405727 32711524 31616988 31123528 31134645 31519145 32302071 33330648 34290838 34986913
7067 34986913 34760878 33286138 31262146 28588339 25704748 22722250 19615022 17053667
7059 17053667 15535652 14214601 13254700 12096921 11223740 10587230 10032508 9371909 9065507
7050 9065507 8652436 8262974 7885526 7476488 7132829 7176590 7289046 6889611 6702937 6512612
7040 6512612 6493524 6612310 6385278 6459008 6553652 6774584 7006951 6965627 7259658 7624376
7030 7624376 8469448 9170832 9857678 11019660 12368014 13611223 14991221 15675774 16261387
7021 16261387 16069104 15664333 14740013 13754009 13051118 12856326 12654986 12857353 13456864
$$ packed form
7085D2582507J394735Q13393N82560k94079j095177k122722k766847k548677k139966
7076C4405727j694203j094536m93460J1117L84500P82926J028577R60190O96075
7067C4986913k26035j474740k023992k673807k883591k982498l107228k561355
7059A7053667j518015j321051r59901j157779q73181o36510n54722o60599l06402
7050I065507m13071l89462l77448m09038l43659M3761J12456l99435j86674j90325
7040F512612j9088J18786k27032P3730R4644K20932K32367m1324K94031L64718
7030G624376Q45072P01384O86846J161982J348354J243209J379998O84553N85613
7021A6261387j92283m04771r24320r86004p02891j94792k01340K02367N99511
$$ plain form
7012 13456864 13938949 14199304 14184876 12941056 11419783 9908016 8699656 7762722 6784010
7003 6784010 6078850 5490462 5073720 4642074 4372602 4500706 3893917 3564004 3482430 3361716
6993 3361716 3295185 3107822 2931893 2742118 2949854 3127450 3132460 3011199 2758670 2777171
6983 2777171 2905231 2712616 2617200 2602338 2570888 2484599 2559536 2458747 2744786 2294455
6973 2294455 2473951 2637953 2638752 2657184 3103378 3308463 3174429 2887756 2713580 2630886
6963 2630886 2480633 2446950 2417437 1946929 2022086 2174503 2016245 2143124 2328587 2283285
6953 2283285 2119072 2228958 2250136 2185933 2332257 2304132 2024847 1968698 2016003 1903561
6943 1903561 2112807 2003193 1812114 1901882 1823096 1584647 1489030 1451167 1641158 1654757
$$ packed form
7012A3456864M82085K60355j4428j243820j521273j511767j208360r36934r78712
7003F784010p05160n88388m16742m31646k69472J28104o06789l29913q1574j20714
6993C361716o6531j87363j75929j89775K07736J77596N010j21261k52529J8501
6983B777171J28060j92615r5416j4862l1450q6289P4937j00789K86039m50331
6973B294455J79496J64002P99J8432M46194K05085j34034k86673j74176q2694
6963B630886j50253l3683k9513m70508P5157J52417j58258J26879J85463m5302
6953B283285j64213J09886K1178o4203J46324k8125k79285n6149M7305j12442
6943A903561K09246j09614j91079Q9768p8786k38449r5617l7863J89991J3599
$$ plain form
6933 1654757 1610787 1574708 1450075 1591411 1732434 1728808 1690674 1770584 1774080 1738107 1767325
6922 1767325 2001050 1885265 2042779 1970289 1592087 1550628 1721166 1637084 1400298 1319235
6912 1319235 1468729 1537126 1527733 1375985 1391409 1486304 1379534 1173362 992212 1040285 1334074
6901 1334074 1264808 1298410 1296214 1448289 1386484 1424632 1437784 1460336 1377726 1034069 1133331
6890 1133331 1042147 976965 1119719 1253371 1321113 1521479 1508972 1454476 1415686 1247090 1174426
6879 1174426 1122649 1307075 1073034 1343566 1819710 1410560 1325615 1353607 1368605 1240899
6869 1240899 1115054 1141250 956324 1220105 1320070 1259027 1523781 1406755 1334149 1571473
6859 1571473 1377464 1275316 1609912 1389746 1364994 1587327 1523804 1391736 1536233 1894072
$$ packed form
6933A654757m3970l6079j24633J41336J41023l626l8134P9910L496l5973K9218
6922A767325K33725j15785J57514p2490l78202m1459J70538q4082k36786q1063
6912A319235J49494O8397r393j51748J5424R4895j06770k06172j81150M8073K93789
6901A334074o9266L3602k196J52075o1805L8148J3152K2552q2610l43657R9262
6890A133331r1184o5182J42754J33652O7742K00366j2507n4496l8790j68596p2664
6879A174426n1777J84426k34041K70532M76144m09150q4945K7992J4998j27706
6869A240899j25845K6196j84926K63781R9965o1043K64754j17026p2606K37324
6859A571473j94009j02148L34596k20166k4752K22333o3523j32068J44497L57839
$$ plain form
6849 1894072 1794835 1705690 1670575 1746866 1261250 1047983 1366032 1435577 1661347 1612003 1338185
6838 1338185 1213782 1362089 1324748 1274602 1191957 1314988 1340774 1241431 1208058 1308896 1179736
6827 1179736 1250252 1449194 1342082 1618160 1526086 1463326 1144065 1367886 1558186 1623501
6817 1623501 1726882 1708383 1515439 1326678 1403237 1584551 1304650 1329527 1471985 1298716
6807 1298716 1516470 1464793 1158188 1188901 1318914 1486803 1611241 1625623 1710301 1588207
6797 1588207 1517363 1535539 1233458 1101109 1256711 1271448 1525237 1463465 1587791 1370375
6787 1370375 1574885 1705498 1633492 1939795 1733842 1548031 1749961 1930848 2052251 2104014
6777 2104014 2141269 2135095 2078341 2287649 2382236 2187046 2202699 2081381 2311549 2152294 2003070
$$ packed form
6849A894072r9237q9145l5115P6291m85616k13267L18049O9545K25770m9344k73818
6838A338185j24403J48307l7341n0146q2645J23031K5786r9343l3373J00838j29160
6827A179736P0516J98942j07112K76078r2074o2760l19261K23821J90300O5315
6817A623501J03381j8499j92944j88761P6559J81314k79901K4877J42458j73269
6807A298716K17754n1677l06605L0713J30013J67889J24438J4382Q4678j22094
6797A588207p0844J8176l02081j32349J55602J4737K53789o1772J24326k17416
6787A370375K04510J30613p2006L06303k05953j85811K01930J80887J21403N1763
6777B104014L7255o174n6754K09308R4587j95190J5653j21318K30168j59255j49224
$$ plain form
6766 2003070 1816911 2296755 2363294 2233168 2212870 2266992 2398185 2362303 2488485 2265096
6756 2265096 2061610 2074265 2201496 2468131 2728987 2518942 2630820 2692874 2672196 2732219
6746 2732219 3096437 3093294 2865725 2881545 2833075 2668377 2742251 2530317 2533154 2525657 2758705
6735 2758705 2882144 2797630 2547483 2461111 2511000 2414027 2422400 2301531 2416103 2205590 2208024
6724 2208024 2242798 1850070 2219447 2419203 2272167 2361452 2457808 2569177 2455999 2239408
6714 2239408 2285314 2290337 2275495 2496115 2219621 2076246 1881050 1843348 2146396 2227389 2141936
6703 2141936 1889878 1789959 1838389 1585017 1671049 1873356 1790096 1927973 1929757 1849574 1834559
6692 1834559 1691322 1680233 1851230 2091720 2150325 1976163 1863888 2003680 1877887 1884661
$$ packed form
6766B003070j86159M79844O6539j30126k0298N4122J31193l5882J26182k23389
6756B265096k03486J2655J27231K66635K60856k10045J11878O2054k0678O0023
6746B732219L64218l143k27569J5820m8470j64698P3874k11934K837p497K33048
6735B758705J23439q4514k50147q6372M9889r6973Q373j20869J14572k10513K434
6724B208024L4774l92728L69377J99756j47036Q9285R6356J11369j13178k16591
6714B239408M5906N023j4842K20620k76494j43375j95196l7702L03048Q0993q5453
6703B141936k52058r9919M8430k53372Q6032K02307q3260J37877J784q0183j5015
6692A834559j43237j1089J70997K40490N8605j74162j12275J39792j25793O774
$$ plain form
6682 1884661 2061811 1812104 1683495 1752128 1597561 1617075 1838759 1958416 1760539 1804757
6672 1804757 1930012 1918872 1693400 1492848 1498147 1350147 1334011 1456943 1464291 1689302 1510133
6661 1510133 1427631 1670060 1644974 1454448 1635821 1627763 1672776 1900193 1995858 1922749 1852127
6650 1852127 1991054 1938921 1726684 1328033 1419468 1522706 1614824 1587428 1636463 1452806
6640 1452806 1440419 1631527 1516717 1231341 1172033 1454342 1753206 1607637 1587778 1348309
6630 1348309 1231705 1273568 1513290 1294909 1341109 1368023 1330862 1508600 1365080 1273529
6620 1273529 1391553 1347256 1415904 1310835 1270967 1111440 1222913 1189390 1241254 1442908
6610 1442908 1454015 1446817 1494214 1607481 1422731 1324874 1340158 1410333 1245162 1077825 968327
$$ packed form
6682A884661J77150k49707j28609O8633j54567J9514K21684J19657j97877M4218
6672A804757J25255j1140k25472k00552N299j48000j6136J22932P348K25011j79169
6661A510133q2502K42429k5086j90526J81373q058M5013K27417R5665p3109p0622
6650A852127J38927n2133k12237l98651R1435J03238R2118k7396M9035j83657
6640A452806j2387J91108j14810k85376n9308K82309K98864j45569j9859k39469
6630A348309j16604M1863K39722k18381M6200K6914l7161J77738j43520r1551
6620A273529J18024m4297O8648j05069l9868j59527J11473l3523N1864K01654
6610A442908J1107p198M7397J13267j84750r7857J5284P0175j65171j67337j09498
$$ plain form
6599 968327 1266585 1412363 1400787 1331658 1313542 1405216 1221954 1134679 1063804 1282797 1355821
6588 1355821 1159740 1310226 1378839 1379357 1241569 1316332 1110559 1358999 1263547 1346297 1320642
6577 1320642 1161782 989747 1090999 1214316 1091734 1181592 1239350 1270911 1390746 1356591
6567 1356591 1403462 1589123 1346740 1342822 1333573 1157745 1449503 1472000 1681189 1583551 1300368
6556 1300368 1458512 1426535 1367488 1441320 1662656 1818686 1535265 1347873 1597651 1471296
6546 1471296 1382995 1216492 1452282 1433240 1286408 1374286 1180972 1275426 1327488 1310125 1389244
6535 1389244 1731681 1613784 1564831 1400647 1409722 1588333 1370863 1417211 1450977 1358664 1321014
6524 1321014 1452355 1669746 1539869 1578596 1771247 1531903 1735202 1757374 1721958 1805724
$$ packed form
6599I68327K98258J45778j1576o9129j8116R1674j83262q7275p0875K18993P3024
6588A355821j96081J50486O8613N18j37788P4763k05773K48440r5452Q2750k5655
6577A320642j58860j72035J01252J23317j22582Q9858N7758L1561J19835l4155
6567A356591M6871J85661k42383l918r249j75828K91758K2497K09189r7638k83183
6556A300368J58144l1977n9047P3832K21336J56030k83421j87392K49778j26355
6546A471296q8301j66503K35790j9042j46832Q7878j93314R4454N2062j7363P9119
6535A389244L42437j17897m8953j64184R075J78611k17470M6348L3766r2313l7650
6524A321014J31341K17391j29877L8727J92651k39344K03299K2172l5416Q3766
$$ plain form
6514 1805724 1579271 1528533 1962822 1932655 2001127 2296056 1899198 1694288 1731683 1807702
6504 1807702 1702345 1868710 2184759 1935032 1703734 1736871 2063747 1791386 1629024 1600640
6494 1600640 1698128 1999736 2119206 2102126 2126835 2213726 1985870 1774682 2068926 2083886
6484 2083886 2086129 2141327 2159523 2326805 2161056 2046126 1993588 1999874 2003894 2334066 2262488
6473 2262488 2106419 2510505 2575682 2356654 2113013 2276433 2296490 2046946 2229993 2138876
6463 2138876 2170957 2234382 2412771 2137824 2300938 2745752 2674016 2465069 2687602 2922818
6453 2922818 2549139 2672520 2658231 2570364 2706284 2758127 2872677 2690874 2634378 2653719
6443 2653719 2619454 2617970 2575721 2416170 2352811 2300071 2487857 2424988 2711522 2929842 2699109
$$ packed form
6514A805724k26453n0738M34289l0167O8472K94929l96858k04910L7395P6019
6504A807702j05357J66365L16049k49727k31298L3137L26876k72361j62362k8384
6494A600640R7488L01608J19470j7080K4709Q6891k27856k11188K94244J4960
6484B083886K243N5198J8196J67282j65749j14930n2538O286M020L30172p1578
6473B262488j56069M04086O5177k19028k43641J63420K0057k49544J83047r1117
6463B138876L2081O3425J78389k74947J63114M44814p1736k08947K22533K35216
6453B922818l73679J23381j4289q7867J35920N1843J14550j81803n6496J9341
6443B653719l4265j484m2249j59551o3359n2740J87786o2869K86534K18320k30733
$$ plain form
6432 2699109 2380286 2194446 2449910 2588918 2617403 2496878 2296014 2249229 2190635 2262166
6422 2262166 2314448 2167569 2314146 2666216 2579091 2260517 2278041 2210067 2247309 2173046 2252812
6411 2252812 2131569 2328131 2201189 2238346 2194587 2279611 2166783 2368821 2521169 2564956
6401 2564956 2323691 1996374 2258118 2524676 2603914 2413535 2238151 2150488 2137055 2160544
6391 2160544 1998459 2113252 2262523 2319713 2071141 2224759 2637064 2616472 2486842 2432623
6381 2432623 2340171 2212971 2093533 2335235 2305454 2215780 2116543 1869579 1892968 1952599 2012037
6370 2012037 1824785 2036909 1995683 1553727 2042131 2241881 1810951 1733456 1655417 1845726
6360 1845726 1848043 2246750 1928312 2001376 2026305 1708942 1934475 2199890 2226690 2424164
$$ packed form
6432B699109l18823j85840K55464J39008K8485j20525k00864m6785n8594P1531
6422B262166N2282j46879J46577L52070q7125l18574J7524o7974L7242p4263P9766
6411B252812j21243J96562j26942L7157m3759Q5024j12828K02038J52348M3787
6401B564956k41265l27317K61744K66558P9238j90379j75384q7663j3433K3489
6391B160544j62085J14793J49271N7190k48572J53618M12305k0592j29630n4219
6381B432623r2452j27200j19438K41702k9781q9674r9237k46964K3389N9631N9438
6370B012037j87252K12124m1226m41956M88404J99750m30930p7495p8039J90309
6360A845726K317L98707l18438P3064K4929l17363K25533K65415K6800J97474
$$ plain form
6350 2424164 2330682 2130672 2114122 2277813 2077336 2172671 1980180 2163374 1937070 1998457
6340 1998457 2224108 2218729 2145889 1783032 2048076 2114876 2438717 2510961 2250946 2347496 2614268
6329 2614268 2428275 2134692 2078076 2390853 2484443 2321927 2391860 2517390 2445897 2357693
6319 2357693 2459915 2369725 2402234 2416596 2274217 2495950 2289340 2474204 2459260 2375399
6309 2375399 2709724 2616986 2499767 2478257 2474537 2599522 2686989 2735785 2665913 2761682 3014880
6298 3014880 2845191 2727402 2883359 2939826 3049130 3220138 3129094 2943869 3078360 3321787
6288 3321787 3430103 3481000 3419116 3719862 3694315 3496384 3595834 3388656 3881784 3976565
6278 3976565 3848531 3879893 4058099 4327535 4253335 4484741 4665433 4777890 4973132 5438855
$$ packed form
6350B424164r3482k00010j6550J63691k00477R5335j92491J83194k26304O1387
6340A998457K25651n379p2840l62857K65044O6800L23841P2244k60015R6550K66772
6329B614268j85993k93583n6616L12777R3590j62516O9933J25530p1493q8204
6319B357693J02222r0190L2509J4362j42379K21733k06610J84864j4944q3861
6309B375399L34325r2738j17219k1510l720J24985Q7467M8796o9872R5769K53198
6298C014880j69689j17789J55957N6467J09304J71008r1044j85225J34491K43427
6288C321787J08316N0897o1884L00746k5547j97931R9450k07178M93128R4781
6278C976565j28034L1362J78206K69436p4200K31406J80692J12457J95242M65723
$$ plain form
6268 5438855 6066813 6779383 7400456 8183270 9570379 11302003 13571311 16985339 20212596
6259 20212596 22267374 22183607 20126590 17409624 14213429 11455527 9432786 7811719
6251 7811719 6902898 6279577 5692033 5435728 5078039 4805483 4666147 4505772 4221946 3978534
6241 3978534 3744344 3438728 3318563 3332561 3316071 3111711 3140924 3249717 3007895 2936918
6231 2936918 2826452 2802516 2596872 2676891 2782854 2627236 2791889 2692123 2528700 2639150
6221 2639150 2753704 2675460 2615887 2792203 2913899 2800924 2941575 2704046 2618125 2655781
6211 2655781 3088404 3084545 2675031 2665330 2830282 2775920 2254120 2555669 2577049 2589970 2609639
6200 2609639 2627880 2462529 2606657 2538265 2619972 2640489 2565520 2578864 2743892 2556741 2907391
$$ packed form
6268E438855O27958P12570O21073P82814J387109J731624K269308L414028L227257
6259B0212596K054778q3767k057017k716966l196195k757902k022741j621067
6251G811719r08821o23321n87544k56305l57689k72556j39336j60375k83826k43412
6241C978534k34190l05616j20165J3998j6490k04360K9213J08793k41822p0977
6231B936918j10466k3936k05644Q0019J05963j55618J64653r9766j63423J10450
6221B639150J14554p8244n9573J76316J21696j12975J40651k37529q5921L7656
6211B655781M32623l859m09514r701J64952n4362n21800L01549K1380J2921J9669
6200B609639J8241j65351J44128o8392Q1707K0517p4969J3344J65028j87151L50650
$$ plain form
6189 2907391 2866618 2674733 2967821 2901383 2824782 2393467 2421532 2589797 2642648 2768308
6179 2768308 3109793 2735929 2600810 2888803 3154076 2814125 2578014 2629139 2994515 3090548
6169 3090548 3154057 3077162 3021870 2730771 2568715 2892784 3080262 3016404 2935460 3188360
6159 3188360 3076003 3028386 3121027 3148815 3100787 2924628 3033953 3126660 2941169 2704020
6149 2704020 2754270 2850123 2619893 2581119 2815273 2812569 2752607 2932397 3040058 2726814 2746515
6138 2746515 2924423 2926893 2959229 2920215 2725501 2796333 2793030 2838542 2952840 2811863 2865119
6127 2865119 2897432 2956042 2796695 2873046 2789104 2828751 2711092 2881073 2850476 2833109 3049204
6116 3049204 3077345 3196191 3112398 3049912 3068347 3034395 2965419 2957938 3116145 3240991 3380766
$$ packed form
6189B907391m0773j91885K93088o6438p6601m31315K8065J68265N2851J25660
6179B768308L41485l73864j35119K87993K65273l39951k36111N1125L65376R6033
6169C090548O3509p6895n5292k91099j62056L24069J87478o3858q0944K52900
6159C188360j12357m7617R2641K7788m8028j76159J09325R2707j85491k37149
6149B704020N0250R5853k30230l8774K34154k704n9962J79790J07661l13244J9701
6138B746515J77908K470L2336l9014j94714P0832l303M5512J14298j40977N3256
6127B865119L2313N8610j59347P6351q3942L9647j17659J69981l0597j7367K16095
6116C049204K8141J18846q3793o2486J8435l3952o8976p481J58207J24846J39775
$$ plain form
6105 3380766 3269147 3408965 3522158 3426679 3632569 3507683 3543894 3650679 3513292 3637597
6095 3637597 3796077 3706716 3651535 3559786 3602763 3538793 3489362 3401625 3621002 3818840 3779261
6084 3779261 3648439 4000057 3991829 3802828 3618611 3959294 3909660 3717111 3758984 3878851
6074 3878851 4012929 4106560 4257841 4310308 4402031 4278638 4312327 4504188 4716627 4269252
6064 4269252 4160138 4321685 4571771 4661428 4470167 4730354 4664329 4763666 4999140 4920583
6054 4920583 5084068 5205793 5454970 5546530 5447131 5324464 5450851 5533685 5621820 5833360
6044 5833360 6073531 6158222 6544656 6669941 6848537 7053818 7435605 7585541 7621531 7786961
6034 7786961 8275649 8467131 8641794 8573759 8327679 8032093 8035122 7941610 7720426 7727075 7582780
$$ packed form
6105C380766j11619J39818J13193r5479K05890j24886L6211J06785j37387J24305
6095C637597J58480q9361n5181r1749M2977o3970m9431q7737K19377J97838l9579
6084C779261j30822L51618q228j89001j84217L40683m9634j92549M1873J19867
6074C878851J34078R3631J51281N2467R1723j23393L3689J91861K12439m47375
6064D269252j09114J61547K50086Q9657j91261K60187o6025R9337K35474p8557
6054D920583J63485J21725K49177R1560r9399j22667J26387Q2834Q8135K11540
6044E833360K40171Q4691L86434J25285J78596K05281L81787J49936L5990J65430
6034G786961M88688J91482J74663o8035k46080k95586L029r3512k21184O649j44295
$$ plain form
6023 7582780 7333454 6965079 6473305 6412877 6372447 5854915 6025481 6013684 6003882 5833898
6013 5833898 5918354 5781277 5519954 5906415 5942777 6038083 6489344 6589799 6826450 6979828
6003 6979828 6853056 6793375 7009103 6951032 6689516 6754688 6906336 6989226 7042979 6787670
5993 6787670 6567560 6261661 6181688 6268497 6070004 6078871 6296320 6328251 6347924 6158543 6563504
5982 6563504 6711755 7066641 7620641 7400390 7307626 7091956 7116625 7149724 7103242 7313722
5972 7313722 7285301 7527579 7602174 8013552 8043337 8069508 8134391 8709372 8776304 8481107 8706364
5961 8706364 8952029 9125951 9021017 8755603 8618060 8813166 8734631 8582194 8739751 8937436
5951 8937436 8761686 8859938 8985853 8962003 8935443 9165569 9082589 8975835 9000581 9138483
$$ packed form
6023G582780k49326l68375m91774o0428m0430n17532J70566j1797r802j69984
6013E833898Q4456j37077k61323L86461L6362R5306M51261J00455K36651J53378
6003F979828j26772n9681K15728n8071k61516O5172J51648Q2890N3753k55309
5993F787670k20110l05899p9973Q6809j98493Q867K17449L1931J9673j89381M04961
5982F563504J48251L54886N54000k20251r2764k15670K4669L3099m6482K10480
5972G313722k8421K42278P4595M11378K9785K6171O4883N74981O6932k95197K25257
5961H706364K45665J73922j04934k65414j37543J95106p8535j52437J57557J97685
5951H937436j75750R8252J25915k3850k6560K30126q2980j06754K4746J37902
$$ plain form
5941 9138483 9092409 9203055 9126987 9400277 9721736 9713747 9605705 9569379 9372135 9355687 9232162
5930 9232162 9238211 9137341 9142303 9272347 9177391 9019497 9020402 9135974 9038607 9005209 9262174
5919 9262174 9595288 9662767 9606553 10071157 10402903 10565481 10676536 10797107 11134581 11084011
5909 11084011 11074116 10936389 10894983 11043507 10965012 11036100 11163766 11060342 11595821 12080521
5899 12080521 11903088 12005902 12465749 12788046 12667346 12746684 12954872 12766802 12988408 13137909
5889 13137909 13293547 13448412 13362351 13458214 13364406 13665752 14032316 14023392 13932763 14134991
5879 14134991 14558729 14769983 14988215 15261733 15538852 15501973 15809262 16456322 16808478 17199449
5869 17199449 18221003 19022469 19978831 21050302 21958604 23152200 24376232 25605707 26748825
$$ packed form
5941I138483m6074J10646p6068K73290L21459p989j08042l6326j97244j6448j23525
5930I232162O049j00870M962J30044r4956j57894R05J15572r7367l3398K56965
5919I262174L33114O7479n6214M64604L31746J62578J11055J20571L37474n0570
5909A1084011r895j37727m1406J48524p8495P1088J27666j03424N35479M84700
5899A2080521j77433J02814M59847L22297j20700P9338K08188j88070K21606J49501
5889A3137909J55638J54865q6061R5863r3808L01346L66564q924r0629K02228
5879A4134991M23738K11254K18232K73518K77119l6879L07289O47060L52156L90971
5869A7199449J021554Q01466R56362J071471R08302J193596J224032J229475J143118
$$ plain form
5860 26748825 27719854 28222197 29037837 29894434 30308042 30366042 30291190 30024426 29512603 29032472
5850 29032472 28711257 28441386 28204861 27494844 26896106 26769825 26549372 26262364 26257408 26268335
5840 26268335 26310969 26743062 27087990 27298092 27717183 28090872 28048963 28301310 28556431 28384594
5830 28384594 27918453 27377912 26582827 25632487 25245264 25200958 25084210 25471356 25941403 26212751
5820 26212751 26844838 27134231 27053137 26821916 26367709 25563431 24747009 24004366 22921501
5811 22921501 22495879 21994342 21794050 21410569 21222364 21190786 20813751 20620274 20938768 21221202
5801 21221202 21290657 20947027 20885126 20962087 20627006 20738217 20961928 21246654 21527996 21751784
5791 21751784 21901096 22295783 22812773 23524876 23885566 23962807 24172286 24059612 24157365 24493584
$$ packed form
5860B6748825R71029N02343Q15640Q56597M13608N8000p4852k66764n11823m80131
5850B9032472l21215k69871k36525p10017n98738j26281k20453k87008m956J0927
5840B6268335M2634M32093L44928K10102M19091L73689m1909K52347K55121j71837
5830B8384594m66141n40541p95085r50340l87223m4306j16748L87146M70047K71348
5820B6212751O32087K89393q1094k31221m54207q04278q16422p42643j082865
5811B2921501m25622n01537k00292l83481j88205l1578l77035j93477L18494K82434
5801B1221202O9455l43630o1901P6961l35081J11211K23711K84726K81342K23788
5791B1751784J49312L94687N16990P12103L60690P7241K09479j12674R7753L36219
$$ plain form
5781 24493584 24589622 24610824 24365596 24314452 24227943 24428987 24506202 24649364 24949939 25264570
5771 25264570 25498480 26022830 26713447 26982367 27460663 27896823 28176777 28309027 28570764
5762 28570764 28520905 28281908 28081464 27725562 26992708 26908599 26498916 26169309 25852642 25623513
5752 25623513 25667578 25964805 26085276 26121718 26445790 26772389 26796402 26785739 26820132 26481882
5742 26481882 26377035 26165530 25704293 25338696 25285959 25103885 25290008 25053642 25106915 25539390
5732 25539390 25655232 25900832 26163599 26509405 26920463 27125637 27024804 26589433 26501767 26773142
5722 26773142 26628687 26599071 26704783 26899821 27136036 27258274 27829736 28101252 28628041 29087285
5712 29087285 29215194 29372007 29278754 29205050 29127541 29231367 29517911 29937320 30559423 30772615
$$ packed form
5781B4493584R6038K1202k45228n1144q6509K01044P7215J43162L00575L14631
5771B5264570K33910N24350O90617K68920M78296M36160K79954J32250K61737
5762B8570764m9859k38997k00444l55902p32854q4109m09683l29607l16667k29129
5752B5623513M4065K97227J20471L6442L24072L26599K4013j0663L4393l38250
5742B6481882j04847k11505m61237l65597n2737j82074J86123k36366N3273M32475
5732B5539390J15842K45600K62767L45806M11058K05174j00833m35371q7666K71375
5722B6773142j44455k9616J05712J95038K36215J22238N71462K71516N26789M59244
5712B9087285J27909J56813r3253p3704p7509J03826K86544M19409O22103K13192
$$ plain form
5702 30772615 31036754 31037556 30806832 29807285 29048834 28126690 26989676 25720565 25181252 24839052
5692 24839052 24278489 23875944 23730705 23350717 23011643 22799691 22567523 22391040 22507891
5683 22507891 22499572 22534750 22864061 23131898 23283031 23392318 23981274 24311788 24470822 24919804
$$ packed form
5702C0772615K64139Q02k30724r99547p58451r22144j137014j269111n39313l42200
5692B4839052n60563m02545j45239l79988l39074k11952k32168j76483J16851
5683B2507891q319L5178L29311K67837J51133J09287N88956L30514J59034M48982
$$ [...]
##END NTUPLES=NMR SPECTRUM
##END=
