##TITLE=1H_TG-2307-63
 CDCl3
 8 sc, 
 15.6.2023
##JCAMPDX= 6.0         $$ Bruker NMR JCAMP-DX V2.0
##DATA TYPE= NMR SPECTRUM
##DATA CLASS= NTUPLES
##ORIGIN= UXNMR, Bruker Analytische Messtechnik GmbH
##OWNER= root
$$ XWIN-NMR		Version 3.5
$$ Thu Jun 15 13:47:41 2023 Russian Standard Time (UT+4h)  she@DPX200
##.OBSERVE FREQUENCY= 200.13135
##.OBSERVE NUCLEUS= ^1H
##.ACQUISITION MODE= SIMULTANEOUS
##.ACQUISITION SCHEME= undefined
##.AVERAGES= 8
##.DIGITISER RES= 18
##SPECTROMETER/DATA SYSTEM= spect
##.PULSE SEQUENCE= zg30
##.SOLVENT NAME= Acetone
##.SHIFT REFERENCE= (INTERNAL, Acetone, 0, 15.7381)
##AUDIT TRAIL= $$ (NUMBER, WHEN, WHO, WHERE, WHAT)
$$ ##TITLE= Audit trail, XWIN-NMR		Version 3.5
$$ ##JCAMPDX= 5.01
$$ ##ORIGIN= Bruker BioSpin GmbH
$$ ##OWNER= she
$$ F:/spectra/data/she/nmr/H-F/1/pdata/1/auditp.txt
$$ ##AUDIT TRAIL=  $$ (NUMBER, WHEN, WHO, WHERE, WHAT)
(   1,<2023-06-15 13:46:14.51 +0400>,<she>,<DPX200>,
      <created by zg, POWCHK disabled, PULCHK disabled
       configuration hash MD5:
       00 E9 B6 7A A2 85 ED C7 34 08 36 98 17 FE 4E 26
       data hash MD5: 16K
       24 C4 20 70 B6 CA 8D 06 A7 0B A6 B4 A2 8F 84 9A>)
(   2,<2023-06-15 13:46:16.89 +0400>,<she>,<DPX200>,
      <Start of raw data processing
       efp BC_mod = 2 LB = 0.24 FT_mod = 6 PKNL = 1 PHC0 = -20782.08 PHC1 = 8.852719 SI = 16K 
       data hash MD5: 16K
       AB BA BE E0 3C 1D 2E 3C 35 1C 29 C0 8D FD 6A AA>)
(   3,<2023-06-15 13:46:50.56 +0400>,<she>,<DPX200>,
      <pk PHC0 = -4.089645 PHC1 = 6.200004 
       data hash MD5: 16K
       9A 70 11 50 B2 AC 0B 0E F3 BE 55 CF 83 2C D8 02>)
(   4,<2023-06-15 13:46:53.07 +0400>,<she>,<DPX200>,
      <abs ABSG = 5 
       data hash MD5: 16K
       91 0F 8B 88 C1 47 00 3E D4 55 99 27 09 D8 70 96>)
$$ ##END=
$$ 
$$ hash MD5
$$ 5A C4 6A F0 36 86 11 8B 39 DE 35 EA B8 97 67 18
##$RELAX= 
##$RELAX= 
##$RELAX= 
##$RELAX= 
##$RELAX= 
##$RELAX= 
$$ Bruker specific parameters
$$ --------------------------
##$DU= <F:/spectra>
##$EXPNO= 1
##$NAME= <H-F>
##$PROCNO= 1
##$TYPE= <nmr>
##$USER= <she>
##$AMP= (0..31)
100 100 100 100 100 100 100 100 100 100 100 100 100 100 100 100 100 100 
100 100 100 100 100 100 100 100 100 100 100 100 100 100 
##$AQSEQ= 0
##$AQ_mod= 1
##$AUNM= <au_zg>
##$AUTOPOS= <>
##$BF1= 200.13
##$BF2= 200.13
##$BF3= 200.13
##$BF4= 200.13
##$BF5= 200.13
##$BF6= 200.13
##$BF7= 200.13
##$BF8= 200.13
##$BYTORDA= 1
##$CFDGTYP= 0
##$CFRGTYP= 5
##$CHEMSTR= <none>
##$CNST= (0..31)
1 1 145 1 1 1 1 1 1 1 1 1 1 1 1 1 1 1 1 1 1 1 1 1 1 1 1 1 1 1 1 1 
##$CPDPRG= <>
##$CPDPRG1= <>
##$CPDPRG2= <>
##$CPDPRG3= <>
##$CPDPRG4= <mlev>
##$CPDPRG5= <mlev>
##$CPDPRG6= <mlev>
##$CPDPRG7= <mlev>
##$CPDPRG8= <mlev>
##$CPDPRGB= <>
##$CPDPRGT= <>
##$D= (0..31)
0 1.2 0 0 0 0 0 0 0 0.06 0 0.03 0 0 0 0 0.0002 0 0 0 0 0 0 0 0 0 0 0 0 
0 0 0 
##$DATE= 1686822373
##$DBL= (0..7)
120 120 120 120 120 120 120 120 
##$DBP= (0..7)
150 150 150 150 150 150 150 150 
##$DBP07= 0
##$DBPNAM0= <>
##$DBPNAM1= <>
##$DBPNAM2= <>
##$DBPNAM3= <>
##$DBPNAM4= <>
$$ [...]
##$SUBNAM3= <"">
##$SUBNAM4= <"">
##$SUBNAM5= <"">
##$SUBNAM6= <"">
##$SUBNAM7= <"">
##$SUBNAM8= <"">
##$SUBNAM9= <"">
##$SW= 18.05172834244
##$SWIBOX= (0..15)
0 0 2 0 0 0 0 0 0 0 0 0 0 0 0 0 
##$SW_h= 3612.71676300578
##$TD= 16384
##$TD0= 1
##$TE= 0
##$TE2= 300
##$TE3= 300
##$TEG= 300
##$TL= (0..7)
0 120 120 120 120 120 120 120 
##$TP= (0..7)
150 150 150 150 150 150 150 150 
##$TP07= 0
##$TPNAME0= <>
##$TPNAME1= <>
##$TPNAME2= <>
##$TPNAME3= <>
##$TPNAME4= <>
##$TPNAME5= <>
##$TPNAME6= <>
##$TPNAME7= <>
##$TPOAL= (0..7)
0.5 0.5 0.5 0.5 0.5 0.5 0.5 0.5 
##$TPOFFS= (0..7)
0 0 0 0 0 0 0 0 
##$TUNHIN= 0
##$TUNHOUT= 0
##$TUNXOUT= 0
##$USERA1= <user>
##$USERA2= <user>
##$USERA3= <user>
##$USERA4= <user>
##$USERA5= <user>
##$V9= 5
##$VALIST= <valist>
##$VCLIST= <CCCCCCCCCCCCCCC>
##$VD= 0
##$VDLIST= <DDDDDDDDDDDDDDD>
##$VPLIST= <PPPPPPPPPPPPPPP>
##$VTLIST= <TTTTTTTTTTTTTTT>
##$WBST= 1024
##$WBSW= 4
##$XGAIN= (0..3)
0 0 0 0 
##$XL= 0
##$YL= 0
##$YMAX_a= 371322
##$YMIN_a= -364830
##$ZGOPTNS= <>
##$ZL1= 120
##$ZL2= 120
##$ZL3= 120
##$ZL4= 120
##$ABSF1= 15.73367
##$ABSF2= -2.318179
##$ABSG= 5
##$ABSL= 3
##$ALPHA= 0
##$AQORDER= 0
##$ASSFAC= 0
##$ASSFACI= 0
##$ASSFACX= 0
##$ASSWID= 0
##$AUNMP= <proc_1d>
##$AZFE= 0.1
##$AZFW= 0.1
##$BCFW= 0
##$BC_mod= 2
##$BYTORDP= 0
##$COROFFS= 0
##$CY= -3
##$DATMOD= 1
##$DC= 0
##$DFILT= <>
##$DTYPP= 0
##$F1P= 0
##$F2P= 0
##$FCOR= 1
##$FTSIZE= 16384
##$FT_mod= 6
##$GAMMA= 0
##$GB= 0
##$INTBC= 1
##$INTSCL= 3.70164e-10
##$ISEN= 128
##$LB= 0.24
##$LEV0= 0
##$LPBIN= 0
##$MAXI= 10000
##$MC2= 0
##$MEAN= 0
##$ME_mod= 0
##$MI= 1.114404
##$NCOEF= 0
##$NC_proc= -7
##$NLEV= 6
##$NOISF1= 3.799351
##$NOISF2= 2.8
##$NSP= 0
##$NTH_PI= 0
##$NZP= 0
##$OFFSET= 15.73808
##$PC= 1
##$PHC0= -20786.17
##$PHC1= 15.05272
##$PH_mod= 1
##$PKNL= yes
##$PPARMOD= 0
##$PSCAL= 0
##$PSIGN= 0
##$REVERSE= no
##$SF= 200.130006696873
##$SI= 16384
##$SIGF1= 3
##$SIGF2= 2
##$SINO= 5.538805
##$SIOLD= 16384
##$SREGLST= <1H.CDCl3>
##$SSB= 0
##$STSI= 16384
##$STSR= 0
##$SW_p= 3612.71676300578
##$SYMM= 0
##$S_DEV= 0
##$TDeff= 16384
##$TDoff= 0
##$TI= <>
##$TILT= no
##$TM1= 0
##$TM2= 0
##$TOPLEV= 0
##$USERP1= <user>
##$USERP2= <user>
##$USERP3= <user>
##$USERP4= <user>
##$USERP5= <user>
##$WDW= 1
##$XDIM= 16384
##$YMAX_p= 285235276
##$YMIN_p= -369969
$$ End of Bruker specific parameters
$$ ---------------------------------
##NTUPLES= NMR SPECTRUM
##VAR_NAME=  FREQUENCY,     SPECTRUM/REAL,   SPECTRUM/IMAG
##SYMBOL=    X,             R,               I
##VAR_TYPE=  INDEPENDENT,   DEPENDENT,       DEPENDENT
##VAR_FORM=  AFFN,          ASDF,            ASDF
##VAR_DIM=   16384,         16384,           16384
##UNITS=     HZ,            ARBITRARY UNITS, ARBITRARY UNITS
##FACTOR=    0.220516191357247, 1,           1
##FIRST=     3149.66206074298, 0,            0
##LAST=      -463.054702262796, 0,           0
##MIN=       -463.054702262796, -369969,     0
##MAX=       3149.66206074298, 285235276,    0
$$ Real data points
##PAGE= N=1
##DATA TABLE= (X++(R..R)), XYDATA
$$ [...]
6086B286427n0486o9216j14011M3843O9500p3253j1119O3863n2292J27867O1348
$$ 2286427 2235941 2166725 2052714 2096557 2166057 2092804 2081685 2145548 2093256 2221123 2282471
6075B282471L623j37026L9640P0564K7689l9651k2508m3843k3897m5269Q4383
$$ 2282471 2286094 2149068 2188708 2259272 2286961 2247310 2224802 2180959 2157062 2111793 2196176
6064B196176J36085N3718O1201j18664J10779J0786N7983p510j43671n5728K14092
$$ 2196176 2332261 2385979 2447180 2328516 2439295 2450081 2508064 2500554 2356883 2301155 2515247
6053B515247L3954N4542J8728R0189M403R9649J03636L2988q658K42281P4084
$$ 2515247 2549201 2603743 2622471 2712660 2717063 2816712 2920348 2953336 2944678 3186959 3261043
6042C261043o6824J80928J15862J77078J49382j88722k78267j74601r3454q4855
$$ 3261043 3194219 3375147 3491009 3668087 3817469 3628747 3350480 3175879 3082425 2997570
6032B997570q827m0756j60099N1161k259R3988P0160J12510R740r5854O6887J00287
$$ 2997570 2988743 2947987 2787888 2839049 2836790 2930778 3000938 3113448 3123188 3027334 3094221 3194508
6020C194508J83734P3652J1396M8550K02010K62629K41520J64424J99066L00437
$$ 3194508 3378242 3451894 3463290 3511840 3713850 3976479 4217999 4382423 4581489 4881926
6010D881926K46492J33527j4042j45007l72402m04569l11466j60120k33167j46142
$$ 4881926 5128418 5261945 5247903 5102896 4730494 4325925 4014459 3854339 3621172 3475030
6000C475030J23946m3399n874j549r5421O02J67142J9443L4689L764j6279J82718
$$ 3475030 3598976 3555577 3549703 3548154 3452733 3453335 3620477 3639920 3674609 3678373 3662094 3844812
5988C844812P9823J48770N2406O9357K34567M48822J22219K77749K36821J60063
$$ 3844812 3924635 4073405 4125811 4195168 4429735 4878557 5000776 5278525 5515346 5675409
5978E675409j13868l25652k00694k95732j82345k84337j42495j81222m144m3790
$$ 5675409 5561541 5235889 5035195 4739463 4557118 4272781 4130286 3949064 3944920 3901130
5968C901130p6350J22391R2113O306O7214J08127P270m8728J76413L5437J36928
$$ 3901130 3824780 3947171 4039284 4045590 4112804 4220931 4228201 4179473 4355886 4391323 4528251
5957D528251p8750Q9714J22082K6348Q2002q4182q1781K05366J36826K16204N4154
$$ 4528251 4449501 4539215 4661297 4687645 4769647 4685465 4603684 4809050 4945876 5162080 5216234
5946E216234j16260j47323j61306j63323L8620J9061J20046R5489r1818J05297
$$ 5216234 5099974 4952651 4791345 4628022 4666642 4685703 4805749 4901238 4809420 4914717
5936D914717m1997N6787L480J97881K31313R4358K7971J25245J86010J52144j10062
$$ 4914717 4872720 4929507 4932987 5130868 5362181 5456539 5484510 5609755 5795765 5947909 5837847
5925E837847m7469r7321r2815M2935O5114j8042J1005j4579J37864m1478K46792
$$ 5837847 5790378 5693057 5600242 5643177 5708291 5690249 5701254 5686675 5824539 5783061 6029853
5914F029853J9693J55066J55980J10054J2766J67434J57622J86841K68265J14632
$$ 6029853 6049546 6204612 6360592 6470646 6483412 6650846 6808468 6995309 7263574 7378206
5904G378206N01643L41440O48327R62236R64720J050954O25595J3222l13306n66265
$$ 7378206 7879849 8221289 8869616 9831852 10796572 11847526 12473121 12486343 12173037 11606772
5894A1606772o28050m93295o44799n48948k34727k41178p0131k5969L611L6572
$$ 11606772 10978722 10485427 9840628 9291680 9056953 8815775 8745644 8719675 8723286 8759858
5884H759858J80971L3140L9425K51055K55019K55203L86573L51859L86176O96883
$$ 8759858 8940829 8973969 9013394 9264449 9519468 9774671 10161244 10513103 10899279 11596162
5874A1596162P24010P34422R17558J144062J505448K154461K580865K545836J401218
$$ 11596162 12320172 13054594 13972152 15116214 16621662 18776123 21356988 23902824 25304042
5865B5304042n35716k304710k913346k119036j346182j134195j045047p20692
$$ 25304042 24768326 22463616 19550270 17431234 16085052 14950857 13905810 13185118
5857A3185118l30485k37970j02158l0925L2818J43660J83270K40692M42715N32090
$$ 13185118 12854633 12616663 12514505 12483580 12516398 12660058 12843328 13084020 13526735 14058825
5847A4058825O84589O71503J071579J227446J146675J180781J235274R40807J029593
$$ 14058825 14743414 15414917 16486496 17713942 18860617 20041398 21276672 22217479 23247072
5838B3247072J282660J385948J788032J717341N74088j492910l108899l390124
$$ 23247072 24529732 25915680 27703712 29421053 29995141 28502231 25393332 22003208
5830B2003208k429662j742250j167272r49224p85936n99221l53486p9161J30971
$$ 22003208 19573546 17831296 16664024 15714800 14928864 14329643 13976157 13896996 14027967
5821A4027967K46135L02140L54802P67875Q67737O64819O69938K84157j19615
$$ 14027967 14274102 14576242 14931044 15698919 16566656 17231475 17901413 18185570 18065955
5812A8065955j93107m98007p64523j024454p64609p09368l31963J9087K67315
$$ 18065955 17872848 17374841 16610318 15585864 14821255 14111887 13779924 13799011 14066326
5803A4066326L04593J1761p85216j235480j257068q36125n77129m88622m13996
$$ 14066326 14370919 14382680 13597464 12361984 11104916 10268791 9691662 9203040 8789044
5794H789044l59986k48109j22697j92389k21431j35824j42151j11538r9774j77458
$$ 8789044 8429058 8180949 8058252 7865863 7644432 7508608 7366457 7254919 7155145 6977687
5784F977687j04824m9852j00799k723k01317k26292k04314q4920k17949j595j66320
$$ 6977687 6872863 6823011 6722212 6719489 6518172 6291880 6087566 6002646 5784697 5783102 5616782
5773E616782k13880M6396n1868J1371j34877j49585j1142l9240J35416l1093n5529
$$ 5616782 5402902 5449298 5397430 5408801 5273924 5124339 5113197 5073957 5209373 5178280 5122751
5762E122751m9458j48514j17815M4104L1282r5238M9766K7444p3693o0431r331
$$ 5122751 5073293 4924779 4806964 4851068 4882350 4787112 4836878 4864322 4790629 4730198 4720867
5751D720867n0286j11255J60884J02624j74909j9326p7531n961j58095L676R0554
$$ 4720867 4670581 4559326 4720210 4822834 4647925 4628599 4551068 4545107 4387012 4390688 4481242
5740D481242L9675p3466j67410m5328p8041L1963l1346j03605L423J1885l9155
$$ 4481242 4520917 4447451 4280041 4234713 4156672 4188635 4157289 4053684 4057107 4068992 4029837
5729D029837m5197k6749q721K02696j30991o7904k1105k04805j16254j35269K4533
$$ 4029837 3984640 3957891 3949170 4151866 4020875 3952971 3931866 3727061 3610807 3475538 3500071
5718C500071k7540j1895m0954j22754j49273J28138o6329M3238M6605K15039n5544
$$ 3500071 3472531 3460636 3419682 3296928 3147655 3275793 3209464 3252702 3299307 3514346 3458802
5707C458802k4719n6870J84326m6484q5423K5004J06208J49647J2834m2291j56646
$$ 3458802 3434083 3377213 3561539 3515055 3429632 3454636 3560844 3710491 3723325 3681034 3524388
5696C524388p4346o0850o4787p4202k1091j1920R466o177N2409m3864j05877P9423
$$ 3524388 3450042 3389192 3324405 3250203 3229112 3217192 3226658 3220481 3272890 3229026 3123149 3202572
5684C202572m6921o3813k2102j05694J36752k8530J02966R8108J64342j9443j86618
$$ 3202572 3155651 3091838 3069736 2964042 3100794 3072264 3175230 3273338 3437680 3418237 3231619
5673C231619j74178j37125K2053R342j9368Q6308M2338r3279r5869K59043J35084
$$ 3231619 3057441 2920316 2942369 2951711 2932343 3018651 3060989 2967710 2871841 3130884 3265968
5662C265968n3345J33063L2035J36720K39019J16636n8012n1139j6594q6233j34563
$$ 3265968 3212623 3345686 3377721 3514441 3753460 3870096 3812084 3760945 3744351 3658118 3523555
5651C523555o2941r0269j65431J8933r3057p3555O2825j61965L1084l7044o3776
$$ 3523555 3460614 3370345 3204914 3223847 3130790 3057235 3120060 2958095 2989179 2952135 2888359
5640B888359P3594r8387j49768j4365J22377J54325K6976n346L4126N5530j11751
$$ 2888359 2961953 2863566 2713798 2699433 2821810 2976135 3003111 2997765 3031891 3087421 2975670
5629B975670K16296J69177J33725P6885P1802M9320q7188r5540j69269j20217
$$ 2975670 3191966 3361143 3494868 3571753 3643555 3692875 3605687 3510147 3340878 3220661
5619C220661k17332l9269l9865O2584m1141l4914m5417K2944o0209J6986P5300
$$ 3220661 3003329 2964060 2924195 2986779 2945638 2910724 2865307 2888251 2828042 2845028 2920328
5608B920328j09102j00347R5986K1386N8711j9276P4751K2943p068q7869P3815
$$ 2920328 2811226 2710879 2806865 2828251 2886962 2867686 2942437 2965380 2958312 2870443 2944258
5597B944258J01524m5469J48201Q724o9220L1102M3728M9367R5478l5662J00567
$$ 2944258 3045782 3000313 3148514 3157238 3088018 3119120 3162848 3212215 3307693 3272031 3372598
5586C372598r8317j74418O1755l6678J5114J46464Q3646l5826k3586J7826N3445
$$ 3372598 3274281 3099863 3161618 3124940 3140054 3286518 3370164 3334338 3310752 3328578 3382023
5575C382023N8625J33482R0422J5670L315J46320Q2706J31599J3125j2053O372
$$ 3382023 3440648 3574130 3664552 3680222 3683537 3829857 3912563 4044162 4057287 4045234 4051606
5564D051606Q3511J70605P2303Q2040J46786K78425J88409J77854J64421M31389
$$ 4051606 4135117 4305722 4378025 4460065 4606851 4885276 5073685 5251539 5415960 5847349
5554E847349L39697J87991J71687K14943K90672L165J41575K29470M90575N96978
$$ 5847349 6187046 6375037 6546724 6761667 7052339 7055504 7197079 7426549 7917124 8514102
5544H514102M36470M51295L42813J55037m9802j83426l50928k46132k19514m3934
$$ 8514102 8950572 9401867 9744680 9899717 9849915 9666489 9315561 9069429 8849915 8805981
5534H805981L942j32882k63652l20613j56514j17793j33415o8844J80882J63525
$$ 8805981 8809923 8677041 8413389 8092776 7936262 7818469 7685054 7616210 7797092 7960617
5524G960617M71600M68875O66264O80366Q00371R32271M67625K44493J37863j37162
$$ 7960617 8432217 8901092 9567356 10247722 11048093 11980364 12447989 12692482 12830345 12693183
5514A2693183m92082p83585q50604q73172q65776o58412m87843l02412l55936
$$ 12693183 12201101 11417516 10566912 9693740 8827964 8169552 7681709 7379297 7023361
5505G023361k96438j06123P4692P8513j11440m136L1288k0710J58332K96377L49425
$$ 7023361 6726923 6620800 6695492 6774005 6662565 6658429 6689717 6669007 6827339 7123716 7473141
5494G473141L59264M55075M9948J53314R2713l11931o10370n42222l95089l96531
$$ 7473141 7832405 8287480 8337428 8490742 8583455 8271524 7661154 7118932 6723843 6327312
5484F327312j98346q7233k57730j29836j27330j02494j64657k4839k33909m1616
$$ 6327312 6128966 6041733 5784003 5654167 5526837 5424343 5259686 5234847 5000938 4959322
5474D959322q85j10162M320j2656l613K7076J089j00964n8766n9588k3493R7726
$$ 4959322 4958437 4848275 4852595 4839939 4836326 4863402 4864491 4763527 4704761 4645173 4621680 4719406
5462D719406j16974r7632O6885M6882j8592j10260J13706j7663p3890N8187j18601
$$ 4719406 4602432 4504800 4571685 4618567 4599975 4489715 4603421 4585758 4511868 4570055 4451454
5451D451454n3504P4694P5561n6005J11328j735l5069Q3668N284k5644K63689
$$ 4451454 4397950 4472644 4548205 4492200 4603528 4601793 4566724 4650392 4655676 4630032 4893721
5440D893721J8106r3028J31482P8972J57033J04721M0141o4974k5578L1100K6323
$$ 4893721 4911827 4818799 4950281 5029253 5186286 5291007 5331148 5266174 5240596 5271696 5298019
5429E298019o4300j1593k0718K5542J40476Q0015N6698l6627p2681J2446J18505
$$ 5298019 5233719 5222126 5201408 5226950 5367426 5447441 5504139 5467512 5394831 5407277 5525782
5418E525782J35159K08453J13559M0712J75806J03397J14042q2244O9917O060
$$ 5525782 5660941 5869394 5982953 6023665 6199471 6302868 6416910 6334666 6404583 6410643
5408F410643j08326j10626Q1242j0654R8072J61895p2212K13254P3557n8331K7799
$$ 6410643 6302317 6191691 6272933 6262279 6360351 6522246 6450034 6663288 6736845 6678514 6706313
5397F706313k11250n3385k01861m2051j21339j36429m8136J33310J54554O9956
$$ 6706313 6495063 6441678 6239817 6197766 6076427 5939998 5891862 6025172 6179726 6249682
5387F249682o4853L4136K809J85430K82402J02773Q0411L0728l75300j11332O2791
$$ 6249682 6184829 6218965 6221774 6407204 6689606 6792379 6872790 6903518 6528218 6416886 6479677
5376F479677n248j47246o4690j15546j86934K1411k2392m4288n3157J5566p8542
$$ 6479677 6474429 6327183 6262493 6146947 5960013 5981424 5959032 5914744 5861587 5877153 5798611
5365E798611O7948J42730J08871l1441j7308K09530J88134K28785m8772r5315
$$ 5798611 5866559 6009289 6118160 6086719 6069411 6278941 6467075 6695860 6647088 6551773
5355F551773l9452r3800k56306k57412k03031j59651k40141r8762K1548j06987
$$ 6551773 6512321 6418521 6162215 5904803 5701772 5542121 5301980 5203218 5224766 5117779
5345E117779J30399K3565j24107j41094L8379n0085M4116r8562R1406J66833Q9522
$$ 5117779 5248178 5271743 5147636 5006542 5044921 4994836 5038952 4940390 5031796 5198629 5288151
5334E288151J12459K40128K02279L30971M08917L20716M08458M55632R6348j69555
$$ 5288151 5400610 5640738 5843017 6173988 6582905 6903621 7312079 7767711 7864059 7694504
5324G694504m06507n70175k68565k02003k33171k3019q200K05191K04395K81854
$$ 7694504 7287997 6717822 6449257 6247254 6014083 5991064 5982864 6188055 6392450 6674304
5314F674304J71391J56389k8114j48548l21516j17480p5147P3545N726J91620
$$ 6674304 6845695 7002084 6973970 6825422 6503906 6386426 6311279 6384824 6390550 6582170
5304F582170J64612R4953K03730K32896M38705M71115N21737M86304L27477m9288
$$ 6582170 6746782 6841735 7045465 7278361 7717066 8188181 8709918 9196222 9523699 9474411
5294I474411k06504m53784l05651m94891m61791m55012m27704l51164l46281l01190
$$ 9474411 9267907 8814123 8508472 8013581 7551790 7096778 6669074 6317910 5971629 5670439
5284E670439p3292q4758l6867j34691n7428j617L7114J40523P1131r5742j21962
$$ 5670439 5597147 5512389 5475522 5340831 5283403 5281786 5318900 5459423 5530554 5434812 5312850
5273E312850k1333m8474r5186M3196o7645j03464J55210k1798O0494J03840p9390
$$ 5312850 5291517 5243043 5147857 5191053 5123408 5019944 5175154 5153356 5213850 5317690 5238300
5262E238300j87513k82154l20774j25886p8507j02187k12445j68006N139L2859
$$ 5238300 5050787 4768633 4447859 4321973 4243466 4141279 3928834 3760828 3765967 3798826
5252C798826j95472K8729J41121M4749j2255m0831P4263j45249k23323j03706
$$ 3798826 3603354 3632083 3773204 3817953 3805698 3764867 3839130 3693881 3470558 3366852
5242C366852p2220R1980O1898Q716j00099r8560r2166L7273J05157J00659J414
$$ 3366852 3294632 3386612 3448510 3457226 3357127 3258567 3166401 3203674 3308831 3409490 3410904
5231C410904k20597m3035m8276l5300l7497o2797R4743n1659j3284J88207j3706
$$ 3410904 3190307 3147272 3098996 3063696 3026199 2963402 3058145 3006486 2993202 3181409 3167703
5220C167703k97980j3861L262m4812r6810o4584N0221J926J0451R7750O8620O0686
$$ 3167703 2869723 2855862 2859124 2814312 2717502 2652918 2703139 2705065 2715516 2813266 2881886 2942572
5208B942572L6353j94896j7975J03829Q738j38317L2774O0127J62504J24336j46610
$$ 2942572 2978925 2784029 2766054 2869883 2878621 2740304 2773078 2833205 2995709 3120045 2973435
5197B973435j47647m4813J41923N3662L0813n7407j66274r2798J33154N8023q3069
$$ 2973435 2825788 2780975 2922898 2976560 3007373 2949966 2783692 2690894 2824048 2882071 2799002
5186B799002J30831l0154j00042j05185R0238N5413J35428j15138J13905R1354
$$ 2799002 2929833 2899679 2799637 2694452 2784690 2840103 2975531 2860393 2974298 3065652
5176C065652m7700r8163R4381P5986j674P4317K9238q0669J06996k4565R1087
$$ 3065652 3017952 2919789 3014170 3090156 3088482 3162799 3192037 3111368 3218364 3193799 3284886
5165C284886L4677O3166J68269J54952Q2012J07980P7378J48642J01947n5896
$$ 3284886 3319563 3382729 3550998 3705950 3787962 3895942 3973320 4121962 4223909 4168013
5155D168013j95579o0162J36332q8620K5221k1060p0690n1290Q456J7073K3225
$$ 4168013 3972434 3912272 4048604 3959984 3985205 3964145 3893455 3842165 3850621 3867694 3890919
5144C890919j53465m1829l3300J36737K13799M7425N3161J24716L9466J30730
$$ 3890919 3737454 3695625 3662325 3799062 4012861 4060286 4113447 4238163 4277629 4408359
5134D408359o1406P9955J20441J5067K1955Q9923K4622J35839K91821J86559J20879
$$ 4408359 4346953 4426908 4547349 4562416 4584371 4674294 4698916 4834755 5126576 5313135 5434014
5123E434014j424j70807k08682j23947l21515p4015J92419Q227j62372j96260
$$ 5434014 5432590 5261783 5053101 4929154 4607639 4533624 4726043 4734270 4571898 4375638
5113D375638j04888j33665p4301k15287r751m9934Q6823J24779K4059j8772Q4028
$$ 4375638 4270750 4137085 4062784 3847497 3837746 3787812 3874635 3999414 4023473 4004701 4088729
5102D088729J05854P4388M6934N1047J93034K90494n3808j13250K54003J41215
$$ 4088729 4194583 4268971 4315905 4366952 4559986 4850480 4796672 4683422 4937425 5078640
5092E078640J96305N7481j14880l9666j93797k48323n3449P3827j49976j08450
$$ 5078640 5274945 5332426 5217546 5177880 4984083 4735760 4682311 4756138 4606162 4497712
5082D497712j11661k04041j76690n5669j44684j9325R7129j68765k4162l2360
$$ 4497712 4386051 4182010 4005320 3949651 3804967 3785642 3882771 3714006 3689844 3657484
5072C657484L073q3833q2963K3794m0224J28313L1449J5885m8928P8027J03566
$$ 3657484 3660557 3576724 3493761 3517555 3477331 3605644 3637093 3652978 3604050 3682077 3785643
5061C785643J20776J17593J27457r1072n5256j68852p9398l717k51050M1747M6366
$$ 3785643 3906419 4024012 4151469 4060397 4005141 3836289 3756891 3753174 3502124 3543871 3590237
5050C590237J7894r7366P8252p275J25150k9211l374J02551n69K396n1161P3074
$$ 3590237 3608131 3510765 3589017 3581742 3706892 3677681 3674307 3776858 3776289 3778685 3727524 3800598
5038C800598M2034L2330j65852r9971p1770m7354P1535J2301p9853L4251M5221
$$ 3800598 3842632 3874962 3709110 3609139 3537369 3490015 3561550 3573851 3493998 3528249 3573470
5027C573470j11167J11808j10673k608R1438k3354p0365Q8911O5426K7209J86683
$$ 3573470 3462303 3574111 3463438 3460830 3552268 3528914 3458549 3547460 3612886 3640095 3826778
5016C826778r8598M3570N7341k0198O397L665O9565m975J22262N7682N0017q727
$$ 3826778 3728180 3771750 3829091 3808893 3815290 3818955 3888520 3883545 4005807 4063489 4113506 4104779
5004D104779o9575p1149j75052m0987R5054N3439q352o2714L18J017K1137q5493
$$ 4104779 4035204 3964055 3789003 3748016 3843070 3896509 3888157 3825443 3825761 3826778 3847915 3762422
4992C762422J56519m7647p7165N770n1013J45435N7116r528j28836k3786J25696
$$ 3762422 3918941 3871294 3794129 3799899 3748886 3894321 3951437 3941909 3813073 3789287 3914983
4981C914983m7211L8424n1789m8619L7465k9984N9092L4863m5760o436k9819K18561
$$ 3914983 3867772 3906196 3854407 3805788 3843253 3813269 3872361 3907224 3861464 3855028 3825209 4043770
4969D043770J12221L4420l9010N4340J1387j10586J6776Q517j9180N4166N8316
$$ 4043770 4155991 4190411 4151401 4205741 4217128 4106542 4123318 4131835 4112655 4166821 4225137
4958D225137k7874l3826O9209R6266J10889Q4771L3964o9886M1950M6222K2449
$$ 4225137 4197263 4163437 4232646 4328912 4439801 4524572 4558536 4488650 4530600 4576822 4599271
4947D599271J5470K7340P3080K5913L2768m4823O0381o8620O8227Q3561Q4111
$$ 4599271 4614741 4642081 4715161 4741074 4773842 4729019 4789400 4720780 4789007 4872568 4956679
4936D956679K7749O1126o6342Q7391r4149q0328o4137O3939l0625L7944K05351
$$ 4956679 4984428 5045554 4979212 5066603 4972454 4892126 4827989 4891928 4861303 4899247 5104598
4925E104598K867R457j7710J27784O3103j51613K9505N1084K54O4174N4709M2176
$$ 5104598 5107465 5116922 5099212 5226996 5290099 5138486 5167991 5219075 5219329 5283503 5338212 5380388
4913E380388N5146n2556K10261R5344J00467O4464J09635L3368J00082M6392j6307
$$ 5380388 5435534 5382978 5593239 5688583 5789050 5853514 5963149 5996517 6096599 6142991 6126684
4902F126684P3876N3524l02570l51711j74543p0191j02174L0218p7614j76501
$$ 6126684 6200560 6254084 5951514 5599803 5425260 5355069 5252895 5283113 5205499 5028998
4892E028998J69119j9519P0317R4053N161j9852J42718k21893J35703J89716J0433
$$ 5028998 5198117 5178598 5248915 5342968 5348129 5328277 5470995 5249102 5384805 5574521 5584954
4881E584954P9459J91524K64766K66312J85015L5767l4246k81015l42076j13137
$$ 5584954 5664413 5855937 6120703 6387015 6572030 6607797 6573551 6292536 5950460 5837323
4871E837323r424k05627j94955l515m0793Q6685L6272k9134R8567L4083q1704
$$ 5837323 5827899 5622272 5427317 5423802 5383009 5469694 5505966 5476832 5575399 5609482 5527778
4860E527778J2399J85781J05504o3155m0136J17634Q1365J17763K18079J24311
$$ 5527778 5540177 5725958 5831462 5768307 5728171 5845805 5927170 6044933 6263012 6387323
4850F387323K1788m1750J27442J49139J90530K16323L84629J78584N0853j51424
$$ 6387323 6409111 6367361 6494803 6643942 6834472 7050795 7435424 7614008 7664861 7513437
4840G513437k92392p4925m5181l2218j66131k3361j79250q8071M0981N6371j05221
$$ 7513437 7221045 7146120 7100939 7068721 6902590 6879229 6699979 6611908 6652889 6709260 6604039
4829F604039k42439N0993n3046P5886K9285m7861n3096L030P0777P76m211R2014
$$ 6604039 6361600 6412593 6359547 6435433 6464718 6416857 6363761 6366791 6437568 6438344 6434133 6526147
4817F526147L2174N4192J42092n6577N363J90062L0653K746J366k01566k38945
$$ 6526147 6558321 6612513 6754605 6698028 6703391 6893453 6924106 6926852 6928218 6726652 6487707
4806F487707j98498k26664j39030k5953q5251j31237N5489J66582J4607Q4726
$$ 6487707 6289209 6062545 5923515 5897562 5812311 5681074 5736563 5903145 5917752 6002478
4796F002478K40834J16842P8414M8001j12515j946j6488j13952J21016N5515M4437
$$ 6002478 6243312 6360154 6438568 6486569 6374054 6372108 6355620 6241668 6362684 6418199 6462636
4785F462636Q5523Q162J67536j098j06621m8133Q7411N5110L5889j9095j6298
$$ 6462636 6548159 6556321 6723857 6722759 6616138 6568005 6655416 6710526 6746415 6727320 6711022
4774F711022j37327j6022k2829j08062j52989N858j13099l4699k1848j19680q0700
$$ 6711022 6573695 6557673 6534844 6426782 6273793 6279651 6166552 6131853 6110005 5990325 5909625
4763E909625K197J36240q9865N7339J50207n5331J20370O7850J7979l6302j62305
$$ 5909625 5911822 6048062 5958197 6015536 6165743 6110412 6230782 6298632 6316611 6280309 6118004
4752F118004j19J4738j41815L0069J9979j29195M1419m1506P8263M7965n4622
$$ 6118004 6117885 6132623 5990808 6020877 6040856 5911661 5953080 5911574 5989837 6037802 5983180
4741E983180K18332J67405l3682Q2032M0927m7910j78049M8088j54055j98565
$$ 5983180 6201512 6368917 6335235 6417267 6458194 6410284 6232235 6280323 6126268 5927703
4731E927703m5629q5925o9306k7664l2057l0402p1706J00644J64679N3128L6471
$$ 5927703 5882074 5796149 5726843 5699179 5667122 5636720 5565014 5665658 5830337 5883465 5919936
4720E919936J60523R1076q4243M8185J6529L5696l6571L4749j50904j98389K11393
$$ 5919936 6080459 6171535 6087292 6135477 6152006 6187702 6151131 6185880 6034976 5836587 6047980
4709F047980j5072J68364P4905n1027O9619O5311q6989J02868J61567J45255K05415
$$ 6047980 6032908 6201272 6276177 6225150 6294769 6360080 6273091 6375959 6537526 6682781 6888196
4698F888196J41574J62379L04920M16257L72546M82127M94029O33376N81857O49724
$$ 6888196 7029770 7192149 7497069 7913326 8285872 8767999 9262028 9895404 10477261 11126985
4688A1126985M55127K56628J45395p6118l86704p37456n72289o53380p19537l87802
$$ 11126985 11582112 11838740 11984135 11908017 11521313 10783857 10211568 9558188 8838651 8450849
4678H450849l26105k89209l84139k70833j84241Q4288j57059L0167j37519r760
$$ 8450849 8124744 7835535 7451396 7180563 6996322 7080610 6923551 6953718 6816199 6806439
4668F806439J25031j13666P4407P8695J48732R5088k6014K14860l5692P5733J49646
$$ 6806439 6931470 6817804 6892211 6970906 7119638 7214726 7188712 7403572 7367880 7443613 7593259
4657G593259P3753K31264O6794J65341J64666K19379K87638L49761K40966L92261
$$ 7593259 7667012 7898276 7965070 8130411 8295077 8514456 8802094 9151855 9392821 9785082
4647I785082M73961O10809O43921Q39264J015022J237070J169445R48677P34506
$$ 9785082 10259043 10869852 11513773 12353037 13368059 14605129 15774574 16723251 17457757
4638A7457757K67609j85759m78424q77667r45134q13513r12890q53534m65548
$$ 17457757 17725366 17539607 17061183 16183516 15238382 14424869 13511979 12658445 12192897
4629A2192897m70540n96187l49138l94293l76395m75504k71124k72220j63930
$$ 12192897 11722357 11126170 10777032 10382739 10006344 9530840 9259716 8987496 8823566
4620H823566p3904j01861j05608p3306n3511l4500J34648L5365k4896J94753K37913
$$ 8823566 8749662 8647801 8542193 8468887 8415376 8380876 8515524 8550889 8525993 8720746 8958659
4609H958659J08478J13619n9794J25501j8507j3539J67301R3446J70129L44988
$$ 8958659 9067137 9180756 9120962 9246463 9227956 9214417 9381718 9475164 9645293 9990281
4599I990281L27735K67048M90990M66807N54313O97244O26358N48761O91244O75078
$$ 9990281 10318016 10585064 11076054 11542861 12097174 12794418 13420776 13969537 14660781 15335859
4589A5335859M44020K80315J91514K49380j90656j97844k3289Q8493J92494L86370
$$ 15335859 15779879 16060194 16251708 16501088 16310432 16112588 16089299 16177792 16370286 16756656
4579A6756656L67363J91570J68904O9150n9612o0650k70847k62474q42236j183851
$$ 16756656 17124019 17315589 17484493 17553643 17494031 17433381 17162534 16900060 16057824 14873973
4569A4873973j111492r97364o64611m85840l89682k31891j52588o0283p4429o6785
$$ 14873973 13762481 12765117 12100506 11614666 11224984 10993093 10840505 10780222 10705793 10639008
4559A0639008J88345P4971L00550J51141K87156L69392L68162N37707N69461N21219
$$ 10639008 10827353 10902324 11202874 11354015 11641171 12010563 12378725 12916432 13485893 14007112
4549A4007112O45451Q81667R58604J120776J053115R59444J169851J077807J197923
$$ 14007112 14652563 15534230 16492834 17613610 18666725 19626169 20796020 21873827 23071750
4540B3071750Q70517J11607m67861r50928q68167p76370m19069n79238p06761
$$ 23071750 23942267 24053874 23586013 22635085 21766918 20990548 20571479 19992241 19285480
4531A9285480o95777p02218r70617r66181q48924j060591q41117r14401n65070
$$ 19285480 18589703 17887485 16916868 15950687 15101763 14041172 13200055 12285654 11720584
4522A1720584m83016l91647k73361r8131m8499n1540o9269k9478o3318n8397J55904
$$ 11720584 11237568 10845921 10572560 10474429 10425930 10374390 10305121 10275643 10212325 10153928 10309832
4511A0309832L74693N34676N23533O16547P30173M31281k41157o45992p29085
$$ 10309832 10684525 11219201 11742734 12359281 13089454 13520735 13279578 12633586 11904501
4502A1904501q09157o36574l00074l39278k64651j33756P3386P7851J19483K22108
$$ 11904501 11095344 10458770 10158696 9819418 9554767 9421011 9494397 9572248 9691731 9913839
4492I913839R8525J06853K00716J41971j64052M0661J24523J8723j13071k580
$$ 9913839 10012364 10119217 10319933 10461904 10297852 10338513 10463036 10481759 10368688 10366108
4482A0366108j22620j72233j5433r6403j01388k85415l60428l12782k83864o0518
$$ 10366108 10243488 10071255 10055822 9959419 9858031 9572616 9212188 8899406 8615542 8555024
4472H555024J09354j52022L4744M1175j31598n6540q5234q4575r2771R2460m9543
$$ 8555024 8664378 8512356 8547100 8588275 8456677 8400137 8314903 8230328 8137557 8230017 8180474
4461H180474n6921j0088n8825j57511J5500J7896n60m8521O7047J31814J70255
$$ 8180474 8123553 8113465 8054640 7897129 7912629 7930525 7929965 7881444 7948491 8080305 8250560
4450H250560R8404O8179o998K9505M0732j15311J25257N2638J13276l077l6358
$$ 8250560 8348964 8417143 8410145 8439650 8480382 8365071 8490328 8542966 8656242 8653165 8616807
4439H616807q9212K0798k9524J90024P139j6924j61348j77574J5250k9469L5760
$$ 8616807 8527595 8548393 8518869 8708893 8716032 8699108 8537760 8360186 8375436 8345967 8381727
4428H381727J7240L1482J24561l8676j58023j35798M09J10890N9195k7035n6361
$$ 8381727 8398967 8430449 8555010 8516334 8358311 8222513 8222922 8333812 8393007 8365972 8309611
4417H309611N225J13865J2200J23279N5480o5123J12579Q1507J64916K13784r5774
$$ 8309611 8314836 8428701 8440901 8564180 8619660 8554537 8667116 8748623 8913539 9127323 9031549
4406I031549N8074j52805j08146j07633j45936m5298m5792J46156j2941j6707
$$ 9031549 9089623 8936818 8828672 8721039 8575103 8529805 8484013 8630169 8617228 8600521
4396H600521L2998M2028k4231R9969J57997R5003K30120M26999M03481L39064
$$ 8600521 8633519 8675547 8651316 8751285 8909282 9004285 9234405 9661404 10064885 10403949
4386A0403949J34549k65309l26051l08380k66759j49518q7218J69767q697J7472
$$ 10403949 10538498 10273189 9947138 9638758 9371999 9222481 9135263 9305030 9296333 9313805
4376I313805L02075J10787K36757L23007L19444N31174L35012k5156m17187k43078
$$ 9313805 9615880 9726667 9963424 10286431 10605875 11137049 11472061 11446905 11029718 10786640
4366A0786640j05625Q199j710K70L4924p6069k20249P0230o4261l5796J80522
$$ 10786640 10681015 10689214 10687504 10687774 10722698 10646629 10426380 10496610 10432349 10396553 10577075
4355A0577075J86871M0636J9739Q2798K46873L04216K61169J92385J06353o1613
$$ 10577075 10763946 10804582 10824321 10907119 11153992 11458208 11719377 11911762 12018115 11956502
4345A1956502m6324P3953J71498N3890J48379K40420K32015K32502K43821L66042
$$ 11956502 11910178 11984131 12155629 12209519 12357898 12598318 12830333 13062835 13306656 13672698
4335A3672698J27914K75149M77879M57709L43110L23619N36453N92564O53752
$$ 13672698 13800612 14075761 14553640 15011349 15354459 15678078 16214531 16807095 17460847
4326A7460847Q36201Q30246J149847J420640J662382J671239J661191J378569
$$ 17460847 18297048 19127294 20277141 21697781 23360163 25031402 26692593 28071162
4318B8071162J268998J193894J383224J345037N07830j222969k839285l338991
$$ 28071162 29340160 30534054 31917278 33262315 33770145 32547176 29707891 26368900
4310B6368900k603757j904065j375041r14543m70074j66752k64435j92198j32693
$$ 26368900 23765143 21861078 20486037 19571494 19101420 18934668 18670233 18478035 18345342
4301A8345342k0728j60758k61226k15953j57076k01566r220j82135k64273j99413
$$ 18345342 18324614 18163856 17902630 17686677 17529601 17328035 17318815 17136680 16872407 16672994
4291A6672994l1947J02178R5476J70260K07001R5311K35746K06268L19867L83313
$$ 16672994 16641047 16743225 16838701 17008961 17215962 17311273 17547019 17753287 18073154 18456467
4281A8456467M06298M86886N70885O86769P73045R04668J059504J288313J287380
$$ 18456467 18862765 19349651 19920536 20607305 21380350 22285018 23344522 24632835 25920215
4272B5920215J387675J319503J129012P99370N69595K21906j36955n53636p41384
$$ 25920215 27307890 28627393 29756405 30555775 31125370 31347276 31210321 30656685 29915301
4263B9915301r78343o27658J15595N29970J141326J507093K599765L249390K235924
$$ 29915301 28936958 28309300 28424895 28954865 30096191 31603284 34203049 37452439 39688363
4254C9688363m82605l994071m952443l564780k321705j650793j290303r12158
$$ 39688363 39205758 35211687 30259244 26694464 24372759 22721966 21431663 20519505
4246B0519505n70483n21888k49326q9607m8522j72Q0127K35210N6135J18525J95505
$$ 20519505 19949022 19427134 19177808 19088201 19039679 19039507 19119634 19354844 19410979 19529504 19725009
4235A9725009L7376k0096m0262j59965j54384N6416P8796K42193L12700q300J08428
$$ 19725009 19762385 19742289 19702027 19542062 19387678 19444094 19522890 19765083 20077783 20069483 20177911
4224B0177911O4721J61267J00694J99507K91615K42259K1866r4135N7261J31845
$$ 20177911 20242632 20403899 20504593 20704100 20995715 21237974 21259840 21165705 21222966 21354811
4214B1354811K84775J45840L78178L19725K89281L94156L98695L35494K22843
$$ 21354811 21639586 21785426 22163604 22483329 22772610 23166766 23565461 23900955 24123798
4205B4123798K79856L01305M09737O42948N88582N49645N08002O49229O05062
$$ 24123798 24403654 24704959 25114696 25757644 26346226 26895871 27403873 28053102 28658164
4196B8658164N71924P92647P84422O94709R10964Q55094J029284Q11756P55156
$$ 28658164 29230088 30022735 30807157 31501866 32412830 33267924 34297208 35108964 35864120
4187C5864120R56393J202150J207627J185380J135042J089103J121440J301671
$$ 35864120 36820513 38022663 39230290 40415670 41550712 42639815 43761255 45062926
4179D5062926J148857J271164J814230J899052K338463K529288K923109L425677
$$ 45062926 46211783 47482947 49297177 51196229 53534692 56063980 58987089 62412766
4171F2412766L669487M145135M549794N493130O807905Q439044J0770290J3436192
$$ 62412766 66082253 70227388 74777182 80270312 87078217 95517261 106287551 119723743
4163A19723743J5307487J4297943Q761395R77758l275737k262171L765443R427046
$$ 119723743 135031230 149329173 158090568 159068326 155792589 153530418 157295861 166722907
4155A66722907J0874284O238411l789194j2473815j5485339j1970413n742412
$$ 166722907 177597191 183835602 180046408 167572593 152087254 140116841 134374429
4148A34374429K65205O487000J2055663J2032588M170033j0564112k1789988j9581556
$$ 134374429 134639634 141126634 153182297 165214885 169384918 158820806 137030818 117449262
4140A17449262j2409259p404500m257461k940623m226778o605083p781543o735807
$$ 117449262 105040003 97635503 93378042 90437419 86210641 79605558 71824015 65088208
4132F5088208m945642l536296l033368k698228k369672j963604j489368j349031
$$ 65088208 60142566 56606270 53572902 50874674 48505002 46541398 45052030 43702999
4124D3702999j338066j036009j204175j094582o52513o40527p33612o44941m74289
$$ 43702999 42364933 41328924 40124749 39030167 38377654 37737127 37003515 36358574 35884285
4115C5884285l13294l01173l11012k97950j90272R1399N9285N4721K53922K99803
$$ 35884285 35570991 35269818 34958806 34660856 34470584 34561983 34621268 34675989 34929911 35229714
4105C5229714L67953K21809m37301r83911j121107j272472j042693o70464o54434
$$ 35229714 35597667 35819476 35382175 34398264 33277157 32004685 30961992 30291528 29637094
4096B9637094m25421l67989k78597j30387l2555q1105q0118q8020r0325l8784
$$ 29637094 29211673 28843684 28565087 28434700 28402145 28321040 28240922 28152902 28062577 28023793
4086B8023793o0357j24239k43236j66960m1365p1797k6040j05237q7587o3096
$$ 28023793 27963436 27839197 27595961 27429001 27387636 27315839 27289799 27184562 27096975 27033879
4076B7033879n4568m152o4155O5271O5046J73318L56442P1102M8214P9322J58267
$$ 27033879 26979311 26975159 26911004 26976275 27041321 27214639 27571081 27642183 27690397 27769719 27927986
4065B7927986Q236j7395k2136K1612J66094J37399K28191L58372J67372K54709
$$ 27927986 27936222 27918827 27896691 27918303 28084397 28221796 28449987 28808359 28975731 29230440
4055B9230440K21096J8834m9402l8926k8485Q0672J74888M9924J37192L20686
$$ 29230440 29451536 29470370 29420968 29382042 29353557 29434229 29609117 29659041 29796233 30116919
4045C0116919K95143K77516L71122L68642J34502J35925r1567j53032K6671j12447
$$ 30116919 30412062 30689578 31060700 31429342 31563844 31699769 31608202 31455170 31481841 31369394
4035C1369394j33810k04257j47148j44698r0414n8679Q6040l9665j08289j12256
$$ 31369394 31235584 31031327 30884179 30739481 30649067 30590388 30676428 30636763 30528474 30416218
4025C0416218l42053m70268n86824n68971n22611m80632m80098m60154l97654
$$ 30416218 30074165 29603897 29017073 28448102 27925491 27444859 26964761 26504607 26106953
4016B6106953m13608m28873l43840l26392l40296m25379o08519p12177o04893
$$ 26106953 25693345 25264472 24920632 24594240 24253944 23828565 23220046 22507869 21902976
4007B1902976m81822n08711k99744l77853l36380j76823p6881k00056m3153M603
$$ 21902976 21421154 20912443 20612699 20234846 19898466 19721643 19644762 19444706 19401553 19406156
3997A9406156k58950l46010k74789k73438k29565m5991l25159j86168j15830L4259
$$ 19406156 19147206 18801196 18526407 18252969 18023404 17977413 17652254 17466086 17350256 17384515
3987A7384515j30572k51336l9374k17039m7294j50865k29181o8478P6380p4340
$$ 17384515 17253943 17002607 16963233 16746194 16698900 16548035 16318854 16250376 16326756 16252416
3977A6252416k5179p9249j25859j63099k51711m9483j46380J7752j07399Q8369
$$ 16252416 16227237 16147988 16022129 15859030 15607319 15557836 15411456 15429208 15321809 15410178
3967A5410178l2482o1516l2395o5669J2442J32092N3920K9266R6885j39271K4285
$$ 15410178 15377696 15316180 15283785 15218116 15230558 15362650 15416570 15445836 15542721 15403450 15427735
3956A5427735Q3147P8415N5102J25719R0220J71648J05931j6029j47102l8689
$$ 15427735 15510882 15589297 15644399 15770118 15860338 16031986 16137917 16121888 15974786 15936097
3946A5936097K43645k8907n5981k4929K3305L8235N856n09Q6739M3413J11324
$$ 15936097 16179742 16150835 16094854 16069925 16093230 16131465 16137321 16136812 16223551 16266964 16378288
3935A6378288m5595l2055N0648J12274K18028J63636J28364J43917J94103K76342
$$ 16378288 16332693 16300638 16351286 16463560 16681588 16845224 16973588 17117505 17311608 17587950
3925A7587950M66283M69738P36753N17233L36179j7053k14694p7827k61112l35098
$$ 17587950 18054233 18523971 19260724 19777957 20114136 20097083 19882389 19804562 19543450 19208352
3915A9208352n5742Q1104J42490o2028j11052l9961k15326l48879l96530l91604
$$ 19208352 19152610 19233714 19376204 19314176 19203124 19163163 18947837 18598958 18202428 17810824
3905A7810824l32914l14572k32523n3026k37454n8203p198j48754j92586j01522
$$ 17810824 17477910 17163338 16930815 16877789 16640335 16582132 16574934 16426180 16233594 16132072
3895A6132072J2541P407J7717k24374p8498j88459j20592k62323K5917M3094Q463
$$ 16132072 16144613 16152020 16169737 15945363 15866865 15678406 15557814 15295491 15321408 15364502 15372965
3884A5372965J38915O8359J1514J13357J14866O5088P5204K57Q3808R6484l1674
$$ 15372965 15511880 15580239 15591753 15705110 15819976 15885064 15960268 15960525 16044333 16140817 16109143
3873A6109143j70543M9819J06525k2712O8330K46748J78746N7647K31964L98514
$$ 16109143 15938600 15988419 16094944 16072232 16140562 16387310 16566056 16623703 16855667 17254181
3863A7254181J64883J08279P2819J49785J55146K68731K88131K15201K40391M73266
$$ 17254181 17419064 17527343 17600162 17749947 17905093 18173824 18461955 18677156 18917547 19390813
3853A9390813M38674M81513M40500M54784N68634O80412N96520P86153Q34027
$$ 19390813 19829487 20311000 20751500 21206284 21774918 22455330 23051850 23838003 24672030
3844B4672030P32701O10315L84599L75669L68818N9812j84446m21670m72797n54345
$$ 24672030 25404731 26015046 26399645 26775314 27144132 27203944 27019498 26597828 26125031 25570686
3834B5570686o92317q94817p98677p76730q20205n25067n84576m99938n22333
$$ 25570686 24878369 23983552 23184875 22408145 21587940 21062873 20478297 19978359 19456026
3825A9456026k91035m14866j94029l01957j94398j49459p7590l291r2383R780
$$ 19456026 19164991 18750125 18556096 18254139 18059741 17910282 17832692 17829401 17737018 17746798
3815A7746798N0717k7764L8578o591O6212m9422n2130L3134J22763J22822N7849
$$ 17746798 17797515 17769751 17808329 17801738 17867950 17818528 17766398 17799532 17922295 18045117 18102966
3804A8102966J89152J03389L09695J32599L5331K9724K37021K51789J27359j74
$$ 18102966 18292118 18395507 18705202 18837801 18873132 18902856 19139877 19391666 19519025 19518851
3794A9518851J29561K10420K56736K37869K28179J67506P5005J29157K22758K74820
$$ 19518851 19648412 19858832 20115568 20353437 20581616 20749122 20824127 20953284 21176042 21450862
3784B1450862K68185Q0167Q780P7753J60413K35057K42181L2850j28691j16270
$$ 21450862 21719047 21799214 21807994 21885747 22046160 22281217 22523398 22556248 22427557 22311287
3774B2311287n9108k9607p9599j0919R4799k103J33547k9161l9335O2761o3497
$$ 22311287 22252179 22222572 22142973 22132054 22226853 22224750 22358297 22329136 22289801 22352562 22289065
3763B2289065l3327Q9510J4626l5530O6795m9240M5639L2550O1620J57735n6318
$$ 22289065 22255738 22345248 22359874 22324344 22391139 22341899 22387538 22420088 22481708 22639443 22583125
3752B2583125J33011J78691P7215L051J45450R0191r6494M7854J17739J8389j16322
$$ 22583125 22716136 22894827 22972042 22975093 23120543 23210734 23114240 23162094 23279833 23298222 23181900
3741B3181900J38952J66900o938J06282P4168l9159J9647l7499J4736m6943p3820
$$ 23181900 23320852 23487752 23480814 23587096 23661264 23622105 23641752 23604253 23618989 23572046 23498226
3730B3498226R5544j54101Q9400K34717Q5739K13891Q0513R9972R6240O4121L7347
$$ 23498226 23593770 23439669 23529069 23763786 23849525 24063416 24143929 24243901 24340141 24404262 24441609
3719B4441609J67779K02515J30108J76752J53750J05277K8209J64738K13730P5311
$$ 24441609 24609388 24811903 24942011 25118763 25272513 25377790 25405999 25570737 25784467 25859778
3709B5859778J79242K14430K24203K44577M13020K82988K94134K52558L55842
$$ 25859778 26039020 26253450 26477653 26722230 27135250 27418238 27712372 27964930 28320772
3700B8320772M97572L55806M35800N28782L98963L54934L24643M58362K28779
$$ 28320772 28818344 29174150 29609950 30138732 30537695 30892629 31217272 31675634 31904413
3691C1904413K6881P1602N8651J13960J30655K10319j7883J62705K70659R0636
$$ 31904413 31931294 32002896 32061547 32175507 32306162 32516481 32498598 32661303 32931962 33022598
3681C3022598L58284L13887K92808P2578j28566l28425k13929j97243k31500m13357
$$ 33022598 33380882 33694769 33987577 34060155 33931589 33603164 33389235 33191992 32960492 32547135
3671C2547135l58819k22206k20682j45500j47336n7711p7188l58023k35360j08478
$$ 32547135 32188316 31966110 31745428 31599928 31452592 31394881 31317693 30959670 30724310 30615832
3661C0615832j87171l46342j85238K3107q3616l7592k1497n1858Q7378J75216
$$ 30615832 30428661 30082319 29897081 29920188 29836572 29798980 29777483 29725625 29813003 29988219
3651B9988219J49535L93261J84490J90989K49571K66460P1014q3214j18681j19501
$$ 29988219 30137754 30531015 30715505 30906494 31156065 31422525 31493539 31410325 31291644 31172143
3641C1172143j31193m0318k7846P7916J09684J16550Q638q3514L7761L4814R060
$$ 31172143 31040950 31000632 30972786 31050702 31160386 31276936 31285574 31202060 31239821 31274635 31283695
3630C1283695K3354O5496K0453P8422J44805J73074K03784J98552K43814J97766
$$ 31283695 31307049 31372545 31392998 31471420 31616225 31789299 31993083 32191635 32435449 32633215
3620C2633215L58746K35844K77642M94399L88493M00187M76327L35167K34023
$$ 32633215 32991961 33227805 33505447 33999846 34388339 34788526 35264853 35600020 35834043
3611C5834043J46945Q5685O9933O4983j03310j76918M0139k24584j85014n1264
$$ 35834043 35980988 36066673 36136606 36201589 36098279 35921361 35961500 35736916 35551902 35500638
3601C5500638j67047O1267J13717n3251J19697J32898j42193j28147q9192l9755
$$ 35500638 35333591 35394858 35508575 35455324 35575021 35707919 35565726 35437579 35348387 35308632
3591C5308632J26792q8855M6584K98856L04182J83913J45910L60574Q9210J03241
$$ 35308632 35435424 35346569 35393153 35692009 35996191 36180104 36326014 36686588 36775798 36879039
3581C6879039L2093Q4147J34242J04219J56232K16498K61277J57249n0983r8596
$$ 36879039 36911132 36995279 37129521 37233740 37389972 37606470 37867747 38024996 37974013 37875417
3571C7875417q5162J79003n676m24n8030k69430k01041p6764o8048j65191l97471
$$ 37875417 37790255 37969258 37963582 37963158 37905128 37635698 37434657 37357893 37289845 37124654 36727183
3560C6727183k02721l21876m22848j71574j99560j5816p3002q7308K2276P2878
$$ 36727183 36524462 36202586 35779738 35608164 35408604 35392788 35319786 35232478 35254754 35327632
3550C5327632K17517L18684L52286M11348M77919M95512M80303L85342M09722
$$ 35327632 35545149 35863833 36216119 36627467 37105386 37600898 38081201 38466543 38876265
3541C8876265M70903M61385N35913L86178P80202O61848P37838P62963J028737
$$ 38876265 39347168 39808553 40344466 40730644 41510846 42172694 42910532 43673495 44702232
3532D4702232R25172Q88762Q24801Q23905N59061L50943J60414K16356J66855
$$ 44702232 45627404 46516166 47340967 48164872 48723933 49074876 49235290 49451646 49618501
3523D9618501q9886K5858K37441J30630M08407M34694L40914O54029N18482M48311
$$ 49618501 49528615 49554473 49791914 49922544 50330951 50765645 51106559 51760588 52279070 52727381
3513E2727381L07982M60741M5845L68929L06508L38084j48334k6400K52965J30022
$$ 52727381 53035363 53496104 53541949 53910878 54217386 54555470 54407136 54380736 54633701 54763723
3503E4763723J79057J87597L81984K76081L86678M44358K50562k78722n53897
$$ 54763723 54942780 55130377 55512361 55788442 56175120 56619478 56870040 56591318 56037421
3494E6037421o73195n93150m38739k88183k66690k35386k62161j46764j70883
$$ 56037421 55364226 54771076 54332337 54044154 53777464 53542078 53279917 53133153 52962270
3485E2962270k23543k4285P4257O2590K18978J69659K17414K37631L97437M21291
$$ 52962270 52738727 52714442 52788699 52851289 53070267 53239926 53457340 53694971 54092408 54513699
3475E4513699L23320N81575O94417O45953Q59415P96371Q94311J089112O90993
$$ 54513699 54837019 55418594 56113011 56758964 57618379 58414750 59309061 60398173 61089166
3466F1089166Q40672P45542P14899M43942L12643M41055K07460J39747J22617
$$ 61089166 61929838 62675380 63390279 63834221 64146864 64587919 64795379 64935126 65057743
3457F5057743L1901k28065n0481M8182P2349n234P1795L26149K57717K35019N44402
$$ 65057743 65089644 64861579 64811098 64859280 64931629 64926395 64998190 65324339 65582056 65817075 66361477
3446F6361477N93834N01087O49945M96735O17893Q50657J107136J525256K148231
$$ 66361477 66955311 67456398 68106343 68603078 69220971 70071628 71178764 72704020 74852251
3437G4852251K735890K646662J249527j282895k986083k976008k118386j695640
$$ 74852251 77588141 80234803 81484330 80201435 77215352 74239344 72120958 70425318
3429G0425318j288012q06806m59642l20232N1794L00061K11198M27277N94069
$$ 70425318 69137306 68330500 67870858 67550626 67602420 67902481 68113679 68540956 69135025
3420F9135025O35874P22837Q47401R48345J408089J807660K165924K459034K806338
$$ 69135025 69770899 70493736 71341137 72289482 73697571 75505231 77671155 80130189 82936527
3411H2936527L097762L651628M682445N989549P734275J0008473J2940707J4039909
$$ 82936527 86034289 89685917 94368362 100357911 108092186 118100659 131041366 145081275
3403A45081275J1447060M162778m962214j1274637j3497501j1940666q972464
$$ 145081275 156528335 160691113 155728899 144454262 130956761 119016095 110043631
3396A10043631o295855m226432l112898k205919j503043j187222q32696m61568
$$ 110043631 103747776 99521344 96408446 94202527 92699484 91512262 90679566 90217998
3388I0217998n1430Q9391L41372K51508N12152O78447N25884M73305L83920L79428
$$ 90217998 90166568 90255959 90597331 90848839 91360991 92039438 92565322 93038627 93422547 93801975
3378I3801975P64297J101901J608128K168638K682779L493687L193491J793917
$$ 93801975 94566272 95668173 97276301 99444939 102127718 105621405 108814896 110608813
3370A10608813o49399k464153k620687k149486j756972j196945p20150n89917
$$ 110608813 109959414 107495261 104874574 102725088 100968116 99771171 99051021 98461104
3362I8461104k87653J15592L19003P50418R13648J168895J089718Q46091O23672
$$ 98461104 98173451 98289043 98608046 99358464 100272112 101441007 102530725 103376816 104000488
3353A04000488J97637P9575J63849O02496N53937Q49336J090696J216810J182578
$$ 104000488 104198125 104277700 104441549 105044045 105597982 106447318 107538014 108754824 109937402
3344A09937402J063312R55626J062624J227321J490591J669699J715142J934762
$$ 109937402 111000714 111956340 113018964 114246285 115736876 117406575 119121717 121056479
3336A21056479J659889J269613Q19327K83805k95739r27897j453839j824393j925863
$$ 121056479 122716368 123985981 124805308 125089113 124793374 123865477 122411638 120587245 118661382
3327A18661382k045082j920852j645002j182149r43835q89116o91119o69038o03729
$$ 118661382 116616300 114695448 113050446 111868297 110924462 110035346 109344227 108675189 108071460
3318A08071460k94501r6615J86875N99120N13200J98457n1390m42824p09427m07214
$$ 108071460 107776959 107680344 107867219 108466339 108979539 109177996 109126606 108683782 107974355 107567141
3308A07567141k63631j66188K78698L73668N26878J043579R54632P58331Q95964
$$ 107567141 107303510 107137322 107416020 107789688 108316566 109360145 110314777 111073108 111969072
3299A11969072Q73912J108975R84770J259785J505519J698299J970840J948256
$$ 111969072 112842984 113951959 114936729 116196514 117702033 119400332 121371172 123319428
3291A23319428K458723K356607K099004K215707K053571K035425J948967J776280
$$ 123319428 125778151 128134758 130233762 132449469 134503040 136538465 138487432 140263712
3283A40263712J746342J755955J638850J508730J745225J755442K392556K598774
$$ 140263712 142010054 143766009 145404859 146913589 148658814 150414256 152806812 155405586
3275A55405586K599127K747106K950776L128373L376719L762322M096151M536271
$$ 155405586 158004713 160751819 163702595 166830968 170207687 173970009 178066160 182602431
3267A82602431M874197M848257M797214M881408N104989N326921N593990N364503
$$ 182602431 187476628 192324885 197122099 202003507 207108496 212435417 218029407 223393910
3259B23393910M873973M286520L668090L225493K553146K055547J481069J439723
$$ 223393910 228267883 232554403 236222493 239447986 242001132 244056679 245537748 246977471
3251B46977471J707256K415416L194503M246668M796067N101195N136510M732407
$$ 246977471 248684727 251100143 254294646 258541314 263337381 268438576 273575086 278307493
3243B78307493M002038K606984L18761k805907o451548j0222643j3315284j5306537
$$ 278307493 282309531 284916515 285235276 282429369 275977821 265755178 252439894 237133357
3235B37133357j4900999j3411839j1897626j0145950q741736p515375o515144
$$ 237133357 222232358 208820519 196922893 186776943 178035207 170519832 164004688
3228A64004688n331254m599602l949263l418788l405869l316626l116945l260679
$$ 164004688 158673434 154073832 150124569 146705781 143299912 139983286 136866341 133605662
3220A33605662l298752k882238k709234k283696j915827j596224j621080j264786
$$ 133605662 130306910 127424672 124715438 122431742 120515915 118919691 117298611 116033825
3212A16033825j398941j443598j515327j458379j551014j588357j454012j518207
$$ 116033825 114634884 113191286 111675959 110217580 108666566 107078209 105624197 104105990
3204A04105990j341384j344296j219401r23147q88349p65053p63619n89504k09138
$$ 104105990 102764606 101420310 100200909 99277762 98389413 97624360 96860741 96271237 96062099
3195I6062099n5929m26812q46779j332062j478183j405996j341047j307710j463791
$$ 96062099 96006170 95579358 94732579 93400517 91922334 90516338 89175291 87867581 86403790
3186H6403790j380413j323491j115717j269293j170892j040801j053908j211803
$$ 86403790 85023377 83699886 82584169 81314876 80143984 79103183 78049275 76837472
3178G6837472j032127r96372q06208n46327p05694p49645o45275o44675n61575
$$ 76837472 75805345 74808973 74002765 73456438 72750744 72001099 71355824 70711149 70149574
3169G0149574o88086p54054n52255m10980l39573j03477j69286m73190n62536
$$ 70149574 69461488 68707434 68155179 67744199 67404626 67301149 67131863 66658673 66096137
3160F6096137p91414p41090p86078p76128o36965q26530r09439o68378o57154
$$ 66096137 65304723 64563633 63777555 63001427 62364462 61537932 60628493 59960115 59302961
3151E9302961p17165m91271n26876n28130j99705j58452j69581l27539k31306
$$ 59302961 58585796 58094525 57567649 57039519 56839814 56681362 56511781 56184242 55952936
3142E5952936j53074j50352L5412k07183j18102q0994k39393k14571k47542j20136
$$ 55952936 55799862 55649510 55684922 55477739 55359637 55278643 55039250 54824679 54577137 54457001
3132E4457001K8439k90444j37665k8873k37577m56021l84950l25081k43867k53478
$$ 54457001 54485440 54194996 54057331 54028458 53790881 53334860 52949910 52624829 52380962 52127484
3122E2127484k27325k42076j98871j75678N4637J77255J38706L84048M67881N58720
$$ 52127484 51900159 51658083 51459212 51283534 51338171 51515426 51654132 52038180 52506061 53064781
3112E3064781P22238Q44410R13250R36788R22023J093750Q87707N92214P59231
$$ 53064781 53787019 54631429 55544679 56481467 57403490 58497240 59384947 59977161 60736392
3103F0736392N04546L59523K66879j17631k34341l50676o06084q92102j107855
$$ 60736392 61240938 61600461 61867340 61749709 61515368 61164692 60558608 59666506 58558651
3094E8558651j140049j022976r07635j018299p49663o72368n52301k92241k79690
$$ 58558651 57418602 56395626 55487991 54469692 53720029 53047661 52495360 52203119 51923429
3085E1923429j16345N5528q6635J62161j0572l80918m12201m77818n47867j031853
$$ 51923429 51807084 51862612 51775977 51938138 51927566 51546648 51134447 50656629 50108762 49076909
3075D9076909r35740j112121j194936j149660j065333j102494j113571r61767
$$ 49076909 48141169 47029048 45834112 44684452 43619119 42516625 41403054 40441287
3067D0441287p94944q28783p53025o54037m77373n09671l97352k63011k46683
$$ 40441287 39646343 38817560 38064535 37410498 36933125 36423454 36026102 35763091 35516408
3058C5516408j53299p3097m2325k48425j15767o8784k20675j34662J57569K184
$$ 35516408 35363109 35290012 35247687 34999262 34883495 34814711 34594036 34459374 34616943 34619127
3048C4619127n6340q260o1280j44014j038J9950J9456J01666L3159N6484M9452
$$ 34619127 34562787 34554527 34493247 34349233 34348195 34368145 34387601 34489267 34522426 34578910 34628362
3037C4628362J50343K67217K84016K47815L64991M21899N10298N22903M79041
$$ 34628362 34778705 35045922 35329938 35577753 35942744 36364643 36874941 37397844 37876885
3028C7876885N02081M75877M63679N48832L98919M83508M51038L90660M12628
$$ 37876885 38378966 38854843 39318522 39867354 40266273 40749781 41200819 41591479 42004107
3019D2004107N19401M95964O69412Q22301Q10153R11075J168623J392400J316954
$$ 42004107 42523508 43019472 43688884 44511185 45321338 46232413 47401036 48793436 50110390
3010E0110390J552546J789220J854004J950293J982492K119734K244321K242379
$$ 50110390 51662936 53452156 55306160 57256453 59238945 61358679 63603000 65845379
3002F5845379J964382J785090J466393J190527Q81389L05749J3552J03641j69455
$$ 65845379 67809761 69594851 71061244 72251771 73133160 73438909 73452461 73556102 73386647
2993G3386647j47034J87293J03627n7026l3015m83519n86287l51546k45619Q6917
$$ 73386647 73239613 73426906 73530533 73473507 73440492 72956973 72370686 72019140 71773521 71860438
2983G1860438M95051J116142J387887J942859K280758K732545L151202L437354
$$ 71860438 72355489 73471631 74859518 76802377 79083135 81815680 84966882 88404236
2975H8404236L656459L946401M366277M265365M128522L840472L516933L598193
$$ 88404236 92060695 96007096 100373373 104638738 108767260 112607732 116124665 119722858
2967A19722858L981154M340402L834899L181068K765350J987948L75890j570185
$$ 119722858 123704012 128044414 131879313 135060381 137825731 139813679 140189569 138619384
2959A38619384k332990j459588J60363Q80932R91138J114732Q75837o420j352126
$$ 138619384 136286394 134826806 134987169 135868101 136859239 137973971 138849808 138843388 137491262
2950A37491262k212246j784348q06345P6588J330281K515871L797842N150563
$$ 137491262 135279016 133494668 132688323 132764911 134095192 136611063 140408905 145559468
2942A45559468O450981O927312O246581L360356p27864l651513m532338l677910
$$ 145559468 152010449 158937761 165184342 168544698 167816834 164165321 159632983 155955073
2934A55955073k224659n97320P91247J940685K341512K545135K284718J781774
$$ 155955073 153730414 153133094 153924341 155865026 158206538 160751673 163036391 164818165
2926A64818165J230107Q06878O81119N08968J078844J462145J255038O57572n05159
$$ 164818165 166048272 166855150 167536269 168045237 169124081 170586226 171841264 172498836 171993677
2917A71993677k019191k985011k967903k518852j428821p9241J178625K728092
$$ 171993677 169974486 166989475 164021572 161502720 160073899 159994658 161173283 163901375
2909A63901375L929549N296345N761012M131336N53501l111030n013669m794370
$$ 163901375 167830924 173127269 178888281 183019617 183573118 180462088 175448419 170654049
2901A70654049l783926l158361k958684k608410k437338k112240j736713j331835
$$ 170654049 166870123 163711762 160753078 158144668 155707330 153595090 151858377 150526542
2893A50526542p89231j74829L93034O21472J338387K140893K605933K843121K964643
$$ 150526542 149737311 149562482 149955516 150576988 151915375 154056268 156662201 159505322 162469965
2884A62469965K892562L292019L485607K758553J443430M88158M89935J365468
$$ 162469965 165362527 168654546 172140153 174898706 176342136 176830294 177320229 178685697
2876A78685697J726346J049163j55867j664768k410342k560967j943088r62601
$$ 178685697 180412043 181461206 181305339 179640571 177230229 174669262 172726174 171763573
2868A71763573J4892O75199J263966J889012K707134M103732N787094P604926
$$ 171763573 171778465 172453664 173717630 175606642 178313776 182417508 188204602 195809528
2860A95809528R153774J0244376Q828678L495119n451724j3562453j6894658j5970851
$$ 195809528 204963302 215207678 224036356 227531475 222079751 208517298 191622640 175651789
2852A75651789j3227299j0368827q192299o413553n401470m988024n287205n947579
$$ 175651789 162424490 152055663 143863364 137449811 132048341 127060317 121773112 115825533
2844A15825533n955592n694575n100400m388618l635623l341804l412766l923224
$$ 115825533 109869941 104175366 99074966 94686348 91050725 87708921 84296155 80372931
2836H0372931l999893l610893l051440k431882k312431j987664j777712j761873
$$ 80372931 76373038 72762145 69710705 67278823 64966392 62978728 61201016 59439143
2828E9439143j774137j760549j584715j573614j551019j550114j441819j593805
$$ 59439143 57665006 55904457 54319742 52746128 51195109 49644995 48203176 46609371
2820D6609371j433736j320821j291733j322556j089633j026429r22032j029410
$$ 46609371 45175635 43854814 42563081 41240525 40150892 39124463 38202431 37173021
2812C7173021p70279n63037q92128o08007n61679m96165l97718m36064l19423
$$ 37173021 36402742 35839705 34947577 34339570 33777891 33281726 32884008 32447944 32128521
2803C2128521k82105l83827k34412k54509m68057n33531p50229q99879q28501
$$ 32128521 31846416 31462589 31228177 30973668 30505611 29972080 29221851 28321972 27493471
2794B7493471q30392n89909q19554m29716n62203n35438m67072n97480l48941
$$ 27493471 26663079 26073170 25253616 24823900 24261697 23726259 23259187 22661707 22312766
2785B2312766k92852m36644l49053k81210l82069l42590k85369l14289m06594
$$ 22312766 22019914 21583270 21234217 20953007 20570938 20228348 19942979 19628690 19222096
2776A9222096m29731k76895m46678j78681k07986l42823l96435k73884r7764j86291
$$ 19222096 18792365 18515470 18068792 17890111 17682125 17339302 16942867 16668983 16571219 16384928
2766A6384928k28885j58968j39183k46267j37583n1334j71815k03334k26052j72936
$$ 16384928 16156043 15997075 15857892 15611625 15474042 15422708 15250893 15047559 14821507 14648571
2756A4648571k31933j67372j23676j37216j25899k01866j76944n5317j9544k00272
$$ 14648571 14416638 14249266 14125590 13988374 13862475 13660609 13483665 13428348 13408804 13208532
2746A3208532j18906j30512j60910k23165j97235L3729j45334q1186L4411n7880
$$ 13208532 13089626 12959114 12798204 12575039 12377804 12411533 12266199 12185013 12219424 12161544
2736A2161544j08467l4568j6273j81431k35551j22259O6982n1826m4808j3453
$$ 12161544 12053077 12018509 12002236 11820805 11585254 11462995 11529977 11478151 11433343 11419890
2726A1419890N6111j78959O6383M0331p6714K9532j21366k47925R9269q865k8235
$$ 11419890 11476001 11297042 11363425 11403756 11327042 11356574 11235208 10987283 11086552 11077687 11049452
2715A1049452o9866K6396Q059j9792j02035Q0562J00462J03163K99226J77605
$$ 11049452 10979586 11005982 11014041 10994249 10892214 10972776 11073238 11176401 11475627 11653232
2705A1653232J66384M38685M25915K19783j99353k44770l82089m13602m93804
$$ 11653232 11819616 12258301 12684216 12903999 12704646 12459876 12077787 11664185 11170381
2696A1170381l24494k88612l48739n6949j23977n2218N9580m2239p4778K0438
$$ 11170381 10845887 10557275 10208536 10151587 10027610 9975392 10034972 9992733 9917955 9938393
2686I938393n7207P9084P93K5804J5467j86314l1877J10100M7209J28426J09815
$$ 9938393 9881186 9960270 9961063 9986867 10002334 9816020 9784143 9894243 9941452 10069878 10179693
2675A0179693J0026O3019J30873k9151J43730J80764r4158J15609J45986j15107
$$ 10179693 10189719 10252738 10383611 10354460 10498190 10678954 10584796 10700405 10846391 10731284
2665A0731284K27842K64213Q1741J31109K0730K33729K60452K70815K46342L73377
$$ 10731284 10959126 11223339 11305080 11436189 11456919 11690648 11951100 12221915 12468257 12841634
2655A2841634K44479K89517L40819K27664L54164M98216M53759N26524N64841
$$ 12841634 13086113 13375630 13716449 13944113 14298277 14796493 15250252 15776776 16341617
2646A6341617L34449K71138J45059J43091P3354J57825n2695M2069p0744O6928
$$ 16341617 16676066 16947204 17092263 17235354 17308708 17466533 17413838 17455907 17385163 17452091
2636A7452091P7400N9364K79003J75251L14826L06243M28932M75389M64372N49702
$$ 17452091 17529491 17588855 17867858 18043109 18357935 18664178 19093110 19568499 20032871 20582573
2626B0582573O84239O17275P27866P35789N81118N12646L71040N12099J62625
$$ 20582573 21266812 21884087 22611953 23347742 23928860 24441506 24812546 25324645 25487270
2617B5487270J00661J29339J28355J60885L81167Q51768O29105J75115l2682l55471
$$ 25487270 25587931 25717270 25845625 26006510 26387677 27239445 27868550 28043665 28010983 27655512
2607B7655512k29174K4104J69436k1454j03293j56309k82712k4529P5406J1707
$$ 27655512 27426338 27450442 27619878 27598424 27495131 27338822 27056110 27031581 27106987 27118694
2597B7118694J61355O0003M19146L64821N40495N79283P30059P57884R26456J276418
$$ 27118694 27280049 27340052 27759198 28124019 28664514 29243797 29973856 30731740 31658196 32934614
2587C2934614J056879P30333K42751k89079p03017p00893q09475r04492r06979
$$ 32934614 33991493 34721826 34964577 34675498 33972481 33271588 32462113 31557621 30650642
2578C0650642n76396m68409k48112j47222l62932n47013p95647n90782l23639
$$ 30650642 30074246 29605837 29357725 29210503 28847571 28300558 27504911 26914129 26590490
2569B6590490k66922p128K13209r4271m61882m91710o44654n72058l66127l67610
$$ 26590490 26323568 26316440 26529649 26435378 25973496 25481786 24837132 24265074 23898947 23531337
2559B3531337q5771L818K7613J10006J91873M58413M48533N67910N47967M32023
$$ 23531337 23445566 23449384 23476997 23587003 23778876 24237289 24685822 25253732 25801699 26233722
2549B6233722j31616m87066q95162j387302j179485j137263j287972j145199j023099
$$ 26233722 26102106 25615040 24719878 23332576 22153091 21015828 19727856 18582657 17559558
2540A7559558q42798o43887n69396n74865m20590l12536j63534o049j7017J73640
$$ 17559558 16716760 16072873 15503477 14928612 14508022 14195486 14031952 14025903 14008886 14182526
2530A4182526k6696l98355m60719n43702n21193m52611l67092l90795m58266k07951
$$ 14182526 14155830 13757475 13296756 12753054 12231861 11779250 11412158 11021363 10563097 10355146
2520A0355146k80187k24283O11M8407L3276k02759q5567l5989k55566l81860l47343
$$ 10355146 10074959 9850676 9851287 9899694 9932970 9730211 9644644 9608655 9353089 8971229 8623886
2509H623886k58589n82101n58986l69854m43198l64048l53991k00759k52625k00438
$$ 8623886 8365297 7783196 7224210 6854356 6411158 6047110 5693119 5492360 5239735 5039297
2499E039297j22900n6719p2946M8082K8911j33448j23390j82311j17039q4809
$$ 5039297 4916397 4859678 4786732 4834814 4863725 4730277 4606887 4424576 4307537 4222728
2489D222728j62685p9219j46995k23295k76351j96305l7963p1580j06943n2707
$$ 4222728 4060043 3980824 3833829 3610534 3334183 3137878 3099915 3028335 2921392 2868685
2479B868685j10292o3812j93661O566R7313j08839j41619q058J1362J50081r9540
$$ 2868685 2758393 2694581 2500920 2507486 2604799 2495960 2354341 2346283 2357645 2507726 2408186
2468B408186l4662j30646j21008J5959k9871J33339p0200j65946K0564K3823j01331
$$ 2408186 2373524 2242878 2121870 2137829 2107958 2241297 2171097 2005151 2025715 2049538 1948207
2457A948207n8981R0244k381j50500M113r3087k588n6285j19641q8616l9806k5442
$$ 1948207 1889226 1979470 1977089 1826589 1830702 1737615 1735027 1678742 1559101 1470485 1430679 1405237
2445A405237J1381O2838K152r394k4330J1862O0845j05388j8915k1481l1693n9442
$$ 1405237 1416618 1479456 1481608 1472214 1447884 1459746 1520591 1415203 1396288 1374807 1343114 1283672
2433A283672R9986L7051m4825M8446K7216j33904r2004k710N293k8629L3910O3077
$$ 1283672 1383658 1420709 1375884 1424330 1451546 1317642 1225638 1222928 1228221 1199592 1233502 1296579
2421A296579m7087K7028Q216l2959n463p236Q3500j9790l0586o2800j07468k894
$$ 1296579 1249492 1276520 1284736 1251777 1246314 1239078 1322578 1302788 1272202 1209402 1101934 1099040
2409A099040j49656L7955O0999j04319M7529L4182N4871J3536K7466j17354k4147
$$ 1099040 949384 987339 1048338 944019 991548 1025730 1080601 1094137 1121603 1004249 980102
2398I80102L2131J2334K7255K927j057k4150q580j36596P1470J3737l2021N066
$$ 980102 1012233 1024567 1051822 1054749 1053692 1029542 1020962 884366 955836 969573 937552 942618
2386I42618M6227R0640r4220J1317j30204J02570J14980j2771J18333J710k74199
$$ 942618 988845 1079485 985265 996582 866378 968948 1083928 1071157 1189490 1191200 917001
2375I17001j16618P3913N862M270O0064J79093Q6840p9262P7787j05773J0439
$$ 917001 800383 874296 880158 884428 944492 1123585 1210425 1131163 1208950 1103177 1113616
2364A113616j021o3352p7803q0405J26617q08n212j72216n1582o0704J41712J0975
$$ 1113616 1112595 1049243 971440 891035 1017652 1016844 1011632 839416 787834 727130 868842 879817
2352H79817m5302p7041K7432J15166J1083J865J25764j3734o5942o438k0227k5300
$$ 879817 834515 757474 784906 900072 911155 913020 1038784 1025050 959108 952670 932443 907143
2340I07143k2279k1422l757k0227r4382m6536J39007J3129q1740J01370l530N3158
$$ 907143 884864 863442 859685 839458 745076 698540 837547 850676 768936 870306 866776 919934
2328I19934m5058q4377R8019J36790n7149j53950o9321M1403r828l536K5160j42777
$$ 919934 874876 790499 888518 1025308 968159 814209 744888 786291 776463 772927 798087 655310
2316F55310j77163N1607o10N0063J43164j4756m0689k4457j3987P7186L7128m465
$$ 655310 478147 529754 529144 579207 722371 707615 666926 642469 628482 705668 742796 738331
2304G38331o675J0952k7162M6119m8929k1668n2409R344K5985m2592N6377N6092
$$ 738331 731656 742608 715446 761565 712636 690968 638559 647903 673888 631296 687673 743765
2292G43765K4292o2201o5004j9983J46661j00499l4705J15180n3827M9536N1059
$$ 743765 768057 705856 640852 620869 767530 667031 632326 747506 693679 743215 794274
2281G94274m1651j18590q5632k0795J30715R7141o1332J44806o0462j20176K3001
$$ 794274 752623 634033 548401 527606 658321 755462 694130 838936 778474 658298 681299
2270F81299j8351O1732m5743j16601k448R1987M1583l5436p8919L7863M1260o7891
$$ 681299 662948 724680 678937 562336 559888 651875 693458 658022 579103 616966 658226 590335
2258E90335Q6086n6060r9535J6297N7105k6658J44655n2430q8222P9803m8814
$$ 590335 676421 620361 520826 537123 594228 567570 712225 659795 571573 651376 602562
2247F02562j06008J46003M5856o0671m9223m9431m9542J23756J7063j87032j02923
$$ 602562 496554 642557 688413 627742 578519 529088 479546 603302 620365 433333 330410
2236C30410J23042J79952m5349L4846r9344k1589p2705Q9795J48629m2960k7443
$$ 330410 453452 633404 588055 622901 523557 501968 429263 519058 667687 624727 597284
2225E97284o6544n2820J34795J7880j38836J8427M5078p332P2026N896m1849N3874
$$ 597284 530740 477920 612715 630595 491759 510186 555264 547932 619958 625854 584005 637879
2213F37879m9800K1149R8283L254o407J65537L6406r0382N1109P9990j63638j33610
$$ 637879 588079 609228 707511 710765 704358 869895 906301 815919 867028 947018 783380 649770
2201F49770m7841J47759J64802p9638k734L4590o552Q643m53J41264p3619O062
$$ 649770 601929 749688 914490 834852 832118 866708 860156 868799 868346 1009610 935991 942053
2189I42053M8151l2172K5546K5602J35741P8417L7473j9413j0157o0343k436O6533
$$ 942053 990204 958032 983578 1009180 1144921 1223338 1260811 1241398 1231241 1170898 1168462 1234995
2177A234995J07464m4956O5946J89474J35977n9179J27456J76615J08018j7693
$$ 1234995 1342459 1297503 1363449 1552923 1688900 1629721 1757177 1933792 2041810 2024117
2167B024117j62756q7894P1324j86003j44957r772r2143l9593j6508j3976P9019
$$ 2024117 1861361 1773467 1844791 1658788 1513831 1504059 1411916 1372323 1355815 1341839 1420858
2156A420858J64613j8763q297N2081O884J50132M0640Q2701j07995O1790O4304
$$ 1420858 1585471 1566708 1558411 1610492 1617376 1767508 1808148 1890849 1782854 1844644 1908948
2145A908948J30549J54554k7636J8679K54698N2586R0562L5908j54421K12972
$$ 1908948 2039497 2194051 2166415 2185094 2439792 2492378 2582940 2618848 2464427 2677399
2135B677399J03991N4580J20646M9143J38451J56999O7065J70160J83070J89429
$$ 2677399 2781390 2835970 2956616 3005759 3144210 3301209 3368274 3538434 3721504 3910933
2125C910933J17177M2945J57810L12735K70176K98938L56766M32310L07677L86084
$$ 3910933 4028110 4071055 4228865 4541600 4811776 5110714 5467480 5899790 6207467 6593551
2115F593551N85155L75979L25958O76866P31879Q81115Q95068J219744J629817
$$ 6593551 7178706 7554685 7880643 8557509 9289388 10170503 11065571 12285315 13915132
2106A3915132K345722K987463L760063N594827P862887P178173K412457n387745
$$ 13915132 16260854 19248317 23008380 28603207 36466094 43644267 46056724 40668979
2098D0668979r757076p602513m693080l159482k387100j928497j440117j146846
$$ 40668979 30911903 23309390 18616310 15456828 13069728 11141231 9701114 8554268
2090H554268r63334n93398l62747l16926l78013l18919m16898n70754m04019k81218
$$ 8554268 7590934 6997536 6634789 6317863 5939850 5620931 5204033 4633279 4229260 3948042
2080C948042l38946k40308j05440p0328j34095j23455k07131j87858j38912j81776
$$ 3948042 3609096 3368788 3263348 3193020 3058925 2935470 2728339 2540481 2401569 2219793
2070B219793j48404N4962j80175j19407j8453p4235j45175m0953m5806j58579
$$ 2219793 2071389 2126351 1946176 1826769 1808316 1734081 1588906 1547953 1502147 1343568
2060A343568P7216n9823q1074J9478k8083l4205k319m1920N7344P1020j17612
$$ 1343568 1420784 1360961 1279887 1299365 1271282 1237077 1234758 1192838 1250182 1321202 1203590
2049A203590j9299p5549M5888j22982j70682K5352J40139J6478o6925p0853k9637
$$ 1203590 1184291 1108742 1154630 1031648 860966 886318 1026457 1042935 976010 905157 875520
2038H75520K6727r5527j1698j47705Q7803q588l7973k0513R4811J33919l0651
$$ 875520 902247 806720 795022 647317 735120 726532 688559 668046 762857 896776 866125
2027H66125j86221r5059m5937J29345l7916l9007k82N6915L5718n4024m5889J07216
$$ 866125 679904 584845 538908 668253 630337 591330 591048 647963 683681 629657 583768 690984
2015F90984o6509j00017R0794l6435j95053J19960J06504r7077o122l0815o0987
$$ 690984 624475 524458 615252 578817 383764 503724 610228 513151 507029 476214 415227
2004D15227n3453L6383R02M8052r623o4651M7594n9395K5714j20380p2468Q6565
$$ 415227 361774 398157 399059 447111 437488 372837 420431 361036 386750 266370 193902 280467
1992B80467j20701J04679m810J20803J568q1358j17698j22015J50517J63478k1316
$$ 280467 159766 264445 259635 380438 382006 300648 182950 60935 211452 374930 353614
1981C53614N5011j43204l1838P9646O173r6521P7653O0920J11596k28068K762
$$ 353614 408625 265421 233583 313229 319402 222881 300534 361454 473050 244982 247744
1970B47744R3813L4009j982q452K0891j47426M3963p5849J00612j33N2911l2974
$$ 247744 341557 375566 373584 365132 386023 238597 282560 206711 307323 307190 360101 327127
1958C27127j20322j17304P0814P5684N8177q9764j2173J2095j4619J4691j55726
$$ 327127 206805 89501 160315 235999 294176 204412 192239 204334 189715 204406 48680
1947D8680J03333J2239J10209k9020j6087K1122j7326j21041N6550M8304j8607
$$ 48680 152013 164252 274461 245441 229354 250476 233150 112109 168659 216963 198356
1936A98356j2442R0074j09359m2080J58875j14588O9248j28177j06950N7604J9639
$$ 198356 185914 275988 166629 124549 283424 168836 238084 109907 2957 60561 80200
1925H0200M1678k2831J72730k1570j26119Q9797M935Q5126k24182j4082R2925
$$ 80200 121878 99047 271777 250207 124088 213885 218820 303946 79764 65682 158607
1914A58607q0702K0597O1625O3212q1070M7609J4098j35144r0J06740q6743J9573
$$ 158607 77905 98502 160127 223339 142269 189878 203976 68832 68742 175482 88739 108312
1902A08312J3589j6612N722M7331p3590Q2904K971j81780L5600k5397J26817o0955
$$ 108312 121901 105289 111011 158342 84752 167656 170627 -11153 24447 -950 125867 64912
1890F4912P0326J870q5368O3583m1585j05610Q4720K7162M5155k6002l3922r6827
$$ 64912 135238 137108 51740 115323 73738 -31872 52848 80010 125165 99163 65241 -31586
1878c1586J06548J00286J13135r0535j60264j9763K7680R6611J15394r0873o3672
$$ -31586 74962 175248 288383 197848 37584 17821 45501 142112 257506 166633 102961
1867A02961L4485J17861j25614o3316Q6955j38282l4888J3890k2939J2130J4186
$$ 102961 137446 255307 129693 66377 153332 15050 -19838 -5948 -28887 -16757 -2571
1856b571l9000M2580J30419L5412o4104N8833p5944j6870K1639p2659P6345m6094
$$ -2571 -41571 1009 131428 166840 102736 161569 85625 68755 90394 17735 94080 47986
1844D7986j1601J38179l8780n8624N4771O0679p3215M2892n9313K54551l689L3573
$$ 47986 36385 174564 135784 77160 131931 192610 119395 162287 102974 357525 353836 387409
1832C87409o5596m7675K8744K755J3813m724p1848q6447j59180J29750P440n1101
$$ 387409 321813 274138 302882 305637 319450 314726 242878 156431 -2749 127001 134441 83340
1820H3340m365N3666J35277r340k9231q6787j1786K0025Q2470p7475k1290m70
$$ 83340 78975 132641 267918 258578 229347 142560 130774 150799 233269 155794 134504 134034
1808A34034m7999p0534J64296J1706p1392J596P2989k9032k3464N9025j41164
$$ 134034 86035 15501 179797 191503 120111 121707 194696 165664 142200 201225 60061
1797F0061j4680M1002K320M1193l8475j9212P820N6641r6979n8912J57984j1730
$$ 60061 45381 86383 88703 129896 91421 72209 80029 136670 39691 -19221 138763 127033
1785A27033J02063K4178r8062o2721k285J59635j24555n5107j18829K12172J78801
$$ 127033 229096 253274 155212 92491 90206 249841 125286 70179 -48650 163522 342323
1774C42323j28766j8889j52989Q0259J1425q4536P4119l395Q3960k5126n4606
$$ 342323 213557 194668 41679 121938 133363 48827 122946 119551 203511 178385 123779
1763A23779K1172K5381r7927k6260K6086l3302P2452J20083m4804o6802O720j5419
$$ 123779 144951 170332 72405 46145 72231 38929 111381 231464 186660 119858 126578 111159
1751A11159j90615J5643J19357L0600P7645l0381r2482k6178k6485O7542q968
$$ 111159 -79456 -63813 55544 86144 163789 133408 40926 14748 -11737 55805 46837
1740D6837j6159N793o70q306J1960l0196R6858K3142j0247q2923J2392K3827J6583
$$ 46837 30678 36471 35801 27495 39455 9259 106117 129259 119012 36089 48481 72308 88891
1727H8891k3179o6338n9667l3133j1457O0154J28896j03573j4620k7773K36089
$$ 88891 65712 -626 -60293 -93426 -104883 -44729 84167 -19406 -34026 -61799 174290
1716A74290q8899n8568O118l8567J7690J41909r653l4030j7804K2884o9968O44
$$ 174290 85391 26823 32941 -5626 12064 153973 144320 110290 92486 115370 45402 46046
1704D6046L4940r2640Q5370N5849j30210l9481j6998K9261P352R5687n8450n3088
$$ 46046 80986 -11654 73716 129565 -645 -40126 -57124 -27863 -20511 75176 16726 -36362
1692c6362Q2062R2124m2477L4921P5868p0102j13734O479J03605m505q2687j97609
$$ -36362 45700 137824 95347 130268 206136 136034 22300 28779 132384 127879 45192 -152417
1680a52417Q2223K47308l85r510l3387l4346N7286j66036M5466J00869j96297
$$ -152417 -70194 177114 176729 167219 133832 99486 156772 -9264 36202 137071 -59226
1669e9226p7159J47642L6069j6080p7021j5294K5264m1475K3735K0060R6577J8327
$$ -59226 -136385 11257 47326 31246 -45775 -61069 -35805 -77280 -53545 -33485 63092 81419
1657H1419p1731q987N4657l7151k373Q4727K1605p9908l5242J30640l8221o3761
$$ 81419 9688 701 55358 18207 15834 100561 122166 42258 7016 137656 99435 35674
1645C5674n013J1013J36249n9610j87871o6151Q7313J47368M0794K3182o5632
$$ 35674 30661 41674 177923 118313 -69558 -135709 -48396 98972 139766 162948 97316
1634I7316l1918j30799O8673J01322n8029J7582k1358O0324l1253n9768N9852
$$ 97316 65398 -65401 3272 104594 46565 64147 42789 103113 71860 12092 71944
1623G1944O5953L5167p3269K1315j9291j957o5308M2110J0528n812n1906R105
$$ 71944 137897 173064 99795 121110 101819 99862 34554 76664 87192 81380 29474 38579
1611C8579N5322O2195j9264j83087n3341J79125K1634K1280k405k792o0635j5492
$$ 38579 93901 156096 136832 -46255 -99596 79529 101163 122443 120038 117246 56611 41119
1599D1119j41915K6735M6107k3062o3203j19780O9595N0926J09388P385l758l3687
$$ 41119 -100796 -74061 -27954 -51016 -114219 -233999 -164404 -113478 -4090 3295 -463 -34150
1587c4150M0342M2646O3391m7815o6858J11846M8821K5706l8163j88247J31129
$$ -34150 6192 48838 112229 64414 -2444 109402 158223 183929 145766 -42481 88648
1576H8648J33582m5496j57350L9306J8655n0205L1454m855m7362K5960q988j03155
$$ 88648 222230 176734 19384 58690 77345 27140 58594 53739 6377 32337 23349 -79806
1564g9806P1729k5646P5144n744l0307K6535j30196Q2647j06211L0151n9682O0704
$$ -79806 -8077 -33723 41421 35677 5370 31905 -98291 -15644 -121855 -91704 -151386 -90682
1552i0682J68766M6519j31000P052k0724p5389R3780p0085r8091R9589k2227O9916
$$ -90682 78084 124603 -6397 655 -20069 -95458 -1678 -71763 -169854 -70265 -92492 -22576
1540b2576K2486M9736J4656O221J5375l0455M2146j17947r1776P2541J31743P2046
$$ -22576 -90 49646 64302 70523 85898 55443 97589 -20358 -112134 -39593 92150 164196
1528A64196n5136j24753m3611j73027J09820M7454J09146J37800j39368k0661
$$ 164196 109060 -15693 -59304 -232331 -122511 -75057 34089 171889 32521 11860
1518A1860L0423j13027J22461J05366k7937p1379j28090j22328J24172o7701J18866
$$ 11860 42283 -70744 51717 157083 129146 57767 -70323 -192651 -68479 -136180 -17314
1507a7314l2570o0055J01956M8820n0391p3873L5218L0963o1014p0585P7871J6973
$$ -17314 -49884 -109939 -7983 40837 -9554 -83427 -48209 -17246 -78260 -148845 -70974 -54001
1495e4001J04264o3701M173K04813n5143j03683R3911j313r8233N7259J2058o3178
$$ -54001 50263 -13438 -9265 195548 140405 36722 130633 129320 31087 88346 100404 37226
1483C7226l7697L3092l7658l725L2030N6470n5574M0833N2490l2703j108q3037
$$ 37226 -471 32621 -5037 -8762 23268 79738 24164 64997 117487 84784 83676 639
1471F39P7697L4114o3420n2664O5468m3001O294j19554J7124o2535j17284l4326
$$ 639 78336 112450 49030 -3634 61834 18833 25127 -94427 -77303 -139838 -257122 -291448
1459b91448K07774J06786p6457K7464J05238p2604o1944J20188J57906o0201k8470
$$ -291448 -83674 23112 -53345 -25881 79357 6753 -55191 64997 222903 162702 134232
1448A34232p2738J2532k2539j28225N3157K2329r3390k5715J17547L0101n108
$$ 134232 61494 74026 51487 -76738 -23581 -1252 -94642 -120357 -2810 27291 22183
1437B2183m0169J01624K6053j2401m4550n8709L1924j0860n3728L8392M5149k871
$$ 22183 -17986 83638 109691 97290 52740 -5969 25955 15095 -38633 -241 44908 42037
1425D2037n2977P6077M2513k663q4763j65033J43385R5163j66919K4239J9641
$$ 42037 -10940 65137 107650 104987 20224 -144809 -1424 93739 -73180 -48941 -29300
1414b9300o3357o8272J38596Q5323j6414M476n8000N002O4742p309l4511P5564
$$ -29300 -92657 -160929 -22333 62990 46576 51052 -6948 -1946 62796 55487 20976 96540
1402I6540l314o1407N86r1293J8777R6269j34577n3521P7585k138j6943L4337
$$ 96540 93226 31819 32405 -58888 -40111 56158 -78419 -131940 -54355 -56493 -73436 -39099
1390c9099m1428J6197P2951R686J5158j04892r5614J06410J0098j710q7085N9248
$$ -39099 -80527 -64330 8621 18307 33465 -71427 -167041 -60631 -50533 -52243 -139328 -80080
1378h0080P8812n9530J29872p720K6965q064N8496k3796n2162k106K5250j55605
$$ -80080 -1268 -60798 69074 61354 88319 80255 138751 114955 62793 60687 85937 -69668
1366f9668o5413Q5999J16649l5315j91116L3699L4949P9431l8092j06293l8640
$$ -69668 -135081 -49082 67567 32252 -158864 -125165 -90216 -10785 -48877 -155170 -193810
1355a93810J41649N1728m230K3719L8370m9549j21505K4516L4063O4625J6287
$$ -193810 -52161 -433 -4663 19056 57426 7877 -113628 -89112 -55049 9576 25863
1344B5863J8003J16723K3019o8845r6595m4197M9634p090j0082J16414j4133j4705
$$ 25863 43866 160589 183608 114763 18168 -26029 23605 16515 6433 122847 108714 94009
1332I4009l4186o4852p8098n7542J53276l0934n497Q1253n0041l0118N9656j6398
$$ 94009 59823 -5029 -83127 -140669 12607 -18327 -23824 57429 7388 -22730 36926 20528
1320B0528p9827p062J35977r0119p3763L7631M6623K3021N2972j05146j09591
$$ 20528 -59299 -66361 69616 -20503 -94266 -56635 -10012 13009 65981 -39165 -148756
1309a48756l766r420J67200q2270N4996q7931J0225P0142R5757p0003Q035M8371
$$ -148756 -152522 -161942 5258 -77012 -22016 -109947 -99722 -29580 66177 -3826 4209 52580
1297E2580q5301O4470Q1553r7302q0064M3282m7565K07577K1796K7157j02254
$$ 52580 -32721 31749 113302 16000 -64064 -20782 -68347 139230 161026 188183 85929
1286H5929o4960J21371o6380j14892o652Q4031L709J48992j49929j58219L9324
$$ 85929 20969 142340 75960 -38932 -45584 38447 42156 191148 41219 -117000 -77676
1275g7676K5049m2574K1751L2563j27544N0306J8761j4447k0895J2339J59197
$$ -77676 -52627 -95201 -73450 -40887 -168431 -118125 -99364 -113811 -134706 -122367 36830
1264C6830K6073j23703L9811J03614J4701j33758k477N3805m9185J1903J80838
$$ 36830 62903 -60800 -20989 82625 97326 -36432 -38909 14896 -34289 -22386 158452
1253A58452k1377o4634N71L84l2554J3627M6827o9342m6262n325j4278j03616
$$ 158452 137075 72441 73012 73396 40842 54469 101296 31954 -14308 -19633 -33911 -137527
1241a37527Q6199J9731L9859J24443L476k25812q6075J09760n3300Q4724L0968
$$ -137527 -51328 -31597 8262 132705 136181 -89631 -175706 -65946 -119246 -34522 -3554
1230c554n9509M723j0540Q3986m1622p6506R7007o6541j4775l3501O8967m8493
$$ -3554 -63063 -58340 -68880 15106 -26516 -103022 -6015 -72556 -87331 -120832 -51865 -100358
1218a00358J21859O0812l4683K1811N9705O9095q9792j862o342J9794m0674J6212
$$ -100358 21501 82313 47630 69441 129146 198241 108449 106587 100245 120039 79365 95577
1206I5577L2861r5549j53418P4667K25488M0149l16341J0088J97357k2298p218
$$ 95577 128438 32889 -120529 -45862 179626 219775 -96566 -86478 110879 88581 81363
1195H1363r4182k7619N7923p7602J38316n2989j22036P6962o260J7726P005j17448
$$ 81363 -12819 -40438 17485 -60117 78199 25210 -96826 -19864 -26124 -8398 -1393 -118841
1183a18841N0370K0647O344O3408J09374n6061j04804R1009l8314n3220j36924
$$ -118841 -68471 -47824 -41480 21928 131302 75241 -29563 61446 23132 -30088 -167012
1172a67012Q6489Q7735n9417J6478j12174R6087L9173m2065L140J15177J7233
$$ -167012 -80523 7212 -52205 -35727 -147901 -51814 -12641 -54706 -51566 63611 80844
1161H0844O5637j11145p0314J34167m3406N1491j09882J53078n0398r2590m8053
$$ 80844 146481 35336 -34978 99189 55783 107274 -2608 150470 100072 7482 -40571
1150d0571j92482O1388J06777J10634J9178j90688j00981J59041J78244M1804
$$ -40571 -233053 -171665 -64888 45746 64924 -125764 -226745 -67704 110540 152344
1140A52344J9560r8360l3431j6367p6115k0634q710O0860M6194R3588j04455J20897
$$ 152344 171904 73544 40113 23746 -52369 -73003 -81713 -20853 25341 118929 14474 135371
1128A35371n5194j46300k2344P7247m552o431q1493M0047J89847n8916j16619
$$ 135371 80177 -66123 -88467 -11220 -15772 -22203 -103696 -63649 126198 67282 -49337
1117d9337p6476J78843r9313J7363p5213K8615N0156J09232K5660q0940K5552
$$ -49337 -125813 53030 -46283 -28920 -104133 -75518 -25362 83870 109530 28590 54142
1106E4142k775o769J3564k4375l0813J15358L7247j79594n5170N1733m302k202
$$ 54142 51367 44598 58162 33787 2974 118332 155579 -24015 -79185 -27452 -31754 -33956
1094c3956M5286N5735l413N3707j68661K4608j09672q6646K84624Q2495n6394
$$ -33956 11330 67065 63652 117359 -51302 -26694 -136366 -223012 61612 144107 87713
1083H7713n4712J6581r2105M3422n8517P1193O9860J958j85576L3274Q3922l1210
$$ 87713 33001 49582 -42523 899 -57618 13575 83435 85393 -100183 -66909 17013 -14197
1071a4197P3850J56813p3731k33545N7134O7248j13876P8389R2393k050P516n767
$$ -14197 59653 216466 142735 -90810 -33676 33572 -80304 -1915 90478 88428 95944 90177
1059I0177k05675J0407L426j0160P8196j34481O8890K6308L7741k7554p3757j04559
$$ 90177 -115498 -105091 -101665 -111825 -33629 -168110 -99220 -72912 -35171 -62725 -136482 -241041
1047b41041J07528q4973R7390R4401k756N2324O0522j51264J0390J00502m951
$$ -241041 -133513 -218486 -121096 -26695 -29451 22873 83395 -67869 -57479 43023 38072
1036C8072n1585k5027j0016q981l3685q774n2417M6769N86O6359Q5986P2721j75432
$$ 38072 -13513 -38540 -48556 -57537 -91222 -99996 -152413 -105644 -105058 -38699 47287 120008 -55424
1023e5424p0933R060K38723R3451j79679k0165p2346P6150M7918j9320j3398P5468
$$ -55424 -126357 -117297 121426 214877 35198 15033 -57313 18837 66755 47435 34037 109505
1011A09505K3709j8487j101p4662K9683j06096j32352N5919l0676N9424J53949
$$ 109505 133214 114727 113626 38964 68647 -37449 -169801 -113882 -144558 -85134 68815
1000F8815j10837p62J06003n6371j1148K7128j40289N3160J21577o7049K5952
$$ 68815 -42022 -42784 63219 6848 -4300 22828 -117461 -64301 57276 -9773 16179
989A6179j02671J25083j05971m717j18979Q6242J21733j19932J0290k04968l1854
$$ 16179 -86492 38591 -67380 -72097 -191076 -104834 16899 -103033 -92743 -297711 -329565
978c29565L16129l9241r1035P0265M9955Q2024M9556k4104k8014r6836p3828N977
$$ -329565 -13436 -52677 -143712 -73447 -23492 58532 108088 83984 55970 -40866 -114694 -108717
966a08717R2363o090K982n5000n5684N6837p514J31996j508q5038k5832J30762
$$ -108717 -16354 -22444 -19462 -74462 -130146 -73309 -80823 51173 49665 -35373 -61205 69557
954F9557j9485k17805q39N7162K20730m9783k19525J8650J28473M6402N4760o6036
$$ 69557 50072 -167733 -168572 -111410 109320 59537 -159988 -141338 -12865 33537 88297 22261
942B2261j76391P9263p2373J71336j2809j94342R7819K1647n208k6611Q8050N9921
$$ 22261 -154130 -74867 -147240 24096 11287 -183055 -85236 -63589 -68797 -95408 -7358 52563
930E2563j6816k9007n389j3015N8035J2414r2329o2192L579Q8092P830K4232r9505
$$ 52563 35747 6740 1351 -11664 46371 58785 -33544 -95736 -92157 -4065 3765 27997 -71508
917g1508K4998o0991m946Q3758j0161n8668O1926J67280j16902p1517N9938N1714
$$ -71508 -46510 -107501 -112447 -28689 -38850 -97518 -35592 131688 14786 -56731 3207 54921
905E4921j3054m0873k3507K4078l2896l2616L8323M1123J660l3492j43879o5016
$$ 54921 41867 994 -22513 1565 -31331 -63947 -25624 15499 17159 -16333 -160212 -225228
893b25228J08268M7002j03150P5561J5010L8656k2510L8426j8803l9267K326R4263
$$ -225228 -116960 -69958 -173108 -97547 -82537 -43881 -66391 -27965 -46768 -86035 -83709 10554
881A0554J5618k9910L6824O654l5065m3056m6069O4657P4478J39195l1790j46309
$$ 10554 26172 -3738 33086 39740 4675 -38381 -84450 -19793 54685 193880 162090 15781
869A5781k1773j675J6322l4919J04804P1789R1647r3830n3070L0202r6251j19357
$$ 15781 -5992 -7667 8655 -26264 78540 150329 241976 148146 95076 125278 29027 -90330
857i0330J07574n1893J42898m8542o9300r7167l4284M3534J06247K0777O261q7003
$$ -90330 17244 -34649 108249 59707 -9593 -106760 -141044 -97510 8737 29514 35775 -51228
845e1228j08437J42828R0352q0741p2717l8052O419M029J20728r3954L4146L6509
$$ -51228 -159665 -16837 73515 -7226 -79943 -117995 -111576 -107547 13181 -80773 -46627 -10118
833a0118n0632M6742J59473J731j52550m6250p8548J27685L6229j08899L502M7124
$$ -10118 -60750 -14008 145465 147196 -5354 -51604 -130152 -2467 33762 -75137 -71635 -24511
821b4511j3173N0850J0120K3505j2393j03840J6212O7968m7817j06746l2108r778
$$ -24511 -37684 13166 23286 46791 34398 -69442 -53230 14738 -33079 -139825 -171933 -181711
809a81711o1910J30658M7096r342M5434o8682K9494J12006L5039q018L7262o6473
$$ -181711 -243621 -112963 -65867 -75209 -29775 -98457 -68963 43043 78082 70064 107326 40853
797D0853k9188J2942k5660K1623K8068J3835j3007J24856j72858j27178R534r3382
$$ 40853 11665 24607 -1053 20570 48638 62473 49466 174322 1464 -125714 -116180 -209562
785b09562P3071J59446k8355k221m3377J8508j03032R6746p704j8649k7133j92583
$$ -209562 -136491 22955 -5400 -7621 -50998 -32490 -135522 -38776 -46480 -65129 -92262 -284845
773b84845l465J63754J62492J55339j69851o1841J3230J02994j00591k8623J0520
$$ -284845 -288310 -124556 37936 193275 23424 -38417 -25187 77807 -22784 -51407 -40887
762d0887Q8975p888j21102J7079K5969J5107J1099R190j0084J4820J07297k8422
$$ -40887 48088 40200 -80902 -63823 -37854 -22747 -11648 -2458 -12542 2278 109575 81153
750H1153n6508n2774o3519M0088o4681M313K4497L746k5025P8132J0802m9858
$$ 81153 24645 -28129 -91648 -51560 -116241 -111928 -87431 -83685 -108710 -30578 -19776 -69634
738f9634P7118J01660k73621M9058k8209m717J3457J4278R4586m9536r3623n666
$$ -69634 7484 109144 -164477 -115419 -143628 -148345 -134888 -120610 -26024 -75560 -169183 -174849
726a74849j1949q655J01597O5388n7102k33114L9433L27914m4623m6116j3322
$$ -174849 -186798 -195453 -93856 -28468 -85570 -318684 -279251 48663 4040 -42076 -55398
715e5398r2017L8026N5940m9133k9476J54480J674j12357j4853r6857j5477J88652
$$ -55398 -147415 -109389 -53449 -102582 -132058 22422 24096 -88261 -103114 -199971 -215448 -26796
703b6796n9743Q0063o7215o3545P3777r964P5620j7484o0155J2765l6294P7915
$$ -26796 -86539 -6476 -73691 -137236 -63459 -73423 2197 -15287 -75442 -62677 -98971 -21056
691b1056J49709J507M0258n8464J33840j31430j21439J4531P6942j36459N3806
$$ -21056 128653 130160 170418 111954 245794 114364 -7075 7456 84398 -52061 1745
680A745J8751j03381j1072R7180j9844k1116L63N3388q4139N3524o9061M9773
$$ 1745 20496 -82885 -93957 3223 -16621 -37737 -37374 16014 -68125 -14601 -83662 -33889
668c3889M8697r3753J24160m8215j30280P4779K9254m9691J34508J8456j4203
$$ -33889 14808 -78945 45215 -3000 -133280 -58501 -29247 -78938 55570 74026 59823
657E9823j0018j6020k1492r274j51004J4015J56501J6284j59914j201K0881n7751
$$ 59823 49805 33785 12293 3019 -147985 -133970 22531 38815 -121099 -122300 -101419 -159170
645a59170m0065J04089Q2732j6868j7152m677N6875n5004l2440Q29k9320J18473
$$ -159170 -199235 -95146 -12414 -29282 -46434 -51111 5764 -49240 -81680 -80851 -110171 8302
633H302j1150q33j1416j15221K8711J57032k7938l1553p2712p5471L9463J65950
$$ 8302 -2848 -3681 -15097 -130318 -101607 55425 27487 -4066 -76778 -152249 -112786 53164
621E3164k446k6891l3418r1949p9295J07766l5690j0060o3393k1167k4662J07006
$$ 53164 50718 23827 -9591 -101540 -180835 -73069 -108759 -118819 -182212 -203379 -228041 -121035
609a21035K9376R4119O2684k4208M7927k1422r4129j2223l7264M909o6858k168
$$ -121035 -91659 2460 65144 40936 88863 67441 -26688 -38911 -76175 -71266 -138124 -140292
597a40292J76505n7420L9039k4958m0568k7919k4987o561J24163O4315M585j21948
$$ -140292 36213 -21207 17832 -7126 -47694 -75613 -100600 -107161 17002 81317 85902 -36046
585c6046j9436N192O7544R3308j06197J2609p7282J15182K0731j20581J67567
$$ -36046 -55482 -50290 17254 110562 4365 16974 -60308 54874 75605 -44976 122591
574A22591m0581n3191J80397n7780m519n2434m1958J88147q9029k38440M3702
$$ 122591 82010 28819 209216 151436 146917 94483 52525 240672 151643 -86797 -43095
563d3095Q9736j4549r2556o601P545l0906J5475L8051J14044q643l8396K354Q3571
$$ -43095 46641 32092 -60464 -67065 -59520 -90426 -74951 -36900 77144 68501 30105 32459 116030
550A16030q8288J57563r9869p5891P8074q1340k2063q8158K6142J33237j4940
$$ 116030 27742 185305 85436 9545 87619 6279 -15784 -103942 -77800 55437 40497
539D0497j24556k9842J9384K150R1433O5392M7181k2656n6050q2366N676j1468
$$ 40497 -84059 -113901 -94517 -92367 -934 64458 111639 88983 32933 -49433 -43757 -55225
527e5225k05683P1919J17587J20481m6941q9003o5819N1881M3575j17083J35201
$$ -55225 -260908 -188989 -71402 49079 2138 -86865 -152684 -100803 -57228 -174311 -39110
516c9110O1377K2941l4247j5153r9171j08295J1721q322m1079j1840m4394Q7252
$$ -39110 22267 45208 10961 -4192 -103363 -211658 -199937 -208259 -249338 -261178 -305572 -218320
504b18320J25688J76448r0699j06923j9437M9042R3215n0285L5779J02740J7035
$$ -218320 -92632 83816 -6883 -113806 -133243 -84201 9014 -41271 -5492 97248 114283
493A14283o3638m9784n2361J0823m0181N0554m8720J3486N7437r4544p9750Q167
$$ 114283 50645 861 -51500 -40677 -80858 -30304 -79024 -65538 -8101 -102645 -182395 -174228
481a74228q6570M6409J22499K3157l732p2895J80160o1794l490J0851M6310j5883
$$ -174228 -260798 -214389 -91890 -68733 -72465 -145360 34800 -26994 -30484 -19633 26677 10794
469A0794p0108J63784J05364J17079j03943j15461J4366K9877l7943o0469O7817
$$ 10794 -59314 104470 209834 326913 222970 107509 121875 151752 113809 53340 121157
458A21157j04291j07801J34796L046n5796j96383O4548J46086j02500r1172Q457
$$ 121157 16866 -90935 43861 46907 -8889 -205272 -140724 5362 -97138 -188310 -179853
447a79853N1032p6018R7108R4790K8946J00647r2326o1411L1847L0196J5242o1919
$$ -179853 -128821 -204839 -107731 -12941 16005 116652 24326 -37085 -5238 24958 40200 -21719
435b1719l5556P4472J30940k5363n7763j9301j54432j678Q8603j20424L4605m0569
$$ -21719 -57275 17197 148137 122774 65011 45710 -108722 -110400 -21797 -142221 -107616 -148185
423a48185j38027n5454L9746K42887J21736L9275k0582k41595k523M1224Q8334
$$ -148185 -286212 -341666 -301920 -59033 62703 101978 81396 -160199 -162722 -121498 -33164
412c3164l556k04273j5549Q9555J96800j89185L2164j27817K1507P8972L6559
$$ -33164 -36720 -240993 -256542 -166987 29813 -159372 -127208 -255025 -233518 -154546 -117987
401a17987N0491j7748k3378q8735k2139O2826P1211L0963K1202n9875O2122K7374
$$ -117987 -67496 -85244 -108622 -197357 -219496 -156670 -85459 -54496 -33294 -93169 -31047 -3673
389c673o9571O380j2499m3279K2091O957m2840j5497n6492L8989R1322o0708M6760
$$ -3673 -73244 -66864 -79363 -122642 -100551 -93594 -136434 -151931 -208423 -169434 -78112 -138820 -92060
376i2060L9538P7082m5807j93615K1738J02006L5191p0583j15270n560N8767p8065
$$ -92060 -52522 24560 -21247 -214862 -193124 -91118 -55927 -126510 -241780 -247340 -188573 -266638
364b66638J52605o0766q3021L2743L8376k862p031J88574j06304N4860J74139
$$ -266638 -114033 -174799 -257820 -225077 -186701 -189563 -196594 -8020 -114324 -59464 114675
353A14675K1820J3447j03236p9860l8817k7572l6966j00756Q2302R8590K2885
$$ 114675 136495 149942 46706 -33154 -71971 -99543 -136509 -237265 -154963 -56373 -33488
342c3488o0096j6757N1593o5678m7649J33173M1181j1453j43275Q5247l4636o7462
$$ -33488 -93584 -110341 -58748 -124426 -172075 -38902 2279 -9174 -152449 -67202 -101838 -169300
330a69300L2108J05572p2127j8120J6655l6066k5954r3048L9485N0386L838J2641
$$ -169300 -137192 -31620 -103747 -121867 -105212 -141278 -167232 -260280 -220795 -170409 -166571 -153930
318a53930k5483O25l4147J04491J7569K6315j36820k01874Q4454P1960J26393
$$ -153930 -179413 -178788 -212935 -108444 -90875 -64560 -201380 -403254 -318800 -246840 -120447
307a20447n2624l4744J04470L7022P338m5800l0021m3344m4406R57J30257K3521
$$ -120447 -173071 -207815 -103345 -66323 -58985 -104785 -134806 -178150 -222556 -221599 -91342 -67821
295f7821Q9749L3809j58432j2332N3840j51217M3823J24024p139m1236K245L5740
$$ -67821 21928 55737 -102695 -115027 -61187 -212404 -168581 -44557 -51696 -92932 -90687 -54947
283e4947n0202J33094r3576n8509K1168k4033m0623J17135j06807M5128p0963
$$ -54947 -105149 27945 -65631 -124140 -102972 -127005 -167628 -50493 -157300 -112172 -183135
272a83135l9128n0210Q7262K31353j2572j15387p824k3848M5737J25577j69387
$$ -183135 -222263 -272473 -185211 46142 33570 -81817 -89641 -113489 -67752 57825 -111562
261a11562o300N6034j29835m9064p4361J24103Q8777K5639j4651q8104L5528Q9364
$$ -111562 -117862 -61828 -191663 -240727 -315088 -190985 -102208 -76569 -91220 -179324 -143796 -54432
249e4432J5834J1426l2959r0919J4113O864O5282J8185J4283l8852r1073L3403
$$ -54432 -38598 -27172 -60131 -151050 -136937 -130073 -64791 -46606 -32323 -71175 -162248 -128845
237a28845J30757l8858M4480R9617j29156m8928r8649m4253o3924o7878Q0198
$$ -128845 1912 -36946 7534 107151 -22005 -70933 -169582 -213835 -277759 -345637 -265439
226b65439J9666L9739q2746O7785L4862k5932q1483l1628R0342J43973L7586L7401
$$ -265439 -245773 -206034 -288780 -220995 -186133 -212065 -293548 -325176 -234834 -90861 -53275 -15874
214a5874l3234q851j54210j109R5017n5960R7599K0224l210o7596n4691M6559
$$ -15874 -49108 -57959 -212169 -213278 -118261 -174221 -76622 -56398 -59608 -127204 -181895 -135336
202a35336j42055R2204o3719j6350P7046J45046O7403j35947n6088L0517J12331
$$ -135336 -277391 -185187 -248906 -265256 -188210 -43164 24239 -111708 -167796 -137279 -24948
191b4948K7312J1219m0755k0373j11034m9404M1894N7755M1657k1390K9460K1923
$$ -24948 2364 13583 -27172 -47545 -158579 -207983 -166089 -108334 -66677 -88067 -58607 -36684
179c6684r1485R3706K1434n6655j31591J06247L2546L5655j30693M5116R452n5281
$$ -36684 -128169 -34463 -13029 -69684 -201275 -95028 -62482 -26827 -157520 -112404 -102952 -158233
$$ [...]
##END NTUPLES=NMR SPECTRUM
##END=
