##TITLE=1H_TG-2307-G
 CDCl3
 8 sc, 
 14.6.2023
##JCAMPDX= 6.0         $$ Bruker NMR JCAMP-DX V2.0
##DATA TYPE= NMR SPECTRUM
##DATA CLASS= NTUPLES
##ORIGIN= UXNMR, Bruker Analytische Messtechnik GmbH
##OWNER= root
$$ XWIN-NMR		Version 3.5
$$ Wed Jun 14 14:09:10 2023 Russian Standard Time (UT+4h)  she@DPX200
##.OBSERVE FREQUENCY= 200.13135
##.OBSERVE NUCLEUS= ^1H
##.ACQUISITION MODE= SIMULTANEOUS
##.ACQUISITION SCHEME= undefined
##.AVERAGES= 8
##.DIGITISER RES= 18
##SPECTROMETER/DATA SYSTEM= spect
##.PULSE SEQUENCE= zg30
##.SOLVENT NAME= CDCl3
##.SHIFT REFERENCE= (INTERNAL, CDCl3, 0, 15.7392)
##AUDIT TRAIL= $$ (NUMBER, WHEN, WHO, WHERE, WHAT)
$$ ##TITLE= Audit trail, XWIN-NMR		Version 3.5
$$ ##JCAMPDX= 5.01
$$ ##ORIGIN= Bruker BioSpin GmbH
$$ ##OWNER= she
$$ F:/spectra/data/she/nmr/H-F/1/pdata/1/auditp.txt
$$ ##AUDIT TRAIL=  $$ (NUMBER, WHEN, WHO, WHERE, WHAT)
(   1,<2023-06-14 14:07:56.48 +0400>,<she>,<DPX200>,
      <created by zg, POWCHK disabled, PULCHK disabled
       configuration hash MD5:
       00 E9 B6 7A A2 85 ED C7 34 08 36 98 17 FE 4E 26
       data hash MD5: 16K
       1F C3 BF D3 7E DE 0B 12 F0 A7 BC C9 DA F8 59 1B>)
(   2,<2023-06-14 14:07:58.71 +0400>,<she>,<DPX200>,
      <Start of raw data processing
       efp BC_mod = 2 LB = 0.24 FT_mod = 6 PKNL = 1 PHC0 = -20344.1 PHC1 = 13.45272 SI = 16K 
       data hash MD5: 16K
       EE 08 DC 3A 40 76 9F F8 4E C3 35 91 40 91 6B B5>)
(   3,<2023-06-14 14:08:15.98 +0400>,<she>,<DPX200>,
      <pk PHC0 = -1.965087 PHC1 = 1.6 
       data hash MD5: 16K
       D2 36 00 3B 58 84 22 A9 02 80 6C EA F4 30 91 BF>)
(   4,<2023-06-14 14:08:20.06 +0400>,<she>,<DPX200>,
      <abs ABSG = 5 
       data hash MD5: 16K
       13 BB 78 37 95 16 7A 64 89 6F 9C C3 69 BB D4 D8>)
(   5,<2023-06-14 14:08:49.37 +0400>,<she>,<DPX200>,
      <abs ABSG = 5 
       data hash MD5: 16K
       6B 5C 7E 3E C1 D6 41 4D 29 DF EF 26 EC 38 FD FB>)
$$ ##END=
$$ 
$$ hash MD5
$$ EE 31 79 0D 82 41 6A FE 40 46 F3 0B 70 39 77 E8
##$RELAX= 
##$RELAX= 
##$RELAX= 
##$RELAX= 
##$RELAX= 
##$RELAX= 
$$ Bruker specific parameters
$$ --------------------------
##$DU= <F:/spectra>
##$EXPNO= 1
##$NAME= <H-F>
##$PROCNO= 1
##$TYPE= <nmr>
##$USER= <she>
##$AMP= (0..31)
100 100 100 100 100 100 100 100 100 100 100 100 100 100 100 100 100 100 
100 100 100 100 100 100 100 100 100 100 100 100 100 100 
##$AQSEQ= 0
##$AQ_mod= 1
##$AUNM= <au_zg>
##$AUTOPOS= <>
##$BF1= 200.13
##$BF2= 200.13
##$BF3= 200.13
##$BF4= 200.13
##$BF5= 200.13
##$BF6= 200.13
##$BF7= 200.13
##$BF8= 200.13
##$BYTORDA= 1
##$CFDGTYP= 0
##$CFRGTYP= 5
##$CHEMSTR= <none>
##$CNST= (0..31)
1 1 145 1 1 1 1 1 1 1 1 1 1 1 1 1 1 1 1 1 1 1 1 1 1 1 1 1 1 1 1 1 
##$CPDPRG= <>
##$CPDPRG1= <>
##$CPDPRG2= <>
##$CPDPRG3= <>
##$CPDPRG4= <mlev>
##$CPDPRG5= <mlev>
##$CPDPRG6= <mlev>
##$CPDPRG7= <mlev>
##$CPDPRG8= <mlev>
##$CPDPRGB= <>
##$CPDPRGT= <>
##$D= (0..31)
0 1.2 0 0 0 0 0 0 0 0.06 0 0.03 0 0 0 0 0.0002 0 0 0 0 0 0 0 0 0 0 0 0 
0 0 0 
##$DATE= 1686737275
##$DBL= (0..7)
$$ [...]
##$SUBNAM3= <"">
##$SUBNAM4= <"">
##$SUBNAM5= <"">
##$SUBNAM6= <"">
##$SUBNAM7= <"">
##$SUBNAM8= <"">
##$SUBNAM9= <"">
##$SW= 18.05172834244
##$SWIBOX= (0..15)
0 0 2 0 0 0 0 0 0 0 0 0 0 0 0 0 
##$SW_h= 3612.71676300578
##$TD= 16384
##$TD0= 1
##$TE= 0
##$TE2= 300
##$TE3= 300
##$TEG= 300
##$TL= (0..7)
0 120 120 120 120 120 120 120 
##$TP= (0..7)
150 150 150 150 150 150 150 150 
##$TP07= 0
##$TPNAME0= <>
##$TPNAME1= <>
##$TPNAME2= <>
##$TPNAME3= <>
##$TPNAME4= <>
##$TPNAME5= <>
##$TPNAME6= <>
##$TPNAME7= <>
##$TPOAL= (0..7)
0.5 0.5 0.5 0.5 0.5 0.5 0.5 0.5 
##$TPOFFS= (0..7)
0 0 0 0 0 0 0 0 
##$TUNHIN= 0
##$TUNHOUT= 0
##$TUNXOUT= 0
##$USERA1= <user>
##$USERA2= <user>
##$USERA3= <user>
##$USERA4= <user>
##$USERA5= <user>
##$V9= 5
##$VALIST= <valist>
##$VCLIST= <CCCCCCCCCCCCCCC>
##$VD= 0
##$VDLIST= <DDDDDDDDDDDDDDD>
##$VPLIST= <PPPPPPPPPPPPPPP>
##$VTLIST= <TTTTTTTTTTTTTTT>
##$WBST= 1024
##$WBSW= 4
##$XGAIN= (0..3)
0 0 0 0 
##$XL= 0
##$YL= 0
##$YMAX_a= 13177
##$YMIN_a= -9977
##$ZGOPTNS= <>
##$ZL1= 120
##$ZL2= 120
##$ZL3= 120
##$ZL4= 120
##$ABSF1= 15.73918
##$ABSF2= -2.31267
##$ABSG= 5
##$ABSL= 3
##$ALPHA= 0
##$AQORDER= 0
##$ASSFAC= 0
##$ASSFACI= 0
##$ASSFACX= 0
##$ASSWID= 0
##$AUNMP= <proc_1d>
##$AZFE= 0.1
##$AZFW= 0.1
##$BCFW= 0
##$BC_mod= 2
##$BYTORDP= 0
##$COROFFS= 0
##$CY= -3
##$DATMOD= 1
##$DC= 0
##$DFILT= <>
##$DTYPP= 0
##$F1P= 0
##$F2P= 0
##$FCOR= 1
##$FTSIZE= 16384
##$FT_mod= 6
##$GAMMA= 0
##$GB= 0
##$INTBC= 1
##$INTSCL= 3.70164e-10
##$ISEN= 128
##$LB= 0.24
##$LEV0= 0
##$LPBIN= 0
##$MAXI= 10000
##$MC2= 0
##$MEAN= 0
##$ME_mod= 0
##$MI= 1.114404
##$NCOEF= 0
##$NC_proc= -11
##$NLEV= 6
##$NOISF1= 3.799351
##$NOISF2= 2.8
##$NSP= 0
##$NTH_PI= 0
##$NZP= 0
##$OFFSET= 15.73918
##$PC= 1
##$PHC0= -20346.06
##$PHC1= 15.05272
##$PH_mod= 1
##$PKNL= yes
##$PPARMOD= 0
##$PSCAL= 0
##$PSIGN= 0
##$REVERSE= no
##$SF= 200.130006476346
##$SI= 16384
##$SIGF1= 3
##$SIGF2= 2
##$SINO= 5.538805
##$SIOLD= 16384
##$SREGLST= <1H.CDCl3>
##$SSB= 0
##$STSI= 16384
##$STSR= 0
##$SW_p= 3612.71676300578
##$SYMM= 0
##$S_DEV= 0
##$TDeff= 16384
##$TDoff= 0
##$TI= <>
##$TILT= no
##$TM1= 0
##$TM2= 0
##$TOPLEV= 0
##$USERP1= <user>
##$USERP2= <user>
##$USERP3= <user>
##$USERP4= <user>
##$USERP5= <user>
##$WDW= 1
##$XDIM= 16384
##$YMAX_p= 296683647
##$YMIN_p= -5314942
$$ End of Bruker specific parameters
$$ ---------------------------------
##NTUPLES= NMR SPECTRUM
##VAR_NAME=  FREQUENCY,     SPECTRUM/REAL,   SPECTRUM/IMAG
##SYMBOL=    X,             R,               I
##VAR_TYPE=  INDEPENDENT,   DEPENDENT,       DEPENDENT
##VAR_FORM=  AFFN,          ASDF,            ASDF
##VAR_DIM=   16384,         16384,           16384
##UNITS=     HZ,            ARBITRARY UNITS, ARBITRARY UNITS
##FACTOR=    0.220516191357247, 1,           1
##FIRST=     3149.88211752304, 0,            0
##LAST=      -462.834645482739, 0,           0
##MIN=       -462.834645482739, -5314942,    0
##MAX=       3149.88211752304, 296683647,    0
$$ Real data points
##PAGE= N=1
##DATA TABLE= (X++(R..R)), XYDATA
$$ [...]
5715F169321M4533J86829m54N1431j33676p759j20934j02500J0284q3506q647
5704F004922J50420N3750K84624q9329J22652j71712K04773r03292m09795O46468
5694E893481J45244L56556K72326R0079J41736J91407J52972M6491K73793L66920
5684G931005K29005L21556J76261m595j5005k35837j44119K8338n4549q6470K51257
5673H396847O2812K19376K79679J57777N22085L32199M89485N16607N75291M78990
5663A2031148L52176J13062k66135j62684j96788m36668m31229l3293m610p0111
5653A0894868P8402L43246L60119J15747N3082J51271L22693J95842j09949K53691
5643A2659012K38710j83865k37469l99372l78608k40734m22640j18326O4836R5656
$$ plain form
5715 6169321 6213854 6400683 6400229 6451660 6317984 6310225 6189291 6086791 6097075 6013569 6004922
5704 6004922 6155342 6209092 6493716 6404387 6527039 6355327 6560100 5656808 5247013 5893481
5694 5893481 6038725 6395281 6667607 6757686 6899422 7090829 7243801 7290292 7564085 7931005
5684 7931005 8160010 8481566 8657827 8653232 8638227 8402390 8258271 8286609 8232060 8145590 8396847
5673 8396847 8459659 8679035 8958714 9116491 9638576 9970775 10460260 10976867 11552158 12031148
5663 12031148 12383324 12496386 12230251 12067567 11870779 11434111 11002882 10969589 10964979 10894868
5653 10894868 10973270 11316516 11676635 11792382 11845464 11996735 12319428 12515270 12405321 12659012
5643 12659012 12897722 12713857 12476388 12077016 11698408 11457674 11035034 10916708 10981544 11077200
5633A1077200L29712J14451M76559L22698K38107K47901r1555m23570m76402o60423
5623A1154678m16310m19542k24175m29251m61417k34388k95615l17881O1281J97775
5613H615155K69408r3396M5966K15768N45972K37226j59809n11893m21396n66827
5603H176174m87033q14689o47861q2249l96446k05177k14075n38351K8846R5650
5593D914789M197j3768n7038N551J28273P5451n1320j68060k29393j18903m49487
5582D040292k82860j00113j71327j30634j35752j79617P836j51413m3224j95196
5572B657992J27929r1106j8880j38436o2370j4507P6124r1118r3967q1735J49489
5561B419415N0770n2791j07938m0817n6435M2602J07847j16418K0533J02670o1585
$$ plain form
5633 11077200 11406912 11521363 11997922 12320620 12558727 12806628 12715073 12291503 11815101 11154678
5623 11154678 10738368 10318826 10094651 9665400 9203983 8969595 8673980 8356099 8417380 8615155
5613 8615155 8884563 8791167 8837133 9052901 9598873 9836099 9676290 9164397 8743001 8176174
5603 8176174 7689141 6874452 6226591 6144342 5747896 5542719 5328644 4790293 4819139 4914789
5593 4914789 4918986 4905218 4848180 4853731 4982004 5057455 5006135 4838075 4608682 4489779 4040292
5582 4040292 3757432 3657319 3485992 3355358 3219606 3039989 3047825 2896412 2853188 2657992
5572 2657992 2785921 2694815 2675935 2537499 2475129 2460622 2536746 2445628 2351661 2269926 2419415
5561 2419415 2470185 2417394 2309456 2268639 2212204 2254806 2362653 2246235 2266768 2369438 2307853
5550B307853k3851P0057j86002J79728K61304k63846l8385J46427j35234J9518
5540B337569L06145P6280j38449o5704J52334j14804j56458r8665j90497j29049
5530A978702O3632Q9059k45053K2454K24043o3075j44234M68J11520M5879K25506
5519B308901J80607j23568r2276M4855L741q5116j59698j9566N0939J65783q9906
5508B184696J50011n1141j74932r8220q4736L6214O0478J82374J45719p2370O0482
5497B338575j02047o9644K09699m9369N8228r9112N5114j77168j61183N392K49663
5486B258148j08505j58061Q1127M0289j93955n3569o4164O052J64830J22911J24958
5475B220061M3153Q5905p9649J63777M1078K78791O5763J05391P7913k51235j02045
$$ plain form
5550 2307853 2284002 2354059 2168057 2347785 2609089 2345243 2306858 2453285 2318051 2337569
5540 2337569 2643714 2719994 2581545 2515841 2668175 2553371 2396913 2298248 2107751 1978702
5530 1978702 2042334 2131393 1886340 1908794 2132837 2069762 1925528 1925996 2037516 2083395 2308901
5519 2308901 2489508 2365940 2273664 2318519 2322260 2237144 2077446 2057880 2108819 2274602 2184696
5508 2184696 2334707 2283566 2108634 2010414 1925678 1961892 2022370 2204744 2350463 2278093 2338575
5497 2338575 2236528 2166884 2376583 2327214 2385442 2286330 2341444 2164276 2003093 2008485 2258148
5486 2258148 2149643 1991582 2072709 2112998 1919043 1865474 1801310 1807362 1972192 2095103 2220061
5475 2220061 2263214 2349119 2269470 2433247 2474325 2753116 2818879 2924270 3002183 2750948 2648903
5464B648903k9882j11389r2885q5798p8740q3468M3391J69755N2180m964r9525
5453B327578J24842L2275L5678J11139j98703j92440J4211J80380M6478R8115
5443B579553L14513j03526J474O6646p1152K48176k6401K15927K50872j35383
5433C340699k33826j65248J13134n7619P7024j36768N9340J0353k58186q229O9912
5422B810586k26171j38501J22383K21980J38553R4029O9532p9754j84914J09068
5412B936791Q9591J96284K53003N527j778J78048J99224M4394l02329j16972r3238
5401C388545j06758O2553l5926j20788J68206L4286R0908k44592k47000K25520
5391C214954j50801K3644m5305m9088J26310O0067r9213r2581j62532q3876K08757
$$ plain form
5464 2648903 2619021 2507632 2414747 2328949 2250209 2166741 2210132 2379887 2432067 2427103 2327578
5453 2327578 2452420 2484695 2520373 2631512 2432809 2240369 2254580 2434960 2481438 2579553
5443 2579553 2894066 2790540 2792014 2858660 2787508 3035684 3009283 3225210 3476082 3340699
5433 3340699 3106873 2941625 3054759 2997140 3074164 2937396 2996736 3007089 2748903 2740674 2810586
5422 2810586 2584415 2445914 2568297 2790277 2928830 3022859 3092391 3012637 2827723 2936791
5412 2936791 3026382 3222666 3475669 3481196 3479418 3657466 3856690 3901084 3598755 3481783 3388545
5401 3388545 3281787 3344340 3308414 3187626 3355832 3390118 3481026 3236434 2989434 3214954
5391 3214954 3064153 3087797 3042492 2993404 3119714 3179781 3080568 2987987 2825455 2741579 2950336
5380B950336K34540j61354j81253L67854k8448j25239j3099k7930l05115J21594
5370B831886j85825l0921j04761M1630m0675l263M4998p0564K9658m3970K3185
5359B491378m603P6848J21557N087k40288k881K54084M21089l74120K1633L7123
5348B806907p8775j79548r8973J02993j11237k4528j8617j96866j66479j79260
5338A855617K01246Q8451l7694O0427k1956j75561J55495m4843O379J26165K24251
5327B437977J88512O9689j52481j21677k34275m2440R4504p3235m8675J26924
5317B244823P3469j46322j06272J62839J71173M6789R4726J26819o684j93658
5307B467702j34714j35117p60J18792k196J83125J4590O6634J80194j6417L5602
$$ plain form
5380 2950336 3184876 3023522 2842269 3210123 3181675 3056436 3043337 3015407 2710292 2831886
5370 2831886 2646061 2615140 2510379 2552009 2511334 2508071 2553069 2482505 2512163 2468193 2491378
5359 2491378 2486775 2563623 2685180 2690267 2449979 2447098 2701182 3122271 2748151 2769784 2806907
5348 2806907 2728132 2548584 2449611 2552604 2441367 2416839 2398222 2201356 2034877 1855617
5338 1855617 2056863 2145314 2107620 2168047 2146091 1970530 2126025 2081182 2087561 2213726 2437977
5327 2437977 2626489 2696178 2543697 2422020 2187745 2145305 2239809 2166574 2117899 2244823
5317 2244823 2318292 2171970 2065698 2228537 2399710 2446499 2541225 2668044 2661360 2467702
5307 2467702 2332988 2197871 2197111 2315903 2313707 2496832 2511422 2578056 2758250 2741833 2777435
5296B777435M9230k18407m731n8930k4565q2834l2910o1459N725j1071o2108j57112
5284B118263q2704n7633j36304k3548k7839k0310Q7568J4861K0962k2260r2274
5273A778782r6951J18507Q8896q2058l1277j78230l1008M5569J02789j3693O9265
5262A770591o8194j52385J8497J6324m8234k5320j83418n6186P7678K34065j11811
5251A471607j25846n9218J21762k8290J11991K6452k71766k26125N87586J75923
5241A784076k87846m0299M8042K2856p2030j75609K4812p9987J85761P6265j88705
5230A297336j12786L5458J45336m3494j68694J11943K9551j21403J07656K0555
5220A301458l6215k36889j5827L02048P4603o5893j8755J66168p4399J1808J06589
$$ plain form
5296 2777435 2826665 2608258 2603527 2544597 2520032 2437198 2404288 2342829 2348554 2337483 2275375 2118263
5284 2118263 2035559 1977926 1841622 1818074 1790235 1769925 1857493 1872354 1893316 1871056 1778782
5273 1778782 1681831 1800338 1889234 1807176 1775899 1597669 1566661 1612230 1715019 1701326 1770591
5262 1770591 1702397 1550012 1568509 1584833 1536599 1511279 1327861 1271675 1349353 1583418 1471607
5251 1471607 1345761 1286543 1408305 1380015 1492006 1518458 1246692 1020567 1608153 1784076
5241 1784076 1496230 1455931 1503973 1526829 1454799 1279190 1304002 1224015 1409776 1486041 1297336
5230 1297336 1184550 1220008 1365344 1321850 1153156 1265099 1294650 1173247 1280903 1301458
5220 1301458 1265243 1028354 1012527 1314575 1389178 1323285 1304530 1470698 1396299 1408107 1514696
5209A514696j28789p7248J6343O1532K7267j62817m4955J52609P8120j45775N3044
5198A344027N7985k20493O8654J18249Q654J4830J66820j0585j94951q334R5608
5187A440464j49169Q6325P7461J25749n3070l43171J81344R8019J03370m4654
5177A522668j76628K5266m9079q219J08999N1737N7188m4142n3357J86485n04
5166A620414J71495L8207j08198M0107k60788m8276J22992o3634O7269K26970
5156A806558Q3485j53511N4552r7898K2127q0648J90449N8274l02588k7945J28684
5145A681539q8939P5375N5637j41393j08396K43912M3323j17025p2442J36023
5135A707614j2441J07719K2483j38063J4420Q8328P5765J19727K37699l6098J3797
$$ plain form
5209 1514696 1385907 1308659 1325002 1386534 1413801 1250984 1206029 1358638 1436758 1290983 1344027
5198 1344027 1402012 1181519 1250173 1368422 1377076 1391906 1558726 1548141 1353190 1344856 1440464
5187 1440464 1291295 1377620 1455081 1580830 1527760 1184589 1365933 1463952 1567322 1522668
5177 1522668 1346040 1371306 1322227 1314008 1423007 1474744 1531932 1487790 1434433 1620918 1620414
5166 1620414 1791909 1830116 1721918 1762025 1501237 1452961 1575953 1512319 1579588 1806558
5156 1806558 1890043 1736532 1791084 1693186 1715313 1634665 1825114 1883388 1580800 1552855 1681539
5145 1681539 1592600 1667975 1723612 1582219 1473823 1717735 1761058 1644033 1571591 1707614
5135 1707614 1695173 1802892 1825375 1687312 1701732 1790060 1865825 1985552 2223251 2187153 2200950
5124B200950k30452Q1358j08020R3607M6183j13904o6809J97453l6053j29111
5114A935202q1003r8452J37738p1612O1793L6924J60929J66299J89844J52908
5104B590570l2924q0299L5210k98330J33085M2206j80791K01784O2700j28091
5094B345120q7952N2395K8858j37763J6276N5474j23111n7877R7137J34562R5425
5083B418544j20633p9943M1558j12137l3821J65865K47257r1179l5905j04989
5073B294617j07718q8970J53302j24604K150R3787j87312J39425m7390M5023j2492
5062B159818p5645J85249J28168q4515R0910M4629R5555n7480J3125k9312p8425
5051B392077J7784j8492n8887l151m564Q3909K6522N9535l5018R7462j00946j00854
$$ plain form
5124 2200950 1970498 2051856 1943836 2037443 2083626 1969722 1902913 2100366 2064313 1935202
5114 1935202 1854199 1755747 1893485 1821873 1883666 1920590 2081519 2247818 2437662 2590570
5104 2590570 2557646 2477347 2512557 2214227 2347312 2389518 2208727 2410511 2473211 2345120
5094 2345120 2257168 2309563 2338421 2200658 2216934 2272408 2149297 2091420 2188557 2323119 2418544
5083 2418544 2297911 2217968 2259526 2147389 2113568 2279433 2526690 2435511 2399606 2294617
5073 2294617 2186899 2097929 2251231 2126627 2128777 2222564 2035252 2174677 2127287 2172310 2159818
5062 2159818 2084173 2269422 2397590 2313075 2403985 2448614 2544169 2486689 2499814 2470502 2392077
5051 2392077 2409861 2391369 2332482 2329331 2324767 2408676 2435198 2494733 2459715 2557177 2456231 2355377
5039B355377J99545M5751r7491k8206r9734J11368r5057j39901K99293P7991K31109
5028B860045m5742l8985J21601K07413j81365N2482J4720j71030R2250J5230M3618
5017B970237P6333n1934J28869J2856j586K10438o7623j02480K34451j78198P4992
5006C306355j51063K78262J1666L1698R9095o7832m275r3516J01837j46842q7090
4995C278295J52543j93171k2196J36950J41961m1176k01767O4340N4431P6136
4985C446346M4718J72838J2904k4225k28447n3698O4802R6837K47194J8045r8152
4974C699162j20135r9767K91492M1674K22739r6029j14104p0617O4309M7079k7103
4963C838700K31625P5287M2884K52438N7252l5885R1223l6442j8406j75453K43314
$$ plain form
5039 2355377 2554922 2600673 2503182 2474976 2375242 2486610 2391553 2251652 2550945 2628936 2860045
5028 2860045 2814303 2775318 2896919 3104332 2922967 2975449 2990169 2819139 2911389 2926619 2970237
5017 2970237 3046570 2994636 3123505 3136361 3134775 3345213 3277590 3175110 3409561 3231363 3306355
5006 3306355 3155292 3433554 3445220 3476918 3576013 3508181 3503906 3410390 3512227 3365385 3278295
4995 3278295 3430838 3237667 3215471 3352421 3494382 3453206 3251439 3315779 3370210 3446346
4985 3446346 3491064 3663902 3676806 3652581 3424134 3370436 3435238 3532075 3779269 3797314 3699162
4974 3699162 3579027 3479260 3770752 3812426 4035165 3939136 3825032 3754415 3818724 3865803 3838700
4963 3838700 4070325 4145612 4188496 4440934 4498186 4462301 4553524 4517082 4498676 4323223 4566537
4952D566537L66941J06783j07461N9903j10564p7868L51700N2536P5918O2010
4942E346435J99903j9230n4546L5789J50347n7813j3606J02062r327J45327j56251
4931E669090R7005Q4221j49045k4229J2345J34997P6553L0495J23473j15634J29308
4920F068579M20933J9331l7920o1353N4336J82100J81181P6894J81818J77250
4910G263149q1599K50926K63604j26777P5367K0506k5982K73258J06159K49087
4900H267698J60977N8280R6088Q6626K01079K5589K96113M18570O9229J60774
4890I841023K43951L08916L89981L08071N17370N49666M83196O25863R27449M83842
4880A4679328K47537m45212m99729j30784m36920o1138j0323j81094J84507K10976
$$ plain form
4952 4566537 4933478 5040261 4932800 4992703 4882139 4804271 5155971 5208507 5284425 5346435
4942 5346435 5546338 5527108 5472562 5508351 5658698 5600885 5587279 5689341 5680014 5825341 5669090
4931 5669090 5766095 5850316 5701271 5677042 5689387 5824384 5900937 5931432 6054905 5939271 6068579
4920 6068579 6489512 6508843 6470923 6409570 6463906 6646006 6827187 6904081 7085899 7263149
4910 7263149 7181550 7432476 7696080 7569303 7644670 7665176 7639194 7912452 8018611 8267698
4900 8267698 8428675 8486955 8583043 8669669 8870748 8896337 9192450 9611020 9680249 9841023
4890 9841023 10084974 10393890 10783871 11091942 11609312 12158978 12642174 13268037 14195486 14679328
4880 14679328 14926865 14481653 13981924 13851140 13414220 13353082 13342759 13161665 13346172 13557148
4870A3557148K57035K45267J58314J89932J48572l0826N4927K71200M39583L44885
4860A5636037K95589N25635J254M42990M50789J86026L97102M57975O29596R44180
4850A9967173J182206J434692J349869J305634M24072p34817j251861j172990
4842B2503978j071142p81619o92890m55267m07484l08032j57702l42784m43910
4833A7843148k51694l53267l30569l53240j30281p5483J79740J97586J48075j84535
4823A6689480l25841O8895q4561J67256J60974K97210N11760O52004O29567K99653
4813A9066397m1951k23463k85480o34375j035324o04007n28645k34952k35662
4804A5242538l99366j46301j24278j08987L4713k62805n4963J6661j6516k31732
$$ plain form
4870 13557148 13814183 14059450 14217764 14407696 14556268 14525442 14580369 14851569 15291152 15636037
4860 15636037 15931626 16457261 16458515 16901505 17352294 17538320 17935422 18393397 19022993 19967173
4850 19967173 21149379 22584071 23933940 25239574 25663646 24928829 23676968 22503978
4842 22503978 21432836 20651217 19958327 19503060 19095576 18787544 18629842 18287058 17843148
4833 17843148 17591454 17238187 16907618 16554378 16424097 16348614 16528354 16725940 16874015 16689480
4823 16689480 16363639 16432534 16347973 16515229 16676203 16973413 17485173 18137177 18766744 19066397
4813 19066397 19024446 18800983 18515503 17881128 16845804 16241797 15713152 15478200 15242538
4804 15242538 14843172 14696871 14572593 14463606 14498319 14235514 14180551 14197212 14180696 13948964
4794A3948964M014j3579o6090l4756R5229j04393K1384K0355r077j05255J1282
4783A3768078O0071l2809N7822J43553P1461L2841K5962q7556J94858o28l9829
4772A4193824q0097j45394p2693M7640N9894j30719K56090J8881p5884L9411k3004
4761A4087949r554j22709O2178J58009k75279J92259O8227j18912O648n2296Q1336
4750A4077856l8458K12384j68657n5090J05010p8836M1108Q5221P4928M19k61713
4739A3994172L36P2954o8500j25161O1273M7541K41950j76273Q9212p4309J07980
4728A4171175r9143M8545Q1121J52020Q648r6060o9771K12507K10122J04622P4026
4717A4797812n6031M53287L70047J96420K78185J85726M74338M26901M51317M99848
$$ plain form
4794 13948964 13952978 13939399 13873309 13838553 13933782 13829389 13850773 13871128 13862051 13756796 13768078
4783 13768078 13828149 13795340 13853162 13996715 14068176 14101017 14126979 14039423 14234281 14233653 14193824
4772 14193824 14113727 13968333 13895640 13943280 14003174 13872455 14128545 14147426 14071542 14110953 14087949
4761 14087949 14078395 13955686 14017864 14175873 13900594 14092853 14161080 14042168 14048816 13996520 14077856
4750 14077856 14039398 14251782 14083125 14028035 14133045 14054209 14095317 14180538 14255466 14255885 13994172
4739 13994172 13994508 14067462 13998962 13873801 13935074 13982615 14224565 14048292 14137504 14063195 14171175
4728 14171175 14072032 14120577 14201698 14353718 14362366 14266306 14196535 14409042 14619164 14723786 14797812
4717 14797812 14741781 15195068 15565115 15761535 16039720 16225446 16699784 17126685 17578002 18077850
4707A8077850M47518J49958k62846l68823n50164m19681l49414o38081m05032
4698A5681285j69432l1708J3606M4690J13223M9793M63073M66831N65842N75731
4688A7772934N56913J04496j72800n71857n10737p76433m91834m77603l51250
4679A5081829l82671m61669l87711l37900k23445k59711j66000l0511K26835o4937
4669A2994109j56744R9283K14896J79397K30378L02981L08729J95185L22077O24010
4659A5314301P84051O59425O84166P51417P95588J053253J129596O05794J42423
4650B1920014j43633q09800j205404j111009p92462o19946o71712j07288k391
4641A6456369j0741K30517L69589J68984O96292J149264O00972Q61113L58372
$$ plain form
4707 18077850 18525368 18675326 18412480 18043657 17493493 17073812 16724398 16086317 15681285
4698 15681285 15511853 15480145 15493751 15538441 15651664 15701457 16164530 16631361 17197203 17772934
4688 17772934 18329847 18434343 18261543 17689686 17178949 16402516 15910682 15433079 15081829
4679 15081829 14699158 14237489 13849778 13511878 13288433 13028722 12862722 12832211 13059046 12994109
4669 12994109 12837365 12936648 13151544 13330941 13561319 13864300 14173029 14368214 14690291 15314301
4659 15314301 16098352 16757777 17441943 18193360 18988948 20042201 21171797 21777591 21920014
4650 21920014 21776381 20966581 19761177 18650168 17857706 17237760 16566048 16458760 16456369
4641 16456369 16445628 16676145 17045734 17214718 17911010 19060274 19661246 20522359 20880731
4632B0880731o4030q45402j028344j445193j295391j026335r51299q52116p12664
4623A2659957n15518m83211m18446l78839l51180k31879k16293j56597k38818
4614I669176o6300q7542k2385R4585j30471k81838R306r2264r9684K7040j51887
4603H867736j27440j12747k96681j806L1983k16250p8551n5730Q0676n681R7081
4592H182590Q1547j45385o1770J69118N4072J65104P637k1003o2455m6147k24408
4581H098900J73774K24758j18513q3326Q7842p2265J19662J71254q8474k33796
4571H279816k15258j58428J6371R5173J32538j82733j37739l2638K751r4245L92938
4560H098546L08621J02029O8217J92323K01758K11772L65891O55922M54394N86291
$$ plain form
4632 20880731 20816701 19971299 18942955 17497762 16202371 15176036 14224737 13372621 12659957
4623 12659957 12144439 11661228 11242782 10863943 10512763 10280884 10064591 9907994 9669176
4614 9669176 9602876 9515334 9492949 9587534 9457063 9175225 9184531 9092267 8992583 9019623 8867736
4603 8867736 8740296 8627549 8330868 8329062 8361045 8144795 8066244 8010514 8091190 8085509 8182590
4592 8182590 8264137 8118752 8056982 8226100 8280172 8445276 8452913 8431910 8369455 8323308 8098900
4581 8098900 8272674 8497432 8378919 8295593 8383435 8311170 8430832 8602086 8513612 8279816
4571 8279816 8064558 7906130 7922501 8017674 8150212 7967479 7829740 7797102 7799853 7705608 8098546
4560 8098546 8407167 8509196 8577413 8769736 8971494 9183266 9549157 10205079 10659473 11245764
4550A1245764M95634P09886J151090J064389J363050J402668P71643P51072L67426
4541A9322622p83136j103774j046533j116461j010282p72510p81638n06115m65365
4532A1736808k12301m17989j75868k27956Q0888J7555J2100J14144q1330k32481
4522A0613570J17605K10359l7958K38214L28233L36040L40033N78199P24055P79286
4512A4227636R79459J127125J021480P52787K06360p27822j209033j149551j006970
4503A4221471j075141j009286o11380m94312k96527l98484j98899L2943J92491
4494A0362876Q6457J93934M70568N81294N28013M21792J87650k90014p55583p79119
4484A1007868n72474n92566n36468m80625k05400m8119k95670l66536j35147l80431
$$ plain form
4550 11245764 11741398 12451284 13602374 14666763 16029813 17432481 18204124 18955196 19322622
4541 19322622 18539486 17435712 16389179 15272718 14262436 13489926 12708288 12202173 11736808
4532 11736808 11524507 11106518 10930650 10702694 10783582 10801137 10813237 10927381 10846051 10613570
4522 10613570 10731175 10941534 10903576 11141790 11470023 11806063 12146096 12724295 13448350 14227636
4512 14227636 15207095 16334220 17355700 18108487 18314847 17587025 16377992 15228441 14221471
4503 14221471 13146330 12137044 11525664 11031352 10734825 10336341 10137442 10170385 10362876
4494 10362876 10449333 10643267 11113835 11695129 12223142 12644934 12832584 12542570 11786987 11007868
4484 11007868 10435394 9842828 9306360 8825735 8620335 8572216 8276546 7910010 7774863 7394432
4474G394432L0539j94128l86939q9416L40360k711k07682Q8576O5049J02037J44108
4463G284225K65640J51736M28963K53618K44575N88214N16871M71974O34697L86820
4453A1227333K9976n34853p16196o81599m66495l74373l77860m50810m37158j54424
4443G063541j38190k82953k65694q1455q0555J2759j0011k72590k41274q0689
4433E622889l75275j11519J53611J24319j8991p5250j96290K3802J23084J27570
4423E397950K1029n169j47128J44467m8865Q5735k99452j35119J45086j32894
4413E025640m8926k1146k35994k01855Q0809J87007M6318j07656o3995j38856
4403D521346p6001J1484O4644J88929n3748k30452k4850m871K49668R7774M8802
$$ plain form
4474 7394432 7424971 7230843 6843904 6754488 7094848 7092137 6884455 6973031 7038080 7140117 7284225
4463 7284225 7549865 7701601 8130564 8384182 8628757 9216971 9733842 10205816 10840513 11227333
4453 11227333 11257309 10722456 10006260 9324661 8858166 8483793 8105933 7655123 7217965 7063541
4443 7063541 6925351 6642398 6376704 6295249 6214694 6227453 6217442 5944852 5703578 5622889
4433 5622889 5247614 5136095 5289706 5414025 5395034 5319784 5123494 5147296 5270380 5397950
4423 5397950 5418979 5413810 5266682 5411149 5362284 5448019 5148567 5013448 5158534 5025640
4413 5025640 4976714 4955568 4719574 4517719 4598528 4785535 4831853 4724197 4660202 4521346
4403 4521346 4445345 4456829 4521473 4710402 4656654 4426202 4401352 4396481 4646149 4743923 4792725
4392D792725j10715J40627o9997J31650j8070M2171J3729j4317J7633N8159j24376
4381D859219k8090j2814j90387R0955N9458j17106k08141J18064p6774P6880Q9406
4370D660670o5199o0584O8563l6619o6449M4865m1883P3983k7157J06219n8558
4359D597851p7898R0850O3140k4397J09418l0557l6989J942O6932j7565J78857
4348D921584J01016r7547j69997k23131J25015j8443J72703Q456k16731M0409
4338D643334l1423R5497L93550j03135m12135J88808K06640j11134L8279J41375
4328E049656N8284L5686M3111J60275r7279j76411K64924J96117j97L00269L35853
4317F170288K9404L31655M61681R9540J88881Q3834k41758l86003m89448k48750
$$ plain form
4392 4792725 4682010 4822637 4752640 4884290 4866220 4908391 4922120 4907803 4925436 4983595 4859219
4381 4859219 4831129 4818315 4627928 4718883 4778341 4661235 4453094 4571158 4494384 4571264 4660670
4370 4660670 4595471 4534887 4603450 4566831 4500382 4545247 4503364 4577347 4550190 4656409 4597851
4359 4597851 4519953 4610803 4673943 4649546 4758964 4728407 4691418 4693360 4760292 4742727 4921584
4348 4921584 5022600 4925053 4755056 4531925 4656940 4638497 4811200 4819656 4602925 4643334
4338 4643334 4611911 4707408 5100958 4997823 4585688 4774496 4981136 4870002 4908281 5049656
4328 5049656 5107940 5143626 5186737 5347012 5249733 5073322 5338246 5534363 5534166 5834435 6170288
4317 6170288 6199692 6531347 6993028 7092568 7281449 7365283 7123525 6737522 6248074 5999324
4307E999324r6573r5419j48163j19428Q852j7105j20046j72400p7534r5552j8322
4296E047634j6910l2422L2386L629J018M2415O2652j10020l180J16604J34444
4285E278250K01093m1107o1097q8270j8182m3284J78668J85900L7013j58363J98798
4274E669419J93859j1860Q5677J11622L24068J85332K49358K68540K73193r8068
4264G251140J56147J5583K9114j11111r8013J74380J09043K19049K97673K77453
4254H320458K42566m02866n35641k73475O546l3052j77896K02538J18802k2777
4244G445203J38872k1850k5375O1894J27223J94818J57792M8493j5189K16510
4234H328391K22129p67L77254J07407j2166K8214K02317J27650J83258J49094
$$ plain form
4307 5999324 5902751 5807332 5659169 5539741 5548593 5531488 5411442 5239042 5161508 5065956 5047634
4296 5047634 5030724 4998302 5030688 5034317 5035335 5077750 5140402 5030382 5027202 5143806 5278250
4285 5278250 5479343 5438236 5377139 5288869 5270687 5227403 5406071 5591971 5628984 5470621 5669419
4274 5669419 5863278 5851418 5937095 6048717 6372785 6558117 6807475 7076015 7349208 7251140
4264 7251140 7407287 7422870 7451984 7340873 7242860 7417240 7526283 7745332 8043005 8320458
4254 8320458 8563024 8160158 7624517 7351042 7357588 7324536 7146640 7349178 7467980 7445203
4244 7445203 7584075 7562225 7536850 7598744 7725967 7920785 8078577 8127070 8111881 8328391
4234 8328391 8550520 8549753 8927007 9034414 9022248 9050462 9252779 9380429 9563687 9712781
4224I712781K65863L7049J15793K90010n2991O2416K53608L04931R3650J89319
4214A1272429M9882J76386L95288K63009K43706K79430R276M80982K55737J36516
4204A3562641M87551M78351K19939K75550O17761O11285J64135L30217K95900
4195A7043330N34890O91551N41507P60441O54224N75716O94832O24439N87481
4186B2708411M83572Q83490P81166P53154R10205R36830Q94238J160566J293520
4177C0805152J557480J475948J691257K409471K582352K962321L305689L725943
4169E0515613M144279N026910N798324O844375Q369114J0517271J3244537J6540065
4161A21000488K0579512K2435097K0970943J3236800J239291r383843j4417586
$$ plain form
4224 9712781 9978644 10015693 10131486 10421496 10368505 10430921 10684529 10989460 11083110 11272429
4214 11272429 11322311 11498697 11893985 12156994 12400700 12680130 12689406 13170388 13426125 13562641
4204 13562641 14050192 14528543 14748482 15024032 15641793 16253078 16417213 16747430 17043330
4195 17043330 17578220 18269771 18811278 19571719 20225943 20801659 21496491 22120930 22708411
4186 22708411 23191983 24075473 24856639 25609793 26519998 27456828 28351066 29511632 30805152
4177 30805152 32362632 33838580 35529837 37939308 40521660 43483981 46789670 50515613
4169 50515613 54659892 59686802 65485126 72329501 80698615 91215886 104460423 121000488
4161 121000488 141580000 164015097 184986040 198222840 199462131 190078288 175660702
4154A75660702j4904931j5277020j4812250j3348050r597056n063822k265488
4147A00392085j542690m359604r133496j0174363q326684o193500m973312m092679
4139E1595757l733493l053156k441355k261947j885953j892549j415939j131245
4131C3780120r22249o51064o84972o61577n64436o50859m67226l85882n77493
4122B8214362n14827l28188n61235m97591l16389l17570k37331J64310K47133
4113B5852674N30734R99306J255715J608536J446414J132553m31058j737862k031199
4104B8625813j845191j601103j501193j141482p80070m12500k02013m7415J99639
4095B1294485K09196l8908J8755N6566q7242k41556j8015M3164l75952q49734
$$ plain form
4154 175660702 160755771 145478751 130666501 117318451 107721395 102657573 100392085
4147 100392085 98849395 94489791 85356295 75181932 66855248 60661748 55688436 51595757
4139 51595757 47862264 44809108 42367753 40105806 38219853 36327304 34911365 33780120
4131 33780120 32857871 32206807 31521835 30860258 30295822 29644963 29177737 28791855 28214362
4122 28214362 27699535 27371347 26810112 26312521 25996132 25678562 25441231 25605541 25852674
4113 25852674 26383408 27382714 28638429 30246965 31693379 32825932 32394874 30657012 28625813
4104 28625813 26780622 25179519 23678326 22536844 21756774 21344274 21142261 21094846 21294485
4095 21294485 21503681 21464773 21483528 21540094 21452852 21211296 21193281 21236445 20860493 20010759
4085B0010759r30065n89169m20959m06757j91768L9089K28242K18906J80525L77162
4075A8515965L46369K98865J59147j85635n74749n01699l30403m75642l60820
4066A6891398Q1575k68575j20665M2546J74413K75225R8371J28350K45254K12615
4056A7760507K87125J71302J38660M01657O01718M35949K19438J99553J56879
4047B0372788L76437L23049N08681K92610L02864P27959O10851K96868L22064
4038B4134171M19015K67435K09140K00729J37024l11341l46551N0446J36656q920
4028B4887804j05707L24046L14864O23824N31771M92748J31820q2091m74264q60849
4018B5783966m92841m01345l77949n10647m45608k18553k29595o7547q5961j17853
$$ plain form
4085 20010759 19080694 18491525 18070566 17663809 17472041 17511130 17739372 17958278 18138803 18515965
4075 18515965 18862334 19161199 19320346 19134711 18559962 18058263 17727860 17252218 16891398
4066 16891398 16972973 16704398 16583733 16626279 16800692 17075917 17174288 17302638 17547892 17760507
4056 17760507 18047632 18218934 18357594 18759251 19360969 19796918 20016356 20215909 20372788
4047 20372788 20749225 21072274 21580955 21873565 22176429 22904388 23515239 23812107 24134171
4038 24134171 24553186 24820621 25029761 25230490 25367514 25056173 24709622 24760068 24896724 24887804
4028 24887804 24782097 25106143 25421007 26044831 26576602 27069350 27201170 27119079 26644815 25783966
4018 25783966 25291125 24889780 24511831 24001184 23555576 23337023 23107428 23039881 22953920 22836067
4008B2836067k02504k84253o63982q31643q19210q55676n08642p52732p47341
3999A7170084n77132l60271m20558k12520j95749m96162o00406n02258l63810
3990A3441218o99732q14379n28128k79937n00411o73308j59072O0004k33392l62232
3980I250631j34767k70464m01714j97859j32091m73587k62769j14945r0003l01747
3970F870685l54079j60758j27170o8219j12109j44680k02297J3355r3267R4078
3960E715539q3425n8918O1707o515j42505J2187J77255m1967o6087p5767O4556
3949E556060J35345j26905k25430j92507k34303j85196N251j09970o554j19386
3939D496405r8993P0476o4248j38403n6650K40686j17279j40175K54560J51662
$$ plain form
4008 22836067 22633563 22349310 21685328 20853685 20034475 19178799 18670157 17917425 17170084
3999 17170084 16592952 16232681 15812123 15599603 15403854 14907692 14307286 13805028 13441218
3990 13441218 12741486 11927107 11398979 11119042 10618631 9945323 9786251 9846255 9612863 9250631
3980 9250631 9115864 8845400 8443686 8245827 8113736 7640149 7377380 7262435 7172432 6870685
3970 6870685 6516606 6355848 6228678 6160459 6048350 5903670 5701373 5714728 5621461 5715539
3960 5715539 5632114 5573196 5634903 5628388 5485883 5498070 5675325 5633358 5567271 5491504 5556060
3949 5556060 5691405 5564500 5339070 5146563 4912260 4727064 4732315 4622345 4615791 4496405
3939 4496405 4397412 4467888 4403640 4265237 4208587 4449273 4331994 4191819 4446379 4598041
3929D598041k73893J4105K02976Q0796J08932n3925j7796K55310K00476m6007
3919E069015j28375k04032j75642j22817p0818J4819j21743r8680M1602q1349
3909D121980N400k9392k20110k6729R4806n0393j29585K3594J83185j42712j12586
3898C717458j27025K166J97391j08792j01594o3205k99624L68430j61227N0909
3888C474887m57k69881j6095L7212k3620J4983L94630K3502P9998k47382K5076
3877C492853N4758m0583j4884j00608m2001J61947K3097L32763J34179K17259
3867D218780r3897m7774j3739j09222j48373j29711l5861j68033J25955N5239
3857C653364l1946k18196j38825P3416K04233m923K0993Q8039k69605J5989J00240
$$ plain form
3929 4598041 4324148 4338253 4541229 4622025 4730957 4677032 4659236 4914546 5115022 5069015
3919 5069015 4940640 4736608 4560966 4438149 4367331 4382150 4260407 4161727 4203329 4121980
3909 4121980 4127380 4097988 3877878 3851149 3945955 3895562 3765977 3789571 3972756 3830044 3717458
3898 3717458 3590433 3592599 3789990 3681198 3579604 3516399 3216775 3585205 3423978 3474887
3888 3474887 3474430 3204549 3188454 3225666 3202046 3217029 3611659 3635161 3715159 3467777 3492853
3877 3492853 3547611 3507028 3492144 3391536 3349535 3511482 3534579 3867342 4001521 4218780
3867 4218780 4124883 4077109 4063370 3954148 3805775 3676064 3640203 3472170 3598125 3653364
3857 3653364 3621418 3403222 3264397 3337813 3542046 3537123 3558116 3646155 3376550 3392539 3492779
3846C492779P5135J99992o5334P7357J71005l948J37762k5709n4135k7424j17851
3835C859629J46683K18294k33084j11318k24848m0118j54711j04843J08071P596
3825C471351j1093J17758k41154Q571O3971j62066q178m8005J8096P7234J12348
3814C398833j79217J89465J58376k66198P1165N652j57269J27925k50316K76927
3804C375343q9039j15361R4226J644J18957j42553n3278K74182k8646N3752l8648
3793C450579J27959j64126j30542K1498R9581j63752J43110J44891N6396Q1491
3783C667085j8219k2088J05771j6950j44385K787K3911J01936J30363j41973J03935
3772C792173j16408j10231Q9785J57276j67148q7763M2462j27318l1720K9044
$$ plain form
3846 3492779 3567914 3767906 3702572 3779929 3950934 3946986 4084748 4059039 4004904 3977480 3859629
3835 3859629 4006312 4224606 3991522 3880204 3655356 3615238 3460527 3355684 3463755 3471351
3825 3471351 3460258 3578016 3336862 3345433 3409404 3247338 3239160 3191155 3209251 3286485 3398833
3814 3398833 3219616 3409081 3567457 3301259 3372424 3378076 3220807 3348732 3098416 3375343
3804 3375343 3286304 3170943 3265169 3266813 3385770 3243217 3189939 3464121 3435475 3489227 3450579
3793 3450579 3578538 3414412 3283870 3305368 3404949 3241197 3384307 3529198 3585594 3667085
3783 3667085 3648866 3626778 3732549 3715599 3571214 3574001 3597912 3699848 3830211 3688238 3792173
3772 3792173 3675765 3565534 3655319 3812595 3645447 3557684 3600146 3472828 3441108 3470152
3762C470152m3173q4800K62989J77417q2851k1578M5523k11581P2839k8697q8100
3751C468140K5410K55192j54978J09788k24297K02427J68263o1746N4700J7818
3741C860717L8743N1260r4967M6814P3449j23237K0765o628j88898R0174J15101
3730C883293j53020m8201L03453J17599j9215q6362J9549J3734r1380N4398J35187
3719D129035L17945o2769p0602P9834j46287k8291k9301Q8861j34091L4860p538
3708D171656J13790N1847j40916J57104j04068j22101J29557o2606J01651J30503
3698D426417J18129K57956l0552j48058J79473M026o9275M14706k38556k73918
3688D640348J93664J75140q1862J14813M7940j69933m4225J32674J71566J03922
$$ plain form
3762 3470152 3426979 3342179 3605168 3782585 3699734 3678156 3723679 3512098 3584937 3556240 3468140
3751 3468140 3493550 3748742 3593764 3703552 3479255 3681682 3849945 3788199 3842899 3860717
3741 3860717 3899460 3950720 3855753 3902567 3976016 3852779 3873544 3866916 3678018 3768192 3883293
3730 3883293 3730273 3682072 3985525 4103124 4083909 3997547 4017096 4030830 3939450 3993848 4129035
3719 4129035 4446980 4384211 4313609 4393443 4247156 4218865 4189564 4278425 4144334 4179194 4171656
3708 4171656 4285446 4337293 4196377 4353481 4249413 4127312 4256869 4194263 4295914 4426417
3698 4426417 4544546 4802502 4771950 4623892 4803365 4807391 4738116 5152822 4914266 4640348
3688 4640348 4834012 5009152 4927290 5042103 5090043 4920110 4875885 5008559 5180125 5284047
3678E284047j6174J01091L2999M62j11973J74597p8271k30167J62353r6292j73201
3667E049471J31673o6656o4446K35346R56j2490J2523K0077j44710l8299K6383
3656E149828j06136J16466K08155k7880q973K1812r4466J75144j61722j81283
3646E090945K9171P9586J68573Q7655l14603K02547R6319j80102l7178N8483J45468
3635E426864J26193K0917k17379k5029K58138K1408j17615J83009K7017q234r0838
3624E604451J72492J58541m4760K09689M4161o3745j7646j47460L14430J37770
3614F367923m4015K37792K27974J1799j79009M861J60036J00907j4095m7283K67396
3603G094286L3184l4731K12748J35118n1000j66701J03878M7151p7540j33348
$$ plain form
3678 5284047 5267873 5368964 5401963 5402425 5290452 5465049 5386778 5156611 5318964 5222672 5049471
3667 5049471 5181144 5114488 5050042 5285388 5286344 5273854 5286377 5306454 5161744 5123445 5149828
3656 5149828 5043692 5160158 5368313 5340433 5331460 5353272 5258806 5433950 5272228 5090945
3646 5090945 5120116 5199702 5368275 5455930 5141327 5343874 5440193 5260091 5222913 5281396 5426864
3635 5426864 5553057 5573974 5356595 5331566 5589704 5611112 5493497 5676506 5703523 5695289 5604451
3624 5604451 5776943 5935484 5890724 6100413 6144574 6080829 6063183 5915723 6230153 6367923
3614 6367923 6323908 6561700 6789674 6801473 6622464 6627325 6787361 6888268 6874173 6826890 7094286
3603 7094286 7127470 7092739 7305487 7440605 7389605 7222904 7326782 7373933 7296393 7163045
3593G163045O0844L31054r0217l8253J86607k6925k6675l9119K05241J29842j2976
3582G842468O3624L1809p7211K21917L2182J416J18984k8091K04117K66511n0070
3571H627656r6191J88450J44884J31277p6327K6918j12758M5544k3182J69609
3561I025880o7942k7195q541R9540J48113p6900J05652m23293k1091K46081J46387
3550I146691K52523j5701m3031J1916J021R1682J16969Q4369K92360K09106J2210
3539A0160115j63863k37043J89161J49099j89225O5203K55167K9479l1492q7893
3529A0138708J23416L73247K2648j24421r469J51055n7387L0518N3865L18018
3519A1020198J13919O5297Q3355o6459k8741R6334J40303M1043K20314J57997
$$ plain form
3593 7163045 7223889 7554943 7464726 7426473 7613080 7586155 7559480 7520361 7725602 7855444 7842468
3582 7842468 7906092 7937901 7860690 8082607 8114789 8116205 8235189 8207098 8411215 8677726 8627656
3571 8627656 8531465 8719915 8864799 8996076 8919749 8946667 8833909 8879453 8856271 9025880
3561 9025880 8957938 8930743 8922202 9021742 9169855 9092955 9198607 8775314 8754223 9000304 9146691
3550 9146691 9399214 9383513 9340482 9352398 9353419 9445101 9562070 9646439 9938799 10147905 10160115
3539 10160115 9996252 9759209 9948370 10097469 9908244 9973447 10228614 10258093 10226601 10138708
3529 10138708 10262124 10635371 10658019 10533598 10524129 10675184 10617797 10648315 10702180 11020198
3519 11020198 11134117 11199414 11282769 11216310 11187569 11283903 11424206 11465249 11685563 11843560
3509A1843560J71158l6874R0602r1588J80706J11464P655q6548K80005K03180
3499A2673320Q6481l0584R840J54397J9865J57435M373k35504K74352J78914M3500
3488A3336389J88127m3132k78943J23715O5103P956K53761P1812Q7755Q44o3537
3477A3749850J60851J28071L9815M08062n8999J96433L82834L5214M08100N53734
3467A6003965J01985q769J50215L40535L47246K71564L36446L32494M23339o251
3457A8292769J67337K12282J55862K35034L16366J86549K14465J91399L40683
3448B0312746P3313K8372L08900J44979L67268K90316K4387K08120M91395L56080
3438B2605876M66569N23067K40132j98735k61256j38790j27854k3298j39078r4414
$$ plain form
3509 11843560 12014718 11977844 12068446 11976858 12157564 12269028 12276683 12190135 12470140 12673320
3499 12673320 12759801 12729217 12739057 12893454 12913319 13070754 13075127 12839623 13113975 13292889 13336389
3488 13336389 13524516 13481384 13202441 13326156 13391259 13399215 13652976 13724788 13812543 13813387 13749850
3477 13749850 13910701 14038772 14078587 14486649 14427650 14624083 15006917 15042131 15450231 16003965
3467 16003965 16105950 16097181 16247396 16587931 16935177 17206741 17543187 17875681 18299020 18292769
3457 18292769 18460106 18672388 18828250 19063284 19379650 19566199 19780664 19972063 20312746
3448 20312746 20386059 20414431 20723331 20868310 21235578 21525894 21550281 21758401 22249796 22605876
3438 22605876 23072445 23595512 23835644 23636909 23375653 23236863 23109009 23085711 22946633 22852219
3428B2852219o9180j56882L20673j46608K24513J50509J43597O2765m7949R3436
3418B3427093K68134J49930K90918K20316K29276L51319N86433O50842K84351
3409B6458612N37235P08554J065625J441267J311377J108273J017035O60260N39406
3400C4847644N70761k644k14285M6584L71103N13049J241330J323045J457273
3391D0153860J572979J917192J967694K102835J919556K049882K126774J799626
3383E5610398J526116J214996J228224Q22756K60730K86784K79550n1119M10164
3374F1588599K88539K85059K88287J11100l01096l82478q12065p56501p35963
3365E9573481j164874j443573j534231j667761j607624j498407j450408j818268
$$ plain form
3428 22852219 22783039 22626157 22946830 22800222 23024735 23175244 23318841 23381606 23333657 23427093
3418 23427093 23695227 23845157 24136075 24356391 24585667 24936986 25523419 26174261 26458612
3409 26458612 26995847 27704401 28770026 30211293 31522670 32630943 33647978 34308238 34847644
3400 34847644 35418405 35415761 35201476 35248060 35619163 36132212 37373542 38696587 40153860
3391 40153860 41726839 43644031 45611725 47714560 49634116 51683998 53810772 55610398
3383 55610398 57136514 58351510 59579734 60402490 60663220 60950004 61229554 61178435 61588599
3374 61588599 61877138 62162197 62450484 62561584 62260488 61878010 61065945 60309444 59573481
3365 59573481 58408607 56965034 55430803 53763042 52155418 50657011 49206603 47388335
3357D7388335j970371j695286j365590j393189j188002j048056j029196q51033
3349C6847612m88063n06069k36066j12522l27709k12591k21996J1260K0952J29593
3339C4904401J11930K23165M75447K84711M05439L04629Q2591j02715L42707J77098
3329C7209403J58884J16900o1629O023m7731R1337J62263O3633K84139N8286N3112
3318C8094620L69193N65659L38608K32129L74342N80083L30169M19811L19891
3309D1624505M03292M44155L24331M40265N80359O26779P60891L16020O21231
3300D6141828N93710M75568P07315O39239Q50894O78187R33714P42539R94616
3291E2757610J262993R45886J285965J004063J045948J451940J198702J469026
$$ plain form
3357 47388335 45417964 43722678 42357088 40963899 39775897 38727841 37698645 36847612
3349 36847612 36359549 35853480 35617414 35504892 35177183 34964592 34742596 34753856 34774808 34904401
3339 34904401 35016331 35239496 35714943 35999654 36405093 36709722 36792313 36689598 37032305 37209403
3329 37209403 37368287 37485187 37423558 37429581 37381850 37473187 37635450 37699083 37983222 38041508 38094620
3318 38094620 38463813 39029472 39368080 39600209 39974551 40554634 40884803 41304614 41624505
3309 41624505 42027797 42471952 42796283 43236548 43816907 44443686 45204577 45520597 46141828
3300 46141828 46735538 47211106 47918421 48557660 49408554 50086741 51020455 51762994 52757610
3291 52757610 54020603 54966489 56252454 57256517 58302465 59754405 60953107 62422133
3283F2422133J241004J525245J612022J845897J888972K025191K156703K300763
3275G7017930K882391L094723K878499L070865L433640M029385M337747M618329
3267A05363509M965858N117993N365920O034958N915309N722537N127619M596092
3259A48209795L941936L013669K361167J982264R37474J003807Q88745Q97443
3251A63236300J076397J193387J106293Q75662K86457n67444j404912k250087
3243A63552053k737190l471068m008786m438293n002374n386851n491590n441627
3235A27574274n546036n211687n069048m731197m343195l797257l763477l348232
3227I1764145k719840k719469k313462k157138j933910j940203j673446j505753
$$ plain form
3283 62422133 63663137 65188382 66800404 68646301 70535273 72560464 74717167 77017930
3275 77017930 79900321 82995044 85873543 88944408 92378048 96407433 100745180 105363509
3267 105363509 110329367 115447360 120813280 126848238 132763547 138486084 143613703 148209795
3259 148209795 152151731 155165400 157526567 159508831 160446305 161450112 162338857 163236300
3251 163236300 164312697 165506084 166612377 167488039 167774496 167207052 165802140 163552053
3243 163552053 160814863 157343795 153335009 148896716 143894342 138507491 133015901 127574274
3235 127574274 122028238 116816551 111747503 107016306 102673111 98875854 95112377 91764145
3227 91764145 89044305 86324836 84011374 81854236 79920326 77980123 76306677 74800924
3219G4800924j454313j101597q92969r05346p73431m90347m41360j92861L87645
3210F8936345K82593K71055P2630J23604m005K71603N33559Q61839R24984R76230
3200G3250437J347434J397217J374421J517919J536168J924337J961967J856546
3192H6166446J452568J403661J414422J382953J124744R40777Q67058O64819Q53132
3183I6270580O58775N37207J18636m22187o28893j103280j424559j933109k100841
3174H9972329k275291k320442k294305k359562k177535k219393k299793j790314
3166G2235694j905762j788357j976991k061317j772841k006948k298408k211753
3158E6213317k297865k092069j911561j773993j790154j864781j466991j226844
$$ plain form
3219 74800924 73346611 72245014 71352045 70446699 69673268 69182921 68741561 68548700 68936345
3210 68936345 69218938 69489993 69562623 69686227 69682222 69953825 70487384 71349223 72274207 73250437
3200 73250437 74597871 75995088 77369509 78887428 80423596 82347933 84309900 86166446
3192 86166446 87619014 89022675 90437097 91820050 92944794 93885571 94752629 95417448 96270580
3183 96270580 96929355 97466562 97585198 97163011 96534118 95430838 94006279 92073170 89972329
3174 89972329 87697038 85376596 83082291 80722729 78545194 76325801 74026008 72235694
3166 72235694 70329932 68541575 66564584 64503267 62730426 60723478 58425070 56213317
3158 56213317 53915452 51823383 49911822 48137829 46347675 44482894 43015903 41789059
3150D1789059j080746j144367p07209p82417o14568m38824l32654m99387n45890
3141C5642997n77621m33395l42365l27839k57869j19129l9040P5902J53071J21381
3131C3896093m3206L8516J32499O6091l1511p3570J92970K51207L90969L95562
3121C5215620K77050M54570J01392N12549O45191N64942Q34335Q63810Q51958
3112D0321417R48080J216521J184943J043871J107250Q90329J193565J227500
3104D9133476N92577N74284Q48375O92296K53234N167l97079o93018j001893p31625
3094D9275794r65828j208840r80469n16800o15355l16454k04841J04732O09966
3085D5181905M95599O05204O77571P26261P12657L70695K45106l16919n73352
$$ plain form
3150 41789059 40708313 39563946 38856737 38074320 37459752 37020928 36688274 36188887 35642997
3141 35642997 35065376 34631981 34289616 33961777 33703908 33584779 33545739 33621641 33774712 33896093
3131 33896093 33852887 33891403 34023902 34089993 34058482 33984912 34177882 34429089 34820058 35215620
3121 35215620 35492670 35947240 36048632 36561181 37206372 37771314 38605649 39469459 40321417
3112 40321417 41269497 42486018 43670961 44714832 45822082 46712411 47905976 49133476
3104 49133476 49726053 50300337 51148712 51841008 52094242 52099409 51702330 51009312 50007419 49275794
3094 49275794 48309966 47101126 46120657 45603857 44988502 44672048 44467207 44571939 45181905
3085 45181905 45677504 46282708 46960279 47686540 48399197 48769892 49014998 48698079 48124727
3076D8124727p93330j170567j638248j921293j861347k066296k071587j996113
3068C4605946j878989j933362j793046j465345j402937j170968r55850j016950
3060B2988499j085037r04463n84256o24678o38174n90010n35434l20409k27561
3051A7478477l74909j25997o3045j96232k50518k39992j43197j7670j45506N1471
3041A5972882k59028l4926p2460j28753j51433q8132N0544j43785j70654o228
3031A4968027J12838J96867K3433L30K44639R1760K34995K41415L5565K0391J54654
3020A6324914j73411o29831j84507l33022k14066r5046k71616k57400J738j99374
3010A3968379k15841r8645j80192R0861P4690N2127j00260L11686K93441K20320
$$ plain form
3076 48124727 47331397 46160830 44522582 42601289 40739942 38673646 36602059 34605946
3068 34605946 32726957 30793595 29000549 27535204 26132267 24961299 24005449 22988499
3060 22988499 21903462 20998999 20414743 19790065 19151891 18561881 18026447 17706038 17478477
3051 17478477 17103568 16977571 16914526 16718294 16467776 16227784 16084587 16066917 15921411 15972882
3041 15972882 15713854 15678928 15606468 15477715 15326282 15238150 15288694 15144909 14974255 14968027
3031 14968027 15080865 15277732 15301165 15301495 15546134 15637894 15872889 16114304 16149869 16170260 16324914
3020 16324914 16151503 15521672 15337165 15004143 14790077 14695031 14423415 14166015 14167753 13968379
3010 13968379 13752538 13653893 13473701 13564562 13639252 13691379 13591119 13902805 14196246 14416566
3000A4416566J66872J54222J07446l3866L8621J86075l8699j3942K9484p7068
2990A4935711l58m5316J20427J36127m9365k55378n5276K04181J8735j16324P5590
2979A4968754L91569M50720K05865K96309K05185L98822M12623N11531O39387
2970A8480765M58974M37082K14981K77030M71501R18231N81563N82226N44584
2961B2966937N27149M73744N68399K11143j26280l3663q8986J25127K60514K25701
2951B5109785L07081Q2581l94617J19093M151K03508L81071N77472P87166N10894
2941B7688185J040306Q14113N08750M99760J34885N6922J41051J96941K57250
2932C1338163L76340O00673Q15547J144072Q92799Q30695Q94219O45135P72873
$$ plain form
3000 14416566 14583438 14737660 14845106 14811240 14849861 15035936 14997237 14983295 15012779 14935711
2990 14935711 14935353 14890037 15010464 15146591 15097226 14841848 14786572 14990753 15009488 14893164 14968754
2979 14968754 15360323 15811043 16016908 16313217 16518402 16917224 17329847 17841378 18480765
2970 18480765 18939739 19376821 19591802 19868832 20340333 21258564 21840127 22422353 22966937
2961 22966937 23494086 23967830 24536229 24747372 24621092 24587429 24498443 24623570 24884084 25109785
2951 25109785 25416866 25499447 25104830 25223923 25228074 25431582 25812653 26390125 27177291 27688185
2941 27688185 28728491 29542604 30051354 30551114 30685999 30742921 30883972 31080913 31338163
2932 31338163 31714503 32315176 33130723 34274795 35167594 35998289 36892508 37537643 38310516
2923C8310516N12527N10449N02310K45691M58832L82888M46931J46886Q6525J52350
2913D1755905K70941L28191K57080Q07775J085994J032670J363745J719494J377570
2904D9999365J023178R80461J147571J278378J321759J021787L75649j9733O517
2895E7134932K09443J48517N76338P87528Q81214R48599R76954J173678J526722
2886F4363925J979384J836888J927592J691113J510550J793844J676410J746829
2878G8526535J848436K090852K621435L052698L473497L732531L786678L445344
2870A02578006L154839L322945L686465M363257M981975N866644O727132P316022
2862A41997285Q156896Q871919R940268J1032762J3492440J6231031J8908773
$$ plain form
2923 38310516 38823043 39333492 39835802 40081493 40540325 40923213 41370144 41517030 41603555 41755905
2913 41755905 42026846 42355037 42612117 43419892 44505886 45538556 46902301 48621795 49999365
2904 49999365 51022543 52003004 53150575 54428953 55750712 56772499 57148148 57128415 57134932
2895 57134932 57344375 57492892 58069230 58856758 59737972 60686571 61663525 62837203 64363925
2886 64363925 66343309 68180197 70107789 71798902 73309452 75103296 76779706 78526535
2878 78526535 80374971 82465823 85087258 88139956 91613453 95345984 99132662 102578006
2870 102578006 105732845 109055790 112742255 117105512 122087487 127954131 134681263 141997285
2862 141997285 150154181 159026100 168966368 179999130 193491570 209722601 228631374
2855B28631374K1324080K1232136J7304377Q191680n063521j7039923k3573854
2848B51006349k5639988k5108897k3319403k0074536j6161862j2807002j0315864
2841A17578797q290655o886398n803320n044226m632946m178811l750167l192473
2833G5799801k773448k852087k802250k697658k510862k315663k161665k232833
2825E5453335k326680k084308k322299k191219k221832k430384k018137j624573
2817C8233903j672984j788344j619333j423624j488758j299273j235257j003369
2809B6702961j163888r07296q99098p97982q09322p64373n97730p09110p07693
2800A9346469n22060m97880o34570n69630n45978o28067n26479m01592l24138
$$ plain form
2855 228631374 249955454 271187590 288491967 296683647 291620126 274580203 251006349
2848 251006349 225366361 200257464 176938061 156863525 140701663 127894661 117578797
2841 117578797 109288142 102401744 96598424 91554198 86921252 82742441 78992274 75799801
2833 75799801 73026353 70174266 67372016 64674358 62163496 59847833 57686168 55453335
2825 55453335 53126655 51042347 48720048 46528829 44306997 41876613 39858476 38233903
2817 38233903 36560919 34772575 33153242 31729618 30240860 28941587 27706330 26702961
2809 26702961 25539073 24631777 23732679 22934697 22125375 21361002 20763272 20054162 19346469
2800 19346469 18824409 18326529 17691959 17122329 16576351 15948284 15421805 15020213 14696075
2791A4696075m51589l27295m14432m30926m47739m09306k08961k66006l23930
2782A1415891j26558j95909l13615j88259l27983l19483l28367J8779k21860l30527
2772I082109p3197j29611l25859q0898l66935j30426O1242j65906j08864J247
2762G762902j57651k60759j87508Q7602j52868j0513k80427j61255Q2083j24964
2752F596642j24460n7611j0340l6643m9882j88366j24340j59523m9977j45685
2742E649815o4558l33689k85127J23431p3378Q079k0209j16841R9811r8827L0863
2731D919370N4504q8931q172m2787M9230J4607q8681R7445q4555j69538j40726
2720D511766j28964m9172j64733L63119J30722j53560n3266O5654o6196o7649
$$ plain form
2791 14696075 14244486 13917191 13502759 13071833 12624094 12214788 12005827 11739821 11415891
2782 11415891 11289333 11093424 10779809 10591550 10263567 9944084 9615717 9634496 9412636 9082109
2772 9082109 9008912 8879301 8553442 8472544 8105609 7975183 8036425 7870519 7761655 7762902
2762 7762902 7605251 7344492 7156984 7244586 7091718 7081205 6800778 6639523 6721606 6596642
2752 6596642 6472182 6414571 6404231 6367588 6317706 6129340 6005000 5845477 5795500 5649815
2742 5649815 5585257 5251568 4966441 5089872 5016494 5024573 5004364 4887523 4987334 4888507 4919370
2731 4919370 4973874 4884943 4876771 4833984 4883214 4897821 4809140 4906585 4822030 4652492 4511766
2720 4511766 4382802 4333630 4168897 4532016 4662738 4509178 4455912 4521566 4455370 4387721
2710D387721O3555l639R299J57166J69925j34427K35104L39349L9790K5174N5646
2699E344663j86564j40379m06042k58628j56564j65771j79554k50044l1637k5340
2689C544140j90640j63473j1163J68583k7051j07853p602j51174J21425m5968
2679C129224j88774j74332O3644L9586J42364n7246k11669j08288K4665L1928
2669B691102L7858J47626L847k8776l03366j3823J24804j9425p0631J53159N0665
2658B773040r1614o5256K08104O9599k2204j93579L3891L54259r4139j1427N6448
2647C017122P1044J577K3641R2369J02846j50275r3132p7337J0492J0870q5820
2636B923397l1507Q308J89424m8022M7536J21081k78895N9557O4603n8231r619
$$ plain form
2710 4387721 4451276 4447637 4456936 4614102 4784027 4649600 4884704 5224053 5263843 5289017 5344663
2699 5344663 5158099 5017720 4611678 4353050 4196486 4030715 3851161 3601117 3569480 3544140
2689 3544140 3353500 3190027 3178864 3347447 3320396 3212543 3204941 3053767 3175192 3129224
2679 3129224 2940450 2766118 2829762 2869348 3011712 2954466 2742797 2634509 2659174 2691102
2669 2691102 2728960 2876586 2880433 2851657 2548291 2534468 2659272 2639847 2569216 2722375 2773040
2658 2773040 2681426 2616170 2824274 2893873 2871669 2678090 2711981 3066240 2972101 2960674 3017122
2647 3017122 3088166 3089743 3113384 3205753 3308599 3158324 3065192 2987855 2998347 3009217 2923397
2636 2923397 2891890 2900198 3089622 3041600 3089136 3210217 2931322 2990879 3055482 2997251 2987632
2625B987632K00537R4665M2154Q5393J63087J16184J31587k9424J13601J19895
2615D025311m5127O9934q3042l2988P9267k77584J69522J79060k36335P4421q1341
2604C841098K72999q9218j88494O9754n8661r7296N9461k5913J86295n5574N6035
2593C970486J12271k03445J04276J86508l4234J54659M1745J47665J06722K87824
2583D874477j917o9829N3737j37967J78811j07851j82152j48665l4594K15318
2573D639368R8828J18711M4619n473j83505k24386k5660O8051j50553j4306r4557
2562D271137j00845k49019j51602k08274j34961K6203o967o4307m7500K35652
2552C569517j45715j6197J00546j95384m1120J17011M3705l5279j23209r2100
$$ plain form
2625 2987632 3188169 3282834 3324988 3410381 3573468 3689652 3821239 3791815 3905416 4025311
2615 4025311 3980184 4050118 3967076 3934088 4013355 3735771 3905293 4084353 3848018 3922439 3841098
2604 3841098 4114097 4024879 3836385 3906139 3847478 3750182 3809643 3783730 3970025 3914451 3970486
2593 3970486 4082757 3879312 3983588 4170096 4135862 4290521 4332266 4479931 4586653 4874477
2583 4874477 4872560 4802731 4856468 4718501 4897312 4789461 4607309 4458644 4424050 4639368
2573 4639368 4738196 4856907 4901526 4896053 4712548 4488162 4462502 4530553 4380000 4365694 4271137
2562 4271137 4170292 3921273 3769671 3561397 3426436 3452639 3445672 3381365 3333865 3569517
2552 3569517 3423802 3407605 3508151 3312767 3271647 3388658 3432363 3397084 3273875 3181775
2542C181775K1519l04968l20947q0250M7239j36716o8301j27769j33593l198J7418
2531B092209M1385l1789m7655j65040q4701l2555K491N9787R7903j19749p4282
2520A738004l04421J411k02773K22472j38968k3989q8353l4588O382J96513K00869
2509A572559k42635j12708p9102j47966J28368L4403j27106p6580j2880l377R6504
2498A029480M274J11960Q0499j38238k72358n3836J57591j60329p2031m4064q7225
2487E55723J15525n693n497M1744p4651q0300R8210R21q4461j14489j07399J03563
2475D43196J65179m4840j49620J07407m3222r2838j39032J13446R5513Q4197j52377
2464C87009j77087M9627R4995j3690L0869R56j34809O0326n1429O7949Q3295j6385
$$ plain form
2542 3181775 3203294 2898326 2577379 2497129 2544368 2407652 2339351 2211582 2077989 2074791 2092209
2531 2092209 2133594 2101805 2054150 1889110 1804409 1771854 1774345 1834132 1932035 1812286 1738004
2520 1738004 1433583 1434994 1232221 1454693 1315725 1291736 1203383 1168795 1175177 1371690 1572559
2509 1572559 1329924 1217216 1138114 990148 1118516 1152919 1025813 949233 936353 932976 1029480
2498 1029480 1033754 1145714 1226213 1087975 815617 761781 919372 759043 687012 642948 555723
2487 555723 671248 665555 660058 701802 627151 546851 645061 645982 561521 447032 339633 443196
2475 443196 608375 563535 413915 521322 478100 385262 246230 359676 455189 539386 387009
2464 387009 209922 259549 354544 340854 371723 372679 237870 298196 246767 314716 398011 381626
2452C81626m3969n6129J25606r6042o6078j0769J12341J6856J3359n3233J99714
2441E23282r0522k78523J45251J40273j37426l1806l1143K9466o3804j35987M0288
2430A09349J27935J26688J3126j05235l0431J99287P6850k40686r8730K32124
2420D10277J28634k33052l5591M0934P9301K451J60022J4060j61424m6926J45739
2409E04425m999j56142N6270J21255k82108J00094k7487L9568L0836l7216j11224
2398B33272j38373J71760L7940k6429j10852P0200r049L6418N4833k1627j78730
2387A19363k340L2137p2191N7865K1874M9147R1354O3576M7699l2352j35902k5740
2375B14490J21461O3298j46930J12886L1944j2039r11k37116J18893K46367q0456
$$ plain form
2452 381626 337657 281528 407134 311092 245014 234245 346586 363442 376801 323568 523282
2441 523282 432760 154237 299488 439761 302335 270529 239386 268852 205048 69061 109349
2430 109349 237284 363972 377098 271863 241432 440719 517569 276883 178153 410277
2420 410277 538911 305859 270268 311202 390503 392954 552976 567036 405612 358686 504425
2409 504425 499426 343284 399554 520809 238701 338795 311308 350876 381712 344496 233272
2398 233272 94899 266659 304599 278170 167318 237518 228469 264887 319720 298093 119363
2387 119363 117023 149160 76969 134834 156708 205855 297209 360785 408484 376132 240230 214490
2375 214490 335951 399249 252319 365205 397149 385110 384199 147083 265976 512343 431887
2364D31887K6355J04480j16632j10075p3842J3691j07258q993k4053Q2374p0865
2353A47069J8609o4595J91218M2371L1195j54071J90346j7865l29053J45002L76146
2342E76372k45384m6571o21P945r6141n1293k0248O3985J11161j87626N0014P5819
2330B37412K23216j15065n6106J04566J26710k38886j2717Q7530j8499K09362
2320E47523l47556m1141J66096K7812L309M2435P4922Q632J19041k5491j65387
2309D10195q1198k5947J2586j58434J24114J46316j69805J63335J6063p5102j19068
2298B43055L8650J17957l15897l567l2798j0063K34014Q902J70174m0204j7407
2287C92816L4332k5302L8362j32358j49870J33396O2629M784K8434j35852R9323
$$ plain form
2364 431887 458242 562722 446090 336015 262173 275864 168606 159613 135560 217934 147069
2353 147069 165678 101083 292301 334672 365867 211796 402142 384277 55224 200226 576372
2342 576372 330988 284417 283796 291741 195600 144307 124059 188044 299205 111579 161593 237412
2330 237412 460628 345563 289457 394023 520733 281847 269130 356660 338161 547523
2320 547523 199967 158826 324922 352734 356043 398478 473400 482032 601073 575582 410195
2309 410195 328997 303050 315636 157202 281316 427632 257827 421162 437225 362123 243055
2298 243055 281705 399662 83765 80198 47400 37337 271351 280253 450427 410223 392816
2287 392816 427148 401846 440208 307850 157980 291376 354005 358789 387223 251371 350694
2276C50694n155m6509j3010o3900M7343J47839k2256j07223M7437j91444l5110
2265A08706k8936m8950J75328J65469k4349j31297l2832P188R8050J20312l783
2254D04906j25184j61258K8986L5931q484R4345K56978k37314J4135Q268j35609
2243A75700j57889P1113m5998K67175K37430L764k61538P5458j8819J04773Q6266
2232E37435k29095j02269J68981j10576l7412J40316Q8745R2051r1472m9309o8147
2221C39248r9909J14088p5357j75710L01534j33394J05854j32396Q8231K3575
2211C55764J22304r3442m7336m913M0275m7360P890L2046p6861J85636j0443j83967
2199B79593P9813J65824q3706l7805j5854K32161M5317O8792j0660j33060J0034
$$ plain form
2276 350694 345539 299030 286020 222120 269463 417302 395046 287823 335260 143816 108706
2265 108706 79770 30820 206148 371617 347268 215971 183139 190327 288377 408689 404906
2254 404906 279722 118464 147450 183381 174897 269242 526220 288906 303041 311309 175700
2243 175700 17811 88924 42926 310101 547531 551295 289757 365215 346396 451169 537435
2232 537435 308340 206071 375052 264476 227064 367380 456125 548176 456704 407395 339248
2221 339248 239339 353427 278070 102360 403894 270500 376354 243958 332189 355764
2211 355764 478068 384626 337290 332377 372652 325292 333182 365228 288367 474003 463560 279593
2199 279593 359406 525230 441524 403719 387865 620026 665343 734135 723475 590415 600449
2188F00449j71894J75519J73967m2357P7546k10053q4512J62890J61715J56457
2178I99727r9219k45916O1658K2897j77478N8402J64907P1060o7304P5792N1965
2167I16491P659O6230M7119l9940j85307P3601J07806O9069P7325j53760J22512
2156A108805Q8638N9475O1059k1206j14105K8306L6209J89378K5457j06545J39155
2145A494626K3727j50880J31775N2472p4581J60717K24584K45490K29038J473
2135B338441J398J05763P263j8382K8977K21996N4299K54132J72426P5630n1568
2124C190375J68596O8803J75751J07136J2957L26181L43471N44623O53475O93130
2114F284498K97668K65524K81923L84838O08981R17353J020404J125112J593698
$$ plain form
2188 600449 428555 604074 778041 735684 813230 603177 518665 681555 843270 999727
2178 999727 900508 654592 716250 739147 561669 620071 784978 856038 788734 864526 916491
2167 916491 924150 990380 1037499 997559 812252 885853 993659 1062728 1140053 986293 1108805
2156 1108805 1197443 1256918 1317977 1296771 1182666 1210972 1247181 1436559 1462016 1355471 1494626
2145 1494626 1518353 1367473 1499248 1551720 1477139 1637856 1862440 2107930 2336968 2338441
2135 2338441 2339839 2445602 2452865 2434483 2463460 2685456 2739755 2993887 3166313 3241943 3190375
2124 3190375 3358971 3427774 3603525 3710661 3723618 4049799 4393270 4937893 5591368 6284498
2114 6284498 6582166 6847690 7129613 7514451 8123432 9040785 10061189 11186301 12779999
2105A2779999K014075K701196M188656N778380P762214P810914K897874o558908
2097C9374400r803733p167384m498594l179538k484775j680775j626392j072407
2089G860802r97422m58412m61293j98300J45728k47794p56262o12346m31133l11433
2079C532135j32620m6352k77595l10390j57342k57579N8811L7376k31958q2835
2069B131651r261J06485j46099k86567j61320o5277j15420J2999k4947m7682j61160
2058A233402p5526r3176K7536j41808m1748q389J8892K53571j36480j10929q8036
2047H37309j39038J30418R54j09219N4506k00753J13857M3770j74875N4875j55445
2036D56359R6692L9730J08036q1017R1328l287r7065q5718j65290j5008J77126
$$ plain form
2105 12779999 14794074 17495270 21683926 27462306 35224520 43035434 45933308 39374400
2097 39374400 29570667 22403283 17904689 14725151 12240376 10559601 8933209 7860802
2089 7860802 6863380 6404968 5943675 5745375 5891103 5643309 4887047 4274701 3843568 3532135
2079 3532135 3399515 3353163 3075568 2765178 2607836 2350257 2409068 2446444 2214486 2131651
2069 2131651 2122390 2228875 2082776 1796209 1634889 1569612 1454192 1467191 1442244 1394562 1233402
2058 1233402 1157876 1064700 1092236 950428 908680 900291 919183 1172754 1036274 925345 837309
2047 837309 698271 828689 829643 720424 774930 574177 688034 731804 556929 611804 456359
2036 456359 553051 592781 700817 619800 711128 707841 610776 525058 359768 344760 521886
2025E21886n9832j26813j7044J08858o800l5527M5382M0937p7370j54189M314
2014B43802j31922J36528r4471j74895K31165Q3978n1884j39611r0609K41791
2004B53872j9883J77650j39019k4911J16007R24j68466j33562K67940r0118N9893
1993C00327j29193j77435J44133N7926n2151r7434J24363o0111J7872J59909m307
1982B83899r9392m5919J2650J80456m3625j51331k15758R5165M6121O1882m8828
1971G5320n1677J14552j8078Q0285K2379j60115J6407R7996j91461R1362M0873
1960A17843M0351P0600k11641p2665K28282j93024M5416L9582j15457j63330O1700
1949a52343J31666j0642Q0846j72073N6242j20963J70576l5314K3917j84631k08880
$$ plain form
2025 521886 462054 335241 318197 427055 420255 384728 430110 471047 393677 239488 243802
2014 243802 111880 248408 153937 -20958 210207 294185 242301 102690 12081 253872
2004 253872 233989 411639 272620 247709 363716 364640 196174 62612 330552 240434 300327
1993 300327 171134 -6301 137832 195758 143607 46173 170536 110425 128297 288206 283899
1982 283899 184507 138588 151238 331694 288069 136738 -79020 16145 62266 124148 75320
1971 75320 23643 138195 120117 200402 222781 62666 79073 177069 -14392 76970 117843
1960 117843 158194 228794 17153 -55512 172770 -20254 25162 64744 -50713 -214043 -152343
1949 -152343 -20677 -31319 49527 -122546 -66304 -187267 -16691 -52005 -28088 -212719 -421599
1938d21599J50119J16141Q8740n8185Q7908J97601p8962k32979M5028p065J68034
1927E4781p583k5573Q5937j34676p8556J04035M3511p3175j28847j00711J50650
1916a10207Q0386k1710N2775L5628r7561Q2673n2755K34050q7730j59955K10643
1905A66237l0337o5277q1882j2855J01868O4648r1405m4189L8018j97129Q3516
1894f8787J31868P2566q1125q351m5509M3917L19k11401J64229R0263n0361j11793
1882g4165N8990j36086K44351J76817j39018j30839j52891J48337P9863l4406
1872D0953K53818n5486j55984k8997J04602o4725K2245m4667j67868J25230K52901
1861B82022j83788N3478N9854m6163J53937j94604l6613J57005k16520N6842K37478
$$ plain form
1938 -421599 -271480 -155339 -66599 -124784 -36876 160725 81763 -151216 -106188 -113253 54781
1927 54781 47198 21625 107562 -27114 -105670 -1635 41876 -31299 -160146 -260857 -110207
1916 -110207 -29821 -51531 1244 36872 -60689 21984 -30771 203279 115549 -44406 166237
1905 166237 135900 70623 -11259 -24114 77754 142402 50997 6808 44826 -152303 -68787
1894 -68787 63081 135647 54522 46171 662 44579 44898 -166503 -2274 87989 37628 -74165
1882 -74165 -15175 -151261 93090 269907 130889 50 -152841 -4504 75359 40953
1872 40953 294771 239285 83301 54304 158906 94181 116426 71759 -96109 29121 282022
1861 282022 98234 151712 211566 165403 319340 124736 88123 245128 28608 85450 322928
1850C22928n1420j64771j06907n1296M7271J36684r3236j26220J23636Q3781Q8778
1839B09228p4220n729J84431M3426q3255K57823L0928j73126J82318o6634k96671
1828B08519J3084N2153m0465q3414J23079K755o3592J01017M1768Q3775j45167
1817B93512p2239k90878P914J33502J31736j09801K13034o1498k01422J00882
1807A44742m4991k6882j70783K12342O9398p7699m5940J68864q0240j75524M4579
1796A7866P7257R2364j04423L3287l5757k74016P5685Q1174O2774P8849l00500
1785a95440L2051L328J12976M9846n1224l2781N2861N9516j10552k6426p2595
1774a78440j06579Q500R2623Q3921K17857Q7788k31232j42820J6679K80292M7127
$$ plain form
1850 322928 271508 106737 -170 -51466 -4195 132489 39253 -86967 36669 120450 209228
1839 209228 135008 129279 313710 357136 273881 531704 562632 389506 571824 505190 208519
1828 208519 221603 273756 233291 149877 272956 275711 212119 313136 354904 438679 293512
1817 293512 221273 -69605 -61691 71811 203547 93746 306780 245282 43860 144742
1807 144742 99751 72869 -97914 114428 183826 106127 60187 229051 148811 -26713 17866
1796 17866 95123 187487 83064 116351 80594 -193422 -117737 -36563 26211 105060 -195440
1785 -195440 -163389 -160061 -47085 2761 -48463 -81244 -28383 31133 -79419 -105845 -178440
1774 -178440 -285019 -276519 -183896 -99975 117882 205670 -25562 -168382 -151703 128589 175716
1763A75716n1133L4945l11927J2219n3596l7287J9269m4576K00843K16938J07023
1752B68434r4362Q6084j88541k1192P4112J8685J2270m487L4376j08046p8242
1741i09O113J6781N8660M6873m2916j35297P449K7570l04714K32455J29736m4653
1729b852k64085P044K37959O2235j5827J8322O9508J9507J11675j72140J02185
1718A73531k27419r6548k1696j9199J56037K29713K6000k30267M0207N9697j40158
1707e0102O4315q5748j20554J96041j0927O0979j86198r7867J50585j14607J76095
1696a7988K44330j92084k03188J52294L644K8204k7880m742J23070q0281J61339
1685A86718J24400k38169J15198K7166j80573m8444J2020m7842n7141J56285j65726
$$ plain form
1763 175716 124583 159528 -152399 -140180 -193776 -231063 -211794 -256370 -55527 161411 268434
1752 268434 174072 260156 71615 50423 124535 143220 155490 151003 185379 77333 -909
1741 -909 5204 21985 80645 127518 84602 -50695 -43246 -15676 -320390 -87935 41801 -2852
1729 -2852 -266937 -259893 -21934 40301 24474 42796 112304 131811 243486 71346 173531
1718 173531 -53888 -150436 -172132 -191331 -35294 194419 220419 -9848 30359 90056 -50102
1707 -50102 14213 -71535 -192089 3952 -6975 54004 -132194 -230061 -79476 -194083 -17988
1696 -17988 226342 34258 -168930 -16636 -12992 15212 -12668 -17410 105660 25379 186718
1685 186718 311118 72949 188147 215313 34740 -13704 -1684 -49526 -106667 49618 -116108
1674a16108p5609l9916J76750N6742m901P0840l5415n7158R5556M7400O5025O0635
1662B43841p8561j83709K06840J27542l36645q3951J58960k6833q1799K4195O9345
1651C9225q225j6702n6678P6178m8785o2787J12581j14572Q3261j36454M7289
1640h5669k4611K9122P610R1398P8848j64931J0237M983J17357q1397n4521O4147
1628g427l4201k69647J47258j27543K05448J46061k25234M7223k2797J49986j6404
1617g277k4548J77076j91446k6838j4654O6408m343J8735M3971J1526O338p2858
1605a7910q8379o020J17655j89214m3623k5197J80712k5789J37005k8523j5449
1594d732l3931M62o0740l8731l9805l6306K39267P1206m7887j82755M6805J01926
$$ plain form
1674 -116108 -191717 -231633 -54883 1859 -3042 67798 32383 -24775 70781 118181 183206 243841
1662 243841 165280 -18429 188411 315953 -20692 -104643 54317 27484 -54315 -30120 39225
1651 39225 31000 14298 -42380 33798 -14987 -77774 34807 -79765 3496 -132958 -85669
1640 -85669 -110280 -81158 -73548 17850 96698 -68233 -57996 -53013 64344 -17053 -71574 -7427
1628 -7427 -41628 -311275 -164017 -291560 -86112 59949 -165285 -118062 -140859 9127 -7277
1617 -7277 -31825 145251 -46195 -73033 -87687 -21279 -25622 -6887 37084 48610 54948 -17910
1605 -17910 -106289 -112309 5346 -183868 -227491 -252688 -71976 -97765 39240 10717 -4732
1594 -4732 -38663 -38201 -98941 -137672 -177477 -213783 25484 96690 48803 -133952 -87147 14779
1582A4779O4278Q314j8802n7181j24718m6558J50561J38714p7459j12201j41376
1571b01649L2101R5664j2158p4908M3845O1041j00993j1077r7832J5854Q1225
1560a68887p6380k16005o3772K13175J74515O8796j21758p0891J46296J89407
1550G4496J5428N182j31002P5989l4035R1236K10309j45875k02542k17347J65674
1539i2487K67713j47280j70754l203J12357J5701j66646J0216L1354p2782R3579
1528a22232K00513o0604k02531p4718l3468K61235k8312M4818r8863l614P1968
1517d5808N3572N7021O3214R1108o1573K2646j4352l9855l7460J1729j59618l3058
1505i2434Q3823J11744j78956J24709Q6341J6550J19622k42594r994Q5022q0255
$$ plain form
1582 14779 79057 87371 68569 11388 -113330 -159888 -9327 129387 51928 -60273 -201649
1571 -201649 -169548 -73884 -86042 -160950 -117105 -56064 -157057 -168134 -265966 -250112 -168887
1560 -168887 -245267 -461272 -525044 -311869 -137354 -68558 -190316 -261207 -114911 74496
1550 74496 89924 95106 -35896 40093 6058 97294 307603 161728 -40814 -258161 -92487
1539 -92487 175226 27946 -142808 -146011 -33654 -17953 -184599 -174383 -143029 -215811 -122232
1528 -122232 78281 17677 -184854 -259572 -293040 -31805 -60117 -15299 -114162 -117776 -45808
1517 -45808 7764 64785 127999 219107 157534 180180 165828 125973 88513 100242 -59376 -92434
1505 -92434 -8611 103133 -75823 48886 135227 151777 271399 28805 18811 103833 23578
1494B3578J61461k9790j32346j05518J54030Q6174o6884Q3736n6442J0940p6965
1483E1974o39j08973j85267J39210J66286j07156P0647Q4662q9920O9945j15479
1472b4710o6536J73089k459q5029K2861j09235J14560m6635P5070J74195j05405
1461A19766J77343k37641q2964K9874l9380M9753Q7273k8244Q1458j3345L3772
1450A77665K6422j81178J31744j22318q1917J72410k8233p0816O3739J8056N5383
1439A60957p2596Q4631j92955L2974R6823O2867o4687J10760l5735j04467L7789
1428A16361j87388j12480O9032J04810L6530m1323J61161o2785n9411J6144j7303
1417B3348N713j10658N9952Q1634j32549K9560O4384P2382j00714p6451J15566
$$ plain form
1494 23578 185039 155249 22903 -82615 71415 157589 90705 174441 117999 128939 51974
1483 51974 51335 -57638 -242905 -103695 62591 -44565 26082 110744 20824 90769 -24710
1472 -24710 -91246 81843 79384 -5645 17216 -92019 22541 -24094 50976 225171 119766
1461 119766 297109 59468 -23496 6378 -33002 16751 104024 75780 157238 143893 177665
1450 177665 204087 22909 154653 32335 -49582 122828 94595 23779 87518 105574 160957
1439 160957 88361 172992 -19963 13011 109834 172701 108014 218774 183039 78572 116361
1428 116361 -71027 -183507 -114475 -9665 26865 -14458 146703 83918 24507 40651 23348
1417 23348 29061 -81597 -21645 59989 -72560 -43000 21384 93766 -6948 -83399 32167
1406C2167q2614J51796P1155j55358n0724J55525J9265n0890j63454R3619K17827
1395B38314R3027k89418J05622j01258k13826K86571Q0743J00784l6963j17400
1385A46196P4389k85474R6701j00466J51411J41431k18567O4211o4655O2707J26770
1374A94654m2135j80175L7040j54306J68004j38401J36588P0798L0218J6050j81825
1363d3490M2251k4265l3367J52145q5405j08535R9133j91654P8018K3875M6232
1352d5062K740r9223j46756K35092m5634M0561j82031q7404J94993R6278N8148
1341B1702j980R2431j57054k62973J49831J0049k9597L5153K10262n1354R9217
1330A15687M4947k17910m7640N4449K3469m9230J26663J01529k79391R1857L6432
$$ plain form
1406 32167 -50447 101349 172504 17146 -33578 121947 141212 90322 -73132 20487 238314
1395 238314 331341 41923 147545 46287 -167539 119032 199775 300559 263596 146196
1385 146196 220585 -64889 31812 -68654 82757 224188 5621 69832 5177 67884 194654
1374 194654 152519 -27656 9384 -144922 23082 -115319 21269 92067 122285 138335 -43490
1363 -43490 -1239 -25504 -58871 93274 7869 -100666 -1533 -193187 -115169 -91294 -45062
1352 -45062 -42322 -141545 -288301 -53209 -98843 -58282 -240313 -327717 -132724 -36446 21702
1341 21702 19722 112153 -44901 -307874 -158043 -147994 -177591 -142438 67824 16470 115687
1330 115687 160634 -57276 -104916 -50467 -26998 -76228 50435 151964 -127427 -35570 862
1319H62R6396K04839k25674J7883l0119o604n6128p7123l3498j04103M2538J65354
1307e377j2243L5968l3172k1866R0285K19446j99518j84970j92972J56331J3105
1296a34983J32161j88684o8366p985Q0290J62575P7886j2769j08620o8496r6853
1285b33844p4512K69142K1869Q9576n9958l8949N3293j04398j71085L8899J60107
1274d9860n9690m4274r5792J5627J37445p69j96824K8025J09095K3137m8432j4538
1262a96850J3631L91535k4217R3732q8322j09696k41592M1983J57940j42045j82176
1251b86077J22984J42487o8810j1298J29282Q391k80582m788J69400J96043m3559
1240G3473j38368n509J9247Q6797R7739k30215l30034J53723J5968J05480L6096
$$ plain form
1319 862 97258 302097 76423 94306 64187 57583 1455 -75668 -109166 -213269 -170731 -5377
1307 -5377 -17620 18348 -14824 -36690 53595 273041 73523 -111447 -304419 -148088 -134983
1296 -134983 -2822 -191506 -259872 -267857 -187567 -24992 52894 40125 -68495 -136991 -233844
1285 -233844 -308356 -39214 -17345 72231 12273 -26676 26617 -77781 -248866 -209967 -49860
1274 -49860 -109550 -153824 -249616 -233989 -96544 -97313 -294137 -266112 -157017 -133880 -182312 -196850
1262 -196850 -183219 208316 184099 277831 189509 79813 -161779 -119796 38144 -103901 -286077
1251 -286077 -163093 -20606 -89416 -100714 28568 36959 -243623 -248411 -79011 117032 73473
1240 73473 -64895 -70404 -51157 35640 133379 -96836 -426870 -273147 -257179 -151699 -115603
1229a15603J69264J90468l47413l002J54910j06399q0798J38676N192j21300o9382
1218a85387j69472J35836K28989m1013p0250l6206Q6521m9933j11207J30152K7574
1207e4396k5792K2505J71490l630j25700p6807L3154P771J59532J78869p9751
1196B07245q5789n4073J43727R9905j38668k42476m9831J10091R9986M4094j24780
1185I431j17374N9248J59298O1114j73329q817J95325j06085k86619Q9077l2842
1174a51573Q609K67315j10170j55873J75414K08518j73530k19488L46662n215
1164A90669j97008K1420N5277j07551J29984N5121j25611m0707L8609k42314p0462
1153b92573J73041N8269K4057q1540k1932K47383o7325m6082o2800O7558J41125
$$ plain form
1229 -115603 53661 244129 -103284 -106286 48624 -57775 -138573 103 5295 -116005 -185387
1218 -185387 -354859 -219023 9966 -31047 -101297 -137503 -50982 -100915 -212122 -81970 -54396
1207 -54396 -80188 -57683 113807 110177 -15523 -92330 -59176 -51405 108127 286996 207245
1196 207245 121456 67383 211110 311015 172347 -70129 -119960 -9869 90117 134211 9431
1185 9431 -107943 -48695 110603 171717 -1612 -10429 184896 78811 -207808 -118731 -151573
1174 -151573 -142964 124351 14181 -141692 33722 242240 68710 -150778 195884 190669
1164 190669 -6339 15081 70358 -37193 92791 147912 22301 -18406 20203 -222111 -292573
1153 -292573 -119532 -61263 -37206 -118746 -140678 106705 39380 -6702 -69502 -1944 139181
1142A39181Q949O181m3915M888o6765K88451j9687j99867m5183n3478m6n785K3784
1129C6708N7902J05000n841N129J8655j2165o4783p0542P7008P9619j88670j29704
1117i1684j9497j4174M374l108P3712j60366j79j63331Q3290J99123Q1509j52672
1105a63003o2565J00380L5152k639j11691o4864K19414N2985j56679r7517J12365
1094a38662L34415j06405o6306j0145M0015J92481L5673O5206j21489p6630k6251
1083A21902R023K2259n5295R430j29501q7115K9362j9390J86675j21071r4225
1072a27946q5725J8855P0030J12289Q0853O902j2873l319R0209p0391r6588m1303
1060e9007K4746M3946j09093O1083M0906L0117J7169L5283J31186L1584L3627
$$ plain form
1142 139181 148130 154311 110396 115284 48519 336970 317283 117416 72233 18755 18709 12924 36708
1129 36708 94610 199610 193769 198898 217553 205388 140605 70063 147071 226690 38020 -91684
1117 -91684 -111181 -125355 -120981 -124089 -50377 -210743 -210922 -374253 -290963 -91840 -10331 -163003
1105 -163003 -225568 -125188 -90036 -92675 -204366 -269230 -49816 3169 -153510 -251027 -138662
1094 -138662 195753 89348 23042 12897 52912 245393 281066 346272 224783 148153 121902
1083 121902 130925 153184 97889 107319 -22182 -109297 -79935 -99325 87350 -33721 -127946
1072 -127946 -213671 -194816 -124786 -12497 68356 75258 62385 59066 149275 78884 -17704 -59007
1060 -59007 -34261 9685 -99408 -38325 2581 32698 49867 85150 216336 247920 281547
1049B81547j72589l9609N8602K7077k8341J1733J22616m018j10806O9224m7752
1038A67684l07080O7628P1062N3946j01403K910n4962J0521j22279J09749K25779
1027A23555k63872J65879r2719L0638o0045M1928L2890J43930J17427p1881k5512
1016A42218j4636k50632M1089J98844R9649P5757m7873j07364M4594j04097R7974
1005A75523J7221J6019k35669j12924O3779Q5356K4075p5708J22490j08106j53916
994a81860m2770l0642J55155r2543m6774Q4936J79487Q1307k5364j9991k0950
983C9991o1032j42402J25029r0970k6196m7525J63974l0619J7792q5929O8420
972f9467M811J720J57360N4053k30878j06972J2198J38674J70787j48171j32198
$$ plain form
1049 281547 108958 69349 127951 155028 126687 138420 261036 257018 146212 215436 167684
1038 167684 -139396 -71768 -706 53240 -48163 -45253 -100215 -89694 -211973 -102224 123555
1027 123555 -140317 25562 -67157 -36519 -96564 -54636 -21746 122184 239611 167730 142218
1016 142218 127582 -123050 -81961 116883 216532 292289 244416 137052 181646 77549 175523
1005 175523 192744 208763 -26906 -139830 -76051 9305 33380 -42328 80162 -27944 -181860
994 -181860 -224630 -255272 -100117 -192660 -239434 -154498 24989 106296 80932 60941 39991
983 39991 -21041 -163443 -38414 -129384 -155580 -203105 -39131 -69750 -51958 -137887 -69467
972 -69467 -64656 -62936 94424 148477 -82401 -189373 -177175 -38501 132286 -15885 -148083
961a48083j9601K7215P4934J21259K10126k49352n188J65230j84788q0369O842
950h1775K7508J29993p9711j10435Q6401k35059o0699n3003K05497n6853Q2349
939a45787J59833J94899r1774k2156m3763j77845m8058p0279l4761l2946K30122
928h2515n6743K1366J91267O2309j18788J6797j50612j476j10893j34544J37923
917b25909n60J08907J3671L0330j87393O0488k2540j23152O8586n5199J20871
906b11900L3140j64133J08265K86409p7015k22881N0169J34286M6350P5803k45422
895a86929K02376j01144j3806J25366J38384j72645j09716N2924k2974K1013J60844
884I3693P1260p8165r3680J85704Q5374k72948l9252r5516P0690L5166m5674q3462
$$ plain form
961 -148083 -167684 -140469 -65535 55724 265850 16498 11310 176540 -8248 -88617 -81775
950 -81775 -54267 75726 -3985 -114420 -28019 -263078 -323777 -376780 -171283 -228136 -145787
939 -145787 14046 208945 117171 95015 51252 -126593 -174651 -244930 -279691 -312637 -82515
928 -82515 -139258 -117892 73375 135684 16896 33693 -116919 -118395 -229288 -363832 -225909
917 -225909 -226469 -117562 -103891 -73561 -260954 -200466 -223006 -346158 -277572 -332771 -211900
906 -211900 -178760 -342893 -234628 51781 -25234 -248115 -197946 -63660 -17310 58493 -186929
895 -186929 15447 -85697 -99503 25863 164247 -8398 -118114 -65190 -88164 -67151 93693
884 93693 164953 86788 -6892 178812 264186 -8762 -48014 -143530 -72840 -37674 -83348 -166810
872a66810j46178K42101n9860k9501J03794j23894O203m824K3540O2324j4402
861a07507J29296N8264k19602n1786J33256L8549L4016m2774k3716o4719L5507
850h1216J32456q7703Q8100m9368l0086r4487p206N0134L577j29076J70909J49025
838A15059K0126j7024M9546j40297j40639J69967P2223j04744M0347l28357l4593
827b98386J65622K07964j3099o583p3915o1052m4164p0439K6679j47700J51987
816a63086J20675n3046p9434P9618M1274j01615L3449J73429L2472p3432L0348
805D0652J7688r5086j17183J01926m930K3051L9094j50040k1747j05730O2337
794b09968J39699L9398r2222q9680J6019j92216J78156J09211l7281J59186j6164
$$ plain form
872 -166810 -312988 -70887 -130747 -160248 -56454 -180348 -174145 -178969 -155429 -93105 -107507
861 -107507 21789 80053 -139549 -191335 -58079 -19530 14486 -28288 -52004 -116723 -81216
850 -81216 51240 -36463 51637 2269 -27817 -122304 -129510 -79376 -75799 -204875 -33966 115059
838 115059 135185 118161 167707 27410 -113229 56738 128961 24217 64564 -263793 -298386
827 -298386 -132764 75200 62101 55518 -18397 -79449 -123613 -194052 -167373 -315073 -163086
816 -163086 -42411 -95457 -174891 -95273 -53999 -155614 -122165 51264 83736 10304 40652
805 40652 58340 -36746 -153929 -52003 -56933 -33882 5212 -144828 -166575 -272305 -209968
794 -209968 -70269 -30871 -123093 -212773 -196754 -388970 -210814 -101603 -138884 20302 4138
783D138j2507J12531n4670M5978J6247r2319j42138k7516J53443m6376K4208L4221
771A5240o4695j60530K35151M5404l8348j12675k9900R7335l3531r9916m1645
760a88110J02573N2021l4413k8357k9893Q0311k7506L9163p8415J38952j96169
749a69843O7459K54063q6588n2870P103J28240P3961n7801j74012Q0104N7173
738A26989n9731k18693K59125K9802m7138j37877P8404j1244j04778L8093J9444
727b7604p8165L11567k3506j9812m4653j53748J69766j66437Q2878l1958J25551
716A43879K7248k49116M5772N8073m6621R9670r5958N6313j8447J51428j10337
705F1904k79605J5101J75508L746J32475r5818j72063N6081Q6294j14896R9569
$$ plain form
783 4138 -8369 104162 49492 95470 111717 19398 -122740 -150256 3187 -43189 -18981 15240
771 15240 -49455 -209985 25166 70570 32222 -80453 -110353 -13018 -46549 -146465 -188110
760 -188110 -85537 -33516 -67929 -96286 -126179 -45868 -73374 -34211 -112626 26326 -169843
749 -169843 -102384 151679 65091 12221 19324 147564 221525 163724 -10288 69816 126989
738 126989 67258 -151435 107690 137492 90354 -47523 30881 19637 -85141 -47048 -27604
727 -27604 -105769 205798 182292 162480 117827 -35921 133845 -32592 50286 18328 143879
716 143879 171127 -77989 -32217 25856 -20765 78905 -17053 39260 20813 172241 61904
705 61904 -217701 -202600 -27092 -23346 109129 13311 -158752 -102671 -16377 -131273 -31704
694c1704R2750J70674J27858j03825j729j7009j27462M2591j24575k7831K736
683B474k41638J50411L3266j84021L07543J86462J6440j81501j07953K40887j00469
672A21901K2326q3558m1949l381J15707k3970o7916K0689J02495L6572j07759
661I1157l6172R1957l2687k7867j12826j1482J08904R4921j82851Q4836J47802
650B15692k92763m1732r876k8732O2996j38569M29869N9704l04683k7650j47606
639b23350n154M1672L6578R5799J21709p05p2966j10999J87462j44887j86514
628b61355J55398J75909o2587J33426l5410j71446l5213k02727K15033J14574
618B5602o4192j18774J21918R2764o8974M9243O0330j42030m7551P2597K32194
$$ plain form
694 -31704 61046 231720 359578 255753 254024 237015 109553 152144 27569 -262 2474
683 2474 -239164 -88753 -55487 -239508 68035 254497 270937 89436 -18517 222370 121901
672 121901 144227 60669 18720 15339 131046 107076 39160 59849 162344 198916 91157
661 91157 54985 146942 114255 86388 -26438 -37920 70984 165905 -16946 67890 215692
650 215692 -77071 -118803 -128679 -157411 -94415 -232984 196885 256589 -48094 -75744 -223350
639 -223350 -228504 -186832 -150254 -54455 67254 66549 -6417 -117416 70046 -74841 -261355
628 -261355 -105957 69952 7365 140791 105381 -66065 -101278 -304005 -88972 25602
618 25602 -38590 -157364 -35446 57318 -11656 37587 97917 -44113 -91664 -19067 213127
607B13127k8727k29279K0076m9584j2530J26914j51313n0683R6841M6047o4481
596h3592J12205N6523k00985J03270O6969j65766m5278J39265M7198j62715K9496
585a03410J17090p0486r6077n6843J63506J06963J6972J6706K1520j50455J08310
574G3796M7275p9607j58073j0119J95953j36264j837O3016r5889p3265p3856Q6555
562a62315J35262J02813J68248k56875r4859l3249J55528J36075j21472j4666
552A4490o9269Q2945n2661p8350P9649J01944r1073q724J93083N5483j02058l45924
540b20465L2812J95144N3764l7028o6450o7888j34003p7224N7736N8235J56736
529d8631j5336m763J71387K945o3187r3988M1702J31693k04866P6136J69356k63660
$$ plain form
607 213127 184400 -44879 -24803 -74387 -86917 39997 -111316 -161999 -65158 -19111 -83592
596 -83592 28613 85136 -115849 -12579 54390 -111376 -156654 -17389 29809 -132906 -103410
585 -103410 13680 -56806 -152883 -209726 -46220 60743 77715 94421 115941 -34514 73796
574 73796 121071 41464 -116609 -126728 69225 -67039 -68876 -5860 -101749 -175014 -248870 -162315
562 -162315 -27053 75760 244008 -12867 -107726 -140975 14553 150628 29156 14490
552 14490 -54779 28166 -24495 -102845 -23196 78748 -12325 -21049 172034 227517 125459 -220465
540 -220465 -187653 7491 61255 24227 -42223 -110111 -244114 -321338 -263602 -205367 -48631
529 -48631 -63967 -68730 102657 105602 42415 -51573 -9871 121822 -83044 -6908 162448 -101212
517a01212M6610K1408K04315p2251K1568q9858k3321O7508M7366m9519L4910r6682
505A0842J36665j86446j54781L3765J98560k02572n0989K86706J4493O6350m3949
494A08644m2847j61780O395J2479M1776J2939n5343M9035J75925j61760J05902
483I1365J0350j05290j07283l1908Q419J71693Q5261o4873M4570L9122Q0496j36538
471H5384P2871m9503K7592o7320k9671o946M8786m2545k21931J10932Q1163n795
459C017R134J35148o2683j05172o7902O8355R7656p6486J00612J09777o5720p2398
447G3338j7428j63737J06914J55737l44204K65488j53004j7336R3041R7265O0273
436A56347J1871q3936l1104Q1189K0468P7920k64536o0159J08251J81052p0387
$$ plain form
517 -101212 -54602 -33194 171121 98870 120438 30580 7259 74767 122133 72614 107524 10842
505 10842 147507 -38939 -193720 -159955 38605 -163967 -214956 71750 86243 152593 108644
494 108644 65797 -95983 -89588 -77109 -35333 -22394 -77737 -28702 147223 -14537 91365
483 91365 101715 -3575 -110858 -142766 -134347 37346 122607 57734 102304 141426 221922 85384
471 85384 158255 108752 136344 69024 39353 32407 81193 38648 -183283 -72351 8812 3017
459 3017 12151 147299 84616 -20556 -88458 -20103 77553 1067 101679 211456 145736 73338
447 73338 55910 -107827 -913 154824 -189380 76108 -76896 -94232 -1191 96074 156347
436 156347 168218 84282 53178 134367 154835 232755 -31781 -91940 16311 197363 126976
425A26976j35902J15150J6615r5584M523R9218j66278o1288M1483M1636O5974
414E2523Q9158L2027j55898q2663O3456j03627R5482m4860q8826k46529J31252
403b58505K05644M1149K421M6554J23034p5058J29752r1898j33484k01311J65211
392d6491K65519J57701j01934J0296j2237j10581j17750J44889r4788j95123J8130
381h2369J8761J71817j19638J46701j84467o6807J73019N1717n996J5983J01804
370B20525j20929j32796N8147K37396q387j45755j52911J98279o4425K9485Q4445
359B03074m9202j00435j95750R5253J22816k7460J9192n0378L9275j19536J8682
348d4469J23235j51694k1319j830o7652K78276j95905j25923l7345J79512K7280
$$ plain form
425 126976 -8926 106224 122839 27255 31778 130996 -35282 -96570 -55087 -13451 52523
414 52523 141681 173708 17810 -64853 -1397 -105024 -9542 -54402 -143228 -389757 -258505
403 -258505 -52861 -11712 -9291 37263 160297 85239 214991 123093 -10391 -211702 -46491
392 -46491 219028 376729 274795 285091 272854 162273 44523 189412 94624 -100499 -82369
381 -82369 -63608 108209 -11429 135272 -49195 -116002 57017 108734 102738 118721 220525
370 220525 99596 -33200 24947 262343 253956 108201 -44710 153569 89144 118629 203074
359 203074 153872 53437 -142313 -47060 75756 48296 67488 17110 56385 -63151 -44469
348 -44469 78766 -72928 -94247 -96077 -163729 114547 -81358 -207281 -244626 -65114 -37834
337c7834j0128P978j02238J73250j7959j27613q5842J52731J84055R5917j79255
326E3062J4449K05473j86083k7526o1188j53237J40315Q8692j88040o6899R9737
315h1245J71959R6935k15754L4880q936J36546J7406N3635m6264j10108P9499
304A28553j19022J71605L9960j66671J88057k38433O8532m0665j80615o283J08651
293d6331j42796Q1194J27731k37652J02702l1677J37179K79898j77560L1827J35445
282B59960J6808l5740j23077k23947J04231j37843o4600k8583m3228J59411L64170
271B47562n465j51550o8469J94560J13800k35711r0207J1061K27013J1509P2508
260C26611q9899j17519O7113M4161r6544J28941k00340l4008J72912J843j07650
$$ plain form
337 -37834 -47962 -39984 -142222 31028 13069 -114544 -200386 -47655 136400 232317 53062
326 53062 67511 272984 86901 59375 -1813 -155050 -14735 73957 -114083 -180982 -81245
315 -81245 90714 187649 -28105 6775 -2161 134385 151791 205426 159162 49054 128553
304 128553 9531 181136 221096 54425 242482 4049 72581 31916 -148699 -154982 -46331
293 -46331 -189127 -107933 19798 -217854 -115152 -146829 -9650 270248 92688 124515 259960
282 259960 276768 241028 117951 -105996 -1765 -139608 -204208 -232791 -276019 -116608 247562
271 247562 242097 90547 22078 216638 330438 94727 4520 15581 242594 254103 326611
260 326611 236712 119193 186306 230467 133923 262864 62524 28516 201428 203271 95621
249I5621J07166k06424L1382M8197m6506k0429J1465J25946p0112N718R6710K1088
237A99822j56776l4937J59558j07575o5130j660K1035k965r7012P3785L5754j4885
225I014M8480J8628r5839q1305J66497o9488n2451j30647J67063N2854m1015p8223
213h6432Q3244K12305O9981k5109j10797K0619R2939o8281k28182K3969M6155
202C0411M4518m6283M6640q7090Q4308q3027j15628k31707K40881L10417j03150
191I0290M7355P0689J6529k33951P9631k8559o1571J4104K6823n6975j40374J72604
179c405L7426J26374k2703l4003q4036N3776n3829K2988L0614J76451m545p0594
167A74514l790n6776j62543R4398j5306J07124P9732N3007N8496l36148q5654
$$ plain form
249 95621 202787 -3637 27745 75942 29436 9007 20472 146418 76306 82024 178734 199822
237 199822 43046 8109 167667 60092 -5038 -6698 14337 11372 -85640 -11855 23899 9014
225 9014 57494 76122 -19717 -101022 65475 -4013 -56464 -187111 -20048 32806 -8209 -86432
213 -86432 -3188 209117 279098 253989 143192 163811 256750 188469 -39713 -15744 30411
202 30411 74929 28646 75286 -11804 72504 -10523 -126151 -357858 -116977 193440 90290
191 90290 137645 208334 224863 -9088 70543 41984 -19587 -5483 21340 -35635 -176009 -3405
179 -3405 34021 160395 137692 103689 19653 73429 19600 42588 73202 249653 245108 174514
167 174514 170724 113948 -48595 45803 30497 137621 217353 270360 328856 -7292 -92946
156i2946m9674J02266J147J5929J09166p9186o1039K32175Q8363k33879j6893
145A5429J72621p0739j4749k3227R9168j13817M5490j40271o9925O1128Q0980
134D2088J22654l2082j04057j10002J38324K32007j02396q8741o3356j52562K22064
123A03941M4488r8422l6279J17091K1313K6649j75407k7441M6352O2612j2084
112G2813n2490j02549L1972M2684J0587J25219K5882r7881j17707J29210M3421
101A11161o5876P3984l7339j09926M2852J37986m9044O1552K7420j79673m7359
90c4262J43044M8845L2291O5483p9024l8694O4183l300j78261k7078R3862J79331
78B66420j49619k50739J0918J48109k0972J93403K9515j48259Q2882J02106j39888
$$ plain form
156 -92946 -142620 -40354 -39207 -23278 85888 6702 -54337 177838 266201 32322 15429
145 15429 188050 117311 102562 79335 178503 64686 110176 -30095 -100020 -38892 42088
134 42088 164742 132660 28603 -81399 56925 288932 186536 97795 34439 -118123 103941
123 103941 148429 50007 13728 130819 152132 178781 3374 -24067 22285 84897 72813
112 72813 20323 -82226 -50254 -7570 3017 128236 154118 56237 -61470 67740 111161
101 111161 45285 119269 81930 -27996 14856 152842 103798 165350 192770 13097 -34262
90 -34262 108782 157627 189918 255401 176377 137683 201866 198566 20305 -6773 87089 266420
78 266420 116801 -133938 -123020 25089 4117 197520 227035 78776 161658 263764 123876
67A23876j21238r750O3490P1546K0002p2015J42960p424o2958j31091l1027J77326
55A63697O3286n8675q8841O9748j11784r4496M4723j609L9255l762J13639J32400
43B67581q5616j46140m9250n3414J16081o3619j2954Q7377L117j0552P7739L6062
31A66412L1381O2589n4669l5995N0427M6336j42775q3074J9859L4744J7339j1114
19A01460J1080n6126K2312L00o2152j14767k4473L4846K1439J39566R4717K7954
7A96156q5909J5632M6770J36929j62876l9032j02001
0E669
$$ plain form
67 123876 2638 -7112 56378 127924 147926 75911 218871 211447 148489 17398 -13629 163697
55 163697 226983 168308 79467 149215 37431 -57065 -12342 -13951 25304 21542 135181 267581
43 267581 181965 35825 -13425 -66839 49242 -14377 -27331 60046 63163 52611 130350 166412
31 166412 197793 260382 205713 169718 220145 266481 123706 40632 60491 95235 112574 101460
19 101460 112540 56414 78726 79026 16874 -97893 -122366 -87520 -66081 73485 168202 196156
7 196156 110247 125879 172649 309578 146702 107670 5669
0 5669
$$ Imaginary data points
##PAGE= N=2
##DATA TABLE= (X++(I..I)), XYDATA
16383a913585J86730l7254K339P8380j85717J67973j6172J0747k3795q196O5349
16372a673201J26765j7102p9487K6130J54515J12450j06915l0678L2524o5172
16362a520171P1066N9124M8722o4519j4340l9337J19685K89981J10p740p4267
16351a131686N8304R3410l3946j26117J30499n6650Q0557J33712R4186j23144
16341h80875q9207n4842J34901J67334p6007J65880M633K0485j47007L3761J77595
16330e43349J00528n5707J11597p47j5589M8877N0317J8969J4261j1798k7600
16319c10241N9562J01193j91355O823k1607J41808P8733l1976j771P5109o2518
16308a56240R6063J35165n9096N3805j54618K3243J7773R7194n076j5228P3515
$$ plain form
16383 -1913585 -1726855 -1764109 -1761770 -1683390 -1869107 -1701134 -1717306 -1706559 -1730354 -1738550 -1673201
16372 -1673201 -1546436 -1563538 -1643025 -1616895 -1462380 -1349930 -1456845 -1487523 -1454999 -1520171
16362 -1520171 -1449105 -1389981 -1341259 -1405778 -1420118 -1459455 -1339770 -1049789 -1049679 -1057419 -1131686
16351 -1131686 -1073382 -979972 -1013918 -1140035 -1009536 -1066186 -985629 -851917 -757731 -880875
16341 -880875 -970082 -1024924 -890023 -722689 -798696 -632816 -628183 -607698 -754705 -720944 -543349
16330 -543349 -442821 -498528 -386931 -387678 -403267 -354390 -304073 -285104 -270843 -282641 -310241
16319 -310241 -250679 -149486 -340841 -334018 -355625 -213817 -135084 -167060 -168831 -93722 -156240
16308 -156240 -60177 74988 15892 69697 -84921 -61678 -43905 53289 48213 32985 106500
16297A06500r5851J82264J42702p2045m4702p1446P7022m9018O9829p0812K6610
16286B01053M4477Q2440l5865J97533Q8896L7495o9182M4137P8535j82207O1513
16275E48825L737K09871M9547j36520L092J16657j0423L1047R0048k32009k8994
16264F44878J07773Q2832p8616J46909j3313p0460L7932P9811P1171O004l7471
16253I77450J72197L8556k70377J00124l5085j9159j14184J47186L2528p9107
16243I50129O0692M4129k2371N0095N3731N2666j19435J28357L3553J754J20016
16232A353316p9994n0062N1481J29242P005n3107J83994k00359J92292n7425j23629
16221A352754N163j33632J38665J960J08515Q1261j4155N0558Q5845p3203N001
$$ plain form
16297 106500 10649 192913 335615 263570 218868 147422 224444 175426 245255 174443 201053
16286 201053 245530 327970 292105 489638 578534 616029 546847 590984 669519 487312 548825
16275 548825 552562 762433 811980 675460 678552 795209 784786 815833 905881 673872 644878
16264 644878 752651 835483 756867 903776 890463 820003 857935 937746 1008917 1014921 977450
16253 977450 1149647 1188203 917826 1017950 982865 963706 849522 996708 1029236 950129
16243 950129 1010821 1054950 1032579 1082674 1136405 1189071 1069636 1197993 1231546 1233300 1353316
16232 1353316 1273322 1223260 1274741 1403983 1410988 1357881 1541875 1341516 1533808 1476383 1352754
16221 1352754 1357917 1224285 1362950 1364910 1473425 1554686 1540531 1591089 1676934 1603731 1608732
16210A608732j1629N0930K3666J5087j47489r9964Q960j28847J33653j44536j1248
16199A297315J92969j27522k7916O0356K84401j62345j8879k6570J11073J27720
16189A710602j33033O7743l0568J18557L3016N0863Q2248K6204J1592k32631Q9722
16178A794315n4925l3362R8584K5724O6890r5729M3849j34270l6402J41379L04008
16167B120061k24359j92957J40493o462J14752M1600J20240q4025L651q3950j73884
16156A775160Q7049J28429l44m8429j07836j70458R4035J94652j9514J36466M9323
16145B118533k15339o60J43019r8745J60315j67528J35549J9759k92219M4915
16135A847599P5986M7632j3994P8052o2455k4737J4822l3122K28653j11021J8989
$$ plain form
16210 1608732 1597103 1648033 1671699 1686786 1539297 1439333 1448293 1319446 1453099 1308563 1297315
16199 1297315 1490284 1362762 1334846 1395202 1679603 1517258 1498379 1471809 1582882 1710602
16189 1710602 1577569 1645312 1614744 1733301 1766317 1817180 1899428 1925632 1937224 1704593 1794315
16178 1794315 1739390 1706028 1804612 1830336 1897226 1801497 1845346 1711076 1674674 1816053 2120061
16167 2120061 1895702 1702745 1843238 1836776 1951528 1993128 2113368 2029343 2032994 1949044 1775160
16156 1775160 1862209 1990638 1990294 1941865 1834029 1663571 1757606 1952258 1932744 2069210 2118533
16145 2118533 1903194 1902534 2045553 1946808 2107123 1939595 2075144 2094903 1802684 1847599
16135 1847599 1923585 1971217 1957223 2035275 1972820 1948083 1962905 1929783 2158436 2047415 2066404
16124B066404r4822k2833J65884P6300J43973j15053q795m651j05785k3105r441
16113B068076n2919j33366L324J44417R4963k5565j03990Q5073O0618l2262P2504
$$ plain form
16124 2066404 1971582 1948749 2114633 2190933 2334906 2219853 2211058 2206407 2100622 2077517 2068076
16113 2068076 2015157 1881791 1885115 2029532 2124495 2098930 1994940 2080013 2140631 2108369 2180873
$$ [...]
##END NTUPLES=NMR SPECTRUM
##END=
