##TITLE=1H_TG-2307-G-1
 CDCl3
 8 sc, 
 14.6.2023
##JCAMPDX= 6.0         $$ Bruker NMR JCAMP-DX V2.0
##DATA TYPE= NMR SPECTRUM
##DATA CLASS= NTUPLES
##ORIGIN= UXNMR, Bruker Analytische Messtechnik GmbH
##OWNER= root
$$ XWIN-NMR		Version 3.5
$$ Wed Jun 14 13:42:46 2023 Russian Standard Time (UT+4h)  she@DPX200
##.OBSERVE FREQUENCY= 200.13135
##.OBSERVE NUCLEUS= ^1H
##.ACQUISITION MODE= SIMULTANEOUS
##.ACQUISITION SCHEME= undefined
##.AVERAGES= 8
##.DIGITISER RES= 18
##SPECTROMETER/DATA SYSTEM= spect
##.PULSE SEQUENCE= zg30
##.SOLVENT NAME= CDCl3
##.SHIFT REFERENCE= (INTERNAL, CDCl3, 0, 15.7645)
##AUDIT TRAIL= $$ (NUMBER, WHEN, WHO, WHERE, WHAT)
$$ ##TITLE= Audit trail, XWIN-NMR		Version 3.5
$$ ##JCAMPDX= 5.01
$$ ##ORIGIN= Bruker BioSpin GmbH
$$ ##OWNER= she
$$ F:/spectra/data/she/nmr/H-F/1/pdata/1/auditp.txt
$$ ##AUDIT TRAIL=  $$ (NUMBER, WHEN, WHO, WHERE, WHAT)
(   1,<2023-06-14 13:41:17.29 +0400>,<she>,<DPX200>,
      <created by zg, POWCHK disabled, PULCHK disabled
       configuration hash MD5:
       00 E9 B6 7A A2 85 ED C7 34 08 36 98 17 FE 4E 26
       data hash MD5: 16K
       56 BC 5E 1C 70 0F 2E D0 83 D5 3E 26 58 DE 0F 7E>)
(   2,<2023-06-14 13:41:19.78 +0400>,<she>,<DPX200>,
      <Start of raw data processing
       efp BC_mod = 2 LB = 0.24 FT_mod = 6 PKNL = 1 PHC0 = -20342.67 PHC1 = 9.252722 SI = 16K 
       data hash MD5: 16K
       8F 96 14 74 1B 59 2C E5 08 22 D5 3E 42 E9 35 75>)
(   3,<2023-06-14 13:41:47.18 +0400>,<she>,<DPX200>,
      <pk PHC0 = -80.99517 PHC1 = 2.800001 
       data hash MD5: 16K
       65 3E AA E6 06 A7 46 38 4A 42 81 B0 35 11 FD FF>)
(   4,<2023-06-14 13:41:52.37 +0400>,<she>,<DPX200>,
      <abs ABSG = 5 
       data hash MD5: 16K
       29 A0 8C C4 A2 12 79 84 9A BA AB 5D F7 F6 72 46>)
$$ ##END=
$$ 
$$ hash MD5
$$ 0D E2 AB E4 9E F0 2C 40 AF 69 B1 85 27 02 55 6B
##$RELAX= 
##$RELAX= 
##$RELAX= 
##$RELAX= 
##$RELAX= 
##$RELAX= 
$$ Bruker specific parameters
$$ --------------------------
##$DU= <F:/spectra>
##$EXPNO= 1
##$NAME= <H-F>
##$PROCNO= 1
##$TYPE= <nmr>
##$USER= <she>
##$AMP= (0..31)
100 100 100 100 100 100 100 100 100 100 100 100 100 100 100 100 100 100 
100 100 100 100 100 100 100 100 100 100 100 100 100 100 
##$AQSEQ= 0
##$AQ_mod= 1
##$AUNM= <au_zg>
##$AUTOPOS= <>
##$BF1= 200.13
##$BF2= 200.13
##$BF3= 200.13
##$BF4= 200.13
##$BF5= 200.13
##$BF6= 200.13
##$BF7= 200.13
##$BF8= 200.13
##$BYTORDA= 1
##$CFDGTYP= 0
##$CFRGTYP= 5
##$CHEMSTR= <none>
##$CNST= (0..31)
1 1 145 1 1 1 1 1 1 1 1 1 1 1 1 1 1 1 1 1 1 1 1 1 1 1 1 1 1 1 1 1 
##$CPDPRG= <>
##$CPDPRG1= <>
##$CPDPRG2= <>
##$CPDPRG3= <>
##$CPDPRG4= <mlev>
##$CPDPRG5= <mlev>
##$CPDPRG6= <mlev>
##$CPDPRG7= <mlev>
##$CPDPRG8= <mlev>
##$CPDPRGB= <>
##$CPDPRGT= <>
##$D= (0..31)
0 1.2 0 0 0 0 0 0 0 0.06 0 0.03 0 0 0 0 0.0002 0 0 0 0 0 0 0 0 0 0 0 0 
0 0 0 
##$DATE= 1686735676
##$DBL= (0..7)
120 120 120 120 120 120 120 120 
##$DBP= (0..7)
150 150 150 150 150 150 150 150 
##$DBP07= 0
##$DBPNAM0= <>
##$DBPNAM1= <>
##$DBPNAM2= <>
##$DBPNAM3= <>
##$DBPNAM4= <>
$$ [...]
##$SUBNAM3= <"">
##$SUBNAM4= <"">
##$SUBNAM5= <"">
##$SUBNAM6= <"">
##$SUBNAM7= <"">
##$SUBNAM8= <"">
##$SUBNAM9= <"">
##$SW= 18.05172834244
##$SWIBOX= (0..15)
0 0 2 0 0 0 0 0 0 0 0 0 0 0 0 0 
##$SW_h= 3612.71676300578
##$TD= 16384
##$TD0= 1
##$TE= 0
##$TE2= 300
##$TE3= 300
##$TEG= 300
##$TL= (0..7)
0 120 120 120 120 120 120 120 
##$TP= (0..7)
150 150 150 150 150 150 150 150 
##$TP07= 0
##$TPNAME0= <>
##$TPNAME1= <>
##$TPNAME2= <>
##$TPNAME3= <>
##$TPNAME4= <>
##$TPNAME5= <>
##$TPNAME6= <>
##$TPNAME7= <>
##$TPOAL= (0..7)
0.5 0.5 0.5 0.5 0.5 0.5 0.5 0.5 
##$TPOFFS= (0..7)
0 0 0 0 0 0 0 0 
##$TUNHIN= 0
##$TUNHOUT= 0
##$TUNXOUT= 0
##$USERA1= <user>
##$USERA2= <user>
##$USERA3= <user>
##$USERA4= <user>
##$USERA5= <user>
##$V9= 5
##$VALIST= <valist>
##$VCLIST= <CCCCCCCCCCCCCCC>
##$VD= 0
##$VDLIST= <DDDDDDDDDDDDDDD>
##$VPLIST= <PPPPPPPPPPPPPPP>
##$VTLIST= <TTTTTTTTTTTTTTT>
##$WBST= 1024
##$WBSW= 4
##$XGAIN= (0..3)
0 0 0 0 
##$XL= 0
##$YL= 0
##$YMAX_a= 501466
##$YMIN_a= -490824
##$ZGOPTNS= <>
##$ZL1= 120
##$ZL2= 120
##$ZL3= 120
##$ZL4= 120
##$ABSF1= 15.71935
##$ABSF2= -2.3325
##$ABSG= 5
##$ABSL= 3
##$ALPHA= 0
##$AQORDER= 0
##$ASSFAC= 0
##$ASSFACI= 0
##$ASSFACX= 0
##$ASSWID= 0
##$AUNMP= <proc_1d>
##$AZFE= 0.1
##$AZFW= 0.1
##$BCFW= 0
##$BC_mod= 2
##$BYTORDP= 0
##$COROFFS= 0
##$CY= -3
##$DATMOD= 1
##$DC= 0
##$DFILT= <>
##$DTYPP= 0
##$F1P= 0
##$F2P= 0
##$FCOR= 1
##$FTSIZE= 16384
##$FT_mod= 6
##$GAMMA= 0
##$GB= 0
##$INTBC= 1
##$INTSCL= 3.70164e-10
##$ISEN= 128
##$LB= 0.24
##$LEV0= 0
##$LPBIN= 0
##$MAXI= 10000
##$MC2= 0
##$MEAN= 0
##$ME_mod= 0
##$MI= 1.114404
##$NCOEF= 0
##$NC_proc= -6
##$NLEV= 6
##$NOISF1= 3.799351
##$NOISF2= 2.8
##$NSP= 0
##$NTH_PI= 0
##$NZP= 0
##$OFFSET= 15.76452
##$PC= 1
##$PHC0= -20423.67
##$PHC1= 12.05272
##$PH_mod= 1
##$PKNL= yes
##$PPARMOD= 0
##$PSCAL= 0
##$PSIGN= 0
##$REVERSE= no
##$SF= 200.13000140629
##$SI= 16384
##$SIGF1= 3
##$SIGF2= 2
##$SINO= 5.538805
##$SIOLD= 16384
##$SREGLST= <1H.CDCl3>
##$SSB= 0
##$STSI= 16384
##$STSR= 0
##$SW_p= 3612.71676300578
##$SYMM= 0
##$S_DEV= 0
##$TDeff= 16384
##$TDoff= 0
##$TI= <>
##$TILT= no
##$TM1= 0
##$TM2= 0
##$TOPLEV= 0
##$USERP1= <user>
##$USERP2= <user>
##$USERP3= <user>
##$USERP4= <user>
##$USERP5= <user>
##$WDW= 1
##$XDIM= 16384
##$YMAX_p= 525878327
##$YMIN_p= -241282
$$ End of Bruker specific parameters
$$ ---------------------------------
##NTUPLES= NMR SPECTRUM
##VAR_NAME=  FREQUENCY,     SPECTRUM/REAL,   SPECTRUM/IMAG
##SYMBOL=    X,             R,               I
##VAR_TYPE=  INDEPENDENT,   DEPENDENT,       DEPENDENT
##VAR_FORM=  AFFN,          ASDF,            ASDF
##VAR_DIM=   16384,         16384,           16384
##UNITS=     HZ,            ARBITRARY UNITS, ARBITRARY UNITS
##FACTOR=    0.220516191357247, 1,           1
##FIRST=     3154.95334802283, 0,            0
##LAST=      -457.763414982946, 0,           0
##MIN=       -457.763414982946, -241282,     0
##MAX=       3154.95334802283, 525878327,    0
$$ Real data points
##PAGE= N=1
##DATA TABLE= (X++(R..R)), XYDATA
$$ [...]
8019 -110744 -165951 -50617 -74882 -19701 -44161 -55996 -23727 -67678 -118866 -113258 -18308 -49824
8007 -49824 -83942 -24949 -42816 -97745 -104217 -85970 -65718 -52743 -63377 -78555 -58627 -84878
7995 -84878 -150098 -139883 -131162 -160080 -99434 -61177 -80550 -117168 -117115 -90615 -50748 -28774 -58148
7982 -58148 -97922 -96095 -5294 -66737 -81031 -101743 -105874 -67444 -43722 -24774 -89503 -140260
7970 -140260 -114392 -101072 -146977 -148585 -130475 -127502 -142750 -136805 -105038 -52571 -85954 -101475
7958 -101475 -27702 -19318 -44926 -106553 -93852 -52107 -44174 -122867 -85673 -128474 -115382 -68412
7946 -68412 -77803 -49775 -53934 -76472 -100301 -29281 -89947 -127878 -122600 -132157 -56471 -49506 -111009
7933 -111009 -126459 -157826 -157720 -113184 -101569 -31752 -21689 -98495 -17490 32836 42685 -67725
7921 -67725 -82490 -72308 -28201 -27574 -79786 -80900 -27248 7965 -49179 -97317 -56339 -52484 -11301
7908 -11301 12538 16904 79203 26854 -40872 -14182 -106260 -124551 -98879 -30288 -49322 -91623
7896 -91623 -82068 -91263 -85777 -63416 -63733 -76806 -69244 -54514 -45277 -36347 -7715 -10861 -7026 -98356
7882 -98356 -32282 -1619 -35708 -80272 -93786 -100761 -85095 -52197 -81892 -139411 -136840 -43096
7870 -43096 -7795 -68518 -80102 -119363 -113777 -83407 -80830 -49150 -82269 -84555 -83029 -156425 -159758
7857 -159758 -69257 -71111 -45363 -64901 -153198 -129581 7037 -56969 -114770 -109047 -141751 -108807
7845 -108807 -150630 -78064 -117752 -157853 -116931 -156823 -138982 -135123 -174742 -142412 -105547 -59534
7833 -59534 -81803 -92253 -125381 -112547 -99959 -120587 -78933 -6313 -8998 -31927 -102481 -44011
7821 -44011 -147061 -120058 -140642 -107254 -189894 -225882 -187399 -165219 -184262 147984 307951
7810 307951 42816 42301 -51740 -49827 -45298 -40895 -78856 -55484 -136383 -53733 -27981 -97805
7798 -97805 -175119 -158788 -102106 -77885 -71041 -90874 -116148 -106829 -67098 -45579 -43704 -13523
7786 -13523 -46052 -98962 -59841 26642 -74485 -61322 -58781 -47802 -57754 -44523 -38143 -135119
7774 -135119 -138692 -131839 -165316 -172318 -132009 -99863 -118485 -89412 -87700 -28514 -55866 -84358
7762 -84358 -146029 -101715 -92281 -121562 -92170 -156205 -126464 -107047 -68383 -6713 -31996 -76930
7750 -76930 -84715 -97850 -88329 -53855 -34624 -16028 -59613 -165322 -152736 -169006 -182184 -153230
7738 -153230 -135765 -61405 30990 -47020 -32378 -32604 -55926 -75245 -97726 -71126 -86927 -61644
7726 -61644 -58546 -44347 -19413 -43456 -33423 -69846 -87124 -71921 -96501 -102032 -138330 -148343
7714 -148343 -56810 -73752 -125405 -111551 -164640 -164695 -148712 -172994 -126413 -55752 -81421 -117145
7702 -117145 -73585 -72545 -50802 -64601 -81641 -59675 -44957 -71214 -63094 -58997 -62317 -60284 -71290
7689 -71290 -110172 -98779 -33876 14349 36697 62053 -11684 -30507 -114751 -61643 -100185 -113798
7677 -113798 -85337 -118929 -62964 -81415 -42993 -25315 -15594 -20962 -87816 -123720 -88522 -18532
7665 -18532 11701 11770 -61978 -70956 -98734 -84994 -40770 -18107 -5495 -56824 -71350 -104926 -129256
7652 -129256 -121775 -50356 14919 -10869 -43685 -7338 -67112 -55491 -44869 32612 37927 -4584
7640 -4584 -71911 -50482 -50106 -79909 -19875 37105 -9762 -8206 -74213 -106267 -53912 -11730 -113782
7627 -113782 -196891 -155940 -84138 -42371 -79042 -39350 -8408 -38009 -46524 -79661 -147107 -108608
7615 -108608 -42799 -4997 -4682 -23108 -19665 4226 -42953 -72864 -48219 -39201 -76090 -65134
7603 -65134 -40810 -60821 -87476 -34869 -37102 -38761 -39324 2791 19713 12866 10959 -2702 -52218
7590 -52218 -113737 -85229 -132038 -99107 -98359 -185087 -115241 -76170 -63106 -63713 -72764 -60076 -101760
7577 -101760 -113315 -116045 -97571 -71982 200 -12863 -41015 41981 2510 -52204 -83376 -89732
7565 -89732 -18664 -6052 -56714 -45251 -63520 -114451 -112974 -47440 -75103 -65069 -11506 -65713
7553 -65713 -63192 -80114 -25553 -83452 -112133 -67282 -60385 -43977 -51232 -96518 -127895 -82332
7541 -82332 -56916 -78156 -63844 -35918 -20267 -16164 -70109 -57307 -3279 20907 -33527 -66246
7529 -66246 -46682 -25331 296 -35008 -61863 -54716 -36991 -110648 -39006 -44040 -35701 -10516
7517 -10516 13372 12805 -20601 -42992 -88727 -110354 -103872 -46715 -61321 -76684 -79019 -68016 -46113
7504 -46113 -33775 -108533 -9782 31052 16000 104196 12568 13713 45833 19507 53710 39950
7492 39950 42691 27830 88753 130389 78527 64543 53050 37029 99009 108460 91604 29145
7480 29145 80639 54458 68386 46860 113823 157029 181000 221354 172809 153621 189579 236809
7468 236809 142189 84272 108666 185558 129589 52460 58987 7350 52708 111145 55522 72812
7456 72812 112815 62956 9104 49891 47017 15340 2658 2632 -37506 -15236 -4609 42764 80729
7443 80729 81458 81955 71032 52776 11600 54527 41035 51270 24247 92430 71795 23448 -14445
7430 -14445 7410 21397 26187 12568 23363 -2369 -21719 -2891 -34544 -9566 10023 9124
7418 9124 16104 59069 38103 3150 -44355 7871 -68248 -4323 1009 2168 3377 -2236 -32613
7405 -32613 -61052 889 -29524 4530 88969 73319 42071 653 -36446 29754 45831 -222
7393 -222 -33667 -47535 24581 2230 -33481 -38869 -25620 -48729 2712 45615 -73297 -85812
7381 -85812 25008 52245 5189 -65024 -20470 -9585 8983 -33701 -50472 -35350 -34140 -19370
7369 -19370 -20872 -42871 -23986 -39 -17430 11740 32760 31947 11103 54096 49712 35236 -43704
7356 -43704 43577 88057 76897 10675 36286 116123 83501 54296 -658 45743 63959 -32867
7344 -32867 7907 49241 -13913 -88901 3962 32941 -37365 14098 2311 28601 65984 75446
7332 75446 64577 7750 23421 40621 17695 7906 67307 66380 -7765 31930 40059 -10069 11593
7319 11593 30506 -1569 42797 217 4898 19835 15015 15882 91251 77087 -5881 52485 91565
7306 91565 40852 -5648 21627 7239 18674 -21951 -39553 -39944 6550 -4083 -27625 -38368
7294 -38368 22641 107273 127431 86014 75303 100241 115817 86098 87712 111325 64721 47749
7282 47749 77504 53697 17741 63980 57804 103680 88017 116015 126064 97943 61636 64709
7270 64709 83765 83669 123274 70857 38606 68696 79219 103406 68103 52478 58805 51255 40369
7257 40369 34496 64701 19504 57991 78190 162321 149315 59636 38388 131224 88088 106910
7245 106910 139407 64953 63656 62969 41396 9383 47125 181995 195737 147880 125976 128374
7233 128374 180156 192934 178807 150264 133610 139661 126826 230269 209470 140406 151862 178449
7221 178449 178619 146089 191229 165418 134175 156080 299595 342437 316386 244547 250604 241448
7209 241448 259527 222289 234917 263895 207831 205013 191268 207448 234619 249107 257663 233307
7197 233307 345624 288408 222763 220920 313333 299260 348541 349728 301935 225029 251116 359125
7185 359125 399293 476525 418903 436691 365763 386147 434038 405565 435674 489119 524154 444084
7173 444084 413040 443793 432716 448486 404870 456127 489443 457481 504320 538329 504033 553550
7161 553550 542706 527617 554890 588012 565552 596406 684408 659494 698215 736093 730570 748646
7149 748646 735279 775648 819556 882675 951953 947414 992503 1023399 1026263 1051198 1139562 1232028
7137 1232028 1212127 1223722 1219419 1249681 1272274 1327262 1359737 1309488 1342800 1417192 1345014 1335711
7125 1335711 1502362 1578182 1588132 1535846 1618854 1691504 1721630 1792649 1806549 1837044 1877088
7114 1877088 1959552 2037394 2138604 2177213 2279598 2418005 2588917 2664779 2751037 2881521
7104 2881521 3070829 3244261 3394406 3566296 3684982 3817536 3949474 4123646 4263121 4481562
7094 4481562 4661652 4904908 5140142 5420459 5807177 6248136 6671262 7152542 7772975 8503640
7084 8503640 9330184 10341247 11445359 12696704 14161502 16006811 18491492 21635709
7076 21635709 25778823 31345274 38162350 45195788 50656320 52034127 48856170 42269292
7068 42269292 34383753 27415971 22044551 18071607 15131893 13020827 11412487 10155295
7060 10155295 9126032 8321970 7538625 6906336 6357915 5930320 5611099 5243837 4932478
7051 4932478 4607194 4282014 3970252 3781672 3533645 3371221 3206990 3061671 2910553 2714093
7041 2714093 2563658 2407191 2350133 2300692 2203300 2096118 2051910 2033695 1945201 1864408 1772801
7030 1772801 1720446 1678112 1627297 1537641 1423787 1467610 1407638 1435863 1479214 1510686 1463007
7019 1463007 1385147 1312045 1256912 1250196 1120794 1005818 947810 956970 905553 863642 803457
7008 803457 784142 754188 749193 703865 712321 721764 739528 771035 760927 824473 806947 844404
6996 844404 889807 1016079 1080825 1057546 958641 782784 757921 747047 652149 607791 624526
6985 624526 526561 501313 522900 479017 478117 462470 415718 372521 422359 431963 357772 344893
6973 344893 328112 349754 319888 235473 209100 319131 305471 322049 345446 290064 200485
6962 200485 163018 197788 256467 273332 249384 272912 277852 283824 299273 257033 178603 245306
6950 245306 239470 260115 241997 266857 217938 156366 139279 172483 239131 188538 163768 178643
6938 178643 100865 53205 98709 105857 99951 128081 98843 144284 208505 170814 150180 165508
6926 165508 103844 126087 151523 144630 142978 172431 166520 150654 150499 199380 214069 191307 246961
6913 246961 215789 186577 157693 115068 65688 96178 105166 89550 122879 192588 249994 211217
6901 211217 161912 165923 93848 161391 185381 131880 97370 79728 77016 102748 129831 141660
6889 141660 139152 118255 106732 91949 44913 10912 16061 4336 -16544 13841 12997 -38400
6877 -38400 -62712 -8214 -15681 -15584 1340 30593 -11859 12931 31235 38686 32743 8159 -15267
6864 -15267 18064 71782 9211 54043 47610 46890 16857 -4440 -47514 -8686 8376 39708
6852 39708 33219 14838 31903 10933 -31212 -6050 -34339 -88938 -107523 5040 2826 -27114
6840 -27114 -8500 38891 51128 39045 8088 -6974 72177 74030 -21854 4770 80800 48784
6828 48784 57575 54065 19984 28790 768 -956 49545 31761 31526 29392 109888 100779 79440
6815 79440 14012 33598 -39191 -71797 -129568 -58996 -19090 4934 25996 30377 41755 13009
6803 13009 -32211 -50962 -16889 -316 -14184 -56595 39815 -8040 -1245 43467 11813 7690
6791 7690 -4998 -69218 -2190 95034 80280 23001 19353 36597 33055 44810 -12357 -21101 35482
6778 35482 -3932 -17046 33311 40621 43204 31197 -31496 -44160 -16445 -23364 -50330 -47375 -58708
6765 -58708 -73255 -63858 -47983 15480 39923 33680 16854 -12507 9873 6047 -42243 -25497
6753 -25497 -36520 -12106 18651 26910 56870 44448 28042 84148 79445 55255 48470 11937
6741 11937 6707 -4516 42619 27905 17572 -43114 -1838 -11903 27425 80808 8037 22030
6729 22030 42734 65631 -2071 36319 -32015 -116387 -32644 -424 -66349 -65901 -38539 -10595
6717 -10595 -33679 -69112 -18502 -70177 -51855 6926 -23700 -20966 2543 -13228 -8188 43325
6705 43325 92636 56200 41786 52499 86076 14112 -19557 3717 -6226 -37905 2705 -36587
6693 -36587 -29827 -30906 2683 90608 45022 -9861 -25123 -30404 21740 20085 14790 54383 79992
6680 79992 83304 51640 82150 125502 116442 102220 136590 146165 193518 172529 217540 263187
6668 263187 275680 196122 156811 104830 78300 124191 74531 45282 31503 31259 -385 20416
6656 20416 7724 -31582 -48524 28603 34962 -30408 -4833 7207 -38776 -79656 -56325 -37772
6644 -37772 49948 39433 -14754 -40486 -17071 -7876 34875 31363 23469 75509 97754 24669
6632 24669 -64274 -59640 15221 -45869 -22953 -42958 -122887 -68954 -22416 -52412 -35855 12099
6620 12099 30553 -8359 -18160 3180 -69456 -50593 -57744 7020 21718 -14247 51754 16408
6608 16408 -46296 -28116 -17017 -9868 37564 76416 31386 61928 42961 22895 44636 52206
6596 52206 2266 -3696 -40605 -38224 -6189 -44279 -40843 -3826 -34772 -56029 -20129 35197
6584 35197 75024 38238 49705 -937 17323 24546 52077 38019 -65409 -125052 -34610 70032
6572 70032 83243 93186 73667 81507 94641 80213 16238 -69896 10831 70476 68326 1766
6560 1766 -54055 5736 -7123 -19685 -16799 -18537 -6467 -44659 -53296 -61534 -24563 33567 -65020
6547 -65020 -77666 -60458 -48392 -14811 -33779 -3703 17246 -22541 12333 37147 32695 33046
6535 33046 3777 33951 60234 36075 13109 14797 51006 67435 12074 16936 60993 10493
6523 10493 21437 34730 77131 73000 104018 13127 -27338 -19090 -3855 -33 40907 17335
6511 17335 -12296 -8765 7470 -30736 -88588 -33412 -94244 -35839 26966 51056 -4341 -68598
6499 -68598 -84487 -90126 -94665 -63165 -66032 -124223 -63450 -12325 6248 -21205 -6163 18768
6487 18768 26006 -9852 -26288 -35386 -34034 -10242 -40980 -61745 -44679 -31647 -6172 31678
6475 31678 38600 10545 -16225 -35050 -43739 -2011 -55950 -23784 -30108 -15984 41952 28641
6463 28641 -53557 -32831 -32515 -20075 -35737 -85959 -41820 -11287 -24015 -15679 -68786 -41449
6451 -41449 -28523 -23854 -17743 -47493 -94084 -82427 -53480 -47912 -54525 -18415 -3545 -47767 -66667
6438 -66667 -93072 -26256 -72337 -72601 -9761 37952 19768 74585 89183 -4764 -58640 -44025
6426 -44025 -25663 -12787 -42500 -39213 -49658 -71868 -34421 4067 5557 297 -11265 -104522
6414 -104522 -91116 -61818 -94739 -69580 14453 14862 20442 -17515 -42945 -32514 -70374 -23713
6402 -23713 -28887 -8196 -34548 -88003 -93534 -26521 24172 -40822 -76421 -78729 -39056 -68069
6390 -68069 -46848 -1902 51498 -12845 -81249 -69475 22829 53232 8912 -14879 -38725 28416
6378 28416 46795 44538 -41050 -9183 7999 -5064 5645 51716 32735 -22464 1713 -33516
6366 -33516 15528 22589 22060 25088 33003 33257 5196 -4524 -29514 -4621 29675 40920 23975
6353 23975 -52770 -41750 -67949 -37694 51297 106575 23655 10665 27791 -12061 -13113 -31758
6341 -31758 -33979 -39385 -18862 -35463 -58946 -15967 9876 16177 81092 100230 92873 60187 130450
6328 130450 17586 -12998 -18662 -3565 2962 -8913 11888 12884 15858 44997 41183 65809 59899
6315 59899 45243 4927 20428 53037 60975 54106 30147 -11394 -18285 3940 42138 14556
6303 14556 -29796 7533 -22675 -24062 1495 10309 58771 107631 58383 -2617 44656 36132
6291 36132 3611 9936 53935 52982 9099 17032 -3043 41323 26579 -14524 -70301 -6775 62945
6278 62945 62938 44933 55138 66634 150645 157490 76253 89964 100393 52533 -3774 18949 28069
6265 28069 32898 137843 132729 100265 105975 124743 89926 90522 79268 211722 139771 97316
6253 97316 91423 127004 158505 128002 215418 191640 208705 329327 473391 635202 847315
6242 847315 1082331 1174561 1126958 938263 714344 567448 470304 448521 354583 205523 237916
6231 237916 207772 217948 213780 192048 161574 117157 93844 50179 40677 28048 98858 155843
6219 155843 167060 115433 22214 76212 53610 -700 63950 128808 97006 43339 42297 -9591
6207 -9591 -30067 -12702 68054 95911 78458 59168 120692 93080 49712 23930 139695 113144
6195 113144 59825 86521 108853 138595 84802 9308 29211 79739 83332 77782 106766 91597
6183 91597 122860 89958 90888 58126 132287 101591 135689 82226 49628 -5200 20620 44386
6171 44386 108166 96744 61217 89991 89356 66107 20028 9008 42303 84740 37718 47008
6159 47008 51227 81863 68625 69273 56789 39570 25434 70525 14677 56522 88003 76049
6147 76049 28610 31305 15143 36162 38784 31005 38930 60064 145265 168364 115998 90688 101546
6134 101546 141044 93032 100234 87716 101582 142222 157578 141198 164243 101726 135247 147427
6122 147427 158993 105299 87157 108195 183692 211776 251916 245868 178069 177332 207542 208922
6110 208922 172123 204262 196111 224427 263691 281880 260667 280451 283046 209274 214896 183535
6098 183535 122739 202860 245910 273855 281626 245654 249550 246552 286937 304507 250296 253257
6086 253257 202937 260105 282410 310015 320331 305662 314554 282320 289754 269876 211139 181819
6074 181819 153997 172855 195535 174539 222257 174754 109946 173739 208844 288915 272529 199297
6062 199297 190878 248350 172903 148945 194533 195390 181753 212345 280051 294935 259644 231847
6050 231847 189368 186710 250810 267272 243443 267552 318706 310195 292878 241902 303851 332985
6038 332985 374269 392672 447103 418851 381470 377626 304194 262664 280821 313241 246241 276071
6026 276071 288002 362089 336387 296405 348831 309323 294750 344647 313350 369975 370586 423371
6014 423371 405591 312604 345779 385894 365401 385179 428881 470456 433854 411999 403285 369779
6002 369779 382280 371122 395626 378430 447654 448133 397950 404770 423527 429483 405307 418564
5990 418564 566659 542245 467284 490908 545117 497281 445230 465019 530249 539931 527667 553495
5978 553495 493105 476590 527415 580470 582299 583944 563188 447008 484476 512183 497743 539390
5966 539390 559592 618267 580461 551885 635634 607326 595435 604315 614336 678471 731984 685704
5954 685704 684515 688993 653798 656408 712260 659643 683791 703872 659990 726043 737689 708367
5942 708367 733062 780408 748164 717898 720051 751304 759552 806602 848907 861949 823973 861722
5930 861722 900418 954599 955198 880225 841475 949406 991263 946624 985253 1010275 1040010 1074137
5918 1074137 1055165 1108157 1231953 1208627 1255265 1305455 1274318 1189893 1171477 1188620 1172064
5907 1172064 1125956 1116538 1195799 1244945 1295100 1363818 1360629 1361786 1330142 1390820 1553626 1643593
5895 1643593 1705286 1721413 1752057 1778825 1842933 1913461 1991752 2067265 2203641 2312989 2382059
5884 2382059 2460458 2596957 2701845 2757019 2707763 2684680 2674901 2581749 2525370 2432748 2415132
5873 2415132 2375068 2233825 2256276 2195562 2213824 2228318 2230624 2208325 2258154 2276173 2215272
5862 2215272 2200210 2260395 2329735 2287875 2293641 2286566 2313132 2357211 2388972 2350486 2417377 2443395
5850 2443395 2460637 2523235 2507874 2559289 2580853 2580875 2606934 2682563 2713598 2758369 2744618 2736315
5838 2736315 2807100 2826422 2841790 2891394 2992516 3030961 3140152 3232126 3210675 3333570 3400622
5827 3400622 3475276 3584465 3655057 3751370 3793020 3953963 4042534 4155505 4172198 4361491 4480776
5816 4480776 4571728 4590736 4673294 4830079 5015980 5134489 5180412 5416996 5619854 5746673
5806 5746673 5961500 6227758 6388540 6641175 6916434 7182353 7506781 7781575 8059077 8429785
5796 8429785 8818503 9282305 9865343 10439964 11149866 11944770 12841655 14039072 15281549
5787 15281549 16676666 18410569 20473018 22817169 25582063 28658273 31946927 34942111
5779 34942111 37071138 37974896 37629986 36122337 33808278 31247567 28857016 26894766
5771 26894766 25447544 24524252 24045799 23954133 24210695 24840126 25874067 27417606 29359078
5762 29359078 31936530 35108046 38931728 43163260 47525972 51062359 52471598 51011725
5754 51011725 47161769 41854649 36290418 31408735 27304415 23966702 21365121 19106333
5746 19106333 17274840 15795303 14441461 13367310 12468936 11716281 11066994 10448209 9964825
5737 9964825 9577296 9143156 8802616 8467467 8168555 7855536 7680457 7490308 7285453 7064526
5727 7064526 6892678 6718772 6667277 6571175 6492711 6391993 6362189 6273902 6255849 6268741 6253190
5716 6253190 6273745 6275251 6245354 6233727 6283892 6332512 6329449 6398042 6471495 6608042 6735723
5705 6735723 6859379 6995011 7168814 7445254 7722995 8082265 8437459 8853219 9328875 9647967
5695 9647967 9843385 9945705 9928842 9884408 9806323 9726384 9783586 9827033 9930160 10079023 10344999
5684 10344999 10676609 10922516 11295889 11837303 12365417 12888504 13449432 13891586 14153868
5675 14153868 14227785 14156077 13977198 13891358 13805495 13771066 13740898 13780570 13845605 14101276 14343447
5664 14343447 14625986 15001308 15416998 15713462 15852446 15857073 15778178 15716353 15557052 15291364
5654 15291364 15061815 14805977 14512053 14281968 14062843 13895518 13834180 13932785 14048854 14248959
5644 14248959 14658391 15062593 15401994 15546427 15476547 15099131 14639160 14180346 13748851 13227873
5634 13227873 12664642 12126082 11621042 11056892 10676382 10410508 10223647 10073077 10051415 10241432
5624 10241432 10377906 10548310 10681936 10662606 10580755 10412145 10000952 9627470 9154639 8642498
5614 8642498 8060885 7483858 6987765 6590852 6281669 5977464 5655065 5487456 5382534 5240731
5604 5240731 5127214 5058892 5028618 4980760 4985134 4915320 4795693 4631622 4424038 4204618 3918182
5593 3918182 3627084 3456884 3286058 3043911 2915496 2782964 2640893 2566732 2487105 2426869
5583 2426869 2374770 2256285 2204256 2153697 2117997 2038899 2022947 2030346 1992869 1968031 1867436
5572 1867436 1898859 1894692 1863658 1848343 1764518 1718476 1693279 1698858 1685977 1633050 1612253 1618563
5560 1618563 1656817 1662415 1601367 1585957 1557843 1599187 1545173 1498713 1470954 1477397 1549571 1551899
5548 1551899 1562537 1528999 1550279 1522296 1461391 1412039 1432534 1471640 1441575 1444795 1430292 1458501
5536 1458501 1487472 1521398 1533595 1539633 1592229 1605706 1583855 1610947 1567702 1569421 1568595 1530942
5524 1530942 1514641 1503805 1444292 1423695 1448036 1492054 1465482 1457985 1503798 1543640 1557453 1520598
5512 1520598 1508551 1541578 1509218 1498037 1524843 1440879 1424075 1427369 1412669 1334208 1294760 1294729
5500 1294729 1374087 1390301 1335407 1348246 1368920 1367424 1410453 1450700 1398485 1328780 1367527 1429105
5488 1429105 1445376 1397845 1347122 1330905 1337888 1365160 1395271 1341858 1372335 1447349 1411231 1385282
5476 1385282 1396432 1354740 1378198 1316709 1301669 1319585 1311016 1377404 1310230 1245431 1261509 1338252
5464 1338252 1346826 1323410 1301848 1265491 1336948 1317346 1263439 1257443 1288947 1299328 1299701 1362053
5452 1362053 1450833 1461685 1449451 1434575 1404026 1359027 1302933 1309226 1299754 1291654 1304078 1319260
5440 1319260 1297975 1298976 1267387 1256470 1271995 1221089 1213266 1239331 1245353 1282487 1252198 1306951
5428 1306951 1317674 1400872 1458227 1469001 1540120 1580200 1678921 1819097 1912470 1964684 1968399
5417 1968399 1854714 1712187 1567242 1446562 1385164 1346693 1314448 1259059 1276683 1206189 1144574
5406 1144574 1216951 1270427 1107898 1130447 1190053 1128899 1107966 1101521 1212724 1194864 1174938
5395 1174938 1143401 1220872 1294290 1297875 1318180 1449857 1578115 1771875 1899669 1843125 1720306
5384 1720306 1538854 1440037 1358187 1341109 1360433 1309507 1268462 1341856 1389579 1401943 1372637
5373 1372637 1348770 1321807 1312991 1395620 1303057 1304675 1325108 1296391 1302220 1272541 1348991 1401340
5361 1401340 1405132 1361087 1306554 1405412 1391707 1440841 1422408 1379628 1343973 1259953 1258744 1265529
5349 1265529 1300487 1283498 1247476 1244118 1233912 1166136 1150876 1118230 1089704 1103235 1178672 1199280
5337 1199280 1203926 1208471 1108732 1081154 1030356 982822 1031964 1062095 1079188 957280 973508 1074561
5325 1074561 1028454 973198 984805 1016043 1035601 1156434 1182809 1205023 1202223 1148882 1063209
5314 1063209 1113230 1126156 1018638 1064517 1044872 1003638 1009443 1014695 997273 1005643 1012322 956120
5302 956120 917241 921780 917474 959670 975304 1033528 1078846 1070576 1107076 1138900 1141803 1190476
5290 1190476 1263693 1375546 1473298 1592483 1651464 1596939 1511600 1370405 1232767 1123317
5280 1123317 1056135 1057114 1074840 1045991 958539 956575 914432 906580 924323 849095 876110 986978
5268 986978 960129 929637 976097 1002664 1024796 1065814 1114609 1179931 1191216 1191956 1192032 1355999
5256 1355999 1413580 1485858 1522225 1456107 1347486 1195066 1081555 1021774 1021689 1001184 919263
5245 919263 914640 847760 751703 761599 794240 755429 717179 713359 686765 679622 658293 723836
5233 723836 723440 754314 721506 755915 731134 763585 765704 853961 977404 1011816 943677 994822
5221 994822 982038 966087 913003 818749 778741 827098 871273 864788 888237 880082 827468 912746
5209 912746 947065 958831 946174 907558 968726 1020028 1142432 1222098 1298890 1427552 1495966
5198 1495966 1611656 1576768 1416698 1269888 1179153 1110094 1099138 1050476 1015546 1034398 980144
5187 980144 995342 996676 965243 959246 1097169 1123806 1077288 1067293 1135230 1233059 1311496 1340395
5175 1340395 1325862 1266895 1206309 1140276 1185923 1126563 1025112 945688 885572 839041 810197
5164 810197 738032 717892 786981 780227 697158 660443 676730 722204 750658 791045 780124 732089
5152 732089 694718 670713 698178 728751 655735 670527 707467 661420 646316 682280 665803 655759
5140 655759 638739 705715 717516 754366 778285 760773 808865 823060 784909 716968 655617 666580
5128 666580 694943 705792 695374 680753 727858 707707 726490 783808 817210 742338 716297 776135
5116 776135 797283 699995 705605 764480 734344 764385 809096 782143 753152 794333 819715 846736
5104 846736 852436 853519 872858 820972 849529 872520 840681 870831 839589 870582 898065 842035
5092 842035 911217 894395 866334 824306 869533 892623 952175 1008067 1022303 948345 966394 959342
5080 959342 935696 962892 915183 899098 898751 915257 954386 930530 889831 921526 1042101 1130348
5068 1130348 1146360 1118221 1053461 1034095 1053075 1098318 1076548 1109471 1054710 1050656 999228 991627
5056 991627 1055640 1076084 1071357 1096552 1134915 1119673 1122016 1147229 1185059 1239847 1212661 1158277
5044 1158277 1238562 1284940 1221508 1230449 1247054 1229362 1326608 1330115 1331923 1317035 1317610 1361121
5032 1361121 1434747 1327740 1242681 1401856 1511160 1430576 1431172 1461058 1465293 1474003 1443967 1483406
5020 1483406 1506598 1583478 1537239 1528315 1532079 1509473 1529791 1569662 1589107 1599598 1554271 1526480
5008 1526480 1553948 1569396 1615936 1626753 1610786 1635396 1687182 1725238 1703877 1759095 1808796
4997 1808796 1880051 1863249 1822884 1864628 1870617 1847049 1841601 1819558 1844530 1958088 1989723 2034133
4985 2034133 2073930 2079699 2139300 2196907 2199027 2263231 2320814 2315601 2258998 2290140 2354166 2351512
4973 2351512 2374082 2452749 2506306 2550983 2622545 2657867 2634266 2719158 2716901 2679953 2728657 2748561
4961 2748561 2870535 2902615 2947174 3012025 3039570 3070059 3076122 3039098 3126145 3206554 3253279
4950 3253279 3350272 3352391 3382034 3438032 3506108 3603850 3646281 3684663 3714206 3749972 3816241 3880033
4938 3880033 4003763 4081976 4116170 4202996 4320738 4390005 4534310 4578173 4617923 4697766 4825743
4927 4825743 4888970 4984557 5071081 5155225 5252305 5319323 5430612 5565412 5664665 5740411 5866006
4916 5866006 5920823 6042056 6249405 6414987 6462360 6592734 6722085 6888743 7024216 7203148
4906 7203148 7368089 7521532 7646267 7863602 8107203 8282609 8441206 8579100 8718528 8961018
4896 8961018 9133776 9381691 9548565 9840940 10080488 10232847 10512260 10790353 11049521 11249305
4886 11249305 11516890 11803111 12038884 12269358 12668843 12997871 13202849 13515693 13931515
4877 13931515 14289148 14617750 14962517 15348946 15718712 16279227 16792030 17273056 17763537
4868 17763537 18320655 18834632 19395523 20027702 20654153 21367159 22099001 22880598 23739840
4859 23739840 24584634 25479805 26517940 27588455 28705785 29903667 31043884 32139035
4851 32139035 33249954 34468418 35774313 37125747 38653625 40206006 41958661 43853268
4843 43853268 45865859 47981901 50207785 52669194 55183224 57840993 60604981 63625981
4835 63625981 66808326 70111891 73474615 76972986 80499692 83980357 87406225 90682235
4827 90682235 93698885 96335457 98414200 99990751 100958495 101340817 101062290 100151318 98330936
4818 98330936 95711712 92544385 88986463 85263847 81466820 77716806 73975314 70265071
4810 70265071 66753758 63427442 60204481 57173058 54288534 51516874 48951843 46640521
4802 46640521 44352127 42275102 40401953 38654105 37037564 35360833 33889297 32472152
4794 32472152 31129933 29937560 28777377 27760117 26834156 25918346 25107796 24369767 23651820
4785 23651820 22853882 21982011 21119087 20225805 19443609 18785472 18174678 17515127 16937907
4776 16937907 16383482 15840953 15307627 14830508 14373022 14008260 13492567 13118792 12783450
4767 12783450 12424581 12093742 11796734 11468138 11201010 10893572 10588289 10246779 10092884
4758 10092884 9901548 9670081 9482770 9287296 9159755 9051643 8856105 8760058 8695895 8631016
4748 8631016 8577308 8464355 8255814 8084490 7925120 7774310 7563290 7453354 7382328 7260921
4738 7260921 7257598 7116298 7037275 6978322 6865781 6773312 6722660 6644338 6591355 6526324 6486053
4727 6486053 6441940 6394280 6346475 6230180 6225543 6247292 6191549 6177908 6226661 6197882 6119004
4716 6119004 6124226 6104410 6093104 6131142 6132498 6126491 6176764 6192168 6270416 6247403 6326357 6460919
4704 6460919 6578057 6724828 6766513 6949406 7239261 7445056 7716382 7998471 8240212 8598494
4694 8598494 8886239 9054459 9143969 9126736 9041106 8964151 8835940 8702148 8616466 8692314 8800354
4683 8800354 8886281 9105356 9252657 9501729 9851723 10207605 10535851 11016768 11549921 12174471
4673 12174471 12864581 13565103 14180297 14787590 15265622 15429819 15194703 14709551 13982403
4664 13982403 13297760 12722810 12197734 11820878 11714792 11702377 11814130 11933325 12160061 12509496
4654 12509496 13077685 13746401 14511650 15402345 16200061 16669417 16751336 16661056 16433802 16134300
4644 16134300 16110822 16201214 16308667 16510332 16574676 16430058 16156185 15833335 15413150 14920002
4634 14920002 14549424 14318225 14098436 13967425 13942104 14043465 14312396 14674298 15206593 15754979
4624 15754979 16446535 17281818 18198410 19231823 20211334 21257487 22273600 23269520 24177945
4615 24177945 24920481 25311859 25066060 24042847 22671972 21138643 19749476 18550944 17767708
4606 17767708 17085266 16635020 16451789 16479158 16755818 17059268 17549953 18248618 19093160 19965044
4596 19965044 20517622 20620173 20090624 19092280 17815623 16478148 15281882 14200105 13292511
4587 13292511 12672331 12158864 11844303 11657965 11452537 11335766 11343090 11488031 11748804 12021560
4577 12021560 12349102 12760825 13212023 13643011 14083511 14474055 14726437 14697332 14461178 14127841
4567 14127841 13627618 13120375 12633647 12163272 11729658 11435213 11175860 10871464 10628807
4558 10628807 10514283 10448184 10423091 10471996 10537268 10683121 10927760 11189758 11405887 11750440
4548 11750440 12186205 12592759 13066386 13538750 13873275 14276219 14628705 14918608 14993868 14981130
4538 14981130 14895796 14795554 14692874 14764520 15044778 15439102 16135312 16958944 17958757 19030179
4528 19030179 20071412 20770351 20873715 20356363 19332818 18123052 17114983 16310101 15612125
4519 15612125 15098374 14651494 14100997 13578287 13147201 12660774 12128826 11606248 11223778
4510 11223778 10910675 10635328 10477594 10360524 10347571 10354127 10487794 10715421 11008172 11396122
4500 11396122 11931167 12604774 13394205 14315667 15428692 16633550 17885176 18960097 19701793
4491 19701793 19934125 19408236 18452315 17400720 16232539 15193215 14158236 13352534 12723655
4482 12723655 12287782 12003386 11797962 11608744 11581103 11636554 11899469 12254759 12533128 12734392
4472 12734392 12592941 12139538 11419045 10583592 9722434 9054963 8496157 8088640 7675446
4463 7675446 7352037 7121378 6918384 6683842 6560576 6461720 6352125 6256083 6225499 6230310
4453 6230310 6104270 6102293 6174884 6264473 6396861 6524168 6616186 6771994 6992043 7340038
4443 7340038 7768182 8204178 8698589 9268258 9855833 10167712 9978286 9462668 8744201 7996668
4433 7996668 7333881 6748636 6279320 5963944 5632863 5448364 5304140 5195454 5156476 5108178
4423 5108178 5021600 4978150 5046126 5063520 5094057 5048098 4921864 4817449 4561332 4369355 4288785
4412 4288785 4233682 4128526 4055468 3978416 3891620 3912177 3863788 3768622 3841660 3774640 3663188
4401 3663188 3599124 3573036 3535986 3495424 3495851 3434385 3439741 3395415 3335879 3322459 3377979 3329702
4389 3329702 3360644 3355535 3340701 3398522 3337297 3309196 3377602 3388724 3410411 3374616 3357937 3392715
4377 3392715 3459518 3425830 3381436 3336791 3415785 3341193 3291773 3245638 3211478 3137167 3125225
4366 3125225 3132246 3121250 3108411 3055737 3055326 3041778 3011026 2991376 2958684 2943159 2944408 2919326
4354 2919326 2897740 2852144 2799316 2798904 2784921 2738643 2652771 2603416 2644423 2646913 2584173 2521088
4342 2521088 2578765 2588224 2591181 2605182 2568498 2646598 2732799 2768424 2792645 2891630 2902553 2984593
4330 2984593 3069630 3126819 3177606 3232972 3228168 3176483 3143440 3061992 3056021 3034409 2968757 2923658
4318 2923658 2899151 2800211 2719669 2688432 2699564 2683451 2664642 2590270 2622384 2606434 2577787
4307 2577787 2564589 2536147 2467764 2559200 2595247 2494193 2490464 2442116 2418953 2452162 2454717 2527300
4295 2527300 2495376 2441396 2475647 2454519 2393107 2369847 2388846 2382335 2362132 2325489 2383927 2344083
4283 2344083 2258818 2295081 2247870 2228061 2242659 2222872 2244264 2249832 2257628 2234632 2222538 2285143
4271 2285143 2385106 2439135 2468343 2439391 2440429 2459494 2420059 2401587 2439073 2478936 2430077 2493694
4259 2493694 2499637 2457294 2424253 2452522 2466877 2397200 2406515 2468704 2506577 2579103 2610262 2554665
4247 2554665 2530681 2621274 2602976 2599916 2648403 2750196 2849116 2894432 2935052 2889767 2859675
4236 2859675 2849732 2837734 2875715 2898686 2955154 2953285 3066165 3186840 3160692 3094407 3076874
4225 3076874 3102760 3092394 3169074 3224428 3171093 3313221 3400913 3369007 3382049 3459400 3584038
4214 3584038 3622999 3682559 3747651 3896953 3988519 4026015 4109601 4177517 4214528 4305969 4470781
4203 4470781 4587325 4626685 4713672 4728613 4857233 5038509 5103904 5216964 5318731 5458606
4193 5458606 5605132 5724120 5743021 5741082 5857203 5970421 6100144 6154503 6172265 6325599
4183 6325599 6481430 6606096 6796426 6976676 7164851 7387927 7561887 7782218 7937519 8091495
4173 8091495 8255230 8391215 8671846 8909571 9199657 9555783 9875558 10297507 10795919 11260588
4163 11260588 11851489 12327987 12764684 13231340 13753141 14250686 14754837 15385064 15999134
4154 15999134 16661106 17382102 18249278 19133720 20190721 21511380 22865477 24253670 25811742
4145 25811742 27635345 29759037 32295018 35393964 39230282 43730621 49277512 56114093
4137 56114093 64639470 75525057 89697648 107952659 129504223 149825335 160707620
4130 160707620 156293427 138636125 115699138 94883780 78762849 66642810 57450904
4123 57450904 50478428 44972800 40692643 37333942 34697292 32396348 30269164 28442449
4115 28442449 26927293 25609259 24480757 23497903 22544463 21710051 20891440 20142141 19439652
4106 19439652 18694304 18123171 17547753 17048493 16711066 16343795 15950592 15607916 15420579
4097 15420579 15257530 15096042 15051851 15034043 14916396 14727147 14588043 14522120 14456131 14431333
4087 14431333 14557869 14663272 14739014 14983184 15381607 15881549 16357825 16917469 17301502 17464850
4077 17464850 17431021 17393567 17390119 17347156 17481673 17793967 18160894 18649566 19152972 19911253
4067 19911253 20610438 21313867 22251100 23445817 24608329 25498453 25952400 26166054 26285128
4058 26285128 26451777 26920096 27593936 28492822 29762206 31204613 32876845 34838690 37224928
4049 37224928 40038092 43746227 48588692 54752004 62636573 73465540 89808308 112813699
4041 112813699 133003619 133850856 112718176 87272059 70146309 59156788 51682621
4034 51682621 46595262 43111943 40455369 38558002 37174823 36233275 35535208 34900909 34290095
4025 34290095 33658714 33085974 32691772 32455904 32379325 32382286 32525178 32741962 33049399 33307835
4015 33307835 33477754 33465485 33394049 33342499 33321912 33258136 33169928 33256835 33710931 34250693 34917419
4004 34917419 35696622 36344420 36762141 36849456 36683367 36316507 35720654 35003624 34372835 33819387
3994 33819387 33376804 33249508 33449947 33790123 34288988 34735802 34847203 34540080 33743115
3985 33743115 32662927 31389814 29986501 28749806 27570144 26586847 25885459 25429688 25200007
3976 25200007 25181134 25157147 24954214 24430710 23608426 22432019 21034436 19674982 18411138
3967 18411138 17301700 16412440 15673989 15126945 14643662 14324288 14049685 13795052 13474272
3958 13474272 12876882 12188798 11505987 10735368 9960944 9425919 8969904 8538858 8088352
3949 8088352 7722778 7405415 7121162 6891595 6651053 6364753 6068022 5816219 5619610 5306098
3939 5306098 5054678 4900778 4712888 4549240 4370519 4281166 4181441 3952477 3754226 3658025
3929 3658025 3625733 3614296 3542683 3530606 3492874 3339209 3256496 3243350 3167090 3068113 3005690
3918 3005690 2980309 2938386 2869088 2826929 2804241 2719998 2783970 2755439 2613085 2589732 2503265
3907 2503265 2497227 2494635 2446620 2336875 2359117 2342876 2299249 2290436 2338923 2372523 2286113 2337797
3895 2337797 2221395 2162958 2149350 2046739 2102859 2138451 2107176 2082704 2107605 2058584 1971023
3884 1971023 2017784 1956324 1827110 1807732 1792932 1732780 1784350 1762297 1673678 1722991 1722541 1751981
3872 1751981 1697709 1670554 1648009 1576097 1578080 1598913 1539211 1587525 1563558 1517574 1574287 1596142
3860 1596142 1564248 1614688 1560595 1535655 1515867 1508777 1544953 1520329 1567741 1586350 1558427 1632516
3848 1632516 1683447 1731317 1786366 1845036 1884816 1920234 2048930 2067698 2016889 2001647 1911574
3837 1911574 1765266 1666140 1613119 1583328 1538296 1512724 1433994 1421353 1445270 1431702 1354599
3826 1354599 1352976 1349807 1298622 1344111 1309417 1233065 1257525 1299134 1399080 1397942 1389411 1392985
3814 1392985 1372014 1329801 1336331 1342401 1342234 1350442 1323882 1347803 1362969 1326143 1346612 1310379
3802 1310379 1334987 1375705 1473991 1515835 1487215 1443577 1422811 1430204 1444583 1440961 1375694 1361157
3790 1361157 1339494 1338086 1369430 1366023 1339945 1394971 1414138 1414969 1413440 1388459 1433173 1448252
3778 1448252 1430625 1443278 1543158 1483513 1441025 1480430 1600020 1591827 1572043 1637549 1618869
3767 1618869 1572079 1537272 1477268 1449612 1466107 1476010 1467298 1496843 1546014 1589926 1579044 1626990
3755 1626990 1713735 1751219 1814772 1830254 1830736 1803273 1756473 1735314 1722360 1554956 1458689 1487364
3743 1487364 1459913 1427412 1397275 1337447 1345903 1372937 1363437 1369223 1353188 1379545 1471530 1491919
3731 1491919 1410882 1361573 1428751 1376433 1350775 1322994 1365574 1344969 1417329 1451903 1428405
3720 1428405 1419496 1441149 1468240 1433263 1468225 1455160 1499211 1537155 1508459 1530748 1548310 1516067
3708 1516067 1521733 1575879 1551580 1548480 1592242 1642405 1640716 1676932 1680795 1660781 1717376 1746673
3696 1746673 1765861 1749282 1734206 1735254 1752215 1742988 1731648 1731229 1700381 1764825 1706424 1745376
3684 1745376 1824669 1776624 1825897 1893470 1916724 1841470 1886483 1913915 1888032 1915622 1908350 1937738
3672 1937738 2006141 2019081 1909223 1971271 2075998 2096291 2109503 2085299 2058743 2121996 2080731
3661 2080731 2115486 2216872 2316960 2354885 2333838 2337316 2404807 2478374 2461692 2541295 2485588
3650 2485588 2574304 2538823 2572906 2551338 2511653 2539881 2422303 2532655 2580972 2545402 2559802
3639 2559802 2586010 2576183 2689450 2705595 2627358 2547340 2526863 2550774 2566387 2595971 2608642
3628 2608642 2605718 2617944 2639313 2633653 2703440 2752179 2737996 2805064 2803309 2806070 2832148 2841205
3616 2841205 2861639 2829568 2828054 2819677 2950812 2895167 2893120 2958506 2960126 2940470 3002117 2988419
3604 2988419 3039472 3129008 3119524 3101335 3170903 3269165 3264477 3362645 3420634 3456511 3493179 3559615
3592 3559615 3668041 3747671 3803576 3846740 3905217 3973681 4056203 4102747 4160653 4187773 4280607
3581 4280607 4363510 4339362 4295679 4328065 4455099 4503144 4500984 4532562 4643424 4645694 4623645
3570 4623645 4671376 4737062 4797161 4832361 4905759 4993229 5060008 5082263 5169312 5317514 5398822
3559 5398822 5528070 5627385 5731157 5854980 5972962 6059991 6085878 6194203 6277202 6410004
3549 6410004 6461816 6523656 6568987 6619645 6669565 6711778 6837131 6909367 6971045 7110264 7220669
3538 7220669 7270118 7368247 7485583 7581881 7800999 7916294 8083274 8219482 8365524 8562472
3528 8562472 8746487 8927660 9189822 9401289 9647069 9928874 10161942 10401513 10629778 10977956
3518 10977956 11308723 11679049 12021679 12414072 12838668 13317944 13785572 14335165 14928604
3509 14928604 15623931 16301985 16999609 17805481 18750625 19747961 20754217 21795984 22988820
3500 22988820 24175523 25322211 26459876 27436802 28348590 29180389 29810739 30387061 30720110
3491 30720110 30938592 31029330 31004370 30947616 30891304 30817600 30693713 30543424 30317532 30078627
3481 30078627 29763451 29367675 28964731 28397367 27648945 26734242 25716986 24694105 23563433
3472 23563433 22413071 21336979 20310359 19352203 18445285 17682530 16960833 16309056 15744053
3463 15744053 15262590 14805711 14451224 14135804 13870807 13712556 13558614 13483494 13377701 13323755
3453 13323755 13322411 13296391 13331201 13409352 13382529 13450731 13536251 13665789 13780344 13883320 13952159
3442 13952159 14047845 14224886 14365899 14470403 14539176 14626049 14668067 14872104 14985381 15026581
3432 15026581 15170948 15186403 15322230 15404233 15544883 15645832 15705048 15828543 15871917 15872155 15937006
3421 15937006 15952513 16040665 16084022 16062704 16102285 16243752 16345508 16370842 16523082 16689401
3411 16689401 16827723 17015427 17202497 17445028 17645879 17888258 18114720 18358113 18712470
3402 18712470 19042605 19401239 19865283 20354695 20818646 21380499 21986521 22581114 23167733
3393 23167733 23971398 24828942 25706594 26752737 27860632 29001512 30362488 31862569 33589833
3384 33589833 35543361 37696557 40107464 42942736 45969711 49401867 53130739 57151236
3376 57151236 61647305 66286504 71070432 75869123 80464362 84722170 88269956 91098030
3368 91098030 93014784 93994955 94276956 93978933 93183538 92248904 91488393 90964407 90697536
3359 90697536 90763786 91001521 91299317 91242013 90678709 89562465 87505665 84768244 81344374
3350 81344374 77395463 72992799 68360418 63816014 59496598 55516184 52014824 49027161
3342 49027161 46529349 44422315 42662134 41325149 40185230 39220745 38455271 37834940 37363314
3333 37363314 37036360 36860487 36659484 36583940 36630407 36786671 36973666 37250466 37613421 38028644
3323 38028644 38580980 39215146 39879946 40611553 41453687 42396344 43422537 44619004 45860804
3314 45860804 47072056 48367150 49784409 51115454 52539311 54063143 55573627 57029225
3306 57029225 58613708 60162971 61786171 63361239 65011219 66681913 68254501 69890834
3298 69890834 71463921 72912606 74247272 75422632 76482260 77376608 78007552 78433167 78660669
3289 78660669 78708883 78589639 78381231 78084670 77730080 77460211 77334592 77455721 77731812 78321223
3279 78321223 79301359 80475833 81811096 83404888 85296417 87512571 89838965 92305217
3271 92305217 95104853 97935348 100748344 103457949 106120220 108490594 110540644 112085109
3263 112085109 113344908 114314285 115099867 115839790 116664236 117825957 119301928 121042097 123081077
3254 123081077 125434418 127983352 130630049 133255498 135885132 138533442 141248724 144233983
3246 144233983 147613201 151424659 155878502 160926000 166315262 171913903 177596244 183142678
3238 183142678 188447507 193404265 197879251 202089549 205949118 209524099 212759570 215767264
3230 215767264 218417038 220597825 222124276 222772738 222480477 221230279 219216234 216721380
3222 216721380 213848727 210913328 207817928 204539159 200956119 197073940 192913697 188082450
3214 188082450 182215141 175275007 167375041 158843898 150024589 141330962 133169507 125682112
3206 125682112 119126734 113393221 108462635 104301460 100908109 98332741 96564696 95457872
3198 95457872 94880801 94910558 95651081 97088380 99135459 101869178 105438671 109661411 114426890
3189 114426890 119623201 124907367 130118304 135228391 139895809 144246598 148324384 151842692
3181 151842692 154936519 157445070 159216026 160261219 160860981 161269204 161611107 161962839 162182362
3172 162182362 162032846 161173840 159882044 158158890 155957015 153176609 149665810 145692076
3164 145692076 141291729 136647031 131803660 126797064 121711580 116452209 111280193 106041659
3156 106041659 100795063 95736218 90892388 86192708 81732721 77556708 73525154 69876299
3148 69876299 66556181 63498501 60828312 58506168 56440258 54798433 53361830 52064894
3140 52064894 50800699 49620037 48552529 47525600 46682342 45829614 45055034 44225701 43436920
3131 43436920 42792294 42259082 41893972 41566285 41391528 41467277 41544404 41663366 41849536 42166193
3121 42166193 42592930 43200249 44009498 44989858 45992742 47097702 48206243 49397834 50630808
3112 50630808 51920585 53203705 54430866 55513215 56537161 57377500 57944118 58255519 58320238
3103 58320238 58251658 58105675 57821967 57482534 57185827 56875607 56684880 56613824 56746316 56993579
3093 56993579 57544573 58321156 59188125 60268583 61509790 62748634 63915274 65076917 66087962
3084 66087962 66938325 67609395 68063133 68386311 68498051 68644709 68670183 68565220 68371511 68187550
3074 68187550 68088230 68042270 68362631 69093224 70239382 71744778 73543143 75526979 77790886
3065 77790886 80219082 82892212 85924401 88827772 91255298 92991683 93780081 93697095 92727070
3056 92727070 90942203 88439720 85197366 81345226 76960860 72235363 67314330 62446998
3048 62446998 57743131 53240149 49167997 45457234 42093178 39144678 36626914 34471301
3040 34471301 32552501 31010099 29651162 28440516 27427366 26564350 25732143 25002841 24319884
3031 24319884 23667431 23087106 22478072 21856046 21241401 20671091 20158114 19646276 19184268
3022 19184268 18738657 18299155 17916247 17548257 17232259 17037564 16923549 16816738 16699860
3013 16699860 16628905 16573125 16541618 16596747 16687800 16846472 17142015 17399169 17668345 17877349
3003 17877349 18002262 18039726 18145007 18165357 17924977 17621014 17328766 16933546 16520778 16103211
2993 16103211 15713901 15413765 15159975 14950769 14680210 14389094 14304583 14210940 14174728 14265816
2983 14265816 14277000 14412145 14553947 14684891 14938550 15204621 15529695 15695527 15902228 16116320
2973 16116320 16208932 16181728 16142488 16107696 16072863 16001767 15993854 15999993 15964009 15862265 15757941
2962 15757941 15611618 15397422 15253173 15142478 15158477 15244705 15361868 15525530 15714945 15990298
2952 15990298 16330512 16817188 17344884 17886543 18448540 19168447 19895903 20548106 21259315
2943 21259315 22089611 23046621 23962966 24867389 25534901 26082135 26473735 26426069 25860861 25100577
2933 25100577 24615589 24451728 24312439 24233195 24170785 23985822 23599111 23068574 22519366 22112822
2923 22112822 21912839 21945661 22061818 22359765 22692749 23072215 23551773 24152974 24814576 25526354
2913 25526354 26041806 26536490 27036022 27633455 28236829 29036565 29895582 30811308 31770439
2904 31770439 32670100 33406456 34005423 34307520 34697598 35005462 35297579 35619743 36010789
2895 36010789 36511767 36951846 37349939 37644647 37862176 38072481 38286086 38645045 39176070
2886 39176070 39854072 40680003 41584665 42687113 43925116 45214653 46564670 48014865 49489278
2877 49489278 51163070 52826140 54298378 55626429 56888857 58132743 59586851 61229394
2869 61229394 63155695 65411819 67945876 70809498 74215007 78213917 82694667 87766432
2861 87766432 93505309 99955778 107159410 114918552 123476516 132958442 143644818 155824676
2853 155824676 169709257 185254925 201459384 216569361 227847420 232990582 231822082
2846 231822082 226297491 219412792 213394340 209479297 208039005 209471915 213771791 220974749
2838 220974749 230930204 243706728 259407323 278885481 303522724 334580086 372150307
2831 372150307 414024431 455446430 491604273 517750300 525878327 506134703 456597554
2824 456597554 390844535 327359265 275485841 235783637 205684638 182689515 164619268
2817 164619268 149877896 137465499 126528672 116734686 108014815 100284349 93546859 87687112
2809 87687112 82529702 78014896 73963175 70224575 66856097 63680390 60697649 57987781
2801 57987781 55395345 52827142 50458605 48157004 46126479 44201459 42441299 40949829
2793 40949829 39576005 38345226 37097120 35985483 34826881 33697056 32486812 31302756
2785 31302756 30274363 29304881 28401810 27510826 26600527 25752920 24898380 24055928 23241441
2776 23241441 22379887 21637959 20848262 20088094 19393388 18705720 18046278 17434679 16857861
2767 16857861 16313425 15777071 15151007 14711703 14192241 13740710 13398999 13094753 12740389
2758 12740389 12391616 12158781 11887918 11703168 11413419 11190388 10914235 10711259 10533201
2749 10533201 10242054 10054758 9896633 9780480 9630614 9486954 9225611 9038923 8848493
2740 8848493 8647499 8415217 8174657 7974264 7828226 7675145 7538059 7448080 7379976 7283694
2730 7283694 7118286 6938729 6747128 6589227 6411406 6307975 6222173 6083036 5924705 5737842
2720 5737842 5625512 5522693 5470225 5300994 5236424 5226085 5192433 5167825 5181197 5112785 5040067
2709 5040067 5000538 4971437 4952060 4899258 4893533 4915292 4846264 4759150 4699324 4715175 4665050 4657127
2697 4657127 4588960 4460929 4343692 4282095 4195615 4085862 4018914 3971940 3923925 3942088 3950680
2686 3950680 3903326 3852233 3785308 3864027 3884828 3956290 3899205 3845101 3837112 3830689 3734943 3781779
2674 3781779 3699540 3597206 3640873 3605123 3603362 3576258 3545692 3520116 3498881 3476568 3447461
2663 3447461 3510183 3486755 3416629 3369471 3347646 3289983 3151968 3073344 3032735 3006846 2979939
2652 2979939 2970787 2974029 3010252 3015959 2986366 2931470 2894732 2900656 2899431 2868869 2891844 2798315
2640 2798315 2738369 2682194 2675324 2850188 2832599 2788881 2818741 2836334 2836375 2875650 2912689 2989328
2628 2989328 2997513 3035619 3052248 3089830 3199826 3303070 3353145 3385396 3416400 3477522 3523551
2617 3523551 3584205 3607861 3597179 3625556 3626189 3588699 3594610 3615209 3711357 3755551 3751868 3883994
2605 3883994 4009655 4055881 4164986 4296799 4401630 4517044 4658279 4811709 4945349 5030387
2595 5030387 5079750 5143250 5164466 5146026 5100516 5154406 5180119 5237399 5335788 5380242 5474390
2584 5474390 5453492 5360516 5313828 5282499 5334425 5360204 5342713 5376337 5372497 5271628 5334918
2573 5334918 5293281 5330887 5472192 5610599 5800483 5903406 6030787 6232156 6457412 6698091
2563 6698091 6998853 7199771 7327040 7341623 7274512 7167434 7032886 6947456 6816043 6651112
2553 6651112 6614108 6602640 6560334 6610741 6709231 6784791 6832808 6964278 7075334 7148530 7132634
2542 7132634 7027148 6738386 6349060 5982259 5593411 5305363 5133725 5024496 4931946 4804609
2532 4804609 4714316 4669238 4643414 4684569 4770554 4883973 5017205 5046051 4983073 4865557 4671602
2521 4671602 4491531 4215105 3944607 3721879 3547807 3370950 3172603 3063023 2951939 2830488
2511 2830488 2739721 2716764 2676304 2633825 2732961 2810244 2704557 2615473 2567957 2476009 2324872
2500 2324872 2306881 2211827 2102929 2082558 2098945 2024293 1985464 1999352 1933432 1882571 1938059
2489 1938059 1961987 1886853 1909495 1855687 1819532 1760101 1669190 1610717 1533817 1421476 1328359
2478 1328359 1264250 1228195 1164389 1136005 1073958 1103666 1134297 1108111 1045647 1070316 1049203
2467 1049203 1009482 988570 955828 922532 882361 847970 822695 785350 822194 816078 737780 709308
2455 709308 676413 701812 725394 784702 712224 691133 702961 691720 657386 642962 694014 716152
2443 716152 765854 711226 675149 670361 658386 657602 595863 599535 556550 540040 547776 505333 442056
2430 442056 381850 511121 514671 474029 486357 463100 488659 479335 412821 386799 445021 424424
2418 424424 446146 498280 446204 427729 473871 471278 409207 343760 304787 334585 343780 351597
2406 351597 366929 366887 368867 379623 354908 306126 358204 340064 287928 276658 255981 233793
2394 233793 268138 262613 284994 279110 338481 358770 344381 349521 298157 257891 299626 367009
2382 367009 305692 244892 269996 244840 254806 309216 320635 324733 381289 341573 266647 359882
2370 359882 312710 262519 346634 306808 346505 277548 265128 244795 259633 270461 289853 291180
2358 291180 273808 224811 177667 248659 245524 250827 262840 290541 294593 296990 288574 292436 321109
2345 321109 312058 349714 410023 377072 383163 362403 320719 295867 270860 292098 338760 248715
2333 248715 235476 180583 238491 280438 337757 323579 304257 263905 264203 230514 222194 166905
2321 166905 229033 284797 225293 183030 213945 251259 211980 177970 201360 189568 181979 208190
2309 208190 175697 204096 176200 195502 211975 208230 288700 267928 221997 198485 218415 262445
2297 262445 217510 268749 256498 238838 175161 183952 200417 139364 136736 223955 295178 259805
2285 259805 220331 219743 162904 196536 223816 236170 247976 237839 268573 225747 189220 153447
2273 153447 166147 124785 183027 189709 170970 278187 152486 88280 85346 140988 120636 100725
2261 100725 123975 162220 142944 171532 180820 195584 212196 179573 113746 75273 88213 81144
2249 81144 111569 113824 102218 124601 124355 145258 114359 89409 69751 29543 89003 113546
2237 113546 76130 76261 98062 186781 215000 184438 180325 168148 194642 207740 193028 203720
2225 203720 220428 148534 195053 217632 157945 122704 177287 188350 177836 120112 95416 87053
2213 87053 150458 137097 193451 215884 191990 174520 129929 168128 188926 161377 199530 227680
2201 227680 219693 196927 159523 93752 104052 159798 168830 218522 238766 303325 247487 240994
2189 240994 186021 194814 205450 214547 228795 242933 226442 168131 211760 210708 195984 174040
2177 174040 223922 291147 212327 216739 332918 264353 216216 233572 180445 251354 313535 292564
2165 292564 305390 255003 227103 273774 274995 345950 325017 354125 347158 301684 274490 301650
2153 301650 333141 342062 343904 442259 459547 431258 490203 548046 582425 589792 569604 542119
2141 542119 524543 530187 575261 589429 515636 471361 529391 551626 518075 510471 536078 518754
2129 518754 546226 552153 583374 630335 711473 698764 673061 625385 685374 787882 740610 669100
2117 669100 712241 711719 793241 829647 830284 818296 929063 1017788 1058330 1081377 1119482 1188866
2105 1188866 1183154 1276855 1315388 1362251 1416304 1426998 1464978 1565299 1673240 1764387 1870659
2094 1870659 2073945 2255011 2510932 2728341 2854727 2996535 3065261 3295145 3740043 4186866
2084 4186866 4758657 5494414 6428926 7680099 9371793 11795702 15343708 19736219 22175272
2075 22175272 20234537 15405203 11283759 8687285 6951722 5797516 4957443 4303722
2067 4303722 3777740 3397468 3059069 2904345 2779293 2678948 2505776 2280475 2122785 1918296
2057 1918296 1761425 1564206 1514533 1497334 1354246 1238325 1169873 1134106 1036582 971525 986135
2046 986135 1013799 913214 881458 825776 737393 709214 708356 730472 753241 650654 592002 609063
2034 609063 608986 594870 531890 541315 588156 512680 462735 453593 417777 421830 414613 395918 383328
2021 383328 309524 344465 395208 337130 375433 361379 350115 341165 231170 282319 285348 275311
2009 275311 294509 298698 320926 270818 275411 271523 278011 307964 300908 281908 270616 280030 242324
1996 242324 238058 221023 144917 196683 206311 181073 210559 195529 204136 192801 190432 169585
1984 169585 158124 158800 161540 187928 150336 132155 28296 -42728 49311 101368 91726 126354
1972 126354 122544 117907 147289 172625 133336 78492 50473 63901 60323 33281 23312 32736 125324
1959 125324 75083 118329 71696 88351 151533 54609 57107 89541 109360 57939 46702 88677
1947 88677 89746 94462 57060 63820 89918 37809 20118 95913 139776 105062 108623 81766 29755
1934 29755 44363 26323 74743 49775 46038 69222 23049 71623 83294 123387 25984 -14260
1922 -14260 85446 162556 75180 43329 34719 69502 110345 69916 25590 40980 104947 71237
1910 71237 37183 121027 103937 86803 129906 87863 114930 95969 32825 27960 73617 70704
1898 70704 86911 112408 76039 48290 39626 58324 31326 -48693 -68574 -43242 70268 88225
1886 88225 -59747 -24774 53642 51986 15833 -16034 8179 -29611 -625 26430 36705 14328
1874 14328 -6090 -505 -29050 26843 90471 25659 46190 52083 40812 58518 74839 45449
1862 45449 -7287 -2289 12181 -1212 -17300 11764 78971 84904 46293 73012 17743 27953
1850 27953 71562 85465 -29274 -15492 -9188 15120 45306 58829 -5920 -32207 47969 94124
1838 94124 27941 -19768 -29583 -39560 -37235 -5026 37683 34266 -8791 -34734 -458 -90650 -76069
1825 -76069 -79240 -81334 1379 105720 52086 85532 89841 11139 -31319 23533 40922 1443
1813 1443 -19908 -53894 5612 1919 -1952 43680 98627 73505 43002 19722 551 19199
1801 19199 22337 61990 79009 30257 -5277 59184 23146 -1402 17820 13186 -77164 -82551
1789 -82551 -61198 -20647 -25293 -53618 19106 61644 -472 -95715 -43718 -31953 -4937 40305
1777 40305 44219 30199 15062 -33804 -64555 -50676 2110 -21870 -33816 -30263 -34226 -50882
1765 -50882 -60747 -34083 9380 18070 23087 75841 133796 90266 15938 11551 18768 22404 8378
1752 8378 9113 20089 33502 704 -4151 -27272 57875 36995 -18019 -41459 -11402 -24677 -33703
1739 -33703 65965 19174 78875 -14900 -73594 -8811 63771 81247 75025 50081 29425 23624
1727 23624 -13830 -47091 -93354 -77586 -49588 -51098 -45097 3300 -2334 -15506 -44616 -46809 -20465
1714 -20465 16640 -38721 8554 74675 9847 -48266 -2100 33804 -31979 33694 39815 -26828
1702 -26828 8581 -17641 8356 -20691 -8908 72105 27577 1572 -9042 -27876 -60404 1130
1690 1130 -6547 -47601 -79772 -86399 -3746 34268 59425 15500 -5874 37591 35488 -7355 -65813
1677 -65813 -29319 -56789 -84490 -104665 -36532 5513 -67150 -66375 -3228 15610 45982 26477
1665 26477 -28051 46274 68846 77581 -26948 3331 -33724 -45287 23278 30913 39364 -16022
1653 -16022 -46034 -12013 9948 11463 36271 -12050 -11144 22939 -6681 -99255 -27487 50905
1641 50905 -7178 -9474 72576 86742 66911 60092 -23895 -15445 13655 69861 25162 -7144
1629 -7144 -37077 -39705 -28770 -19458 -23698 386 -13440 -67532 -22549 267 25969 17224 57289
1616 57289 58180 72848 56977 35294 16142 -78139 -46948 -51862 -63217 -18654 -57325 -46492
1604 -46492 9389 17566 -2650 -17660 -162 38645 26139 63806 -33544 -25217 30095 21825
1592 21825 -19151 -86545 -66697 64907 87242 21320 -17647 -9892 -57511 -72126 -85647 -37286
1580 -37286 31373 59024 56114 17344 46292 31349 -9242 -2682 -109979 -89419 -90741 -36602
1568 -36602 -4949 -9833 -52744 -16012 -53276 -93743 6462 10716 41841 -4362 -64622 -18147
1556 -18147 44193 1515 -30462 -29213 59844 41341 41619 19359 70494 107536 31138 -12540
1544 -12540 -14361 -67244 -44458 -38018 -17224 -68554 -15217 -33396 -21321 16938 56936 25453
1532 25453 13688 61798 52168 14644 -41996 70035 73985 10091 30890 29505 -14401 -3812
1520 -3812 46081 76797 40172 -40397 -80688 -18032 -35764 -89819 -97054 -61641 -5109 7160
1508 7160 -36246 -40074 -23942 -75370 -72986 -67436 -58512 -96591 -77823 -76988 -25436 -38712 -13479
1495 -13479 -13855 -11399 -16248 -13850 1838 24897 37262 39343 -12101 16789 45815 -26973 -56811
1482 -56811 -61526 -44171 -26435 -1159 -55266 -16058 5382 -43220 -33936 5159 -64197 -38861
1470 -38861 -21428 -38084 -22188 -25506 -92526 -89452 -20859 7904 -18431 -5378 1845 17409
1458 17409 -31586 -40264 21010 42688 18845 54732 -38739 -75970 -13643 -6153 -60329 -13407
1446 -13407 68540 1003 9670 -73431 -78459 1286 -10434 4948 67087 -901 -2628 12213
1434 12213 -52264 -21464 -8960 45713 10403 -5581 -52492 -73559 42328 -11958 8194 -4900
1422 -4900 -33991 -17824 -49130 14688 -33143 -16584 17118 20773 -28223 -19593 -23287 7186 -19268
1409 -19268 -19887 25013 -9966 -10537 -89320 -70670 18595 6402 -8464 62930 -9933 -5682 19495
1396 19495 -19157 -20398 -3071 36050 -14860 5275 26181 -24447 5532 -28943 19351 -19265
1384 -19265 -18788 -47998 -41239 5855 9196 19750 -2976 9623 -6430 22648 44758 51175 9773
1371 9773 46598 59538 80723 72788 29341 -20094 -26177 -23921 -34970 -16316 -46455 -42999 -20586
1358 -20586 -10888 13930 -22766 10037 -24499 -40254 -39246 -26844 -27681 -3618 11790 -14632 17056
1345 17056 2892 -27309 -36935 -3613 26626 -43808 -18273 89105 24550 -36591 -28420 -53327
1333 -53327 3418 49757 16619 6904 -38437 34135 32827 25728 28067 -30933 10761 51634 45336
1320 45336 43025 19988 18135 -12880 14200 -3850 24928 13341 33476 -7960 -97182 -63677
1308 -63677 -6672 17149 -14063 -43791 -63754 -23899 4146 -14762 35358 39196 -9883 -57114
1296 -57114 -51562 -10995 -36016 -7903 813 -40335 -52715 1245 -59744 -57098 -53138 -55669 -22233
1283 -22233 -27000 -3129 -14691 -12642 -21534 -16526 -47313 -61857 5264 2659 -22677 -24016 -36142
1270 -36142 18231 22394 12423 -2212 931 14293 -4468 -15479 16084 3366 25796 99773
1258 99773 -8458 -116549 -57811 -60161 18933 88725 52012 14832 21956 34126 13417 28996
1246 28996 -1620 13245 85277 17922 -8894 10428 -4369 64657 4600 34191 60767 64218
1234 64218 -51368 -49892 -102326 -111835 -106228 -58394 -9286 11862 51727 -1988 -3237 -33763
1222 -33763 55373 19902 52920 15932 4848 -30609 25946 -11741 -45408 0 29446 -17991
1210 -17991 -24962 1898 -5773 -73786 -130404 -131210 -143009 -19254 32699 41141 -39509 -72044 -111542
1197 -111542 -51751 -45847 24676 46822 -1150 -32328 -73746 -48636 16864 -6634 -75111 8679
1185 8679 73307 26776 13357 -25402 -12751 5261 -45087 -19193 832 -22894 -29189 7077
1173 7077 -2685 5429 -25968 -77974 -72060 -71155 -35156 44393 15152 -58927 -21035 23895 18263
1160 18263 -1150 -54862 -60083 -12180 -12319 50492 100007 -5883 -32194 30501 1352 35585
1148 35585 52444 34465 -2160 -32062 -68373 -86505 -78152 -46708 -45689 -45830 -56426 -43323 -66409
1135 -66409 -5100 1117 -47285 -6059 16338 2623 8789 -5817 -62405 -74899 -78909 -46228
1123 -46228 6319 4259 34593 -1850 -67458 -41284 -34460 -46987 4366 36710 -24587 -11717
1111 -11717 4859 -27004 4239 24669 1883 30443 8405 17351 17510 35675 26195 -17058 -27000
1098 -27000 -23973 -383 -83918 -32221 -970 -85172 -37373 -17797 10393 -19254 -4121 -70184
1086 -70184 -93571 -6147 -16103 -1184 -9500 -25523 -25550 746 35652 3976 463 4746 -19773
1073 -19773 -20340 43894 7322 13718 -17555 19060 35344 29338 4783 -26295 -39344 -52286 -69733
1060 -69733 -37330 4220 69201 44445 153 -3647 28670 43877 -36040 -49838 10947 68327
1048 68327 44431 27752 12189 -7254 18790 53160 -14270 -67407 -59601 -49207 -36598 -17500
1036 -17500 -25725 -3806 24977 20973 -14339 -6160 -37023 -55054 -34456 -32412 -30744 17838 -17956
1023 -17956 -27009 55180 38850 73995 -2248 -74858 -50641 -27689 -79340 -12936 -7800 20925
1011 20925 -11602 -9507 5931 -29643 11103 -28681 -59364 -26839 58275 4683 19678 -58595
999 -58595 -47868 -21066 4116 60028 -7136 -29499 42879 -213 -17458 -23819 24297 -22450
987 -22450 -39451 -37054 -8529 -33311 -42354 46302 65973 -5945 -77619 -137107 -81637 -61785
975 -61785 -86321 -27261 15397 43514 9815 20633 -7883 -19896 23409 44662 13964 15309
963 15309 38728 -76606 -17542 -1545 -20660 4826 55101 68976 96978 116466 -21418 -49630
951 -49630 -49147 -34693 -8364 19987 -10754 -64654 -39216 20088 1185 -15765 32714 35538 -9768
938 -9768 24703 -16359 -19904 -29580 -41458 3406 20894 33894 30193 -15736 -51340 11986 24692
925 24692 -15313 -23114 -55536 19664 15269 -46480 -43195 41947 11654 -34819 -36420 -20614 60022
912 60022 28472 65518 100669 53564 -233 -111098 -101189 -58779 -50347 -608 -4479 -19211
900 -19211 -25997 -51348 3827 15354 -5542 -24165 28746 42957 66793 38841 10038 -17853
888 -17853 -25367 6637 -16051 49106 93555 88898 55249 33488 -17542 -53488 -61208 14218 -11494
875 -11494 59588 42169 13437 89699 42354 35548 20987 36034 59665 31626 14179 -22299
863 -22299 2118 -53963 -64508 11162 51240 60149 -584 2887 6807 -30211 -47984 -86967 -67508
850 -67508 -13788 13180 29904 -39060 -92922 -45928 -29142 -59898 -28052 24880 21412 7360
838 7360 2935 -39753 -44197 -17155 15689 18893 -8231 17284 7498 950 39281 -30782 -63648
825 -63648 -4486 5879 -19949 13009 -36696 44553 -7637 -98576 -8861 42171 46210 17156
813 17156 54747 16187 -94888 -48006 -46284 -83367 -93139 -84930 -4043 17792 21837 21212 -7213
800 -7213 23244 29187 42478 56438 51765 -28658 -36130 -34209 -90625 -57617 -9710 -19982 -29310
787 -29310 -4974 22216 5122 -29650 20857 -33030 33577 30507 -46094 -69354 -54247 -17918
775 -17918 22490 -41612 -96224 -92677 -141039 -107082 -29967 415 21021 18942 -48653 -3279
763 -3279 18993 44177 5138 -53807 6202 -28950 47708 80109 66662 21246 14662 63137
751 63137 85471 41631 -21143 16157 -38781 -37788 13392 19615 -63219 -43491 12016 79196 52656
738 52656 -7224 -19999 -3341 -7395 -22167 -22894 -40411 -23778 -41987 -2173 -16527 -49701 -46352
725 -46352 22147 21938 82982 48815 -39193 -16874 12105 9205 13111 76729 116204 33967 -8931
712 -8931 -5950 6815 42070 -15195 5119 31931 -61167 -78596 -69393 -13688 -87 44631 5791
699 5791 -22775 -28092 -62987 269 45221 75161 77941 56737 49060 -1105 122 11948 20192
686 20192 9201 20640 3602 2076 -6206 21879 60584 -51895 -72466 -591 53866 32160
674 32160 77831 -23913 -31026 -20754 -65202 2386 49297 13354 44885 54302 -641 21730
662 21730 49281 -29837 -50073 4414 55360 33256 27377 21640 23641 5248 59941 138446 92246
649 92246 43842 -6564 -9521 12810 8534 -30086 -33770 34873 -52463 -55890 -13300 -1516 51824
636 51824 21270 -14702 1777 44154 -9247 -28734 37142 72338 56557 28303 32064 41339
624 41339 12071 37783 -5149 62248 64607 -10966 40376 25317 -42859 5413 -6045 -75825
612 -75825 -67838 -40660 -60341 16517 30073 -18233 101065 58679 31080 36209 25366 -6255
600 -6255 47198 128912 101247 53806 61831 11129 -31969 -16753 38583 49779 75490 13393
588 13393 50786 47801 -21702 21947 -13533 38908 68327 101774 60512 -12279 3810 7296
576 7296 -56354 47227 48831 -238 7953 70232 124503 72632 65750 63090 -10433 -74427 -5774
563 -5774 45458 15265 29145 -7419 27829 56821 5625 19940 24003 12333 24567 70405
551 70405 -2969 -66736 -3040 73385 105451 48879 -25003 -81869 -96972 -44695 -14872 -4197
539 -4197 54379 37721 -7824 25115 44284 25280 41002 20454 -9622 13362 86636 58285
527 58285 -8430 -4863 -32453 -19526 39269 40649 -16247 -60656 -59792 3351 -7075 -18671 3686
514 3686 6602 -8551 6933 -39913 -18910 -48796 -46996 -15039 31210 -14096 -36110 -8430 8636
501 8636 -32312 -30317 -40540 -23757 21914 -14508 22031 49601 57488 5191 95440 111752 70882
488 70882 103890 103108 24042 -46907 10030 18260 8837 16435 12455 41398 53059 60545 -45731
475 -45731 -104709 -79600 -71179 -65554 -33135 -75352 -10950 -26167 31116 18809 42570 5048
463 5048 -4293 -81725 -77840 -36656 58445 95097 46001 83802 -23024 -35478 -31019 -98839 -48395
450 -48395 -21933 -26298 -45407 -35417 4186 10868 -55109 -67817 20981 35939 58831 14619 -37445
437 -37445 -107375 -37605 -12820 47501 83152 29420 13852 60878 47183 -5815 -66731 -22440
425 -22440 -9667 5633 58763 77043 57261 44431 101971 68307 26723 41355 8738 54614
413 54614 33326 37433 59540 73491 11207 -9225 34486 21481 -845 -29265 -12700 13451
401 13451 45649 -9749 8904 8697 4854 46384 2886 -8345 -12513 23121 54665 87471 99345
388 99345 83367 -318 6783 5912 10378 -23143 -31294 -37463 8974 13612 64757 6115 -68810
375 -68810 -19912 33336 -4369 -28251 -5757 -261 -34629 20323 1680 78742 101631 22900
363 22900 69381 -19255 -21010 -35787 -17987 21237 80252 22828 -173 -57399 -31558 37225
351 37225 53638 11041 -47198 -95619 -78905 -30943 -41602 -34178 1871 29658 27167 49493
339 49493 37220 16625 4968 11373 58260 8892 23781 71716 47898 -47682 15793 88989
327 88989 19743 -57510 31138 44645 3354 11035 52903 73362 65272 5591 -33624 -44111
315 -44111 -22202 -51246 -41585 -15894 22626 14820 32215 73173 51869 34317 4937 -39397
303 -39397 -32630 4827 -34380 -20468 -687 -3076 43176 53818 29832 59812 8303 33434
291 33434 51827 13817 -4040 8597 62634 38484 30289 97533 94638 20092 26099 44532 23269
278 23269 25404 -40457 -17120 -17997 -10849 -427 33804 18433 19596 1769 -40301 -47578 -45131
265 -45131 -245 6023 23970 73346 3149 8793 -28705 -21390 64624 43979 111367 42845 16713
252 16713 61210 28745 58248 57013 25219 19668 -12065 -45649 -20960 23615 -87421 -17601
240 -17601 25119 1259 -23785 -40485 -36863 -11154 21565 51862 103649 78027 50415 -30299
228 -30299 2709 -8539 -22068 -1669 -20974 81836 61278 77984 107915 13241 -39046 -18525
216 -18525 -56146 -23344 -90 -474 -75084 -73833 -16361 34760 133360 83398 32120 41261 111066
203 111066 69411 112632 50994 -70508 -101706 -29912 -19790 35110 -13571 42464 53661 56722
191 56722 19660 -16463 -868 8405 33217 -1020 -1313 -2708 5580 83171 83789 20615 5694
178 5694 21777 112344 93917 58329 10478 -48339 -48472 72382 86825 27791 17455 -19867
166 -19867 -34469 -13826 49550 122152 16562 -22263 37733 40428 12354 58118 67304 22257
154 22257 2572 1998 -34120 4844 20638 20682 2592 -62780 25460 55053 -27904 9591 22980
141 22980 13341 15386 -32909 28157 11566 -60718 -45763 -29279 -41010 26835 49145 54508 25955
128 25955 -15127 -10531 -927 9152 -57429 -50097 15869 46339 79677 69527 48091 67252 62362
115 62362 25336 19829 4121 22511 67094 15585 -9185 -8638 6611 2380 44150 18074 52227
102 52227 43958 24615 13903 -11403 32211 -62491 -67241 -37975 383 -20786 15786 25254 9125
89 9125 27909 27051 -17988 -10371 50958 50224 75184 40722 26298 11442 23876 -4258 -22417
76 -22417 -15990 -2589 22457 67351 84779 87247 78876 7227 -29141 40925 43361 -12526 -11019
63 -11019 22153 22228 45179 37786 -5583 -23647 11961 32862 68599 72222 55804 32617 28338
50 28338 47724 39915 17037 76727 57729 28986 16914 22678 36295 3093 29842 54252 54132
37 54132 31753 157 14130 45518 13610 -39749 -18730 27664 38032 23458 23203 53028 -396
24 -396 14470 -11200 -8599 -7641 -37494 -600 35608 19276 58558 51669 27465 26671 114 -14571
10 -14571 5576 28575 39520 16675 58279 65755 60543 -611 -31888 -17706
0 -17706
$$ Imaginary data points
##PAGE= N=2
##DATA TABLE= (X++(I..I)), XYDATA
16383 -2427160 -2427820 -2424863 -2402911 -2328713 -2321322 -2263871 -2236833 -2216609 -2193961 -2171029 -2165125 -2145620
16371 -2145620 -2079990 -2045869 -2048090 -1995556 -1956918 -1952673 -1956786 -1927916 -1863108 -1827971 -1829426 -1783221
16359 -1783221 -1689944 -1638452 -1658021 -1602788 -1504321 -1521399 -1535115 -1553098 -1532197 -1488535 -1450771
16348 -1450771 -1399969 -1363528 -1332506 -1306071 -1273599 -1269217 -1240148 -1228871 -1184978 -1147077 -1083237
16337 -1083237 -1064508 -1062483 -1034934 -1003835 -992048 -913873 -905820 -832607 -817264 -824542 -822701 -815863
16325 -815863 -743703 -705155 -672768 -648594 -606854 -534319 -520077 -502897 -494675 -516808 -447922 -435030
16313 -435030 -421652 -427111 -373056 -313008 -308358 -301001 -235110 -203374 -161798 -192175 -165663 -105651
16301 -105651 -78032 -103575 -38618 -11598 30459 31358 48247 73777 78623 117714 169299 221501
16289 221501 188230 178714 198227 243754 310954 335888 370880 408709 343731 384809 396662 426200
16277 426200 420199 484273 455416 489179 588312 582610 602662 595343 599003 592248 676413 768530
16265 768530 748843 738116 739848 762397 731636 787655 858967 830770 883031 869050 876777 924435
16253 924435 935459 988882 952720 1012945 1016552 1001397 1038351 1072530 1117812 1124026 1101372 1122085
16241 1122085 1247236 1215680 1154947 1197720 1242446 1252501 1246848 1245892 1253201 1275552 1339987 1372029
16229 1372029 1405285 1411456 1385169 1358639 1410596 1443197 1430290 1467748 1517529 1511303 1523804 1504100
16217 1504100 1480767 1465919 1534925 1567990 1574369 1618036 1557870 1550141 1598465 1559975 1582841 1636543
16205 1636543 1644981 1601564 1645346 1698321 1682175 1729348 1711539 1698276 1740155 1701455 1740729
16194 1740729 1710382 1729749 1791911 1842224 1803369 1766612 1813498 1813330 1800870 1814110 1865203 1922799
16182 1922799 1911232 1897513 1906759 1859299 1920316 1938665 1956853 1959061 1966387 2008722 1992780 1946512
16170 1946512 1962606 1947977 1943266 2000590 1997696 1991527 2027121 1971692 2004277 2067773 2102950 2067011
16158 2067011 2050463 2004248 2087286 2135262 2108801 2083768 2052509 2109122 2164911 2161322 2124689
16147 2124689 2089691 2089503 2069809 2017821 2027365 2074142 2111825 2074591 2137928 2137672 2101079 2160921
16135 2160921 2165282 2172162 2111646 2128120 2151954 2167657 2181917 2173817 2159522 2174218 2225818 2258428
16123 2258428 2334418 2328822 2297669 2265200 2300013 2304788 2297616 2262054 2249439 2270897 2275349 2288052
16111 2288052 2264883 2247805 2245230 2273416 2270762 2311305 2342181 2311473 2306933 2284373 2260802 2248348
16099 2248348 2311774 2400900 2364163 2305135 2313580 2247240 2268933 2260758 2308602 2321432 2265907 2304730
16087 2304730 2303954 2254398 2285868 2329405 2328803 2367878 2394545 2308072 2299411 2288418 2274398 2297892
16075 2297892 2301372 2376877 2395353 2363791 2341633 2396609 2276054 2203159 2299281 2368273 2370231
16064 2370231 2359033 2410895 2346443 2320062 2341490 2385008 2412743 2488917 2389886 2317485 2409808
16053 2409808 2386193 2366984 2371133 2359892 2289013 2325077 2335365 2325194 2333519 2340044 2323566 2301042
16041 2301042 2333769 2382636 2374773 2390366 2436730 2391285 2369981 2370808 2301473 2327581 2395464 2410762
16029 2410762 2427507 2483891 2421241 2378366 2393266 2379429 2372799 2391236 2371637 2362535 2382415 2425503
16017 2425503 2448980 2415807 2433213 2447802 2458382 2443512 2387400 2412451 2427012 2373814 2336706
16006 2336706 2341479 2342007 2344795 2381427 2406198 2418343 2375958 2403738 2423528 2415285 2413264 2401110
15994 2401110 2400872 2436304 2463836 2411881 2381288 2428089 2368800 2370213 2338451 2389179 2396886 2364430
15982 2364430 2411836 2379132 2413693 2412117 2418482 2383105 2379455 2361448 2384103 2416850 2375297 2354197
15970 2354197 2316416 2306025 2371674 2387767 2400121 2422981 2411672 2408460 2397877 2399256 2380806 2358132
15958 2358132 2334194 2326452 2386416 2398256 2394761 2411601 2415771 2444543 2438765 2374994 2428247 2446970
15946 2446970 2475913 2431198 2401269 2427584 2406612 2447937 2441636 2503992 2512504 2467843 2443756 2464917
15934 2464917 2465055 2427242 2387497 2435319 2437607 2475728 2434163 2430706 2495344 2455546 2447871 2426230
15922 2426230 2388618 2371009 2387779 2393172 2375783 2402139 2474635 2461199 2399180 2462981 2444481
15911 2444481 2445770 2442408 2358903 2429673 2384754 2342873 2336969 2386108 2439136 2371341 2335834 2486393
15899 2486393 2489296 2411495 2437968 2363820 2420760 2484361 2469695 2462033 2409925 2371038 2368224 2355581
15887 2355581 2418912 2402836 2411535 2407966 2404841 2438301 2385699 2399540 2400192 2412181 2350052 2384739
15875 2384739 2436203 2367048 2372467 2383072 2383850 2437860 2439969 2461236 2376481 2339350 2378335 2329335
15863 2329335 2319988 2324232 2350292 2362672 2412425 2389688 2330959 2313080 2360072 2414905 2367801 2377512
15851 2377512 2387936 2401788 2428124 2442498 2447098 2413511 2415606 2434338 2413199 2419789 2473628 2535517
15839 2535517 2498785 2494195 2490582 2463200 2368761 2432307 2402027 2295277 2336644 2354751 2444481
15828 2444481 2444105 2459585 2465713 2452054 2442389 2442914 2387753 2351443 2356509 2412916 2418697 2423039 2380770
15815 2380770 2439904 2412674 2431842 2455131 2415665 2428050 2414034 2489241 2481455 2434453 2437832 2427966
15803 2427966 2417658 2425763 2445861 2486980 2451125 2409218 2364705 2424841 2401215 2379080 2421473
15792 2421473 2481806 2499446 2452686 2474639 2459416 2438662 2498131 2499708 2433402 2467661 2450742
15781 2450742 2432181 2470160 2440271 2400395 2477992 2426573 2412507 2485007 2472816 2452070 2381093
15770 2381093 2452162 2508522 2438848 2419490 2445130 2496829 2503624 2446817 2451640 2375079 2383738 2386770
15758 2386770 2416073 2513220 2475101 2451666 2403917 2419922 2474401 2528208 2513777 2541920 2512024
15747 2512024 2456902 2467308 2487145 2569433 2478011 2418697 2470096 2492321 2537752 2492856 2483632
15736 2483632 2533676 2488964 2458235 2466922 2462816 2423340 2488102 2542766 2515791 2467759 2463874 2481957
15724 2481957 2456648 2451332 2510698 2528587 2451223 2475919 2379050 2355373 2412623 2381755 2455727
15713 2455727 2425738 2419336 2423450 2459262 2449213 2410156 2462824 2496728 2449669 2429546 2438793 2486601
15701 2486601 2474499 2463365 2503727 2474875 2505125 2498060 2454732 2492044 2583671 2567475 2487536
15690 2487536 2439420 2457210 2456598 2434263 2467530 2452863 2455564 2459924 2453678 2408936 2452301 2482042
15678 2482042 2461753 2499695 2458632 2450080 2453794 2450224 2495122 2460641 2412642 2441702 2426908 2383207
15666 2383207 2424952 2449229 2489461 2555394 2527013 2492575 2515831 2532248 2525396 2501968 2461477
15655 2461477 2514101 2488047 2410369 2410569 2396569 2418126 2451980 2429168 2445022 2509743 2503212 2525217
15643 2525217 2557129 2488461 2498837 2552507 2579207 2509408 2473024 2540275 2524181 2489532 2495954
15632 2495954 2408874 2431208 2446207 2450302 2501709 2505003 2504826 2457728 2422231 2511553 2507847 2435210
15620 2435210 2500636 2566308 2524802 2518789 2532357 2490274 2441214 2472989 2516438 2483104 2483104 2458198
15608 2458198 2458802 2500540 2449114 2422663 2356582 2411253 2500778 2462475 2482341 2493488 2544704 2564687
15596 2564687 2463949 2477753 2525240 2462401 2453064 2424042 2391122 2444327 2428704 2477206 2481512
15585 2481512 2490422 2453056 2454174 2495410 2488062 2499266 2501081 2456353 2463085 2540752 2512405 2528120
15573 2528120 2443441 2402298 2365672 2425785 2491970 2492407 2547652 2502054 2459722 2502810 2551948 2521546
15561 2521546 2536263 2482414 2472928 2505470 2485195 2509061 2527711 2507193 2430593 2408053 2445209
15550 2445209 2520599 2525908 2583726 2500519 2511783 2452569 2473036 2474051 2431588 2455088 2474246 2511443
15538 2511443 2490145 2485893 2489633 2419954 2485268 2465800 2414097 2470081 2549138 2543968 2469727 2461815
15526 2461815 2435795 2498595 2509020 2462306 2456190 2460802 2470943 2517402 2512456 2479950 2445885 2459935
15514 2459935 2427256 2426826 2462923 2455174 2467726 2419699 2451966 2523745 2460753 2508247 2547823 2562911
15502 2562911 2578479 2549467 2533955 2518262 2490843 2507617 2538695 2529129 2462007 2465478 2468128 2426467
15490 2426467 2446939 2511450 2492012 2490456 2491529 2516508 2591849 2524924 2505581 2483931 2500889 2548074
15478 2548074 2575826 2525226 2490091 2523917 2552993 2530455 2568228 2563838 2543123 2532881 2455019
15467 2455019 2516218 2519135 2511400 2468172 2403121 2469537 2500245 2554980 2591406 2559113 2560070 2526861
15455 2526861 2513556 2459062 2447175 2483867 2513840 2457007 2488724 2471121 2532952 2575679 2548156
15444 2548156 2440984 2410585 2481899 2516646 2523206 2598112 2559925 2530286 2528294 2505474 2475089
15433 2475089 2472666 2478548 2524149 2576476 2532140 2459602 2457651 2498585 2518124 2551963 2550766 2616621
15421 2616621 2624110 2599622 2611860 2566356 2499394 2465490 2508862 2539349 2555142 2496939 2481682
15410 2481682 2507664 2557906 2568155 2496921 2501981 2495353 2570766 2616775 2607498 2569389 2572228 2582468
15398 2582468 2541277 2555299 2561573 2582048 2607138 2578749 2572921 2490783 2508656 2532443 2564750 2591803
15386 2591803 2618936 2583077 2575498 2576423 2536083 2521857 2575522 2547856 2584733 2581070 2543817 2503246
15374 2503246 2514166 2485279 2436660 2481488 2512516 2515161 2558845 2503098 2529225 2552453 2521967
15363 2521967 2514880 2536889 2532969 2607082 2593208 2598999 2559357 2518621 2505258 2518968 2515742 2460958
15351 2460958 2537980 2522837 2512414 2510512 2561385 2542781 2559706 2522066 2520353 2565423 2612378 2614986
15339 2614986 2620395 2589799 2548710 2584014 2610710 2595718 2496362 2523003 2582311 2599676 2538421
15328 2538421 2507844 2468824 2542404 2583927 2556508 2509609 2521039 2476987 2419862 2467824 2488396
15317 2488396 2559569 2486691 2459685 2484445 2530426 2516241 2535013 2526496 2559598 2575649 2525291
15306 2525291 2477169 2496546 2487485 2443762 2433721 2523668 2553168 2575115 2591326 2626484 2635120 2572358
15294 2572358 2550164 2636306 2588338 2553556 2490366 2517432 2586099 2579063 2580749 2630593 2597282 2600876
15282 2600876 2559331 2565798 2600179 2598090 2546493 2565025 2589029 2587099 2607544 2579244 2570091 2565052
15270 2565052 2569826 2524097 2525041 2526809 2587211 2549187 2570220 2510326 2512173 2536587 2550877 2579041
15258 2579041 2610972 2627488 2582933 2558245 2612413 2616461 2620146 2567704 2524152 2584188 2605953 2497783
15246 2497783 2474375 2510446 2542991 2582731 2580726 2585389 2500470 2528386 2497802 2536857 2550767 2535837
15234 2535837 2516494 2539953 2613681 2537405 2574748 2538686 2553758 2610172 2599717 2585587 2566723
15223 2566723 2605303 2591020 2624064 2641270 2601320 2576874 2585806 2559980 2569732 2582333 2525985 2485676
15211 2485676 2516358 2554987 2578159 2575659 2571089 2612179 2604509 2579209 2564763 2659580 2628313 2607934
15199 2607934 2523130 2498442 2510587 2549937 2544520 2543351 2598650 2542545 2523380 2563091 2559300 2563836
15187 2563836 2560488 2643339 2661673 2638441 2589898 2547307 2549905 2589719 2654637 2720013 2717730 2626524
15175 2626524 2613503 2578087 2571596 2578954 2554821 2497381 2553126 2524181 2507925 2590180 2628473 2596125
15163 2596125 2565870 2593642 2604127 2553584 2559310 2594412 2574356 2584784 2591791 2551634 2562671 2586973
15151 2586973 2581018 2593425 2594492 2598499 2611844 2537166 2529564 2543196 2548950 2559008 2549438 2644156
15139 2644156 2633630 2678641 2581855 2577760 2545214 2520629 2534936 2607597 2681879 2640125 2633359 2604436
15127 2604436 2708472 2648484 2604964 2553192 2546359 2593704 2612031 2600579 2583249 2595713 2562394
15116 2562394 2558488 2622022 2642987 2630037 2569943 2592836 2582244 2634930 2674579 2640806 2590852
15105 2590852 2553193 2576985 2631910 2614854 2609124 2613371 2663587 2602107 2550489 2638474 2679628 2616397
15093 2616397 2624286 2636715 2685961 2704629 2627577 2623365 2654087 2657914 2698746 2642056 2578429 2581250
15081 2581250 2632276 2639074 2588205 2617364 2601735 2571694 2570679 2617461 2693176 2660831 2602647 2644981
15069 2644981 2623757 2609150 2620884 2595220 2586944 2592797 2538414 2614061 2585767 2615878 2607582 2641695
15057 2641695 2639500 2652088 2638666 2676278 2659266 2577217 2626323 2673872 2685061 2617078 2650457
15046 2650457 2651623 2569808 2561509 2533026 2615947 2647444 2620120 2604177 2587111 2654509 2676391 2693652
15034 2693652 2645836 2546568 2517083 2537254 2533890 2528213 2558390 2664643 2687172 2655419 2612038
15023 2612038 2648196 2615693 2615900 2616811 2559527 2531410 2566792 2631093 2653328 2659670 2568648 2541102
15011 2541102 2564326 2608734 2621355 2659654 2713138 2653887 2632402 2664773 2674331 2666920 2642988 2685851
14999 2685851 2682048 2669679 2602564 2599201 2596980 2581791 2612303 2551579 2579490 2587005 2622890 2573745
14987 2573745 2640530 2678614 2602935 2609204 2655721 2665667 2694633 2594146 2582901 2622104 2676811
14976 2676811 2622760 2615302 2660247 2636791 2641932 2605153 2621708 2550024 2532962 2586939 2614548 2552263
14964 2552263 2637377 2640251 2590710 2613556 2623955 2628503 2666811 2633978 2639483 2646243 2615426 2664882
14952 2664882 2676691 2613655 2624752 2650177 2637019 2634104 2687076 2670067 2686054 2743586 2709044
14941 2709044 2667886 2690769 2707983 2672173 2705696 2664907 2562780 2608370 2602442 2626450 2638484
14930 2638484 2616473 2610836 2608747 2646674 2672152 2640118 2691042 2700748 2699728 2704202 2550659 2586503
14918 2586503 2603602 2617393 2649227 2641548 2676451 2661951 2671738 2652089 2642518 2624795 2620913 2674635
14906 2674635 2653012 2623850 2611069 2643025 2684953 2651422 2630248 2623533 2617718 2650589 2669651 2665252
14894 2665252 2649483 2693563 2650191 2640936 2679045 2686525 2659233 2651179 2665600 2631428 2603195 2586970
14882 2586970 2603113 2614935 2628620 2651185 2636247 2603420 2662237 2633190 2666885 2649016 2630100
14871 2630100 2683559 2664083 2643697 2686792 2673275 2691313 2728696 2677993 2693121 2631748 2672370
14860 2672370 2650594 2670273 2684157 2709521 2676969 2713741 2760934 2689645 2670290 2697758 2717186
14849 2717186 2689523 2660931 2659610 2662409 2643453 2705155 2707382 2667967 2680636 2680031 2687025 2692694 2609923
14836 2609923 2569115 2639361 2677964 2682674 2598588 2667615 2670092 2691357 2688438 2638655 2661966 2721704
14824 2721704 2761350 2656212 2680732 2635534 2585812 2592753 2662007 2702383 2680564 2671691 2689359
14813 2689359 2714359 2623467 2627315 2637208 2680904 2726783 2670443 2629726 2609830 2631671 2669646 2656414
14801 2656414 2672912 2718339 2723816 2689658 2721554 2685022 2644447 2717588 2691492 2665202 2664249 2728777
14789 2728777 2713119 2688603 2714109 2664612 2611478 2684582 2716282 2716987 2681660 2673052 2699203 2709472
14777 2709472 2702006 2681893 2683174 2729275 2728312 2737992 2692284 2654923 2628760 2654517 2744200 2642458
14765 2642458 2614056 2667066 2633138 2678799 2757515 2768041 2744557 2655091 2692935 2743877 2671594
14754 2671594 2675699 2686393 2626184 2659021 2710149 2678736 2707536 2698606 2678864 2670716 2708470 2715534
14742 2715534 2734226 2676873 2674259 2720856 2682198 2660516 2682564 2667504 2656560 2692017 2705037
14731 2705037 2648962 2694802 2658875 2638201 2693907 2689301 2658835 2664317 2729942 2693880 2655103 2718258
14719 2718258 2720885 2745091 2811915 2810025 2772660 2724184 2668317 2711280 2733167 2686877 2639006 2640195
14707 2640195 2747074 2731016 2732719 2757326 2735936 2720480 2705090 2703398 2716253 2690212 2690762 2737682
14695 2737682 2768276 2813190 2803702 2700699 2696826 2709966 2683565 2655247 2715878 2677244 2681194 2659863
14683 2659863 2669205 2673176 2745544 2753711 2742730 2826532 2755855 2717172 2740163 2727337 2658811 2665223
14671 2665223 2698342 2735923 2708648 2733606 2781205 2711145 2696970 2641014 2675800 2681980 2699382
14660 2699382 2758585 2703189 2723857 2686959 2729133 2831162 2831252 2792095 2710512 2730694 2695894 2665034
14648 2665034 2699667 2717004 2699327 2755031 2718141 2692898 2675444 2652103 2612436 2690784 2672828
14637 2672828 2667366 2688150 2746142 2780679 2738791 2748013 2746810 2717504 2717299 2744466 2714356 2726587
14625 2726587 2794694 2753361 2745337 2737613 2784670 2792949 2681718 2720188 2653875 2648919 2698091 2764063
14613 2764063 2801911 2781694 2687426 2745053 2746469 2770611 2804025 2783215 2822156 2837312 2786432
14602 2786432 2730015 2691350 2725331 2731216 2780506 2757689 2751527 2748605 2780755 2777626 2746950 2806261
14590 2806261 2750140 2739998 2759399 2759183 2779828 2755751 2803389 2757127 2705414 2731338 2723571 2718343
14578 2718343 2728475 2691265 2679257 2648167 2666929 2725010 2742030 2774595 2761612 2734320 2644898
14567 2644898 2742982 2784453 2773687 2769747 2761495 2755451 2754343 2727976 2770489 2792248 2714596 2712293
14555 2712293 2692686 2705496 2706324 2724379 2719266 2726903 2707728 2735902 2719283 2680382 2701076 2749156
14543 2749156 2752055 2659267 2699843 2812597 2716332 2692802 2746037 2790251 2746838 2705615 2717923
14532 2717923 2800216 2808558 2791536 2816372 2821790 2850021 2876544 2785713 2744566 2798503 2750377 2742433
14520 2742433 2818783 2759807 2762159 2824853 2804448 2695854 2703754 2751177 2682512 2759884 2797416
14509 2797416 2789560 2762592 2760271 2753800 2837859 2873831 2723689 2638768 2757800 2778933 2759919
14498 2759919 2717363 2734671 2761212 2677142 2667966 2771201 2789376 2745107 2716363 2754497 2818549
14487 2818549 2819148 2785309 2722730 2706917 2747132 2800115 2797604 2780675 2852072 2735496 2696175 2785272
14475 2785272 2766733 2749022 2737731 2724934 2777751 2778618 2825975 2797733 2807381 2807489 2808906 2823065
14463 2823065 2786660 2733466 2764511 2826344 2796900 2810999 2817095 2739344 2727110 2752685 2752115 2776699
14451 2776699 2727400 2724034 2735485 2740257 2817381 2744483 2759557 2783748 2744701 2761285 2760561 2786224
14439 2786224 2747538 2769193 2775270 2801705 2777876 2763314 2723970 2814217 2858189 2845225 2892639
14428 2892639 2895388 2819946 2734836 2805241 2830072 2828399 2806709 2729375 2683126 2721349 2749692 2816442
14416 2816442 2826888 2816946 2862024 2788382 2721937 2756733 2786216 2843203 2853450 2843701 2853110 2793464
14404 2793464 2762398 2831933 2788442 2711892 2788363 2815641 2731181 2753474 2770187 2702001 2760818
14393 2760818 2771693 2794692 2783852 2828677 2889461 2875714 2837096 2760552 2740445 2818044 2810594
14382 2810594 2821623 2753545 2780385 2831247 2807172 2826658 2757089 2696480 2707250 2716844 2737972
14371 2737972 2798492 2824020 2861706 2898793 2893377 2845787 2766135 2729803 2752207 2760065 2752529 2713892
14359 2713892 2695992 2732467 2814924 2806714 2824936 2812270 2811846 2790066 2842902 2833118 2800696 2860656
14347 2860656 2895616 2876996 2824482 2783020 2770866 2809609 2768409 2816915 2848756 2903200 2856998
14336 2856998 2787962 2876333 2925036 2888168 2801876 2764798 2802136 2789755 2810289 2811470 2812467 2886318
14324 2886318 2930217 2907968 2896574 2840793 2848534 2851874 2832914 2835177 2832929 2827821 2832254 2824752 2841134
14311 2841134 2807328 2774530 2803395 2898546 2862568 2844337 2826028 2763607 2781781 2798825 2835732
14300 2835732 2789309 2789646 2800321 2785260 2827289 2814845 2830132 2862611 2844792 2925242 2887306 2859732
14288 2859732 2801918 2772448 2828385 2796302 2803768 2834524 2857852 2834151 2855499 2849733 2854781 2915386
14276 2915386 2868223 2793765 2804835 2833449 2845525 2896619 2839038 2806338 2848659 2821768 2816399
14265 2816399 2878084 2932279 2906840 2851719 2866958 2862258 2871659 2898097 2896434 2851175 2849264 2835316
14253 2835316 2833969 2824209 2877466 2786882 2798364 2835200 2791003 2777633 2804159 2861735 2880196 2933405
14241 2933405 2959841 2924198 2875337 2871100 2903932 2928722 2927122 2902049 2850718 2821782 2888022 2903757
14229 2903757 2900779 2846660 2781547 2831512 2811271 2869582 2817017 2795767 2837649 2824667 2801097
14218 2801097 2807279 2865843 2859113 2833184 2812376 2794162 2843216 2913321 2891148 2867842 2847550 2830811
14206 2830811 2776199 2798817 2831554 2887304 2875644 2779740 2804217 2835065 2855061 2855142 2798896 2886028
14194 2886028 2834539 2853336 2829368 2875437 2919681 2850298 2846486 2886323 2807836 2738458 2799663
14183 2799663 2784302 2855513 2836784 2867184 2913799 2895876 2824990 2829951 2837843 2828645 2851514 2833264
14171 2833264 2770711 2821125 2799571 2838449 2872753 2881807 2920300 2872360 2881300 2872792 2802086 2792076
14159 2792076 2837020 2886655 2867238 2816882 2833947 2861186 2861342 2891921 2816263 2832634 2880943 2894676
14147 2894676 2874826 2920604 2911451 2875505 2863842 2941036 2972398 2884135 2820643 2891293 2918791
14136 2918791 2902690 2864702 2844607 2869744 2884645 2847138 2805952 2825907 2845968 2873576 2892643
14125 2892643 2934659 2923185 2894621 2851461 2818631 2855371 2856047 2836219 2855133 2912215 2880126 2844196
14113 2844196 2893364 2873762 2854130 2910472 2902892 2824827 2860269 2891743 2891589 2871283 2884220 2808017
14101 2808017 2875127 2836893 2830347 2849901 2846425 2835327 2856746 2910051 2934833 2941638 2900822 2868153
14089 2868153 2908221 2990001 2937684 2944122 2945533 2929959 2958109 2903058 2941532 2939327 2922128 2908585
14077 2908585 2866705 2935609 2919493 2922367 2987296 2963337 2927466 2938419 2952146 2944453 2968546 2984269
14065 2984269 2950355 2932545 2949877 2886133 2838081 2865344 2873132 2887315 2864337 2914779 2906946 2875045
14053 2875045 2883810 2901208 2873324 2804997 2898973 2938471 2871930 2880753 2923192 2915056 2931390 2870419
14041 2870419 2858918 2915223 2941026 2944070 2882331 2824133 2866408 2925182 2839049 2847158 2874270 2947240
14029 2947240 2933734 2905920 2913722 2929635 2871119 2841253 2952028 2967704 2867584 2909954 2877826
14018 2877826 2844637 2879994 2951680 2938149 2873682 2871801 2883011 2848951 2803540 2914466 2885035
14007 2885035 2849238 2891542 2966523 2908711 2841184 2870623 2874709 2863342 2881594 2880476 2901928 2874281
13995 2874281 2935765 3002553 2965777 2886732 2921333 2930486 2990120 2944109 2922127 2947756 2955664 2942127
13983 2942127 2877517 2883912 2884634 2886281 2905251 2900853 2942787 2951109 2904284 2928504 2952477 2943677 2896065
13970 2896065 2955143 2958246 2975142 2954096 2877635 2932722 2955412 2937842 2892497 2931150 2891028
13959 2891028 2867829 2910962 2960821 2990043 2939801 2986022 2929625 2905771 2925164 2929530 2986865
13948 2986865 2995211 2944879 2900512 2938303 3005894 2946006 2948242 2944364 2979124 2991405 2938059 2944229
13936 2944229 2979659 2932784 2845407 2776482 2855243 2900526 2875268 2882481 2952680 2924886 2911288
13925 2911288 2998211 2964139 2922219 2911670 2963632 3050454 2943250 2957282 2971352 2916184 2861549
13914 2861549 2791297 2862589 3011190 3002608 2918698 2945247 2922893 2985329 2987050 2957611 2929941
13903 2929941 2908036 2966882 3097752 3052744 2963056 2977573 3052783 3015313 2919483 2955116 2915918
13892 2915918 2935417 2953645 2923110 2948122 2914150 3011677 2988070 2951059 2975714 3001516 3023444
13881 3023444 2983162 2989297 2922803 2934592 3007393 3024617 2985119 2952269 2930738 2980478 2991365
13870 2991365 3025442 2968013 2968174 2966304 2978777 3005956 3028339 3058775 3007596 2988974 2934480 2918927
13858 2918927 2947741 2932210 2897872 2953095 2996304 3008051 2947526 2937768 2963476 2995863 3011290
13847 3011290 2978896 2970778 2981431 2985021 3004462 2980533 2935681 2912030 2927507 2997880 3041758 3043862
13835 3043862 3016584 2977573 2929346 2923382 2988613 3015599 3000943 3001369 2945992 2958621 2993456 2965841
13823 2965841 2942294 2969483 3058619 3091661 3034723 2943343 2941615 3001915 3021012 3006188 3064403
13812 3064403 3045702 2995653 3019313 2974556 2976688 2950454 2921981 2990292 2948982 2953483 2974711 2932979
13800 2932979 2967526 2976239 2950178 2926683 2878512 2894597 2956929 2895695 2857862 2941933 2974596
13789 2974596 2962273 2969186 2937471 2977905 3007751 3036391 3020377 2973206 2960384 2963835 2999755 2997207
13777 2997207 2993643 2985318 2951826 2996747 3049381 2965290 2998694 2999779 3010992 3029292 2994957 2996827
13765 2996827 3009592 3036467 3000109 2971736 3024362 2982703 3024289 3074851 3054177 3040927 3064430
13754 3064430 3026978 2940174 3008770 3055645 3037178 2965843 2961838 2976460 2939814 3042897 3010285
13743 3010285 3024538 3072323 3001045 2879776 2944010 3043913 3072338 3076140 3076289 3123487 3073031 3002368
13731 3002368 3002499 3044556 3062035 3078437 2996991 2983186 3051237 3068753 3089562 3105817 2981586
13720 2981586 3014925 3009313 2979873 2941770 2940035 3013447 3076893 3121753 3059682 3067208 3029800 3050659
13708 3050659 3065871 3078990 3094884 3042062 3018170 2972213 2944091 2956513 3025503 2990511 2981633
13697 2981633 2970320 3001860 2992873 3002480 3032989 3024984 2963766 2943249 3013195 3061028 3052478 3078962
13685 3078962 3071967 3052989 3070383 3080877 3081489 3029614 3002946 3029186 3022042 2983277 2994602 3094908
13673 3094908 3121824 3059398 3001442 3022508 3044221 3037389 3031163 3002145 2960798 2959446 3008668 2978308
13661 2978308 2988773 3006554 3032286 3079548 3057034 3029230 3077889 3065725 3005773 2987316 3058481
13650 3058481 3044229 3056123 3097430 3076416 3046126 3056108 3027334 3000814 3021465 3077526 3062623
13639 3062623 3017668 3048062 3056054 3060570 3019007 3018015 3037156 3019496 3054843 3053380 3040625 2988131
13627 2988131 3038957 3018910 2999400 3084398 3075241 3052220 3027438 3055005 3026651 3019142 2982837 3035717
13615 3035717 3066877 3043802 3055003 2994007 3050425 3049924 3068423 3115388 3102434 3065986 3032016 3081096
13603 3081096 3056924 3089438 3043217 3030419 2968922 3034210 3104135 3103971 3092225 3076298 3044194 3066246
13591 3066246 3094532 3073588 3070681 3034854 3061984 3025703 3074604 3057489 3055551 3043779 3064111 3046999
13579 3046999 2980662 3031392 3039591 3004261 3044869 3030831 3055856 3064619 3081891 3108975 3073800 3001984
$$ [...]
##END NTUPLES=NMR SPECTRUM
##END=
