##TITLE=1H_TG-2307-1X
 DMSO
 8 sc, 
 28.8.2023
##JCAMPDX= 6.0         $$ Bruker NMR JCAMP-DX V2.0
##DATA TYPE= NMR SPECTRUM
##DATA CLASS= NTUPLES
##ORIGIN= UXNMR, Bruker Analytische Messtechnik GmbH
##OWNER= root
$$ XWIN-NMR		Version 3.5
$$ Mon Aug 28 14:50:26 2023 Russian Standard Time (UT+4h)  she@DPX200
##.OBSERVE FREQUENCY= 200.13135
##.OBSERVE NUCLEUS= ^1H
##.ACQUISITION MODE= SIMULTANEOUS
##.ACQUISITION SCHEME= undefined
##.AVERAGES= 8
##.DIGITISER RES= 18
##SPECTROMETER/DATA SYSTEM= spect
##.PULSE SEQUENCE= zg30
##.SOLVENT NAME= DMSO
##.SHIFT REFERENCE= (INTERNAL, DMSO, 0, 15.7943)
##AUDIT TRAIL= $$ (NUMBER, WHEN, WHO, WHERE, WHAT)
$$ ##TITLE= Audit trail, XWIN-NMR		Version 3.5
$$ ##JCAMPDX= 5.01
$$ ##ORIGIN= Bruker BioSpin GmbH
$$ ##OWNER= she
$$ F:/spectra/data/she/nmr/H-F/1/pdata/1/auditp.txt
$$ ##AUDIT TRAIL=  $$ (NUMBER, WHEN, WHO, WHERE, WHAT)
(   1,<2023-08-28 14:49:06.93 +0400>,<she>,<DPX200>,
      <created by zg, POWCHK disabled, PULCHK disabled
       configuration hash MD5:
       00 E9 B6 7A A2 85 ED C7 34 08 36 98 17 FE 4E 26
       data hash MD5: 16K
       46 E5 9D 83 39 9A C9 02 79 07 84 FC 96 F5 E7 79>)
(   2,<2023-08-28 14:49:09.04 +0400>,<she>,<DPX200>,
      <Start of raw data processing
       efp BC_mod = 2 LB = 0.24 FT_mod = 6 PKNL = 1 PHC0 = -21049.11 PHC1 = 15.05272 SI = 16K 
       data hash MD5: 16K
       9A 30 CC D8 B8 B6 8C 34 27 8B 3D 93 18 87 66 0C>)
(   3,<2023-08-28 14:49:31.62 +0400>,<she>,<DPX200>,
      <pk PHC0 = 1.479024 PHC1 = -5.400001 
       data hash MD5: 16K
       AA 41 6E E8 61 CA E2 C6 85 1B F6 5E 56 0E 1E FE>)
(   4,<2023-08-28 14:49:35.50 +0400>,<she>,<DPX200>,
      <abs ABSG = 5 
       data hash MD5: 16K
       45 81 01 B0 BE 39 D5 FC 1B 89 7E A4 7B FC CC E4>)
$$ ##END=
$$ 
$$ hash MD5
$$ 1A D5 10 F2 F4 1F D1 37 49 95 EA 73 55 58 D4 4A
##$RELAX= 
##$RELAX= 
##$RELAX= 
##$RELAX= 
##$RELAX= 
##$RELAX= 
$$ Bruker specific parameters
$$ --------------------------
##$DU= <F:/spectra>
##$EXPNO= 1
##$NAME= <H-F>
##$PROCNO= 1
##$TYPE= <nmr>
##$USER= <she>
##$AMP= (0..31)
100 100 100 100 100 100 100 100 100 100 100 100 100 100 100 100 100 100 
100 100 100 100 100 100 100 100 100 100 100 100 100 100 
##$AQSEQ= 0
##$AQ_mod= 1
##$AUNM= <au_zg>
##$AUTOPOS= <>
##$BF1= 200.13
##$BF2= 200.13
##$BF3= 200.13
##$BF4= 200.13
##$BF5= 200.13
##$BF6= 200.13
##$BF7= 200.13
##$BF8= 200.13
##$BYTORDA= 1
##$CFDGTYP= 0
##$CFRGTYP= 5
##$CHEMSTR= <none>
##$CNST= (0..31)
1 1 145 1 1 1 1 1 1 1 1 1 1 1 1 1 1 1 1 1 1 1 1 1 1 1 1 1 1 1 1 1 
##$CPDPRG= <>
##$CPDPRG1= <>
##$CPDPRG2= <>
##$CPDPRG3= <>
##$CPDPRG4= <mlev>
##$CPDPRG5= <mlev>
##$CPDPRG6= <mlev>
##$CPDPRG7= <mlev>
##$CPDPRG8= <mlev>
##$CPDPRGB= <>
##$CPDPRGT= <>
##$D= (0..31)
0 1.2 0 0 0 0 0 0 0 0.06 0 0.03 0 0 0 0 0.0002 0 0 0 0 0 0 0 0 0 0 0 0 
0 0 0 
##$DATE= 1693219746
##$DBL= (0..7)
120 120 120 120 120 120 120 120 
##$DBP= (0..7)
150 150 150 150 150 150 150 150 
##$DBP07= 0
##$DBPNAM0= <>
##$DBPNAM1= <>
##$DBPNAM2= <>
##$DBPNAM3= <>
##$DBPNAM4= <>
$$ [...]
##$SUBNAM3= <"">
##$SUBNAM4= <"">
##$SUBNAM5= <"">
##$SUBNAM6= <"">
##$SUBNAM7= <"">
##$SUBNAM8= <"">
##$SUBNAM9= <"">
##$SW= 18.05172834244
##$SWIBOX= (0..15)
0 0 2 0 0 0 0 0 0 0 0 0 0 0 0 0 
##$SW_h= 3612.71676300578
##$TD= 16384
##$TD0= 1
##$TE= 0
##$TE2= 300
##$TE3= 300
##$TEG= 300
##$TL= (0..7)
0 120 120 120 120 120 120 120 
##$TP= (0..7)
150 150 150 150 150 150 150 150 
##$TP07= 0
##$TPNAME0= <>
##$TPNAME1= <>
##$TPNAME2= <>
##$TPNAME3= <>
##$TPNAME4= <>
##$TPNAME5= <>
##$TPNAME6= <>
##$TPNAME7= <>
##$TPOAL= (0..7)
0.5 0.5 0.5 0.5 0.5 0.5 0.5 0.5 
##$TPOFFS= (0..7)
0 0 0 0 0 0 0 0 
##$TUNHIN= 0
##$TUNHOUT= 0
##$TUNXOUT= 0
##$USERA1= <user>
##$USERA2= <user>
##$USERA3= <user>
##$USERA4= <user>
##$USERA5= <user>
##$V9= 5
##$VALIST= <valist>
##$VCLIST= <CCCCCCCCCCCCCCC>
##$VD= 0
##$VDLIST= <DDDDDDDDDDDDDDD>
##$VPLIST= <PPPPPPPPPPPPPPP>
##$VTLIST= <TTTTTTTTTTTTTTT>
##$WBST= 1024
##$WBSW= 4
##$XGAIN= (0..3)
0 0 0 0 
##$XL= 0
##$YL= 0
##$YMAX_a= 270222
##$YMIN_a= -403120
##$ZGOPTNS= <>
##$ZL1= 120
##$ZL2= 120
##$ZL3= 120
##$ZL4= 120
##$ABSF1= 15.74909
##$ABSF2= -2.302759
##$ABSG= 5
##$ABSL= 3
##$ALPHA= 0
##$AQORDER= 0
##$ASSFAC= 0
##$ASSFACI= 0
##$ASSFACX= 0
##$ASSWID= 0
##$AUNMP= <proc_1d>
##$AZFE= 0.1
##$AZFW= 0.1
##$BCFW= 0
##$BC_mod= 2
##$BYTORDP= 0
##$COROFFS= 0
##$CY= -3
##$DATMOD= 1
##$DC= 0
##$DFILT= <>
##$DTYPP= 0
##$F1P= 0
##$F2P= 0
##$FCOR= 1
##$FTSIZE= 16384
##$FT_mod= 6
##$GAMMA= 0
##$GB= 0
##$INTBC= 1
##$INTSCL= 3.70164e-10
##$ISEN= 128
##$LB= 0.24
##$LEV0= 0
##$LPBIN= 0
##$MAXI= 10000
##$MC2= 0
##$MEAN= 0
##$ME_mod= 0
##$MI= 1.114404
##$NCOEF= 0
##$NC_proc= -7
##$NLEV= 6
##$NOISF1= 3.799351
##$NOISF2= 2.8
##$NSP= 0
##$NTH_PI= 0
##$NZP= 0
##$OFFSET= 15.79427
##$PC= 1
##$PHC0= -21047.63
##$PHC1= 9.652719
##$PH_mod= 1
##$PKNL= yes
##$PPARMOD= 0
##$PSCAL= 0
##$PSIGN= 0
##$REVERSE= no
##$SF= 200.129995451818
##$SI= 16384
##$SIGF1= 3
##$SIGF2= 2
##$SINO= 5.538805
##$SIOLD= 16384
##$SREGLST= <1H.CDCl3>
##$SSB= 0
##$STSI= 16384
##$STSR= 0
##$SW_p= 3612.71676300578
##$SYMM= 0
##$S_DEV= 0
##$TDeff= 16384
##$TDoff= 0
##$TI= <>
##$TILT= no
##$TM1= 0
##$TM2= 0
##$TOPLEV= 0
##$USERP1= <user>
##$USERP2= <user>
##$USERP3= <user>
##$USERP4= <user>
##$USERP5= <user>
##$WDW= 1
##$XDIM= 16384
##$YMAX_p= 386299175
##$YMIN_p= -602186
$$ End of Bruker specific parameters
$$ ---------------------------------
##NTUPLES= NMR SPECTRUM
##VAR_NAME=  FREQUENCY,     SPECTRUM/REAL,   SPECTRUM/IMAG
##SYMBOL=    X,             R,               I
##VAR_TYPE=  INDEPENDENT,   DEPENDENT,       DEPENDENT
##VAR_FORM=  AFFN,          ASDF,            ASDF
##VAR_DIM=   16384,         16384,           16384
##UNITS=     HZ,            ARBITRARY UNITS, ARBITRARY UNITS
##FACTOR=    0.220516191357247, 1,           1
##FIRST=     3160.90709556133, 0,            0
##LAST=      -451.809667444447, 0,           0
##MIN=       -451.809667444447, -602186,     0
##MAX=       3160.90709556133, 386299175,    0
$$ Real data points
##PAGE= N=1
##DATA TABLE= (X++(R..R)), XYDATA
$$ [...]
$$ plain form
11533 -402711 -301019 -256004 -260375 21446 147111 17089 -38588 -20659 93860 153819 231501
11522 231501 37005 128366 210782 -69350 -165869 -175743 -17705 -268234 -311797 -27783 52351
11511 52351 -77965 -44272 -68084 -73734 -71676 50384 -12953 -151431 -4847 210964 88760
11500 88760 -78070 -149503 -111877 99042 -40995 -304149 -382472 -123926 -82088 -127225 -201490
11489 -201490 -276338 -79901 -129143 -62108 47915 89785 91434 64046 -89699 -3673 -110978
11478 -110978 2595 -242181 -365186 -252679 -232022 -112912 75079 -193574 -234799 49282
11468 49282 83364 56436 149217 134174 -131763 -91359 183803 -45842 10313 -58363 -67737
11457 -67737 -47494 13393 -114871 -241429 -41865 -85429 -42044 119661 -151036 -99208 16965
$$ packed form
11533d02711J01692M5015m371K81821J25665j30022n5677J7929J14519N9959P7682
11522B31501j94496R1361Q2416k80132r6519r874J58038k50529m3563K84014Q0134
11511E2351j30316L3693k3812n650K058J22060o3337j38478J46584K15811j22204
11500H8760j66830p1433L7626K10919j40037k63154p8323K58546M1838m5137p4265
11489b01490p4848J96437m9242O7035J10023M1870J649k7388j53745Q6026j07305
11478a10978J13573k44776j23005J12507K0657J19110J87991k68653m1225K84081
11468D9282L4082k6928R2781j5043k65937M0404K75162k29645N6155o8676r374
11457f7737K0243O0887j28264j26558J99564m3564M3385J61705k70697N1828J16173
$$ plain form
11446 16965 17785 -15488 -162101 -172731 -305043 -32014 32248 -106255 743 -69006 -174995
11435 -174995 -212037 -222703 -29150 -4113 273581 134079 -98474 -212940 -130558 -145515
11425 -145515 -98462 -125047 -71059 -247267 -53221 -109902 34988 54590 51942 -13972 -58088
11414 -58088 -280607 -178692 -145357 -166081 23438 -23912 -3361 -25613 73939 204509 86868
11403 86868 -124279 -133006 -181176 156343 222718 108903 232155 180737 5471 9598 83427
11392 83427 217717 231519 186506 82895 99688 220080 304874 151541 62361 -184565 -247591
11381 -247591 -150845 -86803 145085 -29664 105064 68143 97248 -65163 -169891 -120779
11371 -120779 -36214 3706 93343 199048 -32983 -53557 -19944 -56947 18604 206772 62549
$$ packed form
11446A6965Q20l3273j46613j0630j32312K73029O4262j38503J06998o9749j05989
11435a74995l7042j0666J93553K5037K77694j39502k32553j14466Q2382j4957
11425a45515M7053k6585N3988j76208J94046n6681J44890J9602k648o5914m4116
11414e8088k22519J01915L3335k0724J89519m7350K0551k2252R9552J30570j17641
11403H6868k11147q727m8170L37519O6375j13815J23252n1418j75266M127P3829
11392H3427J34290J3802m5013j03611J6793J20392Q4794j53333q9180k46926o3026
11381b47591R6746O4042K31888j74749J34728l6921K9105j62411j04728M9112
11371a20779Q4565L9920Q9637J05705k32031k0574L3613l7003P5551J88168j44223
$$ plain form
11360 62549 89306 119246 83920 -56792 -42045 12359 39432 -2846 -204261 -230611 -15846
11349 -15846 127893 -62982 -221021 -228966 -191301 -70528 -191459 175460 205825 -15827
11339 -15827 -363951 -358085 -102702 -263832 -153297 -277246 -384631 -256051 -271600 -183934
11329 -183934 -145047 -96158 -155788 82392 108045 -242527 -86392 304889 105530 -119168
11319 -119168 -62603 -33149 -238140 -322559 -66110 -27881 -138520 -242797 45945 -59508
11309 -59508 -179310 -66605 -133972 -15299 -30610 -11430 -23716 -107341 -104947 -16838 -58394
11298 -58394 154387 198008 -89418 -39844 -61462 95446 151427 12153 -33937 -61749 -259877
11287 -259877 -192836 -91796 -52683 11992 36714 -12102 -263281 -297012 -142037 125470 146529
$$ packed form
11360F2549K6757K9940l5326j40712J4747N4404K7073m2278k01415k6350K14765
11349a5846J43739j90875j58039p945L7665J20773j20931L66919L0365k21652
11339a5827l48124N866K55383j61130J10535j23949j07385J28580j5549Q7666
11329a83934L8887M8889n9630K38180K5653l50572J56135L91281j99359k24698
11319a19168N6565K9454k04991q4419K56449L8229j10639j04277K88742j05453
11309e9508j19802J12705o7367J18673j5311J9180j2286q3625K394Q8109m1556
11298e8394K12781M3621k87426M9574k1618J56908N5981j39274m6090k7812j98128
11287b59877O7041J01040L9113O4675K4722m8816k51179l3731J54975K67507K1059
$$ plain form
11276 146529 131697 2520 -29093 76561 -56785 39432 8722 -135791 -21306 115258
11266 115258 146744 160112 106548 -48932 -62377 -35518 -100446 64097 -64687 -81745 -168826
11255 -168826 -46262 -7746 -223630 -266683 -57237 -19065 -123526 -96340 -66402 -170177
11245 -170177 -227508 -165330 -237108 -313046 -144526 -43177 -65303 70921 69813 -32350 3071
11234 3071 78530 113208 228053 102273 4770 -69896 -204542 -221153 117953 3309 -93542
11223 -93542 -108069 -181914 -225814 -117122 -95304 -133386 -159445 -101605 -147109 -190258 -205920
11212 -205920 -184470 -198464 -220273 -134266 21362 22185 -163237 -85377 -20397 3521 72439
11201 72439 14732 -155313 -145305 -7917 206673 169122 38045 31422 -50335 -77552 -80728
$$ packed form
11276A46529j4832j29177l1613J05654j33346R6217l0710j44513J14485J36564
11266A15258L1486J3368n3564j55480j3445K6859o4928J64543j28784j7058q7081
11255a68826J22564L8516k15884m3053K09446L8172j04461K7186K9938j03775
11245a70177n7331O2178p1778p5938J68520J01349k2126J36224j108j02163L5421
11234C071P5459L4678J14845j25780r7503p4666j34646j6611L39106j14644r6851
11223i3542j4527p3845m3900J08692K1818l8082k6059N7840m5504m3149j5662
11212b05920K1450j3994k1809Q6007J55628Q23j85422P7860O4980K3918O8918
11201G2439n7707j70045J0008J37388K14590l7551j31077o623q1757k7217l176
$$ plain form
11190 -80728 -48603 -10810 -130572 -230838 -287489 -74090 -92420 -209989 -196908 -44327 60966
11179 60966 11365 -26860 -131956 -184173 -112317 -159634 -196486 -244339 -327998 -146278 -18374
11168 -18374 -45635 -56727 -56747 -42653 46891 18521 -118239 -9121 27192 53337 59916 -110129
11156 -110129 74485 36086 -183072 -190206 -294729 -130027 -43542 -106448 -154964 38459 -135036
11145 -135036 -235484 -257227 -91383 -226714 -96680 230162 82492 -6262 -115595 -85285
11135 -85285 -183474 -251335 -168860 -34110 59780 -94222 -23950 123075 72563 54072 -81045
11124 -81045 -21023 -13738 -98578 -102532 -122486 -301635 -351626 -239272 -87607 -192701 -344136
11113 -344136 -319380 -76413 -63054 -149183 -71579 -183330 -249745 -34432 -25981 17961 72613
$$ packed form
11190h0728L2125L7793j19762j00266n6651K13399j8330j17569J3081J52581J05293
11179F0966m9601l8225j05096n2217P1856m7317l6852m7853q3659J81720J27904
11168a8374k7261j1092k0J4094Q9544k8370j36760J09118L6313K6145O579j70045
11156a10129J84614l8399k19158p134j04523J64702Q6485o2906m8516J93423j73495
11145a35036j00448k1743J65844j35331J30034L26842j47670q8754j09333L0310
11135h5285r8189o7861Q2475J34750R3890j54002P0272J47025n0512j8491j35117
11124h1045O0022P285q4840l954j9954j79149m9991J12354J51665j05094j51435
11113c44136K4756K42967J3359q6129P7604j11751o6415K15313Q451M3942N4652
$$ plain form
11102 72613 79668 105939 161738 137032 64901 217981 216669 78072 -13368 -103752 7052
11091 7052 81171 -34480 -100014 34091 -86000 -143733 -173322 -96073 87962 -62925 -72
11080 -72 -61770 -122236 -84015 -37341 -66227 -117372 -67835 -33422 88409 48229 63117 -120465
11068 -120465 -123702 -38477 -72997 -140887 -203318 -118916 -34558 -69232 -199123 -251031 -145771
11057 -145771 -252251 -356855 -176795 -181266 -266900 -152900 -51694 -92942 19195 220426
11047 220426 -3976 92004 181896 130917 125697 98381 125449 99477 89706 -44997 -6875
11036 -6875 141540 168342 70885 112743 70885 211852 171301 267492 141913 191047 63128
11025 63128 33551 9193 -107036 -112706 -355279 -313065 -229538 -292751 -171432 -52381 -72360
$$ packed form
11102G2613P055K6271N5799k4706p2131J53080j312j38597r1440r0384J10804
11091G052P4119j15651o5534J34105j20091n7733k9589P7249J84035j50887O2853
11080g2o1698o0466L8221M6674k8886n1145M9537L4413J21831m0180J4888j83582
11068a20465l237Q5225l4520o7890o2431Q4402Q4358l4674j29891n1908J05260
11057a45771j06480j04604J80060m471q5634J14000J01206m1248J12137K01231
11047B20426k24402R5980Q9892n0979n220k7316K7068k5972r771j34703L8122
11036f875J48415K6802r7457M1858m1858J40967m0551R6191j25579M9134j27919
11025F3128k9577k4358j16229n670k42573M2214Q3527o3213J21319J19051j9979
$$ plain form
11014 -72360 -97303 -118371 37171 138325 -3446 -5856 187087 54793 10804 197725 265085
11003 265085 177965 28547 108779 -28261 -208304 -22434 13548 -183588 -121802 -174246
10993 -174246 -40304 -36383 -224916 -85290 -161882 -81080 20642 27174 -85913 50731 6049
10982 6049 8040 13898 -8295 -68347 1122 -77190 -24890 -40381 -132891 -220586 -285453 -170222
10970 -170222 -111700 -135223 -56823 -77462 -109197 215551 49923 51947 -19876 -40258 170062
10959 170062 -75106 25004 156369 -71564 -56707 -12197 -39741 -127392 46470 56879
10949 56879 3494 -14920 148002 124315 83421 121369 -44717 -97881 -27848 31536 -37121
10938 -37121 32518 41983 162872 55011 -146358 -154113 -353339 -366836 -288001 -245585 -165388
$$ packed form
11014g2360k4943k1068J55542J01154j41771k410J92943j32294m3989J86921O7360
11003B65085q7120j49418Q0232j37040j80043J85870L5982j97136O1786n2444
10993a74246J33942L921j88533J39626p6592Q0802J01722O532j13087J36644m4682
10982F049J991N858k2193o0052O9469p8312N2300j5491r2510q7695o4867J15231
10970a70222N8522k3523P8400k0639l1735L24748j65628K024p1823k0382K10320
10959A70062k45168J00110J31365k27933J4857M4510k7544q7651J73862J0409
10949E6879n3385j8414J62922k3687m0894L7948j66086n3164P0033N9384o8657
10938c7121O9639R465J20889j07861k01369p755j99226j3497P8835M2416Q0197
$$ plain form
10927 -165388 -155067 -55901 -178378 -54448 12902 33291 1174 -235338 -219112 -15336 26376
10916 26376 36786 222738 267854 46995 39821 224197 97152 -32478 -8380 187926 263218
10905 263218 205976 -11612 -41224 113705 169312 -199977 -187892 31631 61744 155337 237431
10894 237431 159569 165435 143732 122066 58730 -24077 86615 -86155 -361953 -345009 -89705
10883 -89705 -192693 -331109 -20450 37538 -82484 42072 -35373 -59943 -35280 100992
10873 100992 239049 3103 39783 113077 51094 36545 -43559 -103400 129757 334725 178442
10862 178442 184250 116958 70158 -35258 44880 71896 -25010 75377 200898 216827 -21825
10851 -21825 -24306 149449 134991 150500 21688 32849 206141 112507 -237336 -33486 -118163
$$ packed form
10927a65388J0321R9166j22477J23930O7350K0389l2117k36512J6226K03776M1712
10916B6376J0410J85952M5116k20859p174J84376j27045j29630K4098J96306P5292
10905B63218n7242k17588k9612J54929N5607l69289J2085K19523L0113R3593Q2094
10894B37431p7862N866k1703k1666o3336q2807J10692j72770k75798J6944K55304
10883h9705j02988j38416L10659N7988j20022J24556p7445k4570K4663J36272
10873A00992J38057k35946L6680P3294o1983j4549q0104n9841K33157K04968j56283
10862A78442N808o7292m6800j05416Q0138K7016r6906J00387J25521J5929k38652
10851b1825k481J73755j4458J5509j28812J1161J73292r3634l49843K03850q4677
$$ plain form
10840 -118163 -21603 -151970 -76876 -28694 -123564 -28447 -162313 -114747 -133116 -105091 -145973
10829 -145973 -202894 -228549 -151397 -253614 -205987 15085 222560 236744 181874 133803 130983
10818 130983 -31061 61910 106971 -10181 48183 115162 315641 217078 97270 43507 -26897
10807 -26897 179011 -68036 -2507 -114143 -117441 55829 44564 -135590 -195124 -133845 -211975
10796 -211975 -168723 151591 68353 4081 166132 52446 -68370 -101632 45777 99214
10786 99214 145783 29018 36428 216356 234033 115625 -71279 110906 84027 -149 140354
10775 140354 220762 241038 72059 -43166 150551 301371 167662 9471 -75902 -59499
10765 -59499 125834 64197 -96348 61777 125193 56015 -156725 22412 50772 58088 94016
$$ packed form
10840a18163R6560j30367P5094M8182r4870R5117j33866M7566j8369K8025m0882
10829a45973n6921k5655P7152j02217M7627K21072K07475J4184n4870m8071k820
10818A30983j62044R2971M5061j17152N8364O6979K00479r8563j19808n3763p0404
10807b6897K05908k47047O5529j11636l298J73270j1265j80154n9534O1279p8130
10796b11975M3252L20314q3238o4272J62051j13686j20816l3262J47409N3437
10786I9214M6569j16765P410J79928J7677j18408j86904J82185k6879q4176J40503
10775A40354Q0408K0276j68979j15225J93717J50820j33709j58191q5373J6403
10765e9499J85333o1637j60545J58125O3416o9178k12740J79137K8360P316L5928
$$ plain form
10754 94016 -75875 -257771 1789 99944 -12401 171983 245218 -17076 -16801 -120051 -7733
10743 -7733 124243 144802 108846 23560 130572 136179 194892 202383 167113 39422 -115312
10732 -115312 30434 33979 81507 103831 86322 -90840 -32116 95718 46170 64861 84339
10721 84339 18713 49839 85222 -99795 -11858 -89702 -16251 144496 169454 -105374 57823
10710 57823 123250 326156 379137 393939 229559 -109168 -93715 -179462 -108246 164778 116776
10699 116776 -2848 -89981 -133395 -162237 -111945 -14027 -34936 64993 44889 116759 179815
10688 179815 119428 178248 -14547 33388 259391 142792 144246 25216 -60220 -62968 256539
10677 256539 373666 277254 298435 59959 -37633 57281 142163 287009 226238 31313 16558
$$ packed form
10754I4016j69891j81896K59560R8155j12345J84384P3235k62294K75j03250J12318
10743g733J31976K0559l5956q5286J07012N607N8713P491l5270j27691j54734
10732a15312J45746L545M7528K2324j7509j77162N8724J27834m9548J8691J9478
10721H4339o5626L1126L5383j85017Q7937p7844P3451J60747K4958k74828J63197
10710E7823O5427K02906N2981J4802j64380l38727J5453q5747P1216K73024m8002
10699A16776j19624q7133m3414k8842N0292R7918k0909R9929k0104P1870O3056
10688A79815o0387N8820j92795M7935K26003j16599J454j19030q5436k748L19507
10677B56539J17127r6412K1181k38476r7592R4914Q4882J44846o0771j94925j4755
$$ plain form
10666 16558 39843 8643 -34930 73999 70404 33427 17923 -4999 128595 191913 200173 -88076
10654 -88076 -39505 -297167 -216000 187053 18838 -12602 1465 -158486 -188875 -173378 -89267
10643 -89267 -134987 -135661 -108870 -38626 134653 13046 -42973 -40980 39749 163577 97204 75990
10631 75990 213647 251521 166706 166837 171909 -124865 -125950 25559 131553 34018 79938 122100
10619 122100 188332 153321 81722 -83568 -35412 75072 -14870 -183365 49890 246266
10609 246266 83091 165728 29336 86318 34976 50126 124401 159450 190018 49844 -58205
10598 -58205 155029 146563 42135 42195 189109 390638 231445 398199 256466 127180 425911
10587 425911 379305 -61293 -59829 -75048 127000 246126 247694 311500 439333 272179 67342
$$ packed form
10666A6558K3285l1200m3573J08929l595l6977j5504k2922J33594O3318Q260k88249
10654h8076M8571k57662Q1167M03053j68215l1440J4067j59951l0389J5497Q4111
10643h9267m5720o74K6791P0244J73279j21607n6019J993Q0729J23828o6373k1214
10631G5990J37657L7874q4815J31N072k96774j085J51509J05994r7535M5920M2162
10619A22100O6232l5011p1599j65290M8156J10484q9942j68495K33255J96376
10609B46266j63175Q2637j36392N6982n1342J5150P4275L5049L0568j40174j08049
10598e8205K13234q466j04428O0J46914K01529j59193J66754j41733j29286K98731
10587D25911m6606m40598J464j5219K02048J19126J568O3806J27833j67154k04837
$$ plain form
10576 67342 333673 169326 -67911 67705 39397 -17563 -108296 -48589 138937 381957
10566 381957 384798 64816 101265 55688 159006 114123 21804 -38958 200810 324757 269038
10555 269038 348062 393155 434494 427071 174088 76471 162187 265453 207642 161632 114030
10544 114030 78076 -56714 -98542 116231 265602 137231 -37803 -64309 169386 325092
10534 325092 370288 268274 120599 159380 101323 236996 235039 34852 -33695 -50553 218647
10523 218647 266060 -20530 85132 125037 -17355 -116780 128171 173825 76401 25045 -79273
10512 -79273 133976 194418 249644 268000 378601 259728 431164 478361 490501 451374 335820
10501 335820 128881 83908 24469 55767 151819 249080 285252 184562 238750 122994 129015
$$ packed form
10576F7342K66331j64347k37237J35616k8308n6960r0733N9707J87526K43020
10566C81957K841l19982L6449m5577J03318m4883r2319o0762K39768J23947n5719
10555B69038P9024M5093M1339p423k52983r7617Q5716J03266n7811m6010m7602
10544A14030l5954j34790m1828K14773J49371j28371j75034k6506K33695J55706
10534C25092M5196j02014j47675L8781n8057J35673j957k00187o8547j6858K69200
10523B18647M7413k86590J05662L9905j42392r9425K44951M5654r7424n1356j04318
10512g9273K13249O0442N5226J8356J10601j18873J71436M7197J2140l9127j15554
10501C35820k06939m4973n9439L1298R6052R7261L6172j00690N4188j15756O021
$$ plain form
10490 129015 201569 527489 161687 27392 73065 185156 183910 306998 291835 187773
10480 187773 205978 189408 396287 480634 162699 73027 286717 245636 353529 233400
10470 233400 210573 120395 -39290 217426 395644 255632 77756 133496 163599 179245
10460 179245 90669 172939 262664 298692 307559 196984 197950 209904 237857 230839 257099 130410
10448 130410 -35437 75778 301867 301959 166898 112784 130309 180008 89378 70139 251763
10437 251763 340422 220814 146411 159379 414679 356136 264353 359965 398932 339362 356724
10426 356724 422567 255705 350954 448541 284636 200974 303474 294174 273657 378364 288033
10415 288033 349995 480484 516612 653922 588725 449178 458572 626066 586469 465344 566946
$$ packed form
10490A29015P2554L25920l65802j34295M5673J12091j246J23088j5163j04062
10480A87773J8205j6570K06879Q4347l17935q9672K13690m1081J07893j20129
10470B33400k2827r0178j59685K56716J78218j40012j77876N5740L0103J5646
10460A79245q8576Q2270Q9725L6028Q867j10575R66J1954K7953p018K6260j26689
10448A30410j65847J11215K26089R2j35061n4114J7525M9699r0630j9239J81624
10437B51763Q8659j19608p4403J2968K55300n8543r1783R5612L8967n9570J7362
10426C56724O5843j66862R5249R7587j63905q3662J02500r300k0517J04707r0331
10415B88033O1962J30489L6128J37310o5197j39547R394J67494l9597j21125J01602
$$ plain form
10404 566946 565146 687223 647227 421889 421407 567493 642806 785842 794144 405977 257317
10393 257317 349770 214789 336672 484116 356092 360482 493263 685635 743941 550819
10383 550819 429293 283180 460854 481561 406069 481939 499407 576009 536801 500079 430940
10372 430940 556690 642124 568030 511694 505161 404675 665421 712212 902891 885344 828101
10361 828101 845460 836610 854850 738529 842088 859567 730222 765441 613772 734773 923302
10350 923302 980229 985200 1133323 976071 1025020 1179798 1000441 888531 767267 891596
10340 891596 1016750 1170601 977874 1044022 1005248 969698 884940 792288 789564 1057278 1250919
10329 1250919 1268591 1049263 1101928 1230719 1040748 1129582 1302312 1361483 1293656 1218399
$$ packed form
10404E66946j800J22077l9996k25338m82J46086P5313J43036Q302l88167j48660
10393B57317R2453j34981J21883J47444j28024M390J32781J92372N8306j93122
10383E50819j21526j46113J77674K0707p5492P5870J7468P6602l9208l6722o9139
10372D30940J25750Q5434p4094n6336o533j00486K60746M6791J90679j7547n7243
10361H28101J7359q850J8240j16321J03559J7479j29345L5219j51669J21001J88529
10350I23302N6927M971J48123j57252M8949J54778j79357j11910j21264J24329
10340H91596J25154J53851j92727O6148l8774l5550q4758r2652k724K67714J93641
10329A250919J7672k19328N2665J28791j89971Q8834J72730N9171o7827p5257
$$ plain form
10319 1218399 1312147 1456508 1316286 1446301 1446978 1528678 1599123 1545740 1502840 1597309 1629521
10308 1629521 1647609 1566400 1684244 1609626 1561258 1763627 2001348 1929903 1917880 1921502 1951561
10297 1951561 2081227 1963285 2136374 2269984 2442195 2342052 2213065 2201442 2307244 2573962
10287 2573962 2598550 2603329 2636598 2733765 2994241 2906418 2932614 2896082 3096929 3199197 3145804
10276 3145804 3342700 3294105 3401231 3480472 3687369 3839741 3920631 4098257 4027402 4233644
10266 4233644 4274789 4391690 4548066 4555507 4550858 4721753 5026317 5288433 5420200 5378993
10256 5378993 5556463 5877477 6002317 6113069 6231721 6435857 6359378 6583721 6935431 6990913
10246 6990913 7306877 7498314 7574750 7634855 7923322 8092765 8198067 8409151 8470660 8504323
$$ packed form
10319A218399R3748J44361j40222J30015O77Q1700P0445n3383m2900R4469L2212
10308A629521J8088q1209J17844p4618m8368K02369K37721p1445j2023L622L0059
10297A951561J29666j17942J73089J33610J72211j00143j28987j1623J05802K66718
10287B573962K4588M779L3269R7167K60476q7823K6196l6532K00847J02268n3393
10276C145804J96896m8595J07126P9241K06897J52372Q0890J77626p0855K06242
10266D233644M1145J16901J56376P441m649J70895L04564K62116J31767m1207
10256E378993J77470L21014J24840J10752J18652K04136p6479K24343L51710N5482
10246F990913L15964J91437P6436O0105K88467J69443J05302K11084O1509L3663
$$ plain form
10236 8504323 8658868 8796844 8755278 9179769 9237358 9203016 9231185 9422207 9571061 9439251
10226 9439251 9305551 9189642 9436124 9639802 9706232 9714982 9840971 9963203 9879584 9915188
10216 9915188 10254671 10299864 10536042 10645918 10663905 10805701 11139266 11398731 11628932 11818077
10206 11818077 11919504 12031353 12331903 12612709 12801517 12760133 12571340 13086052 13437462
10197 13437462 13546450 13728520 13827445 13874154 13983529 14047574 13996725 14148138 14077031 14070950
10187 14070950 14151899 14000224 13934084 14122115 14079403 13860265 13797835 13694256 13631330 13393167
10177 13393167 13265622 13236621 13110467 13047990 13066307 12896882 12630768 12522564 12453713 12303847
10167 12303847 12172844 12077318 11899590 11956940 11922207 11768975 11687558 11645031 11707482 11605105
$$ packed form
10236H504323J54545J37976m1566M24491N7589l4342K8169J91022J48854j31810
10226I439251j33700j15909K46482K03678O6430Q750J25989J22232q3619L5604
10216I915188L39483M5193K36178J09876J7987J41796L33565K59465K30201J89145
10206A1818077J01427J11849L00550K80806J88808m1384j88793N14712L51410
10197A3437462J08988J82070R8925M6709J09375O4045n0849J51413p1107o081
10187A4070950Q0949j51675o6140J88031m2712k19138o2430j03579o2926k38163
10177A3393167j27545k9001j26154o2477J8317j69425k66114j08204o8851j49866
10167A2303847j31003r5526j77728N7350l4733j53232q1417m2527O2451j02377
$$ plain form
10157 11605105 11875220 11899317 11649613 11437878 11469633 11662278 11571294 11411075 11431332 11403176
10147 11403176 11269016 11220448 11111733 10887719 10716700 10597305 10309811 10356172 10459437 10170735
10137 10170735 10012509 9849175 9547212 9504678 9330587 8949657 8855500 8784937 8338474 8004400
10127 8004400 7761402 7694952 7347727 7200068 6998650 6926189 6762303 6251140 6187673 6158473
10117 6158473 5909292 5770212 5687733 5501970 5346615 5284366 5018409 4964003 4895836 4705084
10107 4705084 4577288 4566927 4556884 4513720 4476842 4038252 4036235 4072542 3877648 3937485 3889870
10096 3889870 3848799 3957535 3748635 3775281 3718703 3461403 3426483 3306538 3431189 3360941
10086 3360941 3274970 3310686 3312683 3318915 3169251 3268995 3292169 3354082 3193609 3210725 3256917
$$ packed form
10157A1605105K70115K4097k49704k11735L1755J92645r0984j60219K0257k8156
10147A1403176j34160m8568j08715k24014j71019j19395k87494M6361J03265k88702
10137A0170735j58226j63334l01963m2534j74091l80930r4157p0563m46463l34074
10127H004400k42998o6450l47225j47659k01418p2461j63886n11163o3467k9200
10117F158473k49181j39080q2479j85763j55355o2249k65957n4406o8167j90752
10107D705084j27796j0361j0043m3164l6878m38590k017L6307j94894N9837m7615
10096C889870m1071J08736k08900K6646n6578k57300l4920j19945J24651p0248
10086C360941q5971L5716J997O232j49664R9744K3174O1913j60473J7116M6192
$$ plain form
10075 3256917 3067541 3032216 3158161 3165390 3203539 3292114 3247707 3228690 3208546 3059080 3037316
10064 3037316 3144490 3298602 3348698 3265348 3194030 3223106 3352578 3318055 3389711 3524827
10054 3524827 3665414 3829341 3695824 3685009 3653005 3801651 3817558 3773360 3864254 4001683
10044 4001683 4343962 4486123 4530841 4353372 4192506 4365316 4439643 4500688 4818375 4897481
10034 4897481 4959167 5115813 5374500 5229025 5301467 5695701 6049090 6079893 6216810 6326792
10024 6326792 6475134 6820898 6881314 6957163 6998784 7375342 7707745 7876290 8016028 8305832
10014 8305832 8460323 8608648 8891415 9063176 9235491 9432037 9642658 9841619 10045387
10005 10045387 10264751 10404135 10466322 10687619 10675628 10846052 11253350 11335020 11366935 11330324
$$ packed form
10075C256917j89376l5325J25945P229L8149Q8575m4407j9017k0144j49466k1764
10064C037316J07174J54112N0096q3350p1318K9076J29472l4523P1656J35116
10054C524827J40587J63927j33517j0815l2004J48646J5907m4198R0894J37429
10044D001683L42279J42161M4718j77469j60866J72810P4327O1045L17687P9106
10034D897481O1686J56646K58687j45475P2442L94234L53389L0803J36917J09982
10024F326792J48342L45764O0416P5849M1621L76558L32403J68545J39738K89804
10014H305832J54491J48325K82767J71761J72315J96546K10621J98961K03768
10005A0045387K19364J39384O2187K21297j1991J70424M07298Q1670L1915l6611
$$ plain form
9995 11330324 11558259 11640284 11387767 11487053 11671438 11780996 11788379 11645590 11666456 11761822
9985 11761822 11748793 11926521 11819878 11840753 11902008 11943867 11960068 11941915 12028671 12225435 12524854
9974 12524854 12433099 12196865 12226070 12500147 12652061 12908839 13115813 13126849 13464297 13900081
9964 13900081 13879706 13763945 13745275 13847788 13839550 14004627 14085521 14068607 14206662 14230261 14310982
9953 14310982 14334701 14199102 14429573 14292126 14064692 13836325 13495497 13342769 13426826 13309767
9943 13309767 13255080 13027432 12793456 12475133 12253199 12087459 11771731 11900834 11579501 11523828
9933 11523828 11438911 11071649 10913022 10768566 10596842 10541230 10295335 10009861 9819723 9705944
9923 9705944 9668100 9798317 9592881 9580412 9590350 9487154 9457282 9692566 9402401 9242138
$$ packed form
9995A1330324K27935Q2025k52517R9286J84385J09558P383j42789K0866R5366
9985A1761822j3029J77728j06643K0875O1255M1859J6201j8153Q6756J96764K99419
9974A2524854r1755k36234K9205K74077J51914K56778K06974J1036L37448M35784
9964A3900081k0375j15761j8670J02513q238J65077Q0894j6914J38055K3599Q0721
9953A4310982K3719j35599K30471j37447k27434k28367l40828j52728Q4057j17059
9943A3309767n4687k27648k33976l18323k21934j65740l15728J29103l21333n5673
9933A1523828q4917l67262j58627j44456j71724n5612k45895k85474j90138j13779
9923I705944l7844J30217k05436j2469R938j03196k9872K35284k90165j60263
$$ plain form
9913 9242138 9168105 8890319 8794623 8691252 8526888 8380650 8411658 8301409 8273608 8176408
9903 8176408 8048702 7817008 7725696 7565284 7511602 7374302 7088417 6952291 6927228 6903577
9893 6903577 6656399 6480686 6145687 6050961 5904147 5420250 5313973 5091657 5011020 5053258
9883 5053258 5070572 4892104 4673086 4428027 4384093 4345826 4239992 4039683 3820973 3744390
9873 3744390 3630223 3451041 3335425 3307010 3289794 3212621 3135969 3223271 2892355 2695680
9863 2695680 2734453 2872445 2716604 2611500 2653661 2677062 2480150 2350313 2202924 2112047
9853 2112047 2155585 2056000 2165089 2225457 1997589 1929581 2106196 2072862 1987422 1899340 1887412
9842 1887412 1906212 1992265 1881901 1905815 1628517 1648492 1771856 1633045 1556881 1610002 1610254
$$ packed form
9913I242138p4033k77786r5696j03371j64364j46238L1008j10249k7801r7200
9903H176408j27706k31694r1312j60412n3682j37300k85885j36126k5063k3651
9893F903577k47178j75713l34999r4726j46814m83897j06277k22316q0637M2238
9883E053258J7314j78468k19018k45059m3934l8267j05834k00309k18710p6583
9873C744390j14167j79182j15616k8415j7216p7173p6652Q7302l30916j96675
9863B695680L8773J37992j55841j05104M2161K3401j96912j29837j47389r0877
9853B112047M3538r9585J09089O0368k27868o8008J76615l3334q5440q8082j1928
9842A887412J8800Q6053j10364K3914k77298J9975J23364j38811p6164N3121K52
$$ plain form
9831 1610254 1393640 1461713 1447666 1640145 1562517 1384371 1358205 1278934 1537280 1363821
9821 1363821 1490222 1303540 1199715 1083624 1194802 1411444 1312709 1243477 1473496 1449073
9811 1449073 1135284 1070104 908833 1086713 1257544 1164854 980958 1211365 968678 902478
9801 902478 920092 1015178 1196963 900529 975039 954751 910559 864928 1000191 956000 891317
9790 891317 910082 836333 1049080 965027 753816 693879 793664 796919 711256 708749 893840
9779 893840 786991 733550 689575 893500 992455 878692 769686 904871 841349 600803
9769 600803 648789 788243 903200 815308 697397 706069 547539 581298 539077 616707 691155
9758 691155 673704 663829 750825 694738 772247 657594 456453 499759 522199 733310 667995
$$ packed form
9831A610254k16614O8073j4047J92479p7628j78146k6166p9271K58346j73459
9821A363821J26401j86682j03825j16091J11178K16642r8735o9232K30019k4423
9811A449073l13789o5180j61271J77880J70831r2690j83896K30407k42687o6200
9801I02478J7614R5086J81785k96434P4510k0288m4192m5631J35263m4191o4683
9790H91317J8765p3749K12747q4053k11211n9937R9785L255q5663k507J85091
9779H93840j06849n3441m3975K03925R8955j13763j09006J35185o3522k40546
9769F00803M7986J39454J14957q7892j17911Q672j58530L3759m2221P7630P4448
9758F91155j7451r875Q6996n6087P7509j14653k01141M3306K2440K11111o5315
$$ plain form
9747 667995 594272 724594 717190 670181 639276 626416 585482 537859 417034 495068 487180 602413
9735 602413 773861 605233 573056 713199 747413 597159 601394 527851 603597 665659 688328
9724 688328 447680 354103 476165 486558 502407 628588 672709 580747 503351 452575 407574
9713 407574 501746 402021 399019 548248 606067 446842 632745 562892 400347 402141 422641
9702 422641 382418 471054 396056 384000 354090 398371 253574 382497 377718 477249 326493
9691 326493 320292 324726 480235 546049 320472 519080 324155 317736 418583 553633 453093
9680 453093 538801 363271 387481 265006 326977 374016 359815 369155 452676 342525 157544
9669 157544 233226 259796 200937 119727 118630 255092 153968 259197 537097 546267 472181
$$ packed form
9747F67995p3723J30322p404m7009l0905j2860m0934m7623j20825P8034p888J15233
9735F02413J71448j68628l2177J40143L4214j50254M235p3543P5746O2062K2669
9724F88328k40648r3577J22062J0393J5849J26181M4121r1962p7396n0776m5001
9713D07574R4172r9725l002J49229N7819j59225J85903o9853j62545J794K0500
9702D22641m0223Q8636p4998j2056k9910M4281j44797J28923m779R9531j50756
9691C26493o201M434J55509O5814k25577J98608j94925o419J00847J35050j00540
9680D53093Q5708j75530K4210j22475O1971M7039j4201R340Q3521j10151j84981
9669A57544P5682K6570n8859q1210j097J36462j01124J05229K77900R170p4086
$$ plain form
9658 472181 572232 598217 525790 563345 621887 522341 521961 392668 360242 342425 365426 408624
9646 408624 532778 658018 642271 484769 377929 576124 417372 399424 454755 334292
9636 334292 191642 363599 513721 472618 403237 434927 360701 533941 393084 342423 292949
9625 292949 368894 548791 593061 652118 576536 673045 760555 695007 550771 739730 719218
9614 719218 557233 507095 448501 302019 148133 286460 410956 569281 341635 275172
9604 275172 351972 445191 466910 584795 588916 563605 643949 453559 471726 702406 789496
9593 789496 579070 441930 397731 347631 487593 638780 636444 669035 566700 498162 554530
9582 554530 566578 289676 429950 428992 467349 514598 464765 347658 434782 528634 553875
$$ packed form
9658D72181J00051K5985p2427L7555N8542r9546l80j29293l2426j7817K3001M3198
9646D08624J24154J25240j5747j57502j06840J98195j58752j7948N5331j20463
9636C34292j42650J71957J50122m1103o9381L1690p4226J73240j40857n0661m9474
9625B92949P5945J79897M4270N9057p5582R6509Q7510o5548j44236J88959k0512
9614G19218j61985n0138n8594j46482j53886J38327J24496J58325k27646o6463
9604B75172P6800R3219K1719J17885M121k5311Q0344j90390J8167K30680Q7090
9593G89496k10426j37140m4199n0100J39962J51187k336L2591j02335o8538N6368
9582E54530J2048k76902J40274r58L8357M7249m9833j17107Q7124R3852K5241
$$ plain form
9571 553875 455403 373785 356285 490111 507068 625466 549195 409793 284295 287440 350676
9560 350676 368344 306486 400180 475051 355486 540080 370475 238114 419104 648604
9550 648604 609511 624622 526047 444605 634916 490638 399864 465244 533274 491267 446019
9539 446019 550704 353141 476868 446292 534839 699217 461161 413385 577140 531435
9529 531435 456423 367300 373685 379893 542148 547550 530506 652176 630875 570840 540761 478585
9517 478585 615450 631181 446761 462786 290792 260499 491910 545873 600410 718082 694650
9506 694650 641697 618343 707849 643015 736410 623265 466394 563885 542689 511358 541789
9495 541789 529145 446847 431537 527940 601462 511149 491969 281035 349053 630611 614688
$$ packed form
9571E53875r8472q1618j7500J33826J6957J18398p6271j39402j25498L145O3236
9560C50676J7668o1858R3694P4871j19565J84594j69605j32361J80990K29500
9550F48604l9093J5111r8575q1442J90311j44278r0774O5380O8030m2007m5248
9539D46019J04685j97563J23727l0576Q8547J64378k38056m7776J63755m5705
9529E31435p5012q9123O385O208J62255N402j7044J21670k1301o0035l0079o2176
9517D78585J36865J5731j84420J6025j71994l0293K31411N3963N4537J17672k3432
9506F94650n2953k3354Q9506o4834R3395j13145j56871R7491k1196l1331L0431
9495E41789j2644q2298j5310R6403P3522r0313j9180k10934O8018K81558j5923
$$ plain form
9484 614688 661369 617668 340026 463079 668362 675585 604867 661319 828454 972005 757285
9473 757285 505753 498568 381891 413087 468871 518231 616228 628227 827434 970471 823080
9462 823080 695104 506571 415519 664606 773772 818222 625636 640066 876023 875916 777927
9451 777927 660644 567385 758697 729372 764838 810308 653926 679369 832650 701946 607625
9440 607625 500639 598359 640432 856445 757207 527637 483421 417561 473421 549890 613281
9429 613281 691545 594393 454772 853541 1051690 1103644 936653 922528 775276 707631 762509
9418 762509 834627 717320 846422 826415 732158 471279 643680 916762 910893 955935 885604
9407 885604 778721 978616 944731 676248 635234 604202 806973 798698 680257 824417 797562
$$ packed form
9484F14688M6681m3701k77642J23053K05283P223p0718N6452J67135J43551k14720
9473G57285k51532p185j16677L1196N5784M9360R7997J1999J99207J43037j47391
9462H23080j27976j88533r1052K49087J09166M4450j92586J4430K35957j07r7989
9451G77927j17283r3259J91312k9325L5466M5470j56382K5443J53281j30704r4321
9440F07625j06986R7720M2073K16013r9238k29570m4216o5860N5860P6469O3391
9429F13281P8264r7152j39621L98769J98149N1954j66991j4125j47252o7645N4878
9418G62509P2118j17307J29102k0007r4257k60879J72401K73082n869M5042p0331
9407H85604j06883J99895l3885k68483m1014l1032K02771q275j18441J44160k6855
$$ plain form
9396 797562 705217 799553 748019 758035 694613 703785 832786 761586 1005158 1085501 1037376
9385 1037376 939812 841070 964033 1055775 1182184 1177981 1127102 1002133 974757 1013162 892551
9374 892551 1002565 899466 987434 1081101 1007656 1033319 1168845 1078175 1052874 966232 1045068
9363 1045068 1166981 1239278 1207005 1236290 1197693 1134121 1179518 1117250 1258378 1272804 1071840
9352 1071840 1202858 1278749 1206521 1019568 1071442 1192520 1147018 1268014 1360654 1175553
9342 1175553 1261404 1613632 1362475 1336624 1403396 1555484 1194564 969363 1099075 1261616
9332 1261616 1338864 1276845 1360915 1345338 1535562 1361787 1184958 1458981 1465141 1534529 1288254
9321 1288254 1447112 1371940 1321124 1258921 1192185 1347419 1403308 1441990 1352001 1306149 1310732
$$ packed form
9396G97562r2345R4336n1534J0016o3422R172J29001p1200K43572Q0343m8125
9385A037376r7564r8742J22963R1742J26409m203n0879j24969k7376L8405j20611
9374H92551J10014j03099Q7968R3667p3445K5663J35526r0670k5301q6642P8836
9363A045068J21913P2297l2273K9285l8597o3572M5397o2268J41128J4426k00964
9352A071840J31018P5891p2228j86953N1874J21078m5502J20996R2640j85101
9342A175553Q5851L52228k51157k5851O6772J52088l60920k25201J29712J62541
9332A261616P7248o2019Q4070j5577J90224j73775j76829K74023O160O9388k46275
9321A288254J58858p5172n0816o2203o6736J55234N5889L8682q9989m5852M583
$$ plain form
9310 1310732 1413413 1575336 1597428 1456809 1431794 1404118 1462555 1541219 1306033 1416241
9300 1416241 1428610 1512479 1670877 1680602 1705643 1547731 1416308 1432451 1606412 1810161 1541620
9289 1541620 1669235 1777645 1670754 1591126 1623343 1777150 1827717 1718365 1508750 1761001
9279 1761001 1842669 1699395 1635563 1637081 1840796 1748724 1800783 1989145 1996378 2072339 1823957
9268 1823957 1647197 1885775 2124217 2200999 2254854 2157269 2168977 2046549 2071441 2078794 2093880
9257 2093880 1983256 1913896 2030249 2118564 2237134 2225038 2126005 1998711 2065327 2199266
9247 2199266 2095083 2139098 2043751 2107714 2112146 1938942 2279873 2277626 2351870 2428698 2466389
9236 2466389 2387718 2531268 2591519 2603083 2666937 2517913 2521803 2404576 2398112 2527737 2631180
$$ packed form
9310A310732J02681J61923K2092j40619k5015k7676N8437P8664k35186J10208
9300A416241J2369Q3869J58398R725K5041j57912j31423J6143J73961K03749k68541
9289A541620J27615J08410j06891p9628L2217J53807N0567j09352k09615K52251
9279A761001Q1668j43274o3832J518K03715r2072N2059J88362P233P5961k48382
9268A823957j76760K38578K38442P6782N3855r7585J1708j22428K4892P353J5086
9257B093880j10624o9360J16353Q8315J18570j2096r9033j27294O6616J33939
9247B199266j04183M4015r5347O3963M432j73204L40931k247P4244P6828L7691
9236B466389p8671J43550O0251J1564O3854j49024L890j17227o464J29625J03443
$$ plain form
9225 2631180 2557790 2458043 2332972 2430511 2295127 2408679 2364871 2609472 2659185 2804705
9215 2804705 2847013 2656031 2528561 2532705 2586299 2484497 2629779 2615580 2482024 2554407 2744148
9204 2744148 2806906 2728779 2775867 2683781 2716989 2718889 2668562 2656927 2643359 2693807 2544827
9193 2544827 2511165 2529988 2670153 2905149 2873085 3023727 3123087 2921850 2926064 2963848 2774617
9182 2774617 2705033 2894394 2843415 2899131 2889257 2962748 3152601 3248635 3250304 3300766 3124159
9171 3124159 3116514 3014816 3044367 3250312 3235367 3198021 3125395 3105504 3169412 3352488 3376465
9160 3376465 3502827 3416515 3215074 3434006 3485092 3517046 3384356 3491885 3554804 3482230
9150 3482230 3501236 3676786 3681615 3579124 3598077 3724878 3680302 3604837 3796892 3461904 3555775
$$ packed form
9225B631180p3390r9747j25071R7539j35384J13552m3808K44601M9713J45520
9215B804705M2308j90982j27470M144N3594j01802J45282j4199j33556P2383J89741
9204B744148O2758p8127M7088r2086L3208J900n0327j1635j3568N0448j48980
9193B544827l3662J8823J40165K34996l2064J50642R9360k01237M214L7784j89231
9182B774617o9584J89361n0979N5716r874P3491J89853R6034J669N0462j76607
9171C124159p645j01698K9551K05945j4945l7346p2626j9891O3908J83076K3977
9160C376465J26362q6312k01441K18932N1086L1954j32690J07529O2919p2574
9150C482230J9006J75550M829j02491J8953J26801m4576p5465J92055l34988R3871
$$ plain form
9139 3555775 3521405 3523018 3726051 3936928 4032148 4013561 4089706 4001779 3971160 3827789 3842887
9128 3842887 3821725 3800905 4008308 3791012 3785699 3983478 3935764 3863528 4101833 4037956 4037447
9117 4037447 4120923 4206135 4231304 4132615 4048748 4015827 4162305 4155446 4273950 4176620 4110649
9106 4110649 4310362 4285880 4206879 4371289 4250741 4493611 4428994 4442145 4448901 4431634 4466956
9095 4466956 4335839 4222382 4420040 4631617 4561738 4448187 4514614 4591043 4553525 4579145
9085 4579145 4843780 4837432 4713362 4584827 4584953 4724765 4711205 4669133 4791945 4876971 4893713
9074 4893713 5179468 5108752 5250038 5311658 5389508 5419983 5296082 5468969 5408458 5377389 5530552
9063 5530552 5376767 5453653 5505150 5469804 5458122 5522090 5394786 5280287 5450727 5631602
$$ packed form
9139C555775l4370J613K03033K10877R5220j8587P6145q7927l0619j43371J5098
9128C842887k1162k0820K07403k17296n313J97779m7714p2236K38305o3877n09
9117D037447Q3476Q5212K5169r8689q3867l2921J46478o859J18504r7330o5971
9106D110649J99713k4482p9001J64410j20548K42870o4617J3151O756j7267L5322
9095D466956j31117j13457J97658K11577o9879j13551O6427P6429l7518K5620
9085D579145K64635o348j24070j28535J26J39812j3560m2072J22812Q5026J6742
9074D893713K85755p0716J41286O1620P7850L0475j23901J72887o0511l1069J53163
9063E530552j53785P6886N1497l5346j1682O3968j27304j14499J70440J80875
$$ plain form
9053 5631602 5632891 5514802 5477614 5745146 5893244 5986134 5952797 5720890 5581769 5602821 5866026
9042 5866026 5901539 5807322 5804109 5927412 5871696 5930217 6122613 6263530 6324138 5937408 5765328
9031 5765328 6071903 6073882 6065855 5912679 5977824 6193407 6201413 6245092 6302801 6376574 6391159
9020 6391159 6563672 6599753 6629759 6541300 6531299 6546225 6501479 6456050 6528369 6759452 6689517
9009 6689517 6631928 6616019 6609797 6766956 6964280 7070819 7013642 7068776 7202109 7489211 7364293
8998 7364293 7191439 7233112 7361386 7419109 7397823 7393125 7342128 7510532 7674898 7749374 7650554
8987 7650554 7734493 7828913 7760648 7871623 8168805 8145565 8138356 8058012 8064272 8058137 7918543
8976 7918543 8068188 8403650 8406123 8466156 8384532 8523336 8490617 8563669 8667116 8705722 8701236
$$ packed form
9053E631602J289j18089l7188K67532J48098R2890l3337k31907j39121K1052K63205
9042E866026L5513r4217l213J23303n5716N8521J92396J40917O0608l86730j72080
9031E765328L06575J979q027j53176O5145K15583Q006M3679N7709P3773J4585
9020F391159J72513L6081L0006q8459j0001J4926m4746m5429P2319K31083o9935
9009F689517n7589j5909o222J57159J97324J06539n7177N5134J33333K87102j24918
8998G364293j72854M1673J28274N7723k1286m698n0997J68404J64366P4476r8820
8987G650554Q3939R4420o8265J10975K97182k3240p209q0344O260o135j39594
8976G918543J49645L35462K473O0033q1624J38804l2719P3052J03447L8606m486
$$ plain form
8965 8701236 8613389 8825129 8894375 8870380 8941129 9238291 9079330 9055195 9358945 9414969 9292895
8954 9292895 9455351 9496337 9739743 9690801 9450984 9693080 9933546 10014742 9985358 10139892
8944 10139892 10308424 10402017 10502334 10544839 10759277 10862145 11010355 10957992 11010395 11238163
8934 11238163 11419770 11458758 11616193 11834583 11878811 11952454 12141010 12252947 12499910 12551455
8924 12551455 12539736 12694001 12654594 12756229 12704560 12892960 13403392 13528093 13726932 13862554
8914 13862554 13975208 14246222 14225555 14404843 14678343 14588598 14881305 15169313 15443406 15585955
8904 15585955 15722376 15842342 15848917 16312387 16615099 16855806 17069222 17300290 17716599 18106201
8894 18106201 18390709 18599794 18718478 19038940 19405942 19797627 20102184 20557266 20901982
$$ packed form
8965H701236q7847K11740O9246k3995P0749K97162j58961k4135L03750N6024j22074
8954I292895J62456M0986K43406m8942k39817K42096K40466Q1196k9384J54534
8944A0139892J68532R3593J00317M2505K14438J02868J48210n2363N2403K27768
8934A1238163J81607L8988J57435K18390M4228P3643J88556J11937K46963N1545
8924A2551455j1719J54265l9407J01635n1669J88400N10432J24701J98839J35622
8914A3862554J12654K71014k0667J79288K73500q9745K92707K88008K74093J42549
8904A5585955J36421J19966O575M63470L02712K40707K13416K31068M16309L89602
8894A8106201K84508K09085J18684L20462L67002L91685L04557M55082L44716
$$ plain form
8885 20901982 21249462 21650276 22164174 22560988 22987625 23510377 23980366 24628180 25095985
8876 25095985 25422661 25994100 26701534 27189344 27819303 28396229 29176644 29840903 30593882
8867 30593882 31114167 31779059 32395263 32887589 33592242 34417479 35449845 36313587 37252611
8858 37252611 38012544 38812233 39857987 40780510 41660203 42810808 43941761 45111069 46143926
8849 46143926 47381027 48687090 49922502 51199547 52329334 53659921 54938277 56351105
8841 56351105 58054928 59623727 61221583 62742485 64305961 66020569 67982339 69864856
8833 69864856 71740980 73474160 75608448 77687087 79863652 81993217 84212195 86503675
8825 86503675 88540657 90415655 92539060 94595645 96495399 98387659 100116936 101798930
$$ packed form
8885B0901982L47480M00814N13898L96814M26637N22752M69989O47814M67805
8876B5095985L26676N71439P07434M87810O29959N76926P80415O64259P52979
8867C0593882N20285O64892O16204M92326P04653Q25237J032366Q63742R39024
8858C7252611P59933P99689J045754R22523Q79693J150605J130953J169308J032857
8849D6143926J237101J306063J235412J277045J129787J330587J278356J412828
8841E6351105J703823J568799J597856J520902J563476J714608J961770J882517
8833F9864856J876124J733180K134288K078639K176565K129565K218978K291480
8825H6503675K036982J874998K123405K056585J899754J892260J729277J681994
$$ plain form
8817 101798930 103623241 105342863 107150056 109112990 110870291 112847212 114790617 116697415
8809 116697415 118777476 120687770 122851665 124963852 126897665 128857478 130961627 133252192
8801 133252192 135265061 137459186 139296135 141216476 143415668 145610494 147706085 149781818
8793 149781818 151865246 154058166 156159474 158147431 160276966 162053988 163992213 165711164
8785 165711164 167124759 168149746 168833770 169444756 169524171 169455024 169459890 169377167 168963659 168360317
8775 168360317 167718774 166988166 166071712 165058823 163941940 162807189 161615575 160772220 160002440
8766 160002440 159307049 158925463 158727970 158559735 158399560 158344813 158545695 158716198 159117575
8757 159117575 159540176 160063480 160740059 161334103 161983521 162933099 163874411 164892485 166139934
$$ packed form
8817A01798930J824311J719622J807193J962934J757301J976921J943405J906798
8809A16697415K080061J910294K163895K112187J933813J959813K104149K290565
8801A33252192K012869K194125J836949J920341K199192K194826K095591K075733
8793A49781818K083428K192920K101308J987957K129535J777022J938225J718951
8785A65711164J413595J024987O84024O10986P9415o9147M866q2723m13508o03342
8775A68360317o41543p30608r16454j012889j116883j134751j191614q43355p69780
8766A60002440o95391l81586j97493j68235j60175n4747K00882J70503M01377
8757A59117575M22601N23304O76579N94044O49418R49578R41312J018074J247449
$$ plain form
8748 166139934 167353499 168577508 169978030 171286311 172623486 173853070 175024282 175940528
8740 175940528 177038019 177752136 178321709 178853021 179028297 179320822 179428601 179541612 179593089
8731 179593089 179695407 180183840 180578915 181454463 182252233 182888451 183778126 184614611 185548304
8722 185548304 186614286 187787561 188703977 189782267 190915569 191822664 192676078 193854041
8714 193854041 195196528 196471334 198093326 199765634 201733003 203792385 206136824 208552305
8706 208552305 211181676 214177400 217196811 220148310 222830105 225536918 228223210 230491008
8698 230491008 232251319 233674755 234469175 234843620 234652793 234102679 233309527 232240895 231196659
8689 231196659 230321045 229694278 229320872 228977667 229247106 229463583 230243346 230950257 231770100
$$ packed form
8748A66139934J213565J224009J400522J308281J337175J229584J171212R16246
8740A75940528J097491P14117N69573N31312J75276K92525J07779J13011N1477
8731A79593089J02318M88433L95075Q75548P97770O36218Q89675Q36485R33693
8722A85548304J065982J173275R16416J078290J133302R07095Q53414J177963
8714A93854041J342487J274806J621992J672308J967369K059382K344439K415481
8706B08552305K629371K995724L019411K951499K681795K706813K686292K267798
8698B30491008J760311J423436P94420L74445j90827n50114p93152j068632j044236
8689B31196659q75614o26767l73406l43205K69439K16477P79763P06911Q19843
$$ plain form
8680 231770100 232806303 234191351 235575785 237225215 238959148 240526667 242167181 243782966
8672 243782966 245576401 247345408 248804899 250584685 252138262 253375041 254935344 256298411
8664 256298411 257560671 258927518 260266367 261516430 262998994 264771941 266533233 268483383
8656 268483383 270870665 273357858 276231612 278932394 281836984 284548580 287210014 289611425
8648 289611425 291450903 293008307 294440348 295937114 296749790 297357511 298106993 298605522 299003448
8639 299003448 299381987 299948576 300623142 300995894 301541911 302259618 302874655 303232597 303463776
8630 303463776 303898348 304215209 304069979 303857742 303556764 302675480 301496166 300030699 298158188
8621 298158188 296305429 294386534 292397942 290561461 288669979 286675071 284984710 283499838
$$ packed form
8680B31770100J036203J385048J384434J649430J733933J567519J640514J615785
8672B43782966J793435J769007J459491J779786J553577J236779J560303J363067
8664B56298411J262260J366847J338849J250063J482564J772947J761292J950150
8656B68483383K387282K487193K873754K700782K904590K711596K661434K401411
8648B89611425J839478J557404J432041J496766Q12676O07721P49482M98529L97926
8639B99003448L78539N66589O74566L72752N46017P17707O15037L57942K31179
8630C03463776M34572L16861j45230k12237l00978q81284j179314j465467j872511
8621B98158188j852759j918895j988592j836481j891482j994908j690361j484872
$$ plain form
8613 283499838 281983414 280799394 280185612 279634750 279034464 278840406 278840345 278843777 279461112 280356482
8603 280356482 281192493 282281220 283620882 284899676 286493609 288425705 290291317 292452477
8595 292452477 294638590 296910161 299063156 300903176 302826702 304617822 306216920 307647525
8587 307647525 309105850 310327870 311408992 312233045 313378689 314293580 315613804 316454306
8579 316454306 317021924 317956926 318536957 319750764 320880206 322250735 323794669 325764379
8571 325764379 328007943 330065556 332108888 334556472 336472548 338208961 339509727 340834277
8563 340834277 341374413 341370898 341242409 341258857 341209478 341206717 341610613 342472062 343583971 345118678
8553 345118678 347107086 349558684 352240409 355217091 358426535 361709776 365142390 368172765
$$ packed form
8613B83499838j516424j184020o13782n50862o00286j94058o1L432O17335Q95370
8603B80356482Q36011J088727J339662J278794J593933J932096J865612K161160
8595B92452477K186113K271571K152995J840020J923526J791120J599098J430605
8587C07647525J458325J222020J081122Q24053J145644R14891J320224Q40502
8579C16454306N67618R35002N80031J213807J129442J370529J543934J969710
8571C25764379K243564K057613K043332K447584J916076J736413J300766J324550
8563C40834277N40136l515j28489J6448m9379k761M03896Q61449J111909J534707
8553C45118678J988408K451598K681725K976682L209444L283241L432614L030375
$$ plain form
8545 368172765 371209971 374056306 376567494 378886253 380721302 382334801 383645137 384577137
8537 384577137 385411916 385810588 385914420 386050203 386068323 386245137 386299175 386101855 386109965 385842445
8527 385842445 385047256 383884012 382203311 379324371 375193658 369495529 362299854 353194929
8519 353194929 342671514 331052405 318914158 306270635 293636969 281457016 269756468
8512 269756468 258229492 247423021 237189787 227246148 218059030 209379009 201353881 193883379
8504 193883379 186825899 180197834 173958669 167954100 162379254 157344939 152543022 147985272
8496 147985272 143516317 139499263 135493497 131537206 127948237 124516852 121299556 118327367
8488 118327367 115469531 112713319 109937959 107296701 104811245 102525850 100187031 97771781
$$ packed form
8545C68172765L037206K846335K511188K318759J835049J613499J310336R32000
8537C84577137Q34779L98672J03832J35783J8120J76814N4038j97320Q110k67520
8527C85842445p95189j163244j680701k878940m130713n698129p195675r104925
8519C53194929j0523415j1619109j2138247j2643523j2633666j2179953j1700548
8512B69756468j1526976j0806471j0233234r943639r187118q680021q025128p470502
8504A93883379p057480o628065o239165o004569n574846n034315m801917m557750
8496A47985272m468955m017054m005766l956291l588969l431385l217296k972189
8488A18327367k857836k756212k775360k641258k485456k285395k338819k415250
$$ plain form
8480 97771781 95707640 93827195 91573212 89446865 87551193 85670215 83981782 82036919
8472 82036919 80449067 78845903 77011155 75411021 74147009 72553207 71032915 69549659
8464 69549659 68318649 66981260 65670817 64376820 63055038 61876728 60580780 59485421
8456 59485421 58362502 57300082 56107757 55162226 54352417 53347820 52109979 51047915
8448 51047915 50066632 49191060 48251561 47325172 46415399 45502694 44679700 43858998 42853322
8439 42853322 41985198 41055305 40166228 39071773 38181902 37380675 36395448 35544070 34560881
8430 34560881 33670208 32881972 32235696 31565647 30721724 29941948 29210053 28727000 28076865
8421 28076865 27292839 26628435 25964856 25442153 24544838 23967029 23453628 23004339 22685815
$$ packed form
8480I7771781k064141j880445k253983k126347j895672j880978j688433j944863
8472H2036919j587852j603164j834748j600134j264012j593802j520292j483256
8464F9549659j231010j337389j310443j293997j321782j178310j295948j095359
8456E9485421j122919j062420j192325r45531q09809j004597j237841j062064
8448E1047915r81283q75572r39499r26389r09773r12705q22994q20702j005676
8439D2853322q68124r29893q89077j094455q89871q01227r85227q51378r83189
8430C4560881q90673p88236o46276o70049q43923p79776p31895m83053o50135
8421B8076865p84026o64404o63579n22703q97315n77809n13401m49289l18524
$$ plain form
8412 22685815 22171348 21477821 20920866 20470411 20275682 19929593 19577583 19083207 18659295
8403 18659295 18389227 18277594 17951597 17368423 16943349 16852319 16561550 16349072 16207185 15934010
8393 15934010 15454300 15189785 14918558 14766364 14723464 14311389 14107239 13896711 13667751 13413914
8383 13413914 13409858 13381911 13135383 12732104 12577765 12240269 12177781 12147932 11936306 11720788
8373 11720788 11574946 11507905 11197874 11036245 10848522 10760891 10614359 10356099 10361073 10287521
8363 10287521 10077859 10174851 10112454 9697668 9624635 9578738 9343193 9139413 8948118 8682514
8353 8682514 8645245 8492692 8556398 8493366 8160821 8199849 8214989 7993457 7869943 7868433 7761962
8342 7761962 7625299 7564651 7415713 7339783 7516883 7320363 7165316 7145393 6822561 6935888
$$ packed form
8412B2685815n14467o93527n56955m50455j94729l46089l52010m94376m23912
8403A8659295k70068j11633l25997n83174m25074r1030k90769k12478j41887k73175
8393A5934010m79710k64515k71227j52194m2900m12075k04150k10528k28960k53837
8383A3413914m056k7947k46528m03279j54339l37496o2488k9849k11626k15518
8373A1720788j45842o7041l10031j61629j87723q7631j46532k58260M974p3552
8363A0287521k09662R6992o2397m14786p3033m5897k35545k03780j91295k65604
8353H682514l7269j52553O3706o3032l32545L9028J5140k21532j23514j510j06471
8342G761962j36663o0648j48938p5930J77100j96520j55047j9923l22832J13327
$$ plain form
8332 6935888 6889063 6734124 6418644 6205747 6278467 6213702 6190507 6306274 6195417 5929011
8322 5929011 5885866 5723668 5843450 5824877 5720830 5583961 5446849 5258370 5071102 5171666
8312 5171666 5196750 5110244 5008298 4872563 4870326 4835573 4856150 4861856 4746926 4566313 4582946
8301 4582946 4390460 4351484 4319104 4048672 4208200 4215049 4229831 4093877 4194459 4179149 4041153
8290 4041153 3996973 3887275 3791298 3626586 3742864 3692820 3893742 4012754 3836631 3497436
8280 3497436 3520598 3604940 3630324 3520665 3392508 3294146 3282389 3428869 3370849 3322351 3410746
8269 3410746 3426567 3165719 3281533 3252817 3136971 3063412 2992083 2843943 2988791 2992837 2981758
8258 2981758 2861091 2900689 3070170 2864141 2892173 2962580 2940804 2762485 2730818 2732648 2798388
$$ packed form
8332F935888m6825j54939l15480k12897P2720o4765k3195J15767j10857k66406
8322E929011m3145j62198J19782j8573j04047j36869j37112j88479j87268J00564
8312E171666K5084q6506j01946j35735k237l4753K0577N706j14930j80613J6633
8301D582946j92486l8976l2380k70432J59528O849J4782j35954J00582j5310j37996
8290D041153m4180j09698r5977j64712J16278n0044K00922J19012j76123l39195
8280C497436K3162Q4342K5384j09659j28157r8362j1757J46480n8020m8498Q8395
8269C410746J5821k60848J15814k8716j15846p3559p1329j48140J44848M046j1079
8258B981758j20667L9598J69481k06029K8032P0407k1776j78319l1667J830O5740
$$ plain form
8247 2798388 2762801 2803557 2722296 2584604 2593687 2330171 2468098 2565497 2542001 2681661 2792093
8236 2792093 2613953 2387571 2360472 2426324 2631413 2680789 2447100 2467583 2388405 2247942
8226 2247942 2409342 2299634 2517345 2516545 2457255 2381484 2409381 2353389 2224515 2213520 2268534
8215 2268534 2469957 2217730 2075728 1863847 1745045 1944554 1936229 1886572 2078303 2024480
8205 2024480 2238095 2128006 1941511 1771702 1799860 1845544 2055023 1921139 2045825 1920815
8195 1920815 1855214 1981808 3044127 4982528 2705778 1712930 1563369 1586933 1760945
8186 1760945 1505569 1611369 1426057 1387818 1619837 1708115 1647494 1691856 1489169 1731933
8176 1731933 1547015 1592435 1594685 1584753 1494159 1397442 1286937 1339178 1593024 1658577 1392980
$$ packed form
8247B798388l5587M0756q1261j37692R083k63516J37927R7399k3496J39660J10432
8236B792093j78140k26382k7099O5852K05089M9376k33689K0483p9178j40463
8226B247942J61400j09708K17711q00n9290p5771K7897n5992j28874j0995N5014
8215B268534K01423k52227j42002k11881j18802J99509q325m9657J91731n3823
8205B024480K13615j10089j86495j69809K8158M5684K09479j33884J24686j25010
8195A920815o5601J26594J062319J938401k276750r92848j49561K3564J74012
8186A760945k55376J05800j85312l8239K32019Q8278o0621M4362k02687K42764
8176A731933j84918M5420K250r932r0594r6717j10505N2241K53846O5553k65597
$$ plain form
8165 1392980 1283882 1264196 1370725 1361151 1575396 1501222 1469265 1604175 1455108 1348021
8155 1348021 1266395 1330816 1444318 1490487 1437425 1305401 1208027 1204405 1183514 1221024 1369701
8144 1369701 1237457 1051312 1123899 1213584 1344901 1258772 1278121 1297541 1135143 996012
8134 996012 1242052 1331602 1108692 1118219 986455 1126731 1241618 1243526 1354760 1204728 1100835
8123 1100835 1168064 1071437 1311151 1263356 1195103 1319541 1227393 945960 882908 1161357 1078209
8112 1078209 1032252 890643 742023 604491 754538 913015 1012282 1005807 974493 937021 904700
8101 904700 903114 930074 928453 761834 674738 893355 1095095 1083131 950638 919964 952865
8090 952865 860983 839168 799655 897751 888917 975630 917069 709913 644709 723789 880638
$$ packed form
8165A392980j09098j9686J06529r574K14245p4174l1957J34910j49067j07087
8155A348021q1626O4421J13502M6169n3062j32024r7374l622k0891L7510J48677
8144A369701j32244j86145P2587Q9685J31317q6129J9349J9420j62398j39131
8134I96012K46040Q9550k22910R527j31764J40276J14887J908J11234j50032j03893
8123A100835O7229r6627K39714m7795o8253J24438r2148k81433o3052K78449q3148
8112A078209m5957j41609j48620j37532J50047J58477R9267o475l1314l7472l2321
8101I04700j586K6960j621j66619q7096K18617K01740j1964j32493l0674L2901
8090I52865r1882k1815l9513R8096q834Q6713n8561k07156o5204P9080J56849
$$ plain form
8079 880638 859511 783412 767972 611104 670183 877286 809748 685494 745282 697843 653074
8068 653074 817403 683570 723669 733532 711229 684381 587945 726054 815428 723683 658762
8057 658762 718534 766345 789824 758304 712306 559551 547075 498957 380716 560522 600601
8046 600601 462427 366721 366647 516039 647296 426846 427047 395962 570479 770720 675910
8035 675910 620525 507464 677241 632974 448162 372102 415414 382137 435588 644687 531310
8024 531310 544046 501355 299934 430578 440424 477372 547811 358580 281535 297627 312638
8013 312638 270986 419752 390160 522280 503603 171239 247569 236511 336001 455813 200728
8002 200728 74234 237609 397487 361254 458445 591646 526892 521578 372461 360389 300515
$$ packed form
8079H80638k1127p6099j5440j56868N9079K07103o7538j24254N9788m7439m4769
8068F53074J64329j33833M0099R863k2303k6848r6436J38109Q9374r1745o4921
8057F58762N9772M7811K3479l1520m5998j52755j2476m8118j18241J79806M0079
8046F00601j38174r5706p4J49392J31257k20450K01l1085J74517K00241r4810
8035F75910n5385j13061J69777m4267j84812p6060M3312l3277N3451K09099j13377
8024E31310J2736m2691k01421J30644R846L6948P0439j89231p7045J6092J5011
8013C12638m1652J48766k9592J32120j8677l32364P6330j1058R9490J19812k55085
8002B00728j26494J63375J59878l6233R7191J33201o4754n314j49117j2072n9874
$$ plain form
7991 300515 247206 135178 213149 500544 408841 690994 590348 444807 352570 369676 193280
7980 193280 225191 223739 144342 217779 116039 294797 253887 199521 17350 -28407 191633
7969 191633 318775 480584 506421 170065 117968 164811 232729 428303 579195 285521
7959 285521 264891 315829 338022 245314 153810 242439 232691 51788 252740 419347 371865
7948 371865 210965 93282 204605 319720 201584 204871 292459 424998 376674 163101
7938 163101 224018 279153 289803 182256 183106 389326 321163 214919 305069 290517 277447
7927 277447 417836 217648 204378 281280 78815 63388 121868 292277 456780 526887 395087
7916 395087 408391 219957 119943 -29652 134063 345677 435251 425358 168877 172952 279446
$$ packed form
7991C00515n3309j12028P7971K87395r1703K82153j00646j45541r2237J7106j76396
7980A93280L1911j452p9397P3437j01740J78758m0910n4366j82171m5757K20040
7969A91633J27142J61809K5837l36356n2097M6843O7918J95574J50892k93674
7959B85521k0630N0938K2193r2708r1504Q8629r748j80903K00952J66607m7482
7948C71865j60900j17683J11323J15115j18136L287Q7588J32539m8324k13573
7938A63101O0917N5135J0650j07547Q50K06220o8163j06244R0150j4552j3070
7927B77447J40389k00188j3270P6902k02465j5427N8480J70409J64503P0107j31800
7916C95087J3304j88434j00014j49595J63715K11614Q9574r893k56481M075J06494
$$ plain form
7905 279446 489414 363608 94357 148969 195101 140638 92165 101422 265557 222444 20025
7894 20025 -29056 -67670 189975 280377 133573 84343 39592 166148 75629 12329 26832
7883 26832 121449 262953 158803 292059 387188 332761 117866 -33639 71796 134657 295149
7872 295149 467309 440877 146903 51689 255516 138361 65841 166835 256537 206260 159325
7861 159325 82506 128162 -6365 166298 248228 88712 -29330 -107187 174172 212236 -3644
7850 -3644 118177 154995 48179 43178 267404 346661 308676 181920 5216 131905 123479
7839 123479 143548 124036 32733 94237 121871 147957 40061 -16467 49476 48736 24178 -54382
7827 -54382 172123 85250 41584 243298 240336 117465 248658 244810 150021 305843 40589
$$ packed form
7905B79446K09968j25806k69251N4612M6132n4463m8473R257J64135m3113k02419
7894B0025m9081l8614K57645R0402j46804m9230m4751J26556r0519o3300J4503
7883B6832R4617J41504j04150J33256R5129n4427k14895j51505J05435O2861J60492
7872B95149J72160k6432k93974r5214K03827j17155p2520J00994Q9702n0277m6935
7861A59325p6819M5656j34527J72663Q1930j59516j18042p7857K81359L8064k15880
7850c644J21821L6818j06816n001K24226P9257l7985j26756j76704J26689q426
7839A23479K0069j9512r1303O1504K7634K6086j07896n6528O5943p40k4558p8560
7827e4382K26505q6873m3666K01714k962j22871J31193l848r4789J55822k65254
$$ plain form
7816 40589 -269378 5865 144481 313158 270505 373289 143935 -1967 -55151 89794
7806 89794 214437 293821 -22155 -230458 -148721 -420414 -22498 53603 -6119 67827 227821
7795 227821 -125987 -5339 173788 282306 -21267 -186152 -242478 -165461 -146668 -52490
7785 -52490 164468 58614 77616 -17844 54440 49671 72885 97758 2054 223490 271632
7774 271632 138011 216311 28659 37841 -10611 -35558 -93910 -169375 -39950 84411 88379
7763 88379 -35707 3222 312841 185893 174695 -69481 -57952 49834 -65495 -4461 -4539
7752 -4539 1314 37912 143344 421869 359405 105201 158022 350680 176383 98963 116691
7741 116691 -33491 -127443 137048 191350 139594 113531 98216 186409 46980 -123357 41258
$$ packed form
7816D0589l09967K75243J38616J68677m2653J02784k29354j45902n3184J44945
7806H9794J24643P9384l15976k08303Q1737k71693L97916P6101n9722P3946J59994
7795B27821l53808J20648J79127J08518l03573j64885n6326P7017J8793R4178
7785e2490K16958j05854J9002r5460P2284m769K3214K4873r5704K21436M8142
7774B71632j33621P8300j87652R182m8452k4947n8352p5465J29425J24361L968
7763H8379j24086L8929L09619j26948j1198k44176J1529J07786j15329O1034p8
7752d539N853L6598J05432K78525o2464k54204N2821J92658j74297p7420J7728
7741A16691j50182r3952K64491N4302n1756k6063j5315Q8193j39429j70337J64615
$$ plain form
7730 41258 2623 -3530 -19640 -19871 2352 99586 141001 -113174 -108254 -114705 156703 190309
7718 190309 70203 -184260 -300010 -272759 -83366 -93498 -46931 111337 -33546 2645
7708 2645 251514 40356 -72728 -1371 136006 -21071 135787 231101 57847 -70289
7698 -70289 -259594 -220788 -132280 -172160 -190928 -119514 -134114 -149840 -263009 -46873 7542
7687 7542 -19627 -82663 -207114 -121287 -129096 25237 120137 62278 22090 -175688 -297432
7676 -297432 -215107 -177338 -246607 -334548 -281194 -435796 -73553 80116 84848 162 -24517
7665 -24517 -42257 -71611 -93287 -18707 200207 -5228 -211992 -105490 -87458 -139377 320139
7654 320139 252239 149571 -21355 102641 155501 111028 35331 21706 9292 21682 2499
$$ packed form
7730D1258l8635o153j6110k31K2223R7234M1415k54175M920o451K71408L3606
7718A90309j20106k54463j15750K7251J89393j0132M6567J58268j44883L6191
7708B645K48869k11158j13084P1357J37377j57077J56858R5314j73254j28136
7698g0289j89305L8806Q8508l9880j8768P1414j4600j5726j13169K16136N4415
7687G542k7169o3036j24451Q5827p809J54333R4900n7859m0188j97778j21744
7676b97432Q2325L7769o9269q7941N3354j54602L62243J53669M732q4686k4679
7665b4517j7740k9354k1676P4580K18914k05435k06764J06502J8032n1919M59516
7654C20139o7900j02668j70926J23996N2860m4473p5697j3625j2414J2390j9183
$$ plain form
7643 2499 5077 96403 58023 -65707 -118867 8927 183821 190454 136452 161786 -18009 -71267
7631 -71267 -41462 27483 76787 159794 117863 -16165 -102326 51859 -59631 -58266 -20152
7620 -20152 -290314 -150521 87349 37457 -66177 -229497 -201521 -84734 -155160 -227785 -134750
7609 -134750 -81509 -98683 -206966 -106665 -123639 -3565 28416 54948 -91567 51556 50881
7598 50881 -150020 124749 99186 -35395 -716 -120244 -181824 -201733 -298205 -236370 -288836
7587 -288836 -131961 -56325 -128277 -239661 -103277 -162185 -375988 -156585 2636 -42832
7577 -42832 102307 -71277 -122686 -203580 -100672 -126895 -132248 -50021 -73232 -311622 -149424
7566 -149424 77149 -10591 -29838 -78567 52072 87126 -80570 59490 64625 -118412 -170059
$$ packed form
7643B499K578R1326l8380j23730n3160J27794J74894O633n4002K5334j79795n3258
7631g1267K9805O8945M9304Q3007m1931j34028q6161J54185j11490J365L8114
7620b0152k70162J39793K37870m9892j03634j63320K7976J16787p0426p2625R3035
7609a34750N3241j7174j08283J00301j6974J20074L1981K6532j46515J43123o75
7598E0881k00901K74769k5563j34581L4679j19528o1580j9909r6472O1835n2466
7587b88836J56875P5636p1952j11384J36384n8908k13803K19403J59221m5468
7577d2832J45139j73584n1409q0894J02908k6223n353Q2227k3211k38390J62198
7566a49424K26573q7740j9247m8729J30639L5054j67696J40060N135j83037n1647
$$ plain form
7555 -170059 56329 98751 153086 -4351 -49699 -61410 -98342 4455 24961 10885 113258
7544 113258 43819 -155480 -264282 -206893 -129260 -210255 -252591 -211258 142264 190084 79851
7533 79851 -14827 78652 118348 81804 -46250 -233680 -289490 -102473 66178 -115373 -347775
7522 -347775 -116052 -161855 -151101 -93082 -4357 76195 -50726 -25748 -100070 22170 -206497
7511 -206497 -211632 1870 -181920 -128833 -115325 -168166 -122 92095 -11543 58986 -47230
7500 -47230 -100938 -101656 5993 -75536 44076 36376 79438 -44201 -177410 -249009 -196130 -134796
7488 -134796 -75331 -112918 -2076 143026 -80404 -275906 -117452 -189733 -86595 -104771
7478 -104771 -70884 -92287 -112380 -79177 -235634 -315336 -302094 -227926 -340991 -167945 -131221
$$ packed form
7555a70059K26388M2422N4335j57437m5348j1711l6932J02797K0506j4076J02373
7544A13258o9439j99299j08802N7389P7633q0995m2336M1333L53522M7820j10233
7533G9851r4678R3479L9696l6544j28054j87430n5810J87017J68651j81551k32402
7522c47775K31723m5803J0754N8019Q8725Q0552j26921K4978p4322J22240k28667
7511b06497n135K13502j83790N3087J3508n2841J68044R2217j03638P0529j06216
7500d7230n3708p18J07649q1529J19612p700M3062j23639j33209p1599N2879O1334
7488a34796N9465l7587J10842J45102k23430j95502J58454p2281J03138j8176
7478a04771L3887k1403k0093L3203j56457p9702J3242P4168j13065J73046L6724
$$ plain form
7467 -131221 -211775 -191667 -141112 28736 7620 36015 59390 -22416 38202 138380 53158
7456 53158 -171939 -126241 -193134 -49447 289600 78031 -250006 -210091 -164552 -75047 -53067
7445 -53067 79422 118391 -61400 -269669 -238960 -112478 -59253 -215193 -31945 92311
7435 92311 81982 31279 175520 151772 -29836 -265747 -292573 -204777 -83757 -111602 78810
7424 78810 75530 -117295 -6265 -148504 -225535 -42935 -96483 -155859 -188222 -109162 -80407
7413 -80407 -146885 24961 -35531 -235942 -190333 96163 124986 4748 108579 11795 -153040
7402 -153040 -396120 -397773 -136616 -96389 -173987 -11861 89255 -126271 -153959 44704 -58866
7391 -58866 -27812 301671 41438 -240752 -225766 -249867 -143763 -52911 71579 -253198 -248024
$$ packed form
7467a31221q0554K0108N0555J69848k1116K8395K3375q1806O0618J00178q5222
7456E3158k25097M5698o6893J43687L39047k11569l28037L9915M5539Q9505K1980
7445e3067J32489L8969j79791k08269L0709J26482N3225j55940J83248J24256
7435I2311j0329n0703J44241k3748j81608k35911k6826Q7796J21020k7845J90412
7424G8810l280j92825J11030j42239p7031J82600n3548n9376l2363P9060K8755
7413h0407o6478J71846o0492k00411M5609K86496K8823j20238J03831r6784j64835
7402a53040k43080j653K61157M0227p7598J62126J01116k15526k7688J98663j03570
7391e8866L1054L29483k60233k82190J4986k4101J06104R0852J24490l24777N174
$$ plain form
7380 -248024 -403277 -573653 -407117 -207083 -300994 -361560 -150870 38746 -31174 -184799
7370 -184799 -141554 -286576 -394514 -343158 -186361 -147201 -79616 -190464 -259383 -462026 -375226
7359 -375226 -303808 -83082 -139396 -27812 -108849 -211962 -276748 -250542 -266323 -65281 -18148
7348 -18148 -191213 -71095 -812 -55297 -167238 -124451 -123430 -40900 -51306 57158 174229
7337 174229 90353 169829 211444 86222 128626 87318 -39658 -62037 -124262 29869 -65156
7326 -65156 -12525 -134153 -127760 45489 35757 -126950 -218794 -258583 -83590 -29673 -45424
7315 -45424 -92015 -252338 -145119 -275128 -250524 -186062 -35807 -26608 -220256 -241698 -54307
7304 -54307 -161525 33026 -2369 -15777 -67308 -124815 -329881 -265728 -27146 -79337 21140
$$ packed form
7380b48024j55253j70376J66536K00034r3911o0566K10690J89616o9920j53625
7370a84799M3245j45022j07938N1356J56797L9160O7585j10848o8919k02643Q6800
7359c75226P1418K20726n6314J11584q1037j03113o4786K6206j5781K01042M7133
7348a8148j73065J20118P0283n4485j11941M2787J021Q2530j0406J08464J17071
7337A74229q3876P9476M1615j25222M2404m1308j26976k2379o2225J54131r5025
7326f5156N2631j21628O393J73249r732j62707r1844l9789J74993N3917j5751
7315d5424m6591j60323J07219j30009K4604O4462J50255R199j93648k1442J87391
7304e4307j07218J94551l5395j3408n1531n7507k05066O4153K38582n2191J00477
$$ plain form
7293 21140 -58249 -70355 107301 120093 -248321 -330024 -277963 -214369 -92863 -48829 -77797
7282 -77797 -285792 -154387 1099 -162331 -15495 5217 -163033 -28373 -20664 -91071 -101313
7271 -101313 -12856 6765 -28075 -30042 -46681 -127292 -168625 -130244 -210225 -334308 -602186
7260 -602186 -473791 -134631 22652 2937 237144 -7382 -136404 4407 -7120 -174076
7250 -174076 -197412 -83375 -269468 -351512 -281856 -167875 40708 87369 -220477 -58666
7240 -58666 -51259 -171040 50004 114637 -29850 6957 21924 -79818 -125910 -71555 104135
7229 104135 30021 -11942 -57616 -188906 70371 -103531 -20113 30365 -52809 -197569 -322798
7218 -322798 -291905 -170166 -167691 -281895 -345851 -251756 -195010 -238017 -105141 -155447 -118936
$$ packed form
7293B1140p9389j2106J77656J2792l68414q1703N2061O3594J21506M4034k8968
7282g7797k07995J31405J55486j63430J46836K0712j68250J34660P709p0407j0242
7271a01313Q8457J9621l4840j967j6639q0611m1333L8381p9981j24083k67878
7260f02186J28395L39160J57283j9715K34207k44526j29022J40811j1527j66956
7250a74076k3336J14037j86093q2044O9656J13981K08583M6661l07846J61811
7240e8666P407j19781K21044O4633j44487L6807J4967j01742m6092N4355J75690
7229A04135p4114m1963m5674j31290K59277j73902Q3418N0478q3174j44760j25229
7218c22798L0893J21739K475j14204o3956R4095N6746m3007J32876n0306L6511
$$ plain form
7207 -118936 -97077 -188932 -147475 66411 -53865 -169953 -72876 -94788 -149089 -87693 -104083
7196 -104083 -69515 -56525 -222011 -220029 -228328 -162140 -53880 -141245 -46971 -92732 -57377 -37950
7184 -37950 -32717 -86491 -231713 -232424 -301399 -241873 -325484 -230906 -56664 -163940 -167648 -103161
7172 -103161 1871 4922 -114278 -135327 -222264 -193158 -126996 -42794 -257179 -128724 -192139
7161 -192139 -162203 -32818 -169107 -189423 -292668 -202209 -74273 -43563 -167436 -274533
7151 -274533 -207857 -10653 -49493 -120017 -214642 -377634 -343190 -159532 -213515 -165355 -255552
7140 -255552 -111774 -131643 -124142 -181750 -235924 -109203 -38166 -143843 -179734 82961 -57066
7129 -57066 -169669 -170923 -51622 -12885 -232787 -114433 -23369 -64355 -168902 -438411 -304127
$$ packed form
7207a18936K1859r1855M1457K13886j20276j16088R7077k1912n4301O1396j6390
7196a04083L4568J2990j65486J982q299O6188J08260q7365R4274m5761L5355J9427
7184c7950N233n3774j45222p11o8975N9526q3611R4578J74242j07276l708O4487
7172a03161J05032L051j19200k1049q6937K9106O6162Q4202k14385J28455o3415
7161a92139K9936J29385j36289k0316j03245R0459J27936L0710j23873j07097
7151b74533O6676J97204l8840p0524r4625j62992L4444J83658n3983M8160r0197
7140b55552J43778j9869P501n7608n4174J26721P1037j05677l5891K62695j40027
7129e7066j12603j254J19301L8737k19902J18354R1064m0986j04547k69509J34284
$$ plain form
7118 -304127 -212630 -75093 -34619 -62209 -28965 15846 -87144 -151639 -101830 -71541 -185286
7107 -185286 -41266 39890 -32914 -134391 -297688 -360468 -315796 -271418 -256818 -296141 -346512
7096 -346512 -311593 -250384 -309525 -581046 -133214 -128110 -101747 -75876 -148519 -107598 -185790
7085 -185790 -299433 -426583 -219952 -150698 -330120 -313621 -274936 -196544 -245224 -170252 -219060
7074 -219060 -425684 -336438 -14694 -15981 101900 -58203 68221 60166 -186174 -145826 -88439
7063 -88439 -145095 -251180 -152076 -141937 -38776 -146751 -140309 -106733 -61529 49553 -20222
7052 -20222 -205048 -203273 -116099 -244632 -259415 -141745 -100129 -93996 -115743 70771 -83550
7041 -83550 83711 49932 -92990 4099 -71183 -69236 -194919 -297737 -290583 -399809 -298098
$$ packed form
7118c04127R1497J37537M0474k7590L3244M4811j02990o4495M9809L0289j13745
7107a85286J44020Q1156p2804j01477j63297o2780M4672M4378J4600l9323n0371
7096c46512L4919O1209n9141k71521M47832N104K6363K5871p2643M0921p8192
7085a85790j13643j27150K06631O9254j79422J6499L8685P8392m8680P4972m8808
7074b19060k06624Q9246L21744j287J17881j60103J26424q055k46340M0348N7387
7063h8439n6656j06085R9104J0139J03161j07975O442L3576M5204J11082o9775
7052b0222j84826J775Q7174j28533j4783J17670M1616O133k1747J86514j54321
7041h3550J67261l3779j42922R7089p5282J947j25683j02818P154j09226J01711
$$ plain form
7030 -298098 -27491 32051 -69115 -161631 -301203 -170032 -84447 -175981 102079 61856 -128609
7019 -128609 -138963 -118388 -18382 45002 42588 -62730 79557 -200109 -187538 -69235 -108537
7008 -108537 -193544 -150243 -304388 -312366 -107746 -140929 -308610 -149905 -68329 -173416 -240210
6997 -240210 -199738 -246281 -232175 -152960 -45810 -141708 -129311 -94088 -84249 61643 -19183
6986 -19183 -233405 34429 58816 -174533 -156318 -144955 81396 -14724 -183819 -117337 43789
6975 43789 -86407 17984 220481 110343 -22289 -136026 -247187 -217654 -201276 -170044
6965 -170044 -18914 46595 -120168 -163788 -119318 46435 -8943 -56133 -200035 5663 25491
6954 25491 -181320 -311709 -134245 -91496 -190353 -290204 -209922 -76394 -131789 -220392 -190728
$$ packed form
7030b98098K70607N9542j01166r2516j39572J31171Q5585r1534K78060m0223j90465
7019a28609j0354K0575J00006O3384k414j05318J42287k79666J2571J18303l9302
7008a08537q5007M3301j54145p978K04620l3183j67681J58705Q1576j05087o6794
6997b40210M0472m6543J4106P9215J07150r5898J2397L5223R839J45892q0826
6986a9183k14222K67834K4387k33349J8215J1363K26351r6120j69095O6482J61126
6975D3789j30196J04391K02497j10138j32632j13737j11161K9533J6378L1232
6965a70044J51130O5509j66763m3620M4470J65753n5378m7190j43902K05698J9828
6954B5491k06811j30389J77464M2749r8857r9851Q0282J33528n5395q8603K9664
$$ plain form
6943 -190728 -132061 70188 -27047 -187138 -195475 -163658 -268562 -302733 -175650 -94247 -95642
6932 -95642 -157270 -194066 -132899 -59963 -39291 -114666 -38334 -87986 -200138 -66723 -240428
6921 -240428 -252241 -386967 -501694 -349229 -326245 -407659 -158490 -230699 -268032 -199023 -280586
6910 -280586 -285757 -194125 -200940 -252923 -241998 -482168 -363488 -172360 -211820 -201164 -106048
6899 -106048 -119470 -304301 -299177 -79768 -52360 -71751 -210316 -221410 -129256 -270443 -106662
6888 -106662 -203332 -160344 -300409 -308313 -30866 -30170 61256 -156060 -130743 -245746 -511955
6877 -511955 -548839 -231847 -180215 -216449 -236758 -300010 -446822 -467734 -272025 -278033 -40658
6866 -40658 131249 222660 -64609 -282261 -334758 -213375 -191154 -172795 -297117 -174865 -83338
$$ packed form
6943a90728N8667K02249r7235j60091q337L1817j04904l4171J27083Q1403j395
6932i5642o1628l6796O1167P2936K0672p5375P6332m9652j12152J33415j73705
6921b40428j1813j34726j14727J52465K2984q1414K49169p2209l7333O9009q1563
6910b80586n171R1632o815n1983J0925k40170J18680J91128l9460J0656R5116
6899a06048j3422j84831N124K19409K7408j9391j38565j1094R2154j41187J63781
6888a06662r6670M2988j40065p904K77447O96R1426k17316K5317j15003k66209
6877e11955l6884L16992N1632l6234k0309o3252j46812k0912J95709o008K37375
6866d0658J71907R1411k87269k17652n2497J21383K2221J8359j24322J22252R1527
$$ plain form
6855 -83338 -141309 -48266 -232171 -172189 -151686 76585 5660 -395903 -239859 -76956 -310406
6844 -310406 -444103 -391949 -382801 -295114 -151383 73962 -40264 -137042 -229012 -304497 -313932
6833 -313932 -250751 -268779 -353685 -222169 -154153 -212811 -218375 -62425 -84057 -43877 -79415
6822 -79415 -305809 -75662 -130887 143528 35140 -117041 -186807 -315630 -282769 -125109
6812 -125109 -73253 -117500 -242420 -248900 -427394 -337774 -44977 -127171 -86832 -186052 -119169
6801 -119169 -62456 -50567 -178473 -116630 -65788 -192244 -124332 -218746 -219330 -14507 -114827
6790 -114827 -12378 -248205 -178401 -289287 -334869 -257156 -122820 -112183 -268857 -327845 -316725
6779 -316725 -138949 -199247 -234372 -66150 -155157 -196819 -4340 12222 13905 -154725 -76778
$$ packed form
6855h3338n7971R3043j83905N9982K0503K28271p0925m01563J56044J62903k33450
6844c10406j33697N2154R148Q7687J43731K25345j14226r6778r1970p5485r435
6833c13932O3181j8028q4906J31516O8016n8658n564J55950k1632M0180l5538
6822g9415k26394K30147n5225K74415j08388j52181o9766j28823L2861J57660
6812a25109N1856m4247j24920o480j78494Q9620K92797q2194M0339r9220O6883
6801a19169N6713J1889j27906O1843N0842j26456O7912r4414n84K04823j00320
6790a14827J02449k35827O9804j10886m5582P7713J34336J0637j56674n8988J1120
6779c16725J77776o0298l5125J68222q9007m1662J92479J6562J683j68630P7947
$$ plain form
6768 -76778 1601 -52062 -133155 -2085 266505 127016 138918 -174090 -150682 -150160 -242600
6757 -242600 -187011 -203105 -216526 -334456 -378959 -80268 143459 56045 -76881 -166595 -112140
6746 -112140 41946 17328 -31877 -182702 -106820 -90244 -110881 -92806 -54857 -225095 -314178
6735 -314178 -165119 -91210 -137740 -156379 -187047 -136623 -157390 105191 32994 -402665 -196480
6724 -196480 -87136 19169 -63422 -51008 -253420 -281541 -386970 -389007 -261568 -340185 -273415
6713 -273415 -185751 -131162 -130262 -111353 28894 -67488 -31817 -246165 -141133 -409956 -260129
6702 -260129 -96378 -237975 -176573 -269390 -233684 -360969 -296531 -249308 -214974 -312572 -370190
6691 -370190 -199801 -126761 -63769 -106879 -43246 44457 -87387 -209391 -306531 -305047 -179972
$$ packed form
6768g6778P8379n3663q1093J31070K68590j39489J1902l13008K3408N22r2440
6757b42600N5589j6094j3421j17930m4503K98691K23727q7414j32926q9714N4455
6746a12140J54086k4618m9205j50825P5882J6576k0637J8075L7949j70238q9083
6735c14178J49059P3909m6530j8639l0668N0424k0767K62581p2197m35659K06185
6724a96480J09344J06305q2591J2414k02412k8121j05429k037J27439p8617O6770
6713b73415Q7664N4589R00J8909J40247r6382L5671k14348J05032k68823J49827
6702b60129J63751j41597O1402r2817L5706j27285O4438M7223L4334r7598n7618
6691c70190J70389P3040O2992m3110O3633Q7703j31844j22004r7140J484J25075
$$ plain form
6680 -179972 -55358 19323 19997 -145704 -206377 -166849 -58967 -63199 -136307 -265057 -92620
6669 -92620 7724 -60968 -31824 -144811 -74132 -28829 -190125 -214773 -421845 -248661 -45130
6658 -45130 -294817 -207123 -212864 -240767 -358394 -239089 -298761 -190824 -197336 -241169 -211113
6647 -211113 -182911 -231312 -124577 -151725 -170065 -271306 -253250 -337475 -420164 -211315 -306780
6636 -306780 -156836 -141569 -217114 -204206 -127527 -274365 -257535 -276017 -413317 -307429 -188890
6625 -188890 -232961 78894 -23489 -271392 -284318 -182195 -288998 -194122 -24587 -149232
6615 -149232 -183187 -99434 -149413 -3569 -55164 -46519 -8440 -24418 -75325 -68704 -104312 -277751
6603 -277751 -320580 -239240 -387833 -225265 -207447 -223702 -119078 -160300 -318283 -160583 -90867
$$ packed form
6680a79972J24614P4681O74j65701o0673L9528J07882m232p3108j28750J72437
6669i2620J00344o8692K9144j12987P0679M5303j61296k4648k07072J73184K03531
6658d5130k49687Q7694n741k7903j17627J19305n9672J07937o512m3833L0056
6647b11113K8202m8401J06735k7148j8340j01241J8056q4225q2689K08849r5465
6636c06780J49944J5267p5545J2908P6679j46838J6830j8482j37300J05888J18539
6625a88890m4071L11855j02383k47903j2926J02123j06803R4876J69535j24645
6615a49232l3955Q3753m9979J45844n1595Q645L8079j5978n0907O621l5608j73439
6603b77751m2829Q1340j48593J62568J7818j6255J04624m1222j57983J57700O9716
$$ plain form
6592 -90867 -183378 -258647 -187442 -115192 -193140 -207115 -106298 -43670 90611 -68913 -244202
6581 -244202 -242692 -292985 -168537 -95218 12524 -138298 -146956 -94869 -44391 -191115 -226591
6570 -226591 -369076 -102780 -21364 82039 104276 33368 -218007 -222880 -2350 180539 130107
6559 130107 -124892 -226456 -157678 -89367 2380 -88582 -178587 -162525 -286215 -472027 -429121
6548 -429121 -334487 -283296 -244592 -333046 -333825 -425134 -388778 -379293 -313048 -78884 -3301 -203017
6536 -203017 -233912 -233554 -69362 -190072 -331783 -195699 -96134 -34197 -320064 -205294 -93982
6525 -93982 -158483 -157080 -41662 -138404 51830 -198748 -169679 -65641 -323237 -171079 -109354
6514 -109354 -50979 -223892 -292739 -66865 -181576 -190721 -87138 -103521 -119229 -186225 -227154
$$ packed form
6592i0867r2511p5269P1205P2250p7948j3975J00817O2628J34281j59524j75289
6581b44202J510n0293J24448P3319J07742j50822q658N2087N0478j46724l5476
6570b26591j42485K66296Q1416J03403K2237p0908k51375m873K20530J82889n0432
6559A30107k54999j01564O8778O8311R1747r0962r0005J6062j23690j85812M2906
6548d29121R4634N1191L8704q8454p79r1309L6356R485O6245K34164P5583j99716
6536b03017l0895L58J64192j20710j41711J36084R9565O1937k85867J14770J11312
6525i3982o4501J403J15418r6742J90234k50578K9069J04038k57596J52158O1725
6514a09354N8375j72913o8847K25874j14711r145J03583j6383j5708o6996m0929
$$ plain form
6503 -227154 -387059 -275945 -101234 -141019 -225769 -229339 -355061 -220724 -252454 -79835 -223881
6492 -223881 -261431 -206822 -207067 -131752 -57068 -81371 -96097 -91193 143054 55104 -100329 201110
6480 201110 126986 -136632 -84454 95080 97329 -127827 -64738 -97525 40548 133059 -59613
6469 -59613 95915 -20271 -85073 -22757 -82263 -199640 -32530 49613 127317 102174 85719
6458 85719 23092 -67018 -206389 -164557 -141052 -67282 14634 -7730 -79682 25994 22117 -139976
6446 -139976 -228078 -41387 -190971 -346520 -109510 -19123 5028 -61187 49093 -151027
6436 -151027 -45233 -196232 -278167 -73999 -129056 -318973 -339369 -197421 -157069 -334257
6426 -334257 -318622 -194757 -205737 160714 149979 -44297 72547 112539 222898 39356
$$ packed form
6503b27154j59905J11114J74711l9785q4750l570j25722J34337l1730J72619j44046
6492b23881l7550N4609k45P5315P4684k4303j4726M904K34247q7950j55433L01439
6480B01110p4124k63618N2178J79534K249k25156O3089l2787J38073R2511j92672
6469e9613J55528j16186o4802O2316n9506j17377J67110Q2143P7704k5143j6455
6458H5719o2627r0110j39371M1832K3505P3770Q1916k2364p1952J05676l877j62093
6446a39976q8102J86691j49584j55549K37010R0387K4151o6215J10280k00120
6436a51027J05794j50999q1935K04168n5057j89917k0396J41948M0352j77188
6426c34257J5635J23865j0980L66451j0735j94276J16844L9992J10359j83542
$$ plain form
6416 39356 -147008 -33478 -24197 -117079 -56234 85452 40256 -186277 -207221 -127061 -93250
6405 -93250 -150814 -201547 -184365 -334568 -418828 -133890 -137072 -225681 -312737 -283334 -57670
6394 -57670 -126626 -339753 -174120 -189365 -226746 -25206 -116529 -107201 -321550 -184848 -42836
6383 -42836 50921 4115 -5939 -86735 117847 -122324 -240058 -386219 -334594 -152272 -71633
6372 -71633 -128843 -318669 -266662 -359063 -227228 -255033 -163750 -130778 -100590 6629 -47400
6361 -47400 -99237 -183003 -92472 -167315 -254206 -132580 -174944 -42478 -160046 -32063 -130281
6350 -130281 -261587 -180495 -163646 -172557 -97850 -26456 -125612 -200770 -61009 9810 102302
6339 102302 -95463 -230725 -47174 -35956 88945 95943 -130445 18992 17545 -82377 22791
$$ packed form
6416C9356j86364J13530R281r2882O0845J41686m5196k26533k0944Q0160L3811
6405i3250n7564n0733J7182j50203q4260K84938l182q8609q7056K9403K25664
6394e7670o8956k13127J65633j5245l7381K01540r1323R328k14349J36702J42012
6383d2836R3757m6806j0054q0796K04582k40171j17734j46161N1625J82322Q0639
6372g1633n7210j89826N2007r2401J31835k7805R1283L2972L0188J07219n4029
6361d7400n1837q3766R0531p4843q6891J21626m2364J32466j17568J27983r8218
6350a30281j31306Q1092J6849q911P4707P1394r9156p5158J39761P0819R2492
6339A02302j97765j35262J83551J1218J24901O998k26388J49437j447r9922J05168
$$ plain form
6328 22791 116599 88831 205463 26304 53131 94020 -126036 -100204 -305764 -191124 -142922
6317 -142922 -85121 -111615 -332488 -193800 1945 -112215 -67968 -107438 -222388 -97404
6307 -97404 -68020 -53105 -92752 -147140 -122282 -252642 -263822 -262695 -166353 -45087 76771
6296 76771 21446 -107637 -1429 48057 -284967 -193270 -337945 -199772 99172 95274 -4754
6285 -4754 -57663 139588 -41166 -51803 -163084 -187817 -161734 26733 1205 -34494 93147
6274 93147 16478 -72533 -173157 -170170 -152036 -116293 -1296 -60921 15832 114518 35883 -28227
6262 -28227 -198597 -84478 29861 48941 121889 53190 220202 147550 141547 161693 83099
6251 83099 16634 135515 593547 663934 504800 580406 499920 426713 335346 -34227 -4495
$$ packed form
6328B2791R3808k7768J16632j79159K6827M0889k20056K5832k05560J14640M8202
6317a42922N7801k6494k20873J38688J95745j14160M4247l9470j14950J24984
6307i7404K9384J4915l9647n4388K4858j30360j1180J127R6342J21266J21858
6296G6771n5325j29083J06208M9486l33024R1697j44675J38173K98944l898j00028
6285d754n2909J97251j80754j0637j11281k4733K6083J88467k5528l5699J27641
6274I3147p6669q9011j00624K987J8134L5743J14997n9625P6753R8686p8635o4110
6262b8227j70370J14119J14339J9080P2948o8699J67012p2652o003K0146p8594
6251H3099o6465J18881M58032P0387j59134P5606q0486p3207r1367l69573K9732
$$ plain form
6240 -4495 289216 168860 318214 220804 185268 52453 19744 65766 117854 127342 -52680
6229 -52680 -31870 -125326 -67580 -26549 98632 -144903 -85429 -50950 62066 177094 176853
6218 176853 182202 484 -196835 -89441 37006 102964 64795 59758 87257 215566 227347
6207 227347 194587 130914 219579 284615 51313 138918 120440 76212 326718 272185 328795
6196 328795 280344 254453 232978 232510 362654 240093 97407 212578 475803 191433 -94109
6185 -94109 40670 121384 252383 241917 248961 219646 506999 458062 355479 510678 438405
6174 438405 460760 494236 584992 523995 642049 656641 706822 662126 760345 769249 954416
6163 954416 791257 617597 607113 814452 970737 1018781 1000480 1211569 1411685 1550139
$$ packed form
6240d495K93711j20356J49354r7410l5536j32815l2709M6022N2088R488j80022
6229e2680K0810r3456N7746M1031J25181k43535N9474L4479J13016J15028k41
6218A76853N349j81718j97319J07394J26447O5958l8169n037K7499J28309J1781
6207B27347l2760o3673Q8665O5036k33302Q7605j8478m4228K50506n4533N6610
6196C28795m8451k5891k1475m68J30144j22561j42686J15171K63225k84370k85542
6185i4109J34779Q0714J30999j0466P044k9315K87353m8937j02583J55199p2273
6174D38405K2355L3476R0756o0997J18054J4592N0181m4696R8219Q904J85167
6163I54416j63159j73660j0484K07339J56285M8044j8301K11089K00116J38454
$$ plain form
6153 1550139 1606527 1710314 2036788 2165267 2447129 2626901 2979863 3380397 4111520 5007550
6143 5007550 6175578 7434489 8209757 8735792 8642673 7997553 7100249 6007678 5041592
6134 5041592 4164908 3283583 2765266 2506889 2336248 1874425 1436993 1454717 1278910 1001563
6124 1001563 1018945 936701 759683 744220 787089 829977 808655 751622 564461 402311 571051
6113 571051 656593 510669 569877 560976 371739 364660 381157 219534 42177 220869 263568
6102 263568 218132 305557 269911 247860 405254 403193 227581 183753 150464 314663 163403
6091 163403 270576 502725 354469 182284 26281 223980 134973 118722 218651 118981
6081 118981 121617 267161 91234 63635 172572 173010 259750 210438 209966 151021 161634 159090
$$ packed form
6153A550139N6388J03787L26474J28479K81862J79772L52962M00534P31123Q96030
6143E007550J168028J258911P75268N26035r3119o45120q97304j092571r66086
6134E041592q76684q81325n18317k58377j70641m61823m37432J7724j75807k77347
6124A001563J7382q2244j77018j5463M2869M2888k1322n7033j87161j62150J68740
6113E71051Q5542j45924N9208q901j89237p079J6497j61623j77357J78692M2699
6102B63568m5436Q7425l5646k2051J57394k061j75612m3828l3289J64199j51260
6091A63403J07173K32149j48256j72185j56003J97699q9007j6251R9929r9670
6081A18981K636J45544j75927k7599J08937M38Q6740m9312m72n8945J0613k544
$$ plain form
6069 159090 103781 130790 80165 -15055 203684 88062 151538 160498 245765 167849 29629
6058 29629 175903 105865 113689 -11055 -50442 57274 113072 64030 338928 322736 118689
6047 118689 228880 116090 304532 264109 1088 28609 113810 131944 19679 75614 -102052
6036 -102052 -127000 161961 183103 95632 91556 173908 -22639 176022 222254 -49482 -23743
6025 -23743 107020 284806 185931 99012 235096 137137 111423 76216 137959 362091 214226
6014 214226 167286 277038 242564 403552 342963 276700 156215 97413 219707 244018 164486
6003 164486 171186 71294 223931 118296 116916 473075 549614 422764 238451 -55933 -53813
5992 -53813 40002 111933 250637 175854 -17799 -82800 -22968 241991 358827 194301 156213
$$ packed form
6069A59090n5309K7009n0625r5220K18739j15622O3476Q960Q5267p7916j38220
6058B9629J46274p0038P824j24744l9387J07716N5798m9042K74898j6192k04047
6047A18689J10191j12790J88442m0423k63021K7521Q5201J8134j12265N5935j77666
6036a02052k4948K88961K1142q7471m076Q2352j96547J98661M6232k71736K5739
6025b3743J30763J77786r8875q6919J36084r7959k5714l5207O1743K24132j47865
6014B14226m6940J09752l4474J60988o0589o6263j20485n8802J22294K4311p9532
6003A64486O700r9892J52637j05635j380L56159P6539j26850j84313k94384K120
5992e3813R3815P1931J38704p4783j93653o5001N9832K64959J16836j64526l8088
$$ plain form
5981 156213 54434 184228 397782 401127 229270 461789 407751 501873 424151 355693 288169
5970 288169 551673 505811 564284 518056 528316 656848 575933 652571 506638 483910 605260
5959 605260 555079 617665 825918 756175 683630 563087 579684 695491 914162 859610 507009
5948 507009 633885 604731 822573 921248 935641 993877 877657 824943 929293 820488 856258
5937 856258 989816 1086955 1153726 1286757 1501204 1628710 1643028 1436668 1343995 1477791
5927 1477791 1700037 1724113 1710900 1816653 1943364 1958776 1912332 1916403 2232660 2446666 2401531
5916 2401531 2432008 2671424 2555694 2695681 2886606 3144685 3253750 3429867 3509793 3737087
5906 3737087 3980074 4217738 4426262 4408708 4509949 4564271 4764701 4959500 5097114 5261512
$$ packed form
5981A56213j01779J29794K13554L345j71857K32519n4038R4122p7722o8458o7524
5970B88169K63504m5862N8473m6228J0260J28532q0915P6638j45933k2728J21350
5959F05260n0181O2586K08253o9743p2545j20543J6597J15807K18671n4552l52601
5948E07009J26876k9154K17842R8675J4393N8236j16220n2714J04350j08805L5770
5937H56258J33558R7139O6771J33031K14447J27506J4318k06360r2673J33796
5927A477791K22246K4076j3213J05753J26711J5412m6444M071L16257K14006m5135
5916B401531L0477K39416j15730J39987J90925K58079J09065J76117P9926K27294
5906C737087K42987K37664K08524j7554J01241N4322K00430J94799J37614J64398
$$ plain form
5896 5261512 5328128 5325122 5314937 5530238 5516212 5495086 5907191 6062097 6124145 5943322 5965128
5885 5965128 6189243 6201085 6219028 6300642 6312139 6096512 6337202 6627253 6707368 6677367 6745505
5874 6745505 7072627 7295822 7395670 7508538 7739093 8109746 8195055 8333876 8442659 8432362
5864 8432362 8575617 8824197 9081491 9183058 9265017 9429643 9435775 9302887 9576920 9788915
5854 9788915 9670657 9563375 9551703 9330920 9295922 9004766 8886533 8892035 8700704 8471860
5844 8471860 8316918 8178528 7981252 7778111 7566881 7483314 7453988 7562723 7527601 7269876
5834 7269876 6882292 6866944 6715618 6820061 6684904 6638273 6497199 6464208 6270794 6049539
5824 6049539 6057960 6134358 6190070 5842158 5899623 6080541 6031760 5833982 5752895 5554313 5482753
$$ packed form
5896E261512O6616l006j0185K15301j4026k1126M12105J54906O2048j80823K1806
5885E965128K24115J1842J7943Q1614J1497k15627K40690K90051Q0115l0001O8138
5874F745505L27122K23195R9848J12868K30555L70653Q5309J38821J08783j0297
5864H432362J43255K48580K57294J01567Q1959J64626O132j32888K74033K11995
5854I788915j18258j07282j1672k20783l4998k91156j18233N502j91331k28844
5844H471860j54942j38390j97276k03141k11230q3567k9326J08735l5122k57725
5834G269876l87584j5348j51326J04443j35157m6631j41074l2991j93414k21255
5824F049539Q421P6398N5712l47912N7465J80918m8781j97778q1087j98582p1560
$$ plain form
5813 5482753 5403499 5392082 5352569 5072030 4907020 4662949 4442477 4284733 4423020 4196443
5803 4196443 3868087 3802581 3533416 3521973 3472792 3228530 3085335 3047613 2936163 2589899
5793 2589899 2389026 2237401 2220093 2172351 2031451 1812414 1645015 1797650 1657043 1413783
5783 1413783 1312890 1269764 1411715 1460035 1204996 1239618 941847 920898 954314 1071559
5773 1071559 983510 1020450 1155887 874409 782810 706335 751839 741102 669057 649686 514773
5762 514773 602606 671055 664671 649931 599782 655087 800020 624657 517429 389226 503223
5751 503223 489121 73961 101064 373866 595386 607252 483883 598638 618326 365328
5741 365328 59678 360195 508266 316682 197107 85385 161042 264300 335208 277595
$$ packed form
5813E482753p9254j1417l9513k80539j65010k44071k20472j57744J38287k26577
5803D196443l28356o5506k69165j1443m9181k44262j43195l7722j11450l46264
5793B589899k00873j51625j7308m7742j40900k19037j67399J52635j40607k43260
5783A413783j00893m3126J41951M8320k55039L4622k97771k0949L3416J17245
5773A071559q8049L6940J35437k81478r1599p6475M5504j0737p2045j9371j34913
5762E14773Q7833O8449o384j4740n0149N5305J44933j75363j07228j28203J13997
5751E03223j4102m15160K7103K72802K21520J1866j23369J14755J9688k52998
5741C65328l05650L00517J48071j91584j19575j11722P5657J03258P0908n7613
$$ plain form
5731 277595 336499 330788 164659 16207 201071 285037 421723 294007 284425 308207 117354
5720 117354 75905 97588 46715 129651 90894 -80417 156051 232941 240505 66197 -49275
5709 -49275 120851 164210 103866 -116937 -169337 51703 54228 143913 181275 170049 180469
5698 180469 297922 289688 80150 129232 14567 89253 -55203 -63073 145987 263531 149406
5687 149406 20674 29700 -106367 75212 180345 153128 142106 -27090 126077 249987
5677 249987 111086 133884 250841 216046 99319 121794 132544 3352 -92757 -132534 16880
5666 16880 -60419 158110 83819 34274 -35885 -34845 8465 84140 280624 114352 -182
5655 -182 170623 361858 201332 210977 176375 187630 67467 18753 88509 -105294 -229843
$$ packed form
5731B77595N8904n711j66129j48452J84864Q3966J36686j27716r582K3782j90853
5720A17354m1449K1683n0873Q2936l8757j71311K36468P6890P564j74308j15472
5709d9275J70126M3359o0344k20803n2400K21040K525Q9685L7362j1226J0420
5698A80469J17453q234k09538M9082j14665P4686j44456p870K09060J17544j14125
5687A49406j28732R026j36067J81579J05133k7217j1022j69196J53167J23910
5677B49987j38901K2798J16957l4795j16727K2475J0750j29192r6109l9777J49414
5666A6880p7299K18529p4291m9545p0159J040M3310P5675J96484j66272j14534
5655a82J70805J91235j60526R645l4602J1255j20163m8714O9756j93803j24549
$$ plain form
5644 -229843 -87613 -131441 -133744 -94175 -157802 -120136 -129745 16321 -46060 30332 22268 26691
5632 26691 181293 93730 -19514 -143480 -155160 -158263 -214961 -34495 -116155 -159925 -130089
5621 -130089 -256930 -213637 -159410 -55635 -188801 -285175 -128445 49205 -33990 -129021 -48494
5610 -48494 238567 226821 108470 -114718 -78252 -120903 97388 164939 -52482 -122089 -71195
5599 -71195 -35336 -171892 -115506 -126877 -49864 -42071 -7612 148883 142449 211687 188629 15111
5587 15111 160581 187997 114497 56100 -10408 -194157 -109501 5579 -75875 -233386 -242386
5576 -242386 -26197 125636 173348 63903 -46110 -71009 -118180 -59241 -130038 -31468 43398
5565 43398 -25666 -77252 -189041 59212 46980 -25227 66901 -43851 58875 18538 -28477
$$ packed form
5644b29843J42230m3828k303L9569o3627L7666r609J46066o2381P6392q064M423
5632B6691J54602q7563j13244j23966j1680l103n6698J80466q1660m3770K9836
5621a30089j26841M3293N4227J03775j33166r6374J56730J77650q3195r5031Q0527
5610d8494K87061j1746j18351k23188L6466m2651K18291O7551k17421o9607N0894
5599g1195L5859j36556N6386j1371P7013P793L4459J56495o434O9238k3058j73518
5587A5111J45470K7416p3500n8397o6508j83749Q4656J15080q1454j57511r000
5576b42386K16189J51833M7712j09445j10013k4899m7171N8939p0797R8570P4866
5565D3398o9064n1586j11789K48253j2232p2207R2128j10752J02726m0337m7015
$$ plain form
5554 -28477 -225006 -261534 -124645 52580 258339 166561 79385 -47188 116317 189979 207157
5543 207157 127668 2200 -40245 -79146 -216379 -103819 -112366 -294963 -338278 -119957 77485
5532 77485 -82362 -267604 -158009 -206382 -7053 -29338 47689 1964 -125031 -266922 -56236
5521 -56236 28187 26845 -12073 106344 109281 -98832 -82021 -241907 30970 45405 -110677
5510 -110677 -109946 -111921 -170667 8559 96893 83007 236302 273664 41354 -203392 -183062
5499 -183062 137443 61466 -81426 -32028 -132037 -126317 89687 265341 106701 -37461
5489 -37461 44919 34754 245212 248863 158246 116763 121508 122678 -29126 -91249 11112 8799
5477 8799 15748 -64594 45250 62873 -86276 4348 109034 106650 109756 -185900 -174053 -141504
$$ packed form
5554b8477j96529l6528J36889J77225K05759r1778q7176j26573J63505P3662J7178
5543B07157p9489j25468m2445l8901j37233J12560q547j82597m3315K18321J97442
5532G7485j59847j85242J09595m8373J99329k2285P7027m5725j26995j41891K10686
5521e6236Q4423j342l8918J18417K937k08113J6811j59886K72877J4435j56082
5510a10677P31j975n8746J79226Q8334j3886J53295L7362k32310k44746K0330
5499a83062L20505p5977j42892M9398j00009N720K16004J75654j58640j44162
5489c7461Q2380j0165K10458L651r0617m1483M745J170j51804o2123J02361k313
5477H799O949q0342J09844J7623j49149R0624J04686k384L106k95656J1847L2549
$$ plain form
5465 -141504 -91449 -28272 -62670 85079 154537 43932 79729 20046 11863 -75580 -32692
5454 -32692 -148544 -221424 -207614 -213362 -191053 -111785 -125454 -107717 -122026 -121982 -1821 -41495
5442 -41495 -56358 -176292 -105316 -91756 -11383 -75550 -7060 209556 70269 41453 119324
5431 119324 -43088 -206597 86459 71768 -119819 -16809 -129021 -97356 -14837 8214
5421 8214 165942 57052 207852 152105 -153823 10801 -37172 22231 4392 -173111 -85283
$$ packed form
5465a41504N0055O3177l4398J47749O9458j10605L5797n9683q183q7443M2888
5454c2692j15852p2880J3810n748K2309P9268j3669J7737j4309M4J20161l9674
5442d1495j4863j19934P0976J3560Q0373o4167O8490K16616j39287k8816P7871
5431A19324j62412j63509K93056j4691j91587J03010j12212L1665Q2519K3051
5421H214J57728j08890J50800n5747l05928J64624m7973N9403j7839j77503Q7828
$$ [...]
##END NTUPLES=NMR SPECTRUM
##END=
