##TITLE=1H_TG-2307-1
 CDCl3, 16 sc, 
 17.11.2020
##JCAMPDX= 6.0         $$ Bruker NMR JCAMP-DX V2.0
##DATA TYPE= NMR FID
##DATA CLASS= NTUPLES
##ORIGIN= UXNMR, Bruker Analytische Messtechnik GmbH
##OWNER= root
$$ XWIN-NMR		Version 3.5
$$ Tue Nov 17 09:52:11 2020 Russian Standard Time (UT+4h)  she@DPX200
##.OBSERVE FREQUENCY= 200.1315066352
##.OBSERVE NUCLEUS= ^1H
##.DELAY= (6, 6)
##.ACQUISITION MODE= SIMULTANEOUS
##.ACQUISITION SCHEME= undefined
##.AVERAGES= 8
##.DIGITISER RES= 18
##SPECTROMETER/DATA SYSTEM= spect
##.PULSE SEQUENCE= zg30
##.SOLVENT NAME= CDCl3
##.SHIFT REFERENCE= (INTERNAL, CDCl3, 0, 15.7039)
##AUDIT TRAIL= $$ (NUMBER, WHEN, WHO, WHERE, WHAT)
$$ ##TITLE= Audit trail, XWIN-NMR		Version 3.5
$$ ##JCAMPDX= 5.01
$$ ##ORIGIN= Bruker BioSpin GmbH
$$ ##OWNER= she
$$ F:/spectra/data/she/nmr/H-F/1/audita.txt
$$ ##AUDIT TRAIL=  $$ (NUMBER, WHEN, WHO, WHERE, WHAT)
(   1,<2020-11-17 09:51:08.04 +0400>,<she>,<DPX200>,
      <created by zg, POWCHK disabled, PULCHK disabled
       configuration hash MD5:
       00 E9 B6 7A A2 85 ED C7 34 08 36 98 17 FE 4E 26
       data hash MD5: 16K
       D4 11 05 7B A4 6C D6 12 73 FA 32 C9 DF 6F F7 1C>)
$$ ##END=
$$ 
$$ hash MD5
$$ 9A 96 DB 13 D4 54 D7 20 33 0C 9F 76 C6 77 87 0B
##$RELAX= 
##$RELAX= 
##$RELAX= 
##$RELAX= 
##$RELAX= 
##$RELAX= 
$$ Bruker specific parameters
$$ --------------------------
##$DU= <F:/spectra>
##$EXPNO= 1
##$NAME= <H-F>
##$PROCNO= 1
##$TYPE= <nmr>
##$USER= <she>
##$AMP= (0..31)
100 100 100 100 100 100 100 100 100 100 100 100 100 100 100 100 100 100 
100 100 100 100 100 100 100 100 100 100 100 100 100 100 
##$AQSEQ= 0
##$AQ_mod= 1
##$AUNM= <au_zg>
##$AUTOPOS= <>
##$BF1= 200.13
##$BF2= 200.13
##$BF3= 200.13
##$BF4= 200.13
##$BF5= 200.13
##$BF6= 200.13
##$BF7= 200.13
##$BF8= 200.13
##$BYTORDA= 1
##$CFDGTYP= 0
##$CFRGTYP= 5
##$CHEMSTR= <none>
##$CNST= (0..31)
1 1 145 1 1 1 1 1 1 1 1 1 1 1 1 1 1 1 1 1 1 1 1 1 1 1 1 1 1 1 1 1 
##$CPDPRG= <>
##$CPDPRG1= <>
##$CPDPRG2= <>
##$CPDPRG3= <>
##$CPDPRG4= <mlev>
##$CPDPRG5= <mlev>
##$CPDPRG6= <mlev>
##$CPDPRG7= <mlev>
##$CPDPRG8= <mlev>
##$CPDPRGB= <>
##$CPDPRGT= <>
##$D= (0..31)
0 1.2 0 0 0 0 0 0 0 0.06 0 0.03 0 0 0 0 0.0002 0 0 0 0 0 0 0 0 0 0 0 0 
0 0 0 
##$DATE= 1605592267
##$DBL= (0..7)
120 120 120 120 120 120 120 120 
##$DBP= (0..7)
150 150 150 150 150 150 150 150 
##$DBP07= 0
##$DBPNAM0= <>
##$DBPNAM1= <>
##$DBPNAM2= <>
##$DBPNAM3= <>
##$DBPNAM4= <>
##$DBPNAM5= <>
##$DBPNAM6= <>
##$DBPNAM7= <>
##$DBPOAL= (0..7)
0.5 0.5 0.5 0.5 0.5 0.5 0.5 0.5 
##$DBPOFFS= (0..7)
0 0 0 0 0 0 0 0 
##$DE= 6
##$DECBNUC= <off>
##$DECIM= 32
##$DECNUC= <off>
##$DECSTAT= 4
##$DIGMOD= 1
##$DIGTYP= 9
##$DL= (0..7)
0 120 120 120 120 120 120 120 
##$DP= (0..7)
150 150 150 150 150 150 150 150 
##$DP07= 0
##$DPNAME0= <>
##$DPNAME1= <>
##$DPNAME2= <>
##$DPNAME3= <>
##$DPNAME4= <>
##$DPNAME5= <>
##$DPNAME6= <>
##$DPNAME7= <>
##$DPOAL= (0..7)
0.5 0.5 0.5 0.5 0.5 0.5 0.5 0.5 
##$DPOFFS= (0..7)
0 0 0 0 0 0 0 0 
##$DQDMODE= 0
##$DR= 18
##$DS= 0
##$DSLIST= <SSSSSSSSSSSSSSS>
$$ [...]
##$SUBNAM2= <"">
##$SUBNAM3= <"">
##$SUBNAM4= <"">
##$SUBNAM5= <"">
##$SUBNAM6= <"">
##$SUBNAM7= <"">
##$SUBNAM8= <"">
##$SUBNAM9= <"">
##$SW= 16.9725356469052
##$SWIBOX= (0..15)
0 0 2 0 0 0 0 0 0 0 0 0 0 0 0 0 
##$SW_h= 3396.73913043478
##$TD= 16384
##$TD0= 1
##$TE= 0
##$TE2= 300
##$TE3= 300
##$TEG= 300
##$TL= (0..7)
0 120 120 120 120 120 120 120 
##$TP= (0..7)
150 150 150 150 150 150 150 150 
##$TP07= 0
##$TPNAME0= <>
##$TPNAME1= <>
##$TPNAME2= <>
##$TPNAME3= <>
##$TPNAME4= <>
##$TPNAME5= <>
##$TPNAME6= <>
##$TPNAME7= <>
##$TPOAL= (0..7)
0.5 0.5 0.5 0.5 0.5 0.5 0.5 0.5 
##$TPOFFS= (0..7)
0 0 0 0 0 0 0 0 
##$TUNHIN= 0
##$TUNHOUT= 0
##$TUNXOUT= 0
##$USERA1= <user>
##$USERA2= <user>
##$USERA3= <user>
##$USERA4= <user>
##$USERA5= <user>
##$V9= 5
##$VALIST= <valist>
##$VCLIST= <CCCCCCCCCCCCCCC>
##$VD= 0
##$VDLIST= <DDDDDDDDDDDDDDD>
##$VPLIST= <PPPPPPPPPPPPPPP>
##$VTLIST= <TTTTTTTTTTTTTTT>
##$WBST= 1024
##$WBSW= 4
##$XGAIN= (0..3)
0 0 0 0 
##$XL= 0
##$YL= 0
##$YMAX_a= 484321
##$YMIN_a= -357124
##$ZGOPTNS= <>
##$ZL1= 120
##$ZL2= 120
##$ZL3= 120
##$ZL4= 120
##$ABSF1= 10
##$ABSF2= 0
##$ABSG= 5
##$ABSL= 3
##$ALPHA= 0
##$AQORDER= 0
##$ASSFAC= 0
##$ASSFACI= 0
##$ASSFACX= 0
##$ASSWID= 0
##$AUNMP= <proc_1d>
##$AZFE= 0.1
##$AZFW= 0.1
##$BCFW= 1
##$BC_mod= 2
##$BYTORDP= 1
##$COROFFS= 0
##$CY= 11.3945322036743
##$DATMOD= 1
##$DC= 2
##$DFILT= <>
##$DTYPP= 0
##$F1P= 15.9154993809931
##$F2P= -4.1035820241983
##$FCOR= 0.5
##$FTSIZE= 0
##$FT_mod= 4
##$GAMMA= 1
##$GB= 0.15
##$INTBC= 1
##$INTSCL= 1
##$ISEN= 128
##$LB= 0.24
##$LEV0= 0
##$LPBIN= 0
##$MAXI= 10000
##$MC2= 0
##$MEAN= 0
##$ME_mod= 0
##$MI= 1.114404
##$NCOEF= 0
##$NC_proc= 0
##$NLEV= 6
##$NOISF1= 3.799351
##$NOISF2= 2.8
##$NSP= 1
##$NTH_PI= 0
##$NZP= 0
##$OFFSET= 15.70392
##$PC= 1
##$PHC0= -11047.33
##$PHC1= 10.60089
##$PH_mod= 1
##$PKNL= yes
##$PPARMOD= 0
##$PSCAL= 0
##$PSIGN= 0
##$REVERSE= no
##$SF= 200.130013532006
##$SI= 16384
##$SIGF1= 3
##$SIGF2= 2
##$SINO= 400
##$SIOLD= 16384
##$SREGLST= <1H.CDCl3>
##$SSB= 0
##$STSI= 0
##$STSR= 0
##$SW_p= 3612.71676300578
##$SYMM= 0
##$S_DEV= 0
##$TDeff= 0
##$TDoff= 0
##$TI= <>
##$TILT= no
##$TM1= 0
##$TM2= 0
##$TOPLEV= 0
##$USERP1= <user>
##$USERP2= <user>
##$USERP3= <user>
##$USERP4= <user>
##$USERP5= <user>
##$WDW= 1
##$XDIM= 8192
##$YMAX_p= 0
##$YMIN_p= 0
$$ End of Bruker specific parameters
$$ ---------------------------------
##NTUPLES= NMR FID
##VAR_NAME=  TIME,          FID/REAL,        FID/IMAG
##SYMBOL=    X,             R,               I
##VAR_TYPE=  INDEPENDENT,   DEPENDENT,       DEPENDENT
##VAR_FORM=  AFFN,          ASDF,            ASDF
##VAR_DIM=   8192,          8192,            8192
##UNITS=     SECONDS,       ARBITRARY UNITS, ARBITRARY UNITS
##FACTOR=    0.0002944,     1,               1
##FIRST=     0,             0,               0
##LAST=      2.4114304,     0,               0
##MIN=       0,             -357124,         0
##MAX=       2.4114304,     484321,          0
$$ Real data points
##PAGE= N=1
##DATA TABLE= (X++(R..R)), XYDATA
$$ [...]
2438A044L72o61K208m057L564j535m86J723j231J011j825K219k379J95J012k63
2454I11p99Q55L23j868J737j485P03j604J591m07j911L278l913K097n21j85J14
2471a084n01J510j601J351l12l87j947L103j866k21K285k562J981j948K411j910
2487a698N90K258k968J998q26N96r80J888o16m05J207J9n56p74L008l415K202
2504A528q4m96J098j196K027k897K453l12q72R82k25n12k7J295k147J494j052
2521A057J631j874L82J722m066L453k141M15j12L56Jj671K144j936j13J6R72j949
2539a713J323r4j341J420j640J416k781L258j643j279K442k154J349j363J565
2554a235j519N75J121j322P7O48N78k526L335k195J027M72n79J293k267L381k543
$$ y = [1044, 1416, 755, 2963, -1094, 2470, 935, 449, 2172, 941, 1952, 127, 2346, -33, 162, 1174, 911, 112, 967, 1290, -578, 1159, -326, 377, -1227, 364, -43, -1954, 1324, -2589, -492, -1013, -1198, -1084, -1585, -75, -1676, -325, -637, -1024, -2971, 132, -1734, -1955, 330, -2232, -251, -2199, 212, -1698, -1108, 1150, -1818, 180, -646, -50, -1030, 858, 242, -163, 1044, 1063, 507, -267, 2741, -674, 1528, 1444, 948, 2046, 850, 2877, -20, 2433, 2121, 1249, 2231, 2006, 1494, 1467, 2762, 615, 2109, 1057, 2688, 814, 1196, 2918, -1148, 2305, 164, 579, 467, 823, 824, -847, 1297, -639, -752, -736, 236, -1713, -390, -484, -1825, -405, -2045, -629, -3410, -152, -1795, -3074, -632, -2786, -1437, -2800, -1235, -2754, -2179, -1058, -2380, -2303, -1655, -1077, -3603, -268, -2463, -1436, -964, -1543, -250, -2517, 864, -1679]
2571a679J273R59j102M00P54M35j584J753p28N25m53J758j283o66K738k996K057
2588B161p87J109q57K0J706k716J944r19l0j94J286j651J96R36j285N86j430K851
2606B926l558J815P6k198K236j651J144k095J445j30j232R82n89o60l6J551k714
2623b688K063q62O8l78j78J551l002L249j617l57R36k28K49j105J874j758R91
2640a192M43N34j467J319N65j938K604j893J525q32J381n10j125K773k351J456
2656A292k32M50p66R24K96j019O55l49Q09j838K648j791j39J762k382J469j243
2673E46J756j729N06J076k000Q04k37J04j224K081j979L77l35K28k02j237K573
2690A108l371J922k86q66L54j65M10j946J910p68k95J65J027j268k81J638j992
$$ y = [-1679, -406, 553, -549, -149, 605, 1040, -544, 1209, 481, 1006, 553, 2311, 1028, 362, 3100, 104, 2161, 1374, 2483, 1626, 1646, 3352, 636, 2580, 1661, 1631, 1437, 2723, 1072, 1268, 2204, 919, 1505, 75, 2926, -632, 1183, 1259, -939, 1297, -354, 790, -1305, 140, 10, -1222, -240, -829, -1489, -1525, 26, -2688, -625, -1487, -1419, -1797, -1975, -424, -3426, -177, -1794, -2151, -1215, -1443, -1194, -2299, -425, -2183, -1192, -749, -215, -1682, -363, 202, -1736, 868, -1025, 500, -332, 1049, 539, -586, 2187, -164, 1292, 1060, 1510, 744, 1668, 1964, 945, 1600, 1251, 2060, 222, 2870, 1079, 940, 2702, 320, 1789, 546, 2302, 573, 1079, 2155, 155, 959, 722, 826, -398, 1683, -296, 81, -254, -26, -228, -1465, 1108, -2263, -341, -627, -1493, -1139, -1304, -894, -2840, -930, -1698, -1993, -1828, -801, -2069, -2350, -712, -2704]
2707b704J534q36J439j638J006Q93k578K637j093L93r6R46m74n69J508j024N70
2724h6j16J504k026J812p7j005J637j279J820k136K565j238n88J526j112L95k31
2741A365R78j405J431k10k61o16N92L57k143L032k379N65K26n36K30j289K168
2758B105k211P52K62l78m91P6J30j449J488j109P99j660J594j011q96K252k904
2775b651J894p89O98j373O40N10j587J466l02J92j032K027j664N9R35p67J211
2792e33j546K394k112J357K21j271J602p52J148j291J722r20j4O68p3j98k92J848
2810A958k488K316r35J40k94RJ516k553K609j400N3M09k22l01m56J424j776J316
2828A325q97R70j902J527k57j687K448k010J241r92Q49j033p14K061j746L44k51
$$ y = [-2704, -1170, -2006, -567, -2205, -1199, -306, -2884, -247, -1340, -947, -1043, -97, -571, -1140, 368, -656, -86, -202, 1302, -724, 1088, 1011, 6, 1643, 364, 2184, 48, 2613, 1375, 787, 2313, 1201, 1596, 1365, 2343, 938, 2369, 2159, 1898, 1282, 1874, 2231, 88, 3120, 741, 1306, 1532, 996, 1226, -63, 2105, -106, 646, 908, 530, 39, 115, 245, -1204, 284, -825, -26, -1686, -92, -1103, -1999, 253, -2651, -757, -1546, -848, -2221, -1581, -1071, -2658, -1192, -1494, -1302, -2334, -307, -1971, -1912, -977, -1744, -533, -2079, 315, -1797, -440, -219, -1490, 112, -640, 508, -783, 939, 19, 5, 673, 600, 402, 110, 1958, -530, 1786, 851, 991, 697, 706, 2222, -331, 2278, 878, 931, 1340, 1118, 817, 361, 1785, 9, 1325, 428, 1398, -504, 1023, 766, -921, 1527, -483, 758, -234, 615, -418, -1132, 929, -817, -473, -724]
2845g24Q89j812J536r78l65O62m34J074k105K674k173M09R42j203J022j091J899
2862B22k017J016M80j001M37M06j57r24K261j819Q44l34N56j53o41K286k501K029
2880I90m66l20J99J73P88j670K116j348P39p91R53j097M48J179j693J807j306
2897G01J154j647J170K10j593J978j225K23o01J145j215k0O67q55M16m09J136
2914A235k462J972r48p57J399j464J462j978J726j152l53R85o21n6J7P71k042
2931b266J808j106N22l21K78M88j625K547j766M04m3M21lm08J407j468J334o89
2949d86N97p83J129r0p82J797j537R27j108J938j357L09J424j892J454n91O93
2966A642r53O38M1l46M71l04L03j180J911k068Q17L49o66P96j403J895k471J315
$$ y = [-724, 165, -1647, -111, -1089, -1454, -792, -1226, -152, -2257, 417, -1756, -1347, -405, -1608, -586, -1677, 222, -1795, -779, -299, -1300, -863, -457, -614, -1538, 723, -1096, -252, -586, -30, -183, -824, 1462, -1039, 990, 524, 204, 403, 576, 1364, -306, 1810, 462, 1201, 410, 1363, 266, 714, 1893, 200, 2007, 701, 1855, 208, 1378, 1588, -5, 1973, 748, 971, 370, 1515, 300, 280, 947, 92, 508, 99, 1235, -1227, 745, -203, -960, 439, -1025, 437, -1541, 185, -967, -1320, -335, -956, -1012, -995, -224, -2266, -458, -1564, -1042, -1363, -1085, -597, -2222, 325, -1441, -1037, -1080, -659, -662, -1070, 337, -1131, 203, -486, 111, -672, 457, 367, -415, 1382, -155, 772, -336, 1602, 245, 554, 1978, 86, 1540, 949, 1642, 689, 1327, 1368, 1022, 1493, 1189, 1492, 312, 2223, 155, 972, 1321, 655, 1451, 48, 1943, -528, 787]
2984G87r7r91P01j73K08j663J841j625P82n07N71n01j78J282k567K190j555Q21
3002f74o45L81N87j433J772j694N42k3M29r16O19P20j614J417j241J511j513J632
3020a43m09j119K251j530R68r87J623j199M65P06r66O96k05P09j516J834o09k16
3038C53P67l63P20j737K340k029J072M09m71L23n38J461j951J101o27J77l34Q26
3056A499o06r54J883k293J332p66N92n63n85J677k379J679q46J89m61N85m46o39
3074a102J250j547R78j353J734j402N35M62j602J490j313J273j231J026p0r19
3090a791J163p77N16o93J518j524J125K9l09K93m54J727k355K155p52q9Q71o98
3108d5R07j303J924j518Q26j26M87m56J44Q39j698K046j388J087j118O29L73j575
$$ y = [787, 690, -301, 400, 227, 435, -1228, 613, -1012, -230, -737, -166, -667, -845, 437, -2130, 60, -1495, -674, -1319, -938, -351, -1784, -12, -1706, -1164, -1187, -758, -1674, -1055, -335, -1949, -532, -1773, -262, -1775, -143, -552, -1671, 580, -950, 18, -969, 654, -545, -80, 626, -340, 356, 151, 860, -656, 1178, 569, 353, 1120, 757, 1477, -260, 2080, 51, 1123, 1532, 1061, 1384, 846, 2307, 356, 1457, 830, 1007, 673, 1499, 893, -61, 1822, -471, 861, 95, 687, 124, -461, 1216, -1163, 516, -330, -141, -602, -17, -463, -1102, 148, -1399, -421, -1774, -40, -1442, -907, -445, -2047, -557, -1870, -597, -1828, -802, -872, -1791, -628, -1405, -889, -1582, -64, -1588, -463, -434, -743, -450, -904, 823, -1532, 623, -129, -218, 653, -45, 862, -441, 1483, -35, 791, 665, 1152, 696, 840, 1679, -19, 2027, 639, 1726, 608, 1237, 1610, 35]
3126C5K065k037J409p47N71n46n02J005j408O81n15P57j415J519j041l96J025
3143D60j446J001j382J749j341QO81r94Q66o46M99j113J446r15k89L24p7N59j294
3162a904J799j895J541l57k61O49p24J472k029J736l91J63J32j8J96p19J764j428
3180b74J308p30N80p12L98R96j818K133j191Q08n37L81J57r51J345r43O05o32
3198I23R60r23M09K25j077J210j400J466j834J485o62m88O49j112Q32j028J194
3215H29j357O82k47l03J20p53J000j715K034j602J90N5RL03j334J719j655Q82
3233a143j20k1j00j23O49j113J419r08P88p00O72J4r22J741j811J714r47P98m35
3252e48N2J134j762J705p04J003r36Q18m42j84J079p54P30n80J163j409R78J35
$$ y = [35, 2100, 63, 1472, 725, 1296, 750, 248, 1253, -155, 526, 11, 768, -647, 872, -169, -565, 460, -986, 15, -1367, 382, -959, -951, -270, -1264, -398, -1044, -545, -1658, -212, -1127, -1416, -1092, -1169, -610, -1904, -105, -2000, -459, -816, -1077, -428, -1152, 320, -1709, 27, -364, -201, -69, -87, 109, -610, 1154, -274, 1034, 304, 884, 172, 570, 1566, -252, 1881, 690, 1498, 961, 1342, 1499, 548, 1893, 950, 1555, 923, 1883, 960, 1369, 1594, 517, 1727, 327, 1793, -41, 1444, 782, 294, 943, -169, 663, -365, 829, -528, 154, -93, -396, -276, -1029, -29, -1744, 290, -1312, -1122, -1067, -1058, -755, -2089, -370, -2025, -1143, -1263, -1284, -1384, -1507, -858, -1971, -552, -1460, -672, -1372, -700, -686, -1608, 133, -1678, 36, -911, -113, -548, -496, 638, -1124, 581, -123, 880, -56, 762, 320, 136, 1215, 461, 1191, 611, 1774, 365, 1343, 1478]
3270A478q23J196j114J039j446J449o31l79Q17p20J25n70J259j794J257l88k92
3287D63J66m98R29j984J943j318O6J92k60J13n92J109j615R89m36L55r99L11O86
3306c80j271J308j131Q52p06L58L5j009J877j702J219o16P50p95N23L31p75Q49
3324b83p43J190j460J978j282j1J235j117Q04p54J666j624Q71L17n54O07n86R56
3342A210j423J832j058L42j84P2K37o92J330j688J276p47J32j11J24L62j544J777
3360A247j116N94m66L24m00o04J299j595J008j158R94p66J41M38j166J189r80
3377a017P12p82Q82o14l12P37r12P62q70J322j377R50j62o76J138j026J399j749
3395a595J764q69j30P22o68O98m24J305j465J078q0L1j14n8R27j346J386j023
$$ y = [1478, 655, 1851, 737, 1776, 330, 1779, 1148, 769, 1586, 866, 991, 421, 1680, -114, 1143, 755, 463, 629, 131, 1060, -924, 1019, -299, -233, -41, -301, -188, -780, 329, -1286, -297, -733, -378, -1377, -1066, -380, -1651, -343, -1474, -622, -1328, -970, -935, -1944, -67, -1769, -550, -1166, -416, -1211, -688, -357, -1132, -283, -1026, 164, -1296, 682, -600, -611, 624, -493, 311, -443, 1223, -401, 470, 787, 233, 840, 254, 1210, -213, 1619, 561, 903, 719, 791, 1028, 336, 1666, -22, 1254, 507, 639, 528, 652, 1014, -530, 1247, 131, 725, 259, 583, 183, -421, 878, -717, 291, -867, 127, -639, -498, -60, -1226, -37, -1017, -305, -1087, -205, -819, -1131, -394, -1306, -544, -1414, -92, -1469, -519, -681, -1357, -219, -1245, 154, -1595, 169, -700, -830, -108, -776, -78, -502, 803, -662, 416, 336, 367, 253, 195, 1122, -224, 1162, 139]
3413A39P83K25l46K00r22J550j139R75o20L58l59J61M53j148J349j189P52j146
3431G6J203l38n43J121j601J301j137Q67r72L06L21j214J088q03L71r13J138j161
3449h90M84M36j004O69j120J518j621Q11k47j91L85l64N41q64J310j231K44J05
3467a029L82Q0q08J372j448J430p32J25K72k71Q07j431J692j104Q71m43K15M16
3485C96m75J097j318R68l17N89q09N16N19r12J309j296J199j060P43m28k46R82
3503A457j078N96m75R30j514J212n44l90O84p61O89j185J528j101j41L88m43K58
3521A10p31R73j262J131n84k03j88k0M56p95J204j502Q61m85L65j8n78J388j728
3540a606J095p50O75k75J00J54l89Q78q43Q60r43J239q91J72R55j075J042r58
$$ y = [139, 922, 1147, 801, 1001, 79, 1629, 490, 1465, 845, 1203, 844, 1005, 1458, 310, 1659, 470, 1222, 76, 1279, 941, 398, 1519, -82, 1219, 82, 949, -23, 283, 604, -610, 478, -325, 46, -867, 271, -890, -406, 30, -974, -305, -1425, 93, -1528, -717, -964, -1155, -770, -1134, -593, -1457, -147, -1378, -1134, -1029, -647, -567, -1375, -3, -1451, -21, -753, -628, -356, -627, 180, -1251, 441, -663, 208, -235, -20, 396, -79, 1018, -300, 668, 351, 940, 131, 647, 1166, 254, 1563, 267, 1466, 406, 1149, 721, 475, 1457, 379, 975, 500, 1430, -84, 1128, 584, 194, 878, 117, 806, -379, 1149, 48, -93, 295, -148, 110, -621, 352, -910, 221, -363, -566, -754, -774, -318, -1113, 91, -1411, -550, -1035, -670, -688, -1266, 122, -1606, -511, -1261, -586, -861, -761, -607, -996, -118, -961, -101, -1044, 195, -696, -524, 431, -644, 398, -560]
3558e60J001m98N14M9p51J159r02R61r36Q19o41M80L40r34P98m79R99j577J257
3577A099n99J62M10p31P62j169J261o57L9j5K9j39l91P09r87O80q16N65o14L24
3597g8K99j053J451j513O40k90K6J9k50O00j095P99l67M59n55M30r0m48J087j340
3617a269J303j060J019p45o3R27j260J209q17R70q50P37j2m28Q35o66O88o41J210
3636A087r95M20L32m80M99o18J101j090R51m74q0J21j0L50m97R93j029O44n98
3655F27K62k73k28R82j624J379o62K98l42N0J36j277J323j010N04k52K25o56J63
3674c75K98q98R30o63N28r05O61l16k78O55p40O42r17P97m20j3L40n97M22l65
3694a214J019r91Q77p75J47L60k42M67p15J026p34M79P5J6K64m15J005r78Q12
$$ y = [-560, 441, -57, 457, 506, -245, 914, 12, 973, 37, 856, 215, 695, 1035, 101, 899, 420, 1419, -158, 1099, 500, 662, 1072, 341, 1103, -66, 1195, 538, 577, 562, 591, 452, 61, 770, -217, 463, -353, 212, -402, -78, 221, -832, 619, -894, -254, -544, -518, -499, -749, -149, -1244, -445, -812, -353, -908, -478, -568, -1016, 71, -1269, 34, -1026, -7, -752, -815, 112, -1148, 61, -756, 214, -636, 101, 89, -339, 496, -170, 518, -123, 1087, 92, 512, 844, 364, 863, 245, 1346, 256, 1207, 733, 653, 774, 764, 1114, 617, 1610, 581, 1225, 627, 889, 616, 388, 1370, -254, 1125, 463, 761, 419, 469, 605, -672, 651, -359, 145, -107, 118, -538, -375, -77, -975, -45, -708, -180, -1085, -424, -740, -1018, -363, -1103, -461, -1378, -581, -1001, -1014, -674, -1271, -849, -1214, -195, -1186, -309, -1084, -937, -577, -819, -352, -1067, -41, -775, -296, -221, -205, 59, -356, 649, -329, 483]
3713D83j71Nj46M09K89q48J393j408Q79o09N76q2m06J164j339R85o53L70l35L38
3733H94l09m81J057j063Q61r52J166j099J05L55o88Q02j041R40j143O81l34k88
3751e37N05n85N76q24O61p64Q55o19J71L47q89R90j267J290o36p9M47n46N69p33
3771a068J010q71O62l97K89q0j78P93j082J519r31P43n55K34J84l90Q99q57P67
3790F91m22P60n45j83Q15p16Q70r35R08p72N43r8j38L39j140J155p97J000q04
3809E31O0M38j035P91n72P98j041P99m47j26j3m25N66j209J422j218N31qm96K78
3829c76l56R20j324J117j034M96q8n8K92o76Q09j136J012p36M96r2K19M88j279
3848a306J365j205J032l16L21J30q77J019o13P91o43Q86q12M68J96n27J025j264
$$ y = [483, 312, 317, 171, 580, 869, 21, 1414, 6, 885, 276, 852, 770, 364, 1528, 189, 1174, 521, 891, 556, 894, 585, 104, 1161, 98, 959, 7, 1173, 74, 179, 534, -154, 648, -393, 547, -596, 85, -249, -537, -32, -617, -41, -865, -204, -968, -113, -732, -561, -214, -1103, -113, -1380, -90, -726, -805, -358, -904, -335, -1068, -58, -929, -267, -664, -375, -455, -633, 160, -922, 597, -334, 409, -146, 88, 272, -118, 781, -76, 691, 269, 1029, 484, 301, 1116, 400, 1270, 335, 1243, 471, 1014, 916, 778, 1117, -23, 1132, 335, 1335, 531, 591, 1029, -6, 785, 213, 1011, -30, 769, 322, 196, 183, -242, 324, -885, 537, -681, -150, -158, -654, -376, -732, 188, -1136, -19, -1053, -557, -645, -703, -411, -1087, -278, -1414, -402, -1138, -642, -734, -515, -27, -1306, 59, -1146, -114, -430, -109, 21, -856, 163, -450, 341, -302, 584, -228, 240, 436, -91, 934, -330]
3866c30J270j275J149l13j09M87k70L42o49J007j031O39J50m91L28j45N53j145
3884A67P94o55L89k44r3N16j051J373j374O65o03l0J26k58O34j264J124q51P60
3903A25p02K91m5q79J217j292R50p81M28j69R6J86o32Q85o80M24m66N43l68p9
3923i48N51p80P16m31Q63p75M92J39l03J12k78J223j269J076m71K94J09k31M03
3942D92j10O79q31O56k76Q9K27o31Q91r55J014o74L09l37j25L22m68Q28q70P41
3962I71p13K43j80m8M98r58J154j113O47q89O71l35m77R76j208J028r18O19m71
3981e03J35O3l70K90n53N60p02J126q36J49M46j066J065r22J000q61N07o0p6L05
4001c03l98P27q72R49o77N10L7JK21q47J413j189P77k69K45k5j41N92n83R07p72
$$ y = [-330, 940, -335, 814, 501, 392, 879, 609, 951, 302, 1309, 278, 917, 1067, 576, 904, 759, 1312, 167, 961, 306, 695, 451, 358, 874, -177, 1196, -178, 487, -116, -146, -20, -278, 356, -908, 216, -635, 125, -577, -286, -331, -1210, 7, -1285, -335, -1116, -688, -857, -761, -575, -1207, -322, -1002, -578, -1044, -501, -869, -948, -397, -1177, -461, -892, -29, -804, -312, -173, -476, -364, -642, 581, -688, 388, -83, 211, 320, 89, 492, 382, 1061, 230, 886, 610, 699, 926, 295, 1186, 231, 1245, 571, 880, 543, 418, 740, 272, 1100, 230, 971, 258, 501, 321, 273, 771, -187, 967, -146, 501, -388, 283, -52, -529, 447, -761, 267, -651, -32, -503, -368, -305, -675, -385, -938, -378, -1080, 46, -790, -641, -195, -1261, -196, -1118, -118, -979, -472, -532, -608, -303, -701, 26, -846, 103, -574, -64, -27, -26, 195, -652, 761, -428, 349, 80, 325, 300, 159, 751, 168, 1075, 303]
4022C03N57m82M58j96l05O22q51J003j090R58o54J84M28q01Q98r35L96l31M78
4041F40k09n48N75l74M43r11R44q05M73j6n53N12q37Q46q05M89l05n2P8l86L53
4062d48n78Q39q31O92m28J39J19k87O85j034J124o21J71j18L1N07p66J054r40
4081f90N09L8K11j41rK16m03Q78q57Q73p69P87k93l91Q64p23P15p26Q04n99L32
4102F26J37j01L15o91R11j137R99o43K53J48n51N58q78J092q75K22k55J4L75p36
4122b17M04o81J101j106N40k99K40l9p04P74q19Q04p55Q6J23k55P08p34M71l58
4142g16M03n68M71j71n26O52m32P91p93R71o19K77J53l19N48p21Q94p66P21j80
4162G0J0N47p35N77n08Q28j044R46j05m35M49l15Q95j185J310o94k68K27l25M98
$$ y = [303, 860, 378, 836, 640, 335, 957, 106, 1109, 19, 977, 323, 507, 935, 134, 1032, 97, 493, 162, 640, 431, -117, 458, 84, 527, -384, 560, -245, 228, 212, -341, 171, -666, 180, -625, -136, -441, -493, -415, -801, -448, -1026, -187, -1018, -326, -754, -615, -496, -783, -98, -1132, -8, -629, -458, -576, -545, -38, -804, 250, -690, -181, -143, 68, -73, -82, 134, -269, 609, -248, 625, -144, 643, 350, -41, 823, 100, 815, 89, 893, 294, 626, 763, 662, 977, 286, 1197, 60, 1059, 416, 669, 817, 266, 824, -54, 1038, 163, 385, 130, 144, 519, -217, 187, -494, 607, -499, 41, -258, -18, -57, -761, 13, -806, -2, -757, -671, -548, -803, -95, -829, -358, -716, -313, -881, -410, -581, -1107, -455, -887, -96, -889, 82, -537, -260, -107, -426, 122, -599, 295, -471, 250, 70, 80, 627, -108, 469, -39, 789, -255, 691, 586, 151, 600, 285, 1180, -5, 1305, 611, 343, 570, 245, 743]
4182G43J00L24r95J057n23m77M01m86L08j36J326j491N35m00k19J64m77N65p90
4201d71P06n13P2m79K19M87q98P39o68N51o09O38o59J31M15q85P91m48M77m90
4221h94M31n6m37O51m42O46p72Q03o12L57M16o36O52n54P69q99Q53l22K1M30o58
4242b53Q50o26Q47p94M88L5l22M89m79P11q26J024q66M31l14J36K12n64R66r98
4262A47P40o77N86j74p04R45p81N52o02L51n02J53J12l41N78r42Q75p90N79n84
4282d79PM2k83O01o80P33o19L12j52J66n4o33Q85q67P24n31N07l87j45Q46r21
4303i28R32p19P55o71M49J58k40M54o05R75r47O81lJ33j30j3M22q71Q06m01K64
4324E01j01J3J43k08L72n67J072r76L86j29j67N44o25N21p91Q15p58L43J18n44
$$ y = [743, 843, 1167, 172, 1229, 706, 229, 630, 144, 452, 316, 1642, 151, 686, 286, 67, 231, -246, 319, -471, 235, -278, -206, -685, -466, 21, -877, -138, -806, -255, -864, -226, -885, -754, -339, -1224, -433, -881, -404, -894, -463, -519, -956, -305, -747, -101, -873, -70, -682, -325, 91, -545, 107, -447, 322, -577, 276, -46, -25, 405, -253, 597, -29, 818, 24, 512, 547, 225, 714, 235, 946, 120, 1144, 278, 709, 395, 531, 743, 179, 1145, 147, 887, 210, 796, 622, -82, 863, 82, 634, 32, 383, -119, 34, 146, -195, 383, -559, 316, -474, 105, -479, -472, -430, -713, -112, -792, -59, -678, -366, -518, -352, -406, -1039, -154, -1021, -297, -828, -321, -708, -853, -7, -928, 4, -715, 40, -631, -182, -24, -264, 190, -415, 560, -387, 294, 291, 424, 294, 281, 703, -168, 638, 237, 501, 400, 413, 556, 348, 720, 153, 1225, 249, 635, 506, 339, 883, 258, 779, -12, 803, 45, 388, 506, -38]
4344c8N79p70Q97q26O39o92nL13k35J64o32P05o37P32q30m87O98k96N29r32J111
4365a3p38O26n28J48J63n14N55o41P88n69M59o4k86P31j175J232q34P33m65L63
4385b9j02J37N48r33N77l87N84j28N4K23l40M54n58M84m82P43o54K87M34o65O51
4406H98o36R1n3Q20o59J35o5l31O99n42O21q30M82k70m66L37j85L02p49R67q58
4427b92J06m8j88P61j063R84j088Q09m92M3J31m79P55p17O68r30Q75m64p5M01
4447c03l35O27q34O11n17K24M4j59K68m38Q76p94Q99p70N08J79o54P45l31N40
4467C86o96P86o53N64j0k81L89k93N35m31K64J27O46j180K88J63j63L55o07M95
4487F84m03N0L25n58O99q86O90m09K06j32J29j41k39N16o55M48r22O41j36j28
$$ y = [-38, 541, -229, 668, -158, 481, -211, -216, 97, -138, 26, -606, 99, -538, 194, -636, -1123, -425, -721, -192, -1124, -13, -751, -125, -653, -505, -342, -856, -301, -942, -154, -723, -264, -328, -614, 117, -1058, 174, -660, 73, -392, -29, -131, 6, 554, -379, 198, -189, 395, 267, 321, 544, 204, 658, 100, 584, 102, 845, 191, 478, 912, 247, 898, 262, 353, 300, 1120, 461, 596, 531, 200, 899, 357, 978, 148, 630, 360, -106, 231, 46, 348, -401, 566, -292, -186, -234, -422, 339, -724, 260, -828, -19, -511, -468, -337, -816, -61, -778, -110, -1040, -165, -629, -704, -303, -638, -11, -845, -234, -751, -527, -483, -642, -374, -812, 64, -730, 169, -601, -93, 86, -568, 177, -154, 386, -310, 476, -177, 387, 377, 96, 485, 192, 727, 296, 560, 687, 1333, 153, 441, 604, 441, 796, 189, 684, 281, 331, 656, 98, 797, -89, 601, 192, 398, 266, 395, 254, 15, 531, -124, 324, -598, 43, -93, -221]
4507b21K85p00Q20p57J39k62O16j68k84M96r29R13p73P48p02M24Km72P60r58R50
4528g3o75Q58n81Q4L70o67N76j94K89l73N33l60N07L8n68Q66j116R89m09L01J0
4549D05j37M99o48P51o58P39n22O7n0O8K84n86Q21r00O54n53J86J52m19O61p94
4570B0P83q78L35j84k61L28m37O35n77N14o72L30j31rN0n74P94p61P09p65K06
4591e45K17l22K12j86L52o89P71n51L09Q2k65N69n64Q80q29N39n22M06J30m39
4611d45O18p95R48n41O18k69N5q0k52P64o89R18p31K27l0Q6J97l78P94q31L73
4632E57m01L75p8k2K54l45O02p16Q08p78M88l68k70J96k43N20q39N12j54l22K51
4653B7m26O29m66M09n29K01l19J85J74n64O46p23M14j95K17l88K51L06m80L97
$$ y = [-221, 64, -636, 184, -573, -434, -696, -80, -248, -532, -36, -965, -52, -825, -77, -779, -355, -353, -825, -65, -1023, -73, -748, 110, -471, -387, -17, -684, -108, -302, -13, -386, 147, -213, 294, 332, -236, 630, -486, 503, 94, 395, 405, 268, 767, 119, 870, 212, 951, 429, 496, 446, 514, 798, 212, 1033, 133, 787, 234, 420, 572, 153, 814, 20, 803, -75, 260, 76, -185, 143, -294, 341, -236, 278, -394, -64, -195, -204, -154, -728, 66, -695, 14, -751, -545, -328, -650, -438, -624, -272, -961, -190, -741, -432, -350, -615, -46, -610, 270, -559, -20, -542, -136, -6, -445, 173, -622, 326, -215, 403, 134, 189, 109, -143, 621, -68, 850, 119, 346, 316, 402, 599, 221, 1015, 184, 557, 156, 531, 453, 431, 685, 340, 942, 226, 1034, 256, 744, 376, 106, 302, 59, 579, -260, 252, 98, -224, 27, -399, 230, -236, 173, -356, -155, -474, -289, -115, -679, -33, -756, -342, -537, -320, -708, -457, -151, -631, -234]
4673b34p34O53m40K97j55JM26n44O70o83P77m07K18Kk76P05m91K98m31Q16n18
4694e0J8N70o47N44n34O96o35M84k33K80J27p12P74p03P29m94L94J3k29M70m73
4715C89M01m70L53o84M12j32Q8K88o66O93q42N28l75Q4M1k81N74n59L81n85M52
4736I0l30M3j07l19M12o27P82n59N27m32j36O19m77K64l48L02j78J25RL3N48r12
4758f71N78m49L79J15k41K48l33O68m91P28q82N72k15R7J8k31P11q63J020q14
4778e6K41J10o3J06r0M01n53N50m47L38j14l00M14n72N65k45k8k87M96l66K9K62
4800C91o38L71l13N62l80o3P4k54K90k35L3n11O69k71r5J63n80Q44p51P16n81
4821e59j14L74j96L21n18O90q31Q76p69P22j12l88M70n73Q18m13M44m68L06l3
$$ y = [-234, -968, -315, -755, -458, -613, -612, -186, -730, -60, -743, 34, -373, -155, -153, -429, 276, -215, 83, -348, 468, -50, -32, 538, -109, 435, -99, 597, -38, 446, 213, 493, 620, -92, 682, -21, 708, 214, 608, 621, 392, 862, 389, 790, 320, 673, -11, 401, 269, 357, 645, -21, 672, -170, 358, -17, 67, 108, -173, 401, -158, 223, -362, 90, -240, -197, -304, -623, -211, -838, -56, -615, -88, -520, -656, -37, -514, -250, -598, -296, -474, -349, -340, -307, 241, -671, -93, -542, -163, -48, -289, -41, -374, 294, -197, 531, -351, 221, 6, 103, 121, -110, 601, -262, 758, -56, 185, 295, 232, 338, 248, 649, 96, 646, 199, 537, 423, 123, 537, -35, 530, 285, 257, -30, 466, 100, 129, 391, -247, 124, -189, 373, -7, -70, 4, -250, 40, -195, -162, -673, -4, -275, -370, -207, -787, 57, -694, 22, -559, -673, -299, -495, -174, -692, -2, -833, 43, -726, -4, -116, -504, -34, -607, 211, -202, 242, -226, 80, 47]
4841D7m7M94r41J080r01O87Nl6Q1k71L29l89P35p77N60j27j10L99o97N83p09P86
4863G81m66J05J30l68M71m29J27j70N50q37M83r1m97O61m17L08n41N87o97K25
4883h5R3l19M73r47Q37o27L79j52q4J28R7J0p06P52n64M69l27l68P30n03O74o06
4905f46L39j8L39n13O2K32k70P35r22Q21k65J32o7k72O37n98Q58q68O72o4M38
4926G62l36l63L52p40J748j259M11p53Q96l51m9L92p60Q19q20P30l85j7L95n65
4946A07P45r60N46m94N54m80j07J67k46M86o53O60m69J40j40m02N23m19M51m80
4966d71M58l07L28l71k99Q25q15N09m71M65m40K32K4k17N09n64N85o84L84j87
4986e07L00N9j64L47k76N02m47K24j74K09K69m82O09m70P28o16j5P2j36O58o24
$$ y = [47, 0, 494, -447, 633, -268, 419, 424, 388, 469, 198, 527, 138, 873, 96, 656, 529, 419, 818, 121, 704, -5, 781, 315, 420, 550, 182, 653, 224, 351, 181, 731, -106, 377, 286, -211, 450, 33, 341, -200, 387, -310, -85, 8, -311, 162, -785, 52, -575, -196, -348, -432, -304, -207, -197, -903, -151, -715, -246, -573, -941, -211, -714, -40, -646, -307, -325, 14, -499, -437, -205, -475, 260, -662, 159, -106, 26, -41, -313, 324, -274, 584, -284, 388, 324, 762, 426, 63, 415, -325, 1423, 164, 575, -178, 718, 367, 318, 710, -50, 769, -51, 679, 294, 277, 672, 107, 852, -108, 438, -56, 498, 18, -89, 78, -168, 318, -335, 325, -144, -4, -144, -546, -23, -442, 9, -471, -13, -320, 8, -363, -662, 163, -652, -143, -614, -149, -589, -357, -333, -550, -41, -605, -20, -704, -320, -507, -207, -148, -312, 35, -241, 261, -186, 38, -136, 73, 342, -140, 469, -1, 727, 111, 96, 168, 32, 690, 66]
5007F6N65o75N56l84L26L09n82N01o15O94m98M09j00k96J07l83N53o86O61n24
5027DK61l9j83J44o04O42p04P47o29K25M0k11J87l78N76q59O48j87p8j53k87M95
5049c43m45N29n72O60m08J67j36j93N37o44N73k95K98q1J13L11j81R5l69P05n40
5070b19K22m9JO73n43L23k69L71l59M32m26Q5N45m81L56m44O53p06K19O0k59L48
5092E33m27P09n13J49l23M7J78l49O25n59L73m03L37l26Q7j34o5K74m74L72m48
5113c37L93k49Q8P6k88J87n45N86n72L42J04k80K46m36M48k56N83o25L11k98Q5
5134d37O52o62O83o48M98l09P8J05k5L67p77O51o86N27L7j71M59o96R48o21M89
5155D62m46K97k90K32K58l20M41o87O25l92O4K0j15L43m17M17m12N54l61k5j64
$$ y = [66, 631, -44, 512, 128, 454, 763, 181, 682, 67, 761, 263, 672, 572, 276, 383, 0, 553, -133, 528, 4, 265, 226, 43, 187, -417, 225, -479, 268, -361, -136, -96, -307, -120, -498, 78, -781, -133, -320, -398, -551, -838, -343, -788, -259, -831, -171, -579, -412, -548, -741, -204, -848, -275, -570, -272, -353, -240, 71, -110, -15, -384, 321, -219, 3, -46, -45, 628, 85, 408, 139, 510, 151, 583, 157, 242, 787, 306, 662, 218, 871, 165, 384, 444, 185, 533, 106, 815, 302, 451, 128, 175, 353, 4, 629, 70, 443, 40, 377, 51, 138, 4, -61, 213, -261, 111, -337, 56, -193, -105, -29, -317, -130, -675, -89, -661, -319, -215, -495, -249, -685, -237, -493, 90, -535, -224, -522, -437, 215, -447, 236, -412, 86, -223, -145, -40, -65, 302, -475, 176, -510, 17, 54, -117, 342, -354, 594, -27, 462, 16, 313, 23, 255, 513, 193, 634, -53, 572, 180, 244, 264, 149, 492, 75, 492, 80, 634, 273, 248, 84]
5176H4j58M82m97O53j079R60o48R4J89l96L33n18Q04o77L22m51J51Pq7M12o02
5197f22L93m42L92j85N13j83m28N09n36M89k55L16k17m6J00k42P16o52L15p1r9
5218b35L90m15N29n10O17n81M87k87J09L17m40M66m69M53q8L78m76J16q7r1M08
5239E91n50P20p75K00Q6j55L07p77Q29n22M95m27L63q7k48K20l55L27m06K98j71
5260c7q3K10o46N19l58N80p57N79n24J86L92p85Q55n59L04l65M25k43j55K80l03
5281d85N40p32N33l03J81J22j54L81m63N98o27O45m27L78q1k84N48q24P41n80
5301b93P98k52J70Q6k83M26n34L24l81M13K0R2k72j90O18n81L68k31M17l45k7
5322C43J33m71N46p35O84n10L61M8p38M76m90N15n76O43m59N0r4O2J47l96M56
$$ y = [84, -74, 408, -89, 564, -515, 445, -203, -109, 80, -316, 17, -501, 303, -374, -52, -503, -352, -345, -432, -20, -622, -229, -671, -279, -464, 49, -134, -562, -53, -589, -100, -355, -39, -256, -302, -202, -444, 272, -380, -65, -136, -235, 155, -260, 269, -241, 376, -205, 282, -5, 104, 421, -19, 447, -22, 431, 343, 721, 245, 361, 274, 183, 591, 41, 761, -14, 186, 272, 117, 424, -353, 476, -46, 449, 22, 385, 298, 50, 270, -85, 242, -164, 134, -37, -120, 90, -556, -37, -395, 185, -572, 7, -517, -331, 61, -724, 131, -428, -124, -489, -64, -307, -462, -182, -485, 55, -677, -144, -447, -266, -144, -298, 83, -380, 218, -409, 236, -191, 187, 106, -178, 370, -454, 287, -293, 505, 253, 423, 509, 226, 652, 118, 442, 61, 474, 494, 586, 314, 124, 742, 161, 529, 298, 715, 370, 343, 476, 5, 551, -184, 500, -10, 351, 399, -339, 137, -353, 162, -414, 229, -230, -180, -274, -212, -65, -461, -5]
5343en51L65k7L3P6j78K69m95L86p42P71k19o2K38l24K96n31N18j58K54n3k97
5365d36M24k20M30n84M53k28J79J08l03M23l50O25m79N42n13J50p7o4M02o54Q05
5386F33n46K40n8m4P4j53K18n56P11m18J58K7j08K07m87L77m91M61k15J56j86
5407@p3J55m32N59m90N20n21K35k92k41L80l50L66n61M77PJ08k8k33M48r31O88
5429b09k96J16J95J1J30m37M75n54P64o29N32m41j67M93k60P28o37N67n19K71
5449A33k23J66L92p02N66l73O29n97J95J73l40N53m02L83j80K69m28K50k36j02
5469A26L24k17L74n96M11k20o4J70l61M00o45N18k50K45J44k98O1k16L03o96P38
5490B51n26R1J42j45o1l69O61p80O57l09Q9p8j89K53k07K20j2K92m45J42N4k27
$$ y = [-5, -556, -191, -218, -185, -109, -287, -18, -513, -127, -869, -98, -317, -379, -141, -465, -169, -700, -182, -340, -86, -139, -436, -12, -232, 198, -386, 67, -161, 18, 126, -177, 246, -104, 521, 42, 584, 71, 221, 144, 80, 482, -172, 633, 87, 327, 269, 225, 299, 146, 364, -192, 519, 101, 259, 286, 178, 385, -102, 275, -216, 245, 30, 186, 0, -73, 82, -350, 209, -281, 239, -282, -47, -339, -580, -200, -550, -184, -745, -268, -261, -153, -181, -414, 34, -897, -209, -505, -389, -194, -183, -53, -490, -15, -569, 195, -434, 98, -343, -510, -17, -277, 451, -186, 381, -138, 133, -90, 76, 468, -234, 332, -41, 588, -9, 186, 359, 19, 572, 170, 553, 373, 642, 214, 464, 228, 126, 450, 233, 607, 11, 422, 202, 138, 308, -53, 347, -298, 220, -30, 215, 359, 61, 122, -94, 209, -487, 251, -275, -184, -42, -187, -248, -617, 44, -736, -79, -388, -299, -377, -566, -313, -520, -300, -312, -20, -465, -323, -269, -496]
5512d96M50k93M98m31K91j71K8Oj57N18m17N30p28N66j26J77O7m62N33m45M89
5533D27m24M80l04L9K2k96P42n84M15m99J85M7Mk1j79M66m95K34j66J46n1k44
5555e6M36k61L07m95K16mJj55NL30o59N53m35R2l8k17K35m66N66l85K35j41j36
5578d72M22m36Q93r20L45l60K84p0j28L26k36O15p13O24m30K82l66K66mj33K95
5599H4j5K25o21L97N5k37N31n34N59p49O94n20K75K06j61J93r3J74l50K83l11
5620H5L5J29j76O05p17M86p24L98J72j49J39k34L25m73L20l87P08n64k35J92l5
5641a00J11k56L78n06O1l8M35k42k61M13n08L87k97M64j55j33M02o40M41m51M59
5662c6k52J53q7n3L40n71P53k92K22j36L4M8k68L60k05K86l58J29K08k6M9l13
$$ y = [-496, -46, -339, 159, -272, 19, -152, -124, -118, -275, 243, -174, 356, -372, 194, 68, 245, 312, -150, 383, -62, 427, 3, 483, 179, 218, 240, -56, 686, 102, 517, 18, 203, 250, 254, 233, 54, 520, 25, 259, 93, 239, 188, -56, 380, 119, 426, -69, 147, 143, 144, -11, -6, 324, -335, 218, -217, -125, -163, -380, -145, -611, -45, -430, -195, -336, -472, -50, -486, 407, -513, -168, -528, -244, -314, -442, -116, -352, 263, -450, 174, -256, 26, -340, -74, -78, -211, 84, 69, 294, -327, 70, 125, -112, 419, -115, 444, -305, 389, -131, 144, 350, 189, 382, 289, 463, 113, 396, 85, 120, 249, 73, 678, -39, 447, -277, 121, 293, 144, 283, 49, 374, -99, 221, -166, 542, -22, -257, -65, -100, 11, -245, 133, -373, -312, -350, 85, -157, -418, -5, -513, -126, -423, 41, -114, -247, 155, -485, -44, -495, -36, -288, -135, -222, -275, 65, -506, 247, -45, 177, 41, 75, 123, -145, 215, 10, 296, -62, 67, 275, 249, 298, -15]
5684a5K78k21J64k24K74N3k09L41k33K1o8K08n06L72L91m42J75l13L80o18O22
5705D30m25J81k93J07J70n23N45j45l8R4l25J89j49J24o54O65k85J11n1O4K22
5726A4l19K59m87O15l87L62o46L88r4l8K14n22N97k89K40o4l1L65n73J81r6M02
5748I1k56k7K87k78K81l28N33l94K88k36L00k08J03J51l33N39n88O64m04J54L02
5769F41n46R9m16N45Jl3j00K39k9m75L62j77J36k92Q4J59k01Q8k34J80p4j7m8
5792a08pQ5j38M12r16Q21n02J01P2R7o3Nn9l08P06n75J21l9k3K88l40J09O7J29
5816f5m39P41l15k60M68m71L22k46K58n1J2m8j16M40k03K52m68K26o3K24K35m11
5838B2L94l97L77l94J59j25J37l1NL51n22M10k77J31j24j19K69k65M15n55K31
$$ y = [-15, 263, 42, 206, -18, 256, 309, 100, 441, 208, 229, 161, 369, -137, 235, 626, 184, 359, 46, 426, -192, 430, 5, 186, -107, 0, 170, -353, 192, 47, 9, 103, -222, -33, -182, -58, -712, -47, -332, -221, -272, -208, 14, -305, -46, -533, 82, -305, 57, -589, -201, -295, -333, -119, -641, -44, -333, -93, -157, -188, 177, -396, -215, -311, 91, -165, -192, 95, -183, 98, -230, 303, -91, 197, -39, 261, 53, 156, 307, -26, 513, -75, 589, 185, 339, 641, 95, 194, -222, 323, 324, 291, 191, 430, 401, -74, 288, 111, 247, -45, 39, 198, -3, 85, -149, 31, -43, -60, -108, -115, -30, -168, 244, -672, 149, -353, -252, -180, -83, -146, -141, -200, -508, 198, -377, -256, -295, -318, -30, -370, -261, -194, -65, -504, 237, -78, -338, 130, -341, -19, -265, -7, -58, -46, -94, -210, 230, 27, 279, -189, 37, -26, 198, 433, 22, 416, 19, 396, 2, 161, 36, 173, 142, 147, 498, -24, 386, 109, 240, 116, -3, 266, 1, 416, -139, 92]
5859I2k71M13l39r2L58o16P03p23O14m38J04J64j87M15n94M51o61K55k81Q44n14
5880c03j13N11p03P77m86L46j85j11K01pj99j58N91m20N26j90q8Q3k62J43MJ16
5902G3o7K51j98n6K78k08O0j91N79m62L78l18j25J46j80M29l16M74j83q7j63M2
5924A56L67l65J93j06L6k20J77J47k39J38m42N05m36M37n40J83K48m70K75m79
5944d35K43N7K86m29K04P4n18M41m16K97j66J57%r1K45m03K30j52M14l11J57Q9
5966b7n85O96l78K03j57K16q8J90j33J22J11m33L47k99J91M8J66J15m95O83l09
5987A84%k85O00m24l5M61j43J82m18K87l66J70J76k08M55n92K92p61P15k80P9
6008H9o0K6J75k39M07n77L14j66K56m31j78O10o32O45p15J56K74K58l36m53L90
$$ y = [92, -179, 234, -105, -197, 161, -455, 248, -475, 139, -299, -195, -31, -218, 197, -397, 54, -607, -352, -633, 211, -303, -416, 95, -608, 169, -317, 29, -156, -267, -66, -73, -272, -430, 161, -259, 267, 77, -11, 72, -190, -47, -43, 73, 6, 257, 59, 3, 281, 73, 133, -58, 521, 59, 437, 119, -6, 140, -40, 389, 73, 547, 364, 277, 114, 156, 523, 158, 351, 245, 281, 61, 238, 385, 146, 284, -158, 347, -89, 348, -192, -9, 239, -231, 44, -435, -192, -135, 151, -278, -74, 0, -518, -77, -493, -196, -362, -205, -205, -296, -51, -454, -224, -376, 38, -273, -116, -27, -612, 84, -294, -91, -248, -32, -120, 70, -63, 59, 170, -263, 84, -215, -24, 24, 190, 305, -190, 493, 184, 184, -101, 499, 75, 40, 501, 358, 540, 122, 409, 43, 213, 389, 181, 636, 44, 336, -425, 290, 10, 89, 29, 55, 230, -9, 398, -179, 135, -31, 225, -206, -384, 226, -406, 239, -476, -320, -46, 212, -124, -577, -187]
6029a87m29O90m18K29j92o5K24l71M81n32L11K1R6j77Q0K60l19K88k26J26j99
6050c09K01L9j93K61N6L1M1O5R8k07J20n3K96l29K02n02M87m62O3L85k46L04k57
6073I1K64l40K76q3J0m2k05L18k10J71k54L58k16k60M46k80J51mQ5m12L3J83j02
6096b2K13o02O68n15J90n1q5K83l23L54k14J70k98J22n12K76L45m68N57n85N93
6117I6l60K46k4j17K37m15K77l49N33l3j86L10l07J77l42P18o42M66j14j27K32
6138B76k75J90k38L29k09J99j21K8R6j67L91n66L83j02K2k77L95m3k69L16l89
6159c1J64j76K28j53j93K89l64K63j46M29q06N00K3k43L49n36M80k18J3k17J12
6180b33N9k49K80j45L52m28L34j57J51r7k26K70j77M48p94N08J43r4N1j47K76
$$ y = [-187, -616, 74, -344, -115, -307, -372, -148, -519, -38, -570, -259, -238, -142, -319, -239, 21, -298, -10, -236, -110, -309, -108, -69, -262, -1, 55, 86, 127, 192, 290, 83, 203, 150, 446, 117, 319, -183, 304, -158, -95, 290, 44, 348, 91, 355, 15, 291, 208, 218, 176, -29, 289, 79, 250, -4, 354, 138, -122, 324, 44, 195, 191, 276, -136, -103, 80, -22, 191, -411, 257, -258, -68, -119, -204, 79, -244, 110, -104, 66, -232, -110, -622, -346, -1, -469, 88, -497, 96, -264, -18, -42, -159, 78, -337, -60, -409, 124, 91, -95, 215, -92, 85, -257, 461, -181, 285, 171, 44, 276, 1, 191, -47, 282, 73, 272, 151, 179, 275, 108, 499, -67, 316, 214, 236, -41, 354, 311, 42, 358, -31, 133, -43, 185, 32, -161, 128, -236, 27, -119, 310, -496, 4, 27, -216, 133, -403, 77, -141, -128, -345, -233, -174, -423, -143, -288, 64, -364, -30, -187, -36, -133, -359, -89, -266, 182, -612, -104, 39, -55, -4, -151, 125]
6201A25l26L65l28J26L2n2M77l25N9k53K62o6J82J49m94M98m38M31m95N28l25
6222A32n7J90n0K55l88L38l00O4M4n7K93m08K41n53M41m13N53k89K76k81j28K83
6244A86l99L64k57n1K46k11K02m72M70n27L13r7k3J53m8P8k29N24p59M62j17j61
6266c53K19k13J26k06L20n3n5L34k22K32m03L83l05N42k85K94j33l35K18k41L68
6287B32l59N23m34M26k05j43L06l67L92j87P8j31m9L9j99M27k34K37l38J00j08
6308FK15Lm17M48j55K64k64M9Q2j80l29P1M65n22K86q6Q1P7l34O9rK08l26L38
6332D0k21J2O9m0J81n67M83k28K09%q4Ko8o7k40O77k17j03J05J21k0l13M43l08
6356a34L95m29K80k7j44R1q2M89m75K68m06L33J66j91J37M8Rk66K42k76L43M0
$$ y = [125, -201, 164, -164, -38, -6, -58, 419, 94, 153, -100, 162, 96, 278, 427, -67, 431, -7, 424, -71, 457, 132, 75, 265, 215, 470, 82, 420, 120, 184, 228, 171, 464, 56, 297, -256, 185, -228, 325, 36, 312, 31, -97, 186, -213, 151, -106, -157, 89, -122, 80, -392, 78, -449, -136, -233, -256, -103, -151, -73, -302, 222, -537, -75, -192, -353, -134, -347, -221, -427, -107, -160, -215, 119, -103, 129, -274, 109, -196, 346, 61, 355, 222, -113, 105, -136, 232, -127, 396, -38, 388, 183, 40, 346, -21, 371, 184, 262, 131, 82, 121, -78, 349, 115, 352, 14, 114, 6, 221, 224, -193, 255, 100, 364, 100, 149, 231, 51, -278, -207, 258, -264, 22, -64, 17, 94, -240, -171, -180, 28, -298, 40, -181, -169, -100, -140, 41, -526, -43, -271, -62, -62, -146, -144, -212, -279, -519, 158, -59, -162, -57, 64, 44, -269, 174, -134, 261, -168, 112, 85, -59, 32, -50, 439, -36, 232, -174, 159, 325, 134, 271, 319, 328, 62, 304, 28, 371, 411]
6378D11l81L30k12N88p02J61k3j66K19j83L63n85L08j83L9q5J14N90n90j9j7K96
6400B73o50K89j88L18l06l3L91l96J82m92L43K43j01M5k2J8j70N1J3K6K47l29
6422b48K92j20O5j84Q2J03K6n8j22M03m03L71k80N01n89J38K40k85K26k10M97
6443D45p19L61n0P31j36n70L90o47M31j29L18K20j14l57r35J509j44j85k96k09
6463h6R7Q8J68l86N2L7J83n15M29o7k44L63m05M54m73L42M6N2l6m10K65k66J83
6486a29Q2q8N7r4J6l31M98n12L71j34J47J9n5O8k30L71l57M43k26J39K12k68j
6509bk34L71j78K48j87J27j53p4L31l24M87k60J65r3j88J43l46L39P7J02k42n3
6531E6P5L1J19j73L7j74K67j27p1jk96O10l69L55p47N02j99k66L51k24L92j56
$$ y = [411, 30, 360, 148, 736, 34, 195, 172, 6, 225, 42, 405, -180, 128, -55, -16, -101, 13, 603, 13, -6, -23, 273, -377, -88, -276, 42, -264, -297, 94, -302, -120, -612, -269, -26, -127, -82, -104, -86, -256, -205, -192, -166, 81, -248, 44, -76, -11, -195, -113, -10, 16, -42, -164, 239, -164, 207, -73, 428, -161, -23, 217, -68, 158, -52, 445, -274, 87, 37, 768, 632, 62, 452, -195, 236, 107, 425, 645, 531, 174, -761, 748, 604, 419, 123, -86, 11, 99, 267, -119, -67, -30, 153, -362, 67, 0, -244, 119, -286, 168, -305, 37, 83, 135, 99, -311, -46, -312, -129, -47, -135, -78, -172, -156, -487, 11, -501, -130, -264, -117, -98, -153, -85, -315, 56, -301, 142, -84, 55, 267, -1, -2, -236, 135, -43, 205, 18, 145, -8, -82, 249, -75, 412, 152, 317, 224, 36, 179, -167, 172, 249, 351, 109, 56, 131, 162, 281, 108, 145, -29, 238, 111, 40, 39, -257, 353, -16, 339, -408, 94, -105, -371, -20, -244, 148, -8]
6553hJ12k10o4r70P32K78%J54l87L31k36L51m65L8K46k09M17j39k90PL37j53r4
6576b22L45k03Oj11J0M6L99m06K48K02m76L14k63K81j45n2Lk11N50l32K89j53
6598A19J80n9j43J48l36K93j67K42k75J38j43K12p7m8P7j72J80j49L53k13M0r3
6620A07o1R8k56J80j11L7o0k5J89l09L16k27J93n17L82J13j83R8k88L02l55N48
6642A71k64K14j25m37M71k88J98k14m4L58l5k4p3J70j87J14n1J72k48J28L60l00
6664F6L69m93J91p1K85k07O1K8k11Q6r8K07j25J18Qj55J44J9k0j31N2O5m9l2j19
6689a2J55j12o7J17j44Kq0O0j55M57m25K42j20K03k15L1L36l67K20l74K16k87
6711c19K24q2J42k0J4n7l19M21r4j72J49K73k08m70L47J17nj61L34k74J04K15
$$ y = [-8, 104, -106, -170, -1140, -408, -130, -130, 24, -363, -32, -268, 83, -382, -344, -98, -307, 110, -29, -319, -312, 25, -128, -222, 123, -80, -74, -185, -175, -129, 270, -136, 112, 314, -162, 152, -111, 170, 25, -27, -24, -235, 315, -17, 272, 119, 299, 240, 97, 245, -91, 202, 35, 277, 2, 140, -3, 209, 132, 84, 161, -11, 169, 20, 373, 160, 200, 107, 46, 144, -112, 68, -43, -6, -66, -91, 98, -211, 105, -122, 71, -446, -64, 49, -134, -36, -324, -22, -377, 171, -93, 121, -4, -441, 30, -258, -60, -274, -318, 40, 5, -19, -92, 78, -109, 5, -46, 126, -122, 6, 366, 66, 435, -58, 133, 62, 347, 140, 201, 229, 18, 104, 6, 213, 88, 206, 214, 59, 203, 222, 202, 71, 123, 188, 139, 107, -12, 143, 31, -36, 81, -63, -61, -141, -81, -236, 221, -204, 38, -82, 121, -94, -63, 273, -94, 126, -248, -32, -319, -95, -177, -35, -55, -41, -98, -417, 4, -90, -262, -113, 160, -48, -518, -171, -54, -59, -220, 114, -160, -56, 159]
6733A59n88N22k48L62j26P2K59m31L85l81K72l74M28k97N0L06m08KM9P3m5K01
6755B42j18j4l9M7l8j51J97j70J54k85K43n7j00M19k87l09J54J14j3r6J29j41
6777a19J67k02K02j22O2q4J27L81j075N16m61M32J19j29K33j89J47m72N91m91
6797c67L50j67k08K08r1L07k20K78r8k01K89k24J66o6j4Q5K8j9j48L70k83L73
6819C48m25K00J12j36k02L09J39j99P5j28P3k90m0K66J45Q8n12L40q2mj94N8K6
6842c3J12J45o77N86k94K79j97J86m1j32O9q7QR0j71J98l26K49j64L7j66K10J0
6865a09J31qk90O6k10M60l73K94Q6m1j50J31km33K38k08M61k16J23j62m7K84m00
6888c75N32j98O7J57o0J78l51L00l49L25m39L30j72P6J42l39M13j26K46l55J49
$$ y = [159, -429, 93, -155, 207, 81, 153, 412, -19, 366, -15, 257, -117, 311, 14, 64, 370, -38, -36, 13, 86, 41, 242, 124, 110, 71, 118, 80, -71, 126, -44, 110, -175, 68, 11, -89, 330, 43, -266, -112, 2, -11, -107, 22, -119, 48, -154, 48, -74, -12, -96, 31, 412, -663, -147, -608, -176, -57, -186, 47, -142, 5, -467, 124, -367, -17, -184, -392, -184, -275, 32, -188, 90, -8, -209, 80, -144, 22, -44, -58, 27, 55, 36, -112, 258, -25, 348, -77, 123, 235, 99, -103, 206, 345, 146, 221, 93, 166, -124, -164, 102, 247, 335, -177, 163, 81, 77, -117, -59, -33, 79, 224, -453, 133, -161, 118, -79, 107, 66, -66, 3, -84, -76, 14, -157, 41, -285, -36, -200, -163, -329, -119, -109, 22, 14, -276, -210, -420, 40, -333, -39, 47, 6, -144, -13, -15, -448, -210, -418, 43, -173, -50, -212, -259, 25, -375, 157, -41, 26, 183, 123, 301, -50, 250, -99, 226, -213, 117, -55, 21, 163, -176, 237, 111, 357, 2, 151]
6909A51N6j11j24n8L06k22K74m60L54k65M5L73l33J92m43K57j44O4J11k31M11
6930B03m37J02L54k46MJ7j12k90O19m97M91m81J46m6p8j8j45K67k92K57j31J49
6952a64o7R7j88K29J04r4K8k09J96J48m41N08j93q7J0L60j66J94k35N4J20j83
6974B1KJ47m5r5O0J70k29M6j0J27j16rJ47l55K00j10L12j28J9k8o4r0k63L56j14
6999d9J48M1k11j23L54k31j36L12k26J27l6j53J5J68P6O7j88q3K9L4J21k39K84
7022A01j72j9K95n33M20l61J73J81j90K40l29J46j93K28J24m6j73J22Pj03K13
7043A31j38K3J11p8m0J73J25l42L15q0K10k70M01k57j23j93K28J8Mk2k01M6K16
7066B57m16L37j59J47k96R8J36j20r5J01J22k56K12k81J73K2j48K65k73J69l75
$$ y = [151, 207, 96, -28, -86, 220, -2, 272, -188, 166, -99, -54, 319, -14, 178, -265, -8, -152, -88, 23, -208, 203, -234, -132, 222, -24, -20, -3, -115, -405, 214, -283, 208, -273, -127, -173, -251, -269, -414, -147, -439, -182, -313, -164, -231, -134, -322, -93, 11, -83, -55, -264, -68, 80, -361, 147, -46, -133, -123, 237, 71, 265, 30, 84, 204, 21, 23, 170, 125, 30, 90, 260, 31, 77, 67, 194, 78, 69, 216, -139, 61, -49, 263, 135, 154, 126, 62, -28, -291, 65, -49, 99, 140, -71, -194, 160, -71, -207, 105, -121, 6, -30, -183, -168, 0, 76, 143, -45, -128, -99, -65, 56, -183, 101, -71, -90, 205, -328, 92, -269, -96, 85, -105, 135, -194, -48, -241, -13, 111, 65, -108, 14, 21, -82, 131, -7, 16, 127, 49, 9, 182, 307, -35, 280, 200, 410, 140, 541, 284, 161, -32, 196, 214, 218, 196, -5, 41, 257, -159, 178, 19, 166, -130, -32, 104, -16, -111, -10, 112, -144, 68, -213, -40, -18, -166, 99, -174, -5, -380]
7087c80L24K11m04M30l62K79k85K62j81J80j40j17L25l42n1k1J69k08O13k45L3
7108I0k07O3N6k37L05l97M69j11q2O0j85K27k69L50j52K03j02J20n9j40K34m06
7130a70M67j90j48J49K5K46m54N18m12M9m3J59q9J27J55m89M79l08Qo9lj92o1
7153b46L70m76K46j47K82L6M6j89k25K65O4P8k14L5L4j05K79l82J51o7J45k1J24
7176H3j86k9J98j68O2l16L45k07K66n0j92J84J3K32l14M7j68K51o2K62j5k14K05
7199B27m66L29j46Q0L0K3N0j80K11j61J52k17L88j94l04M72q1j28q8O6q7p5L73
7222B74l15J29J7J27l17m1k0R5P1j87K91j50Lj60J04n6M8K49n06O50m79P7O4k41
7246b73J20p7L59k62J66ol3k47p0L93k73L98m45K86k2q9J6J28j3p1J69j86L86
$$ y = [-380, -56, 155, -249, 181, -181, 98, -187, 75, -106, 74, -66, -183, 142, -200, -251, -272, -103, -311, 302, 57, 90, -117, -54, 2, -235, 70, -327, 142, 31, -51, 9, -176, 51, -218, 132, -20, 183, 81, 201, 142, 2, 236, -170, 297, 107, -41, 108, 133, 379, -75, 443, 31, 80, 37, 196, 107, 234, 389, -100, 379, 71, 79, 10, 7, -185, -246, 124, -352, -106, -253, 29, 65, 111, -78, -303, -38, 26, 104, -110, -75, -41, -146, 133, -249, -98, -165, -20, -41, 83, -103, -132, 66, -102, -40, -356, -11, -218, 48, -2, -194, -10, 3, 235, -79, -32, -200, 51, -11, 251, 236, 22, 227, -239, 90, -56, 24, 54, 77, 127, -53, 158, -3, 149, -68, 320, 126, -178, 294, 213, 85, -3, 63, -24, -99, 274, -41, 88, 105, 232, -85, -126, -146, -51, 20, -167, 124, -26, -23, -183, -79, -135, -87, 162, -344, 306, -173, -96, -32, -273, -153, -230, 129, -133, 33, 27, -6, -253, -323, 70, -203, 195, -250, 36, 14, -75, -59, 69, 56, -15, 154, -32, 354]
7269C54k57J46L4j85J65k45K63l05N18o73L53ro0J38k98L55l72J90P1j05Q1l3
7291A26J0m4J16k40L54j13j57L66o44K31j71K23j98M75k16o6o8n2J85m83M37j06
7313c5o2K1j64L40k98K32l84J77J27j10j57j2L18k84J78j61J79R1k39K36KK37
7335B32m34K35k2j75L3O5K28k64J83m2J92O0j61j70L16p5j26o1NL66m82j9K03
7358H7k61L95l93J49K20N8m1l5%k91K00o7J85k35R3M7K12l20k54L96k03J74k4
7381I2O0j21n5J76k61J24r1J22j18m6J04l48L98k65J61j58L18k51l00K94j8J1
7403a72o6K52M5L8j33R5k35L6J58j78M12l59J07P8k56J85j08J0p6K80j4p9N1m5
7427B6L26m23M83m54K41mj83K17l33M59k44p4j21J91J20l25L70lk32J45l1k97
$$ y = [354, 97, 243, 277, 92, 257, 12, 275, -30, 488, -185, 168, 159, 99, 237, -61, 294, -78, 112, 183, 78, 159, 126, 136, 92, 208, -32, 322, 209, 52, 418, -226, 5, -166, 57, -141, 334, 118, 52, -16, -68, 117, -366, 71, -35, -97, -76, -240, 100, -198, 34, -350, -173, -46, -156, -313, -325, -7, -291, -113, -274, -95, -4, -243, -7, -5, 232, -202, 33, 11, -164, -131, -66, 162, -102, 81, 39, 231, 291, 130, -40, 276, 201, 75, 14, 19, 385, -97, -116, 87, -174, 221, -172, -23, 197, 255, 214, 179, 179, -112, 88, 21, 206, -29, 64, 111, 323, 3, -251, 145, -58, 116, 92, 152, 31, -24, 152, -109, 15, -76, 46, -72, -118, -14, -362, 36, -229, -68, -226, 92, -159, -459, -165, -183, -172, -238, 14, 59, 97, -36, 59, -176, -140, 18, -160, 252, -107, 0, 78, -178, 7, -101, -91, -167, 113, 99, 20, 71, 26, 352, -71, 412, -42, 199, 195, 12, 229, -104, 355, 111, 37, -84, 107, 227, -98, 272, 269, 37, 182, 151, -146]
7449a46Q5L97k59J4l86N34m05K8m9J60N3K28m59j00K06M9P1k58M78n66M16j14
7471b3P5L8n32L79R8J0k89l55L46M04m98O09q16N87k43r1oM48k53M88m31M0J65
7494A50j79J95l34K53n5J65k82J86p5P5J87m20M97l35Q4L8P5k32J08L22m12R8
7516A09l38K01J15P2P4l45K62o3L3k46K38j81J64O9k95J54k8J96l55qj29J60J50
7539IOM7j80j3n3K83K5k16pR3j56n0K93j54N3j79J3K95n78L99j49J85o3M1J20
7564F4l55L85l01K80j74L14p4N9J8l29K61k20L13k43L46l66L06k38k6J56l81L17
7586A12L0K51l50m2J53k89L36j24J91j11j24qJ14N4k13J4k18K76J3j81P5l8R9
7609B0j22J63k77P1rJ42%q3J71r2Kl22J32J8K45ql06M12j45k51K72o4k0j78J78
$$ y = [-146, -61, 336, 77, 91, -295, 239, -166, -138, -187, -27, 26, 254, -205, -305, -99, -50, 21, -237, 241, -325, 91, -23, 52, 90, -442, -63, 35, 45, -244, -599, -253, 151, -347, 262, -554, 33, -210, -301, -307, 141, -112, 376, -55, -15, 150, -29, 166, -168, 85, 30, 195, -87, 99, 24, 99, 286, -134, 363, 28, 112, 150, 225, -7, 101, 423, 11, 109, -229, -28, 87, 159, 233, -112, 150, 87, 120, -126, 112, -69, 95, 164, -131, 23, -5, 191, -164, -172, -301, -141, 9, 15, 62, -118, -131, -184, 99, 124, -92, -99, -6, -162, -212, 81, -73, -20, -199, -186, 109, -469, -70, -219, -34, -97, -56, 64, -291, 94, -207, 73, -101, 213, 139, 198, 216, -113, 148, -72, 241, -2, 344, -22, 284, 46, 20, 176, -205, 112, 142, 393, 43, 1, 154, -135, 201, 77, 268, 157, 33, 25, 139, 193, -20, -6, -224, 52, 65, -116, -41, -79, 20, -102, 61, -216, -145, -154, -12, -12, -95, 76, -16, -14, -336, -204, -186, 59, 51, -255, 157, 12, -239, 33, -31, -51, -229, -51]
7634e1K2J31k86L34k19J50J3k04K48l79P4P1MP7k4R2P3J11l06j9J19K14j62l9
7658D4J39k70K13j05K18k80Q0O5J09R0k01j27Q2j58J13K5rJ0J67j37J35k45J0
7681c2R3n9j60q3M25k16J94k49j26J89j5L4l78M31n22P40n49J60L1p2K63l56L48
7704I1k67K20k90K85j82K7J9N8L30j76j20k26L3M0n6L44k81J36j6J70m9j44J47
7727I3j49J69m64N10j74r3K50j13K13k00P5k6L4r4l9j09L32l5j63K04l15K95m99
7750b98L83J86k33j66J06K08k98J04r0M1J27k60M7O4m9J77j15PQ8n4J54j36q8
7773i5j60L11j47k9N8o9j60J85N2K7j71J71j95R7J72p8J88k96Q6n3K34k18lL8
7797e5%J04j98L50l16K21J05o1p0j53K47l04J71Q4P9nm9J3J52j63l34K66m1r7
$$ y = [-51, -29, 102, -184, 150, -69, 81, 94, -110, 138, -241, -167, -96, -92, -15, -39, 53, 126, 237, -69, -88, 31, 245, 83, 44, 183, -87, 126, 21, 239, -41, 39, 104, 213, 303, 102, -25, 57, -101, 12, 37, 28, 38, 205, 68, 203, -42, -32, 61, 2, -158, -241, 184, -32, 162, -87, -213, -24, -39, -5, -383, 48, -474, 266, -283, -123, -92, -164, 99, -257, 91, -176, 44, -246, 39, -143, -116, -97, -39, 291, 115, -5, -231, -198, -158, -214, 130, -151, -15, -31, 139, 90, -54, 93, -56, 113, -351, 159, -15, -108, 142, 29, 242, 42, 117, 91, 125, 31, -8, -117, 215, 180, 17, 221, -94, 201, -298, 85, 271, 38, -128, -22, 186, -112, -8, -98, -57, 70, -190, -143, -79, -128, 49, -66, -59, 29, -25, 129, -7, -95, -255, 56, -91, -120, -62, -131, -291, -106, -54, -27, -198, -27, -222, -125, 47, -31, 157, -139, -53, -106, 128, -90, -93, -55, -55, 49, -149, 201, -115, 106, 211, 150, 80, -73, 174, -130, 41, 125, 204, 199, 150, 163, 315, 152, -182, 84, 43, -54]
7821e4J78n5J30k49J79j50J62k89N8K9J40k11k01N67n06L88j37K45J2k85Q2k35
7843b02K55l70K66q7l9J1j69K83j72l8J70J25K8P1k91j05J97p5K83l10K87n6r8
7866c6j78N7M84p14K47N1J51n6o6p1J92J41l32J89RP1N4l18N4J45L97p49N19j18
7890A23M3K5o91R15n34L6qM76n90J40J39J92q1k62L31l01J5J88n1K9m36J87q0
7913a95K50M3j07m2J64m27J18J30l35K81J05Pm0m5K09m25L34j68n0O0m4q0q0M36
7937I9o30N32n0j84L82n85N27j01J32M4M1k90K33j10j90J07Q1J45l86N15l06m6
7959d0J94k8R3k27J32J15k17k60K26j1j2M35l25l4r0j31L42k41LJ41J54k64L8
7982gM4M1k79K73K90o25N72r4Lj61j44J64j97J64j60Rk72K00L28j11lj67j18J83
$$ y = [-54, 124, 69, 199, -50, 129, -21, 141, -148, -90, -61, 79, -132, -333, 234, -272, 116, -21, 224, 236, -49, 33, -202, 53, -317, -51, -138, -177, -166, -335, -52, -224, -262, -92, 33, 61, 132, -159, -264, -67, -142, 141, -169, 118, 62, -36, -214, -157, 327, -387, -140, -89, 62, 6, -60, -131, 61, 202, -130, 59, 68, 139, 193, -125, -71, 74, 471, -278, 241, 123, 166, 191, -500, 415, -119, -83, -91, 385, -205, -65, 74, 266, 185, -77, 254, -47, -32, 156, 105, 134, -302, -115, -195, 55, 98, -9, -51, 113, -314, -196, -66, -401, -120, -15, -8, -48, -93, 116, -309, 25, -143, -193, -133, -177, -257, -337, 99, -531, 1, -49, -233, 149, -436, 91, -10, 122, 166, 207, -83, 150, 40, -150, -43, 38, 183, -203, 312, 6, -40, 154, 126, 219, -8, 124, 239, 22, -238, -12, -23, -35, 400, 75, 41, -49, -180, 162, -79, -76, 65, 219, -45, -7, 37, 78, -201, 72, 362, -263, 309, 215, 218, 57, -87, 77, -120, 44, -116, -107, -379, -179, 149, 38, 35, -132, -250, -67]
8006f7r6q3K21J68k63P0k44N24n16L47k26K8Q6M8q1J6j00m5M14l81J25J25o7J01
8030A04j21o1j36L56o0J16j13o2K86l47O2O9L01k27j8%j31M51m83J57Rj79j00
8053a27K29j00L4Mr1J87J37k20Jk23M49m95Q4o4K22j73P9R6m77N02k53J94j10
8076a15r0J59j52L9M9J16j64K63n7j78j26J39l7O7N0r1P7K12j98q4nk7j89M18
8100G6p9p6J71Q7o2Q3k09Nk31K57l1L0Q3J58k94M74m21J66j55K6k10K18K06m66
8124a94K55k44N53j73o4o7l52L10k6K20k08K95m66L36k28j21J67RO4j36L5J44
8146A09k11K2m1J08k67K86j6k23K73q6m6J64l56K58J03k62MJ02n0J19p8K81m22
8169b29K24j21J02J23j55K35N0r7j25k40qK80p6k9J23J8n6k18J36n5l7L97
$$ y = [-67, -163, -246, -25, 143, -120, -50, -294, 230, -286, 61, -165, -137, -51, -3, -84, -68, -168, -213, 201, -180, -55, 70, 3, 104, -17, -78, -214, 142, 82, 198, 85, 23, 309, -38, 24, 93, 394, 167, 149, 149, 18, 469, -14, 143, 152, -27, -127, 102, 2, 36, 40, -51, 136, 273, 53, 54, -169, 280, -215, -131, -195, 27, -146, -67, 29, -448, 54, -199, -5, -115, -205, -46, -198, -159, -110, 6, -158, 105, 48, -130, -256, -117, -154, -87, -37, -128, -51, 161, -37, -121, -126, -153, -342, 76, -3, -79, 92, 179, 117, 200, -9, -4, -235, 22, -9, 21, 104, 262, -32, 442, 21, 187, 32, 58, -152, 66, 272, -194, 61, -183, 370, 197, 133, 66, -286, 24, -2, 218, 10, 305, -161, 175, -53, -174, -7, 2, 66, -70, -35, 109, -102, -80, -121, -13, -280, 6, -10, -233, 40, -46, -92, 72, -284, -26, 77, -185, -181, -79, -129, -10, -88, 193, -229, -5, -126, -24, 99, -56, 179, 229, 132, 7, -233, -241, 39, -37, -66, 57, 75, 19, -199, -63, -118, -155, 242]
8191B42
$$ Imaginary data points
##PAGE= N=2
##DATA TABLE= (X++(I..I)), XYDATA
0@%%%%%%kJ0j6J6k4L2m0M8n6P5r9J23j47J76k16K60l08L64m28M99n79O72p72Q87
30D75j017J159j315J489j683J895k128K385k667K974l309L676m077M515m993N516
46B895o088O712p394Q143q968R877j0883J2004j3258J4669j6270J8103k0230K2728
60A2040k5709K9342l3879L9721m7557N8651p5629J04990j69206N33647j41258
71B85153o42277Q21179n55456K85732M8791l89336M19983k13652M8285K22549
81C30951n60420L87997L7531l11965L44263j66436j31221K30314p0522j38619
91d8127O0585J8790r5184K09728j35638q4831R5721p6822J49793k14380k4209
102a44574L12431l26380J55670J13668m03630L41711p1268j28007K07923k51243
$$ y = [0, 0, 0, 0, 0, 0, 0, -2, 8, -8, 8, -16, 16, -24, 24, -32, 43, -56, 67, -80, 96, -120, 140, -168, 196, -232, 267, -312, 360, -412, 475, -542, 617, -698, 791, -892, 1003, -1125, 1260, -1407, 1567, -1742, 1934, -2143, 2372, -2621, 2895, -3193, 3519, -3875, 4268, -4700, 5177, -5706, 6298, -6960, 7709, -8561, 9542, -10688, 12040, -13669, 15673, -18206, 21515, -26042, 32609, -43020, 61970, -107236, 426411, 285153, -357124, 464055, -91401, 194331, 243122, -146214, 273769, 60117, 108402, 330951, -229469, 158528, 196059, -115906, 228357, 61921, -69300, 161014, 90492, -48127, 12458, 31248, -63936, 145792, 10154, -74677, 21044, -55778, 94015, -120365, -144574, 167857, -158523, -2853, 110815, -292815, 48896, -22372, -150379, 57544, -193699]
112a93699K57726r6367j24211K54458l35056J86943J34964k57283J98032p4166
122d8659k4786J00502j41029J06026q0435M7771J40031k16604J20953L54n6329
133e2205L2101k4271R6029j41266J32704L0335j88312J81592r7875k7238J25550
144F7144j17515J16724q1695j6619J58746k74279K01107J0690k29362L36502j73524
155b081o0441J44717j36212R0555o7437L1079O7623j51871J66113j5436j82648
166a16039J59827k2034n9867N4148K5482m1549m8033J54246j48146k4211J39029
177G2853j28556R4718j7829k9859K7624p8929J33948j02179o5208K13293j72143
188e2267L1243J34605k20869J02481K7909l9550J9502n4226J26608j12351J8735
$$ y = [-193699, 64027, -32340, -156551, 97907, -237149, -50206, 84758, -172525, 25507, -48659, -73445, 27057, -113972, -7946, -88381, -40610, 99421, -117183, 3770, 4124, -52205, -20104, -44375, 51654, -89612, 43092, 73427, -114885, 66707, -31168, -58406, 67144, -50371, 66353, -15342, -31961, 126785, -147494, 53613, 64303, -165059, 171443, -2081, -62522, 82195, -54017, 36538, -30899, 180, 67803, -84068, 82045, 66609, -116039, 43788, 21754, -38113, 16035, 41517, -32, -48065, 106181, -41965, -66176, 72853, -55703, 39015, 21186, -8673, 18951, -59978, 73970, -28209, -93417, 119876, -52267, -21024, 113581, -107288, -4807, 23102, -16448, 3054, -51172, 75436, -36915, -18180]
199a8180Q1180j60267R0029M4568n1096Q846j6068O2995p4480M46R8909j74893
211a08011J23990O7410j67514J38820p5113l834N3872p3548Q6888q4008M1217
222A69Q7833j49250N8769M5278j02978Q3744J2651n4515J4693K9882J0083q5078
234d8719O3425m372l3267O0227k8615O677n2783O8789J476j10970J25492l8196
246I164n7027J23693r1206k2126O1993n2653O0169p2911M0579M8864j27220J49387
258G0706q4212p4697J51488r1462J1645L4762l9282L1182m0033M2646m075r7440
270h8772J43091l4774q5803J18450p0530j1661M2858o626k6007j773O4232m8307
282e622m997K6142k4504m143K6041J6443n5183K2140P3135j01110J6482Q7542
$$ y = [-18180, 63000, -97267, -7238, 37330, -13766, -4920, -20988, 42007, -32473, -32027, 66882, -108011, 15979, 83389, -84125, 54695, -20418, -24252, 29620, -43928, 42960, -41048, 169, 88002, -61248, -2479, 42799, -60179, 23565, 36216, -18299, -3606, 26276, 36359, -48719, 14706, 10334, -22933, 37294, 8679, 15356, -37427, 31362, 32838, -78132, 47360, 9164, -47863, 75830, -15376, -37502, 24491, -28162, 32007, -40904, -325, 48539, -78681, 70706, -13506, -88203, 63285, -28177, -16532, 18230, -21052, 10130, -29903, 12743, 8668, -88772, 54319, 19545, -66258, 52192, -18338, -29999, 12859, 6233, -19774, -21547, 42685, -5622, -10619, 15523, -8981, -13124, 12917, 29360, -25823, -3683, 69452, -31658, -15176, 72366]
294G2366j36095Q7466L4758r3649P4020m8094M2481k0063m9489J04836r1519J2497
306a0485J01484j30186L2290O9269r5757N0198J139j8070R416l629L4364o8538
318b8505K9285K4436l9393J4368J4782o063m1504O3360j3782q0657R0890j0872
330A6345p1088R1058m0519k8501M5584l7993M6239p1471M1805N3670j21739J07944
342C1334k3083p5873R4817l6455k1134K9091q561J7649l8110L1877J3110p9432
354f4770R3728k4429m5662O1269k7251R328k2878L4449j4945l8333Q0165m3591
366b920k1504N5695l5923n263K1669r823N42j7825N7793m2081l1501R3044r0995
379b9092K2796M4243n2522K6120j2382L6514m0202k0693P8517p4514Q54P8583
$$ y = [72366, -63729, 23737, 58495, -35154, 38866, -9228, 33253, 13190, -36299, 68537, -22982, -10485, 90999, -39187, -6897, 62372, -33385, 16813, 17952, -118, 9298, 5669, 40033, -28505, 780, 25216, -14177, 191, 14973, 8910, -32594, 30766, 16984, -63673, 27217, 16345, -54743, 36315, -4204, -32705, 12879, -25114, 21125, -50346, -8541, 45129, -76610, 31334, 8251, -67622, 27195, -9260, -30394, -1303, -9864, 7785, -30325, 1552, 14662, -64770, 28958, 4529, -41133, 20136, -7115, 2213, -20665, 13784, -1161, -39494, 40671, -2920, -24424, 31271, -4652, -9915, 11754, 1931, 2473, -15352, 42441, 360, -31141, 61903, -29092, -6296, 37947, -14575, 11545, -837, 35677, -4525, -25218, 53299, -21215, -20361, 58222]
391E8222p9658J6951L6076l7038R689k2196M8661m2527k698O5483q3664L7288
403D589J4738l4826J3949l450K2475l2193J7747K9026p4329M8097K5083q1426
415e0520P1675j3234k1399K6525k7978M1377o8061M3027L7747r4734P9783j296
427B2912n3975M0994o278j0991q175J9839K2262o1204N3196M478o9191P3635l4404
440f902n495J8066m489K5073o2791N8804j3087n6568Q4937m2088k3622O1893l6418
453b687l705R94o82J6757m5883O5514k7900m0558Q1107o0435l654K0514p83l237
467d638j4750M9056m8419q267N7434n9435K504M3630l3399J6145r507J4878j5093
480i861l3508Q0578p4512J4153O2792p8601M4186l338k1632Q681j0801M1602l5215
$$ y = [58222, -21436, -4485, 31591, -5447, 4242, -17954, 30707, -11820, -14518, 50965, -32699, 4589, 19327, -15499, -1550, -5000, 17475, -14718, 3029, 32055, -42274, 5823, 30906, -50520, 21155, 7921, -13478, 13047, -14931, 26446, -41615, 1412, 39159, -55575, 24208, 22912, -31063, 9931, 3653, -7338, -15513, 4326, 26588, -34616, 18580, 23058, -46133, 27502, -6902, -12397, 5669, 1180, 26253, -36538, 22266, 9179, -47389, 37548, -4540, -28162, 33731, -2687, -6392, -5398, -6080, 10677, -35206, 30308, 2408, -38150, 42957, -17478, -21132, -618, -1401, -4638, -19388, 29668, -18751, -27018, 30416, -29019, -26515, 17115, -16284, -139, -9646, 5232, -9861, -43369, 37209, -37303, -23150, 39642, -38959, 5227, 1889, -19743, -11062, -21863, 19739, -15476]
493a5476m186N6487o8833K1645L6295o8582M6056L546J223r864j0554M4095o4395
506c2543L7293J9083n4140M9153N478k0854n201O983J3203l3053K7397K3559n9853
519b3495N9351o531m7302M4576k8499K2919j5675J4003K2649o3983O0597j4847
531B3763m8657N8965k0257j4529L4554j6369l038k1841K3941R010n5612O7312
543C7242k3646k5720M8171l6100o404o766L3177j4467k9420N4848l3689j6422
555a9196M0369m1738j443K6174q418J0212l1403L6537j9019l5565O8990o3638
567c8138J6027M3720m5751K0321r204M1o245p943L9088l1433p327N5214n4100
580b5730M812K8778l8715K1250N030J9095l1520L173L9749n4675K1948J4578k3461
$$ y = [-15476, -19662, 36825, -32008, -10363, 25932, -42650, 3406, 6952, 8175, -1689, -12243, 31852, -32543, 4750, 23833, -30307, 18846, 24324, 3470, -1731, 5252, 18455, -14598, 12799, 36358, -23495, 35856, 29325, -17977, 26599, -1900, 21019, 5344, 19347, 41996, -21987, 38610, 23763, -24894, 34071, 13814, -715, 33839, 17470, 14432, -7409, 16532, 25542, -30070, 37242, 13596, -12124, 36047, -53, -6457, -13223, 19954, 5487, -23933, 30915, -2774, -19196, 21173, -20565, -22008, 4166, -4252, 5960, -25443, 11094, -7925, -43490, 25500, -38138, -22111, 21609, -24142, -3821, -13025, -12984, -19229, -27172, 11916, -19517, -26844, 28370, -25730, -20918, 7860, -30855, -9605, -4575, 14520, -17000, -13827, 25922, -28753, -6805, 7773, -15688]
593a5688J7704J5427p094k5693J4563K1305m0714K1715K6356m6442M3429p105
605A7763k4652R763r837L3272l8954K6319J7661n3576M7940j2749l6018L5357
617A2289p345j518J0542j0172J0855l6786L1129Q779n7885O2644j6064j7484K6232
630A5216k0411l936j2997L3150p149l3352M2374l676l2507K9165j6892j4327K3157
643b185M806J506k9908L7150j3127k7237M1323l4006R752K1688n581q182j0157
656a4158K1414j7550o268L5893l0021k080M6530m1016J0Q178l400P827j4139L9446
670C0666l8084Q49M3139m9216O054J8018r953P241N929k93j6794q29L0179l7846
684a0940M317L5168l7087K6822n170j4795k789J010K7589m1637K1977K0291l9536
$$ y = [-15688, 2016, 17443, 10349, -15344, -781, 20524, -20190, 1525, 27881, -18561, 24868, 17763, -6889, 2874, -6963, 26309, -12645, 13674, 31335, -22241, 25699, 12950, -23068, 12289, 4944, 3426, 13968, 3796, 14651, -22135, 8994, 17773, -40112, 22532, 6468, -11016, 15216, -5195, -9131, -22128, 11022, 3873, -29479, 12895, 9219, -23288, 5877, -11015, -25342, -2185, 2621, 4127, -25781, 11369, -1758, -28995, 12328, -21678, -11926, 9762, 4181, -4001, -14158, 7256, -10294, -16562, 19331, -10690, -12770, 33760, -7256, -7246, 932, -2468, 5359, -8780, 30666, -7418, -6569, 36570, -12646, -6592, 11426, 1473, 8714, 14643, 14350, -2444, -3273, 26906, -10940, -6623, 28545, -8542, 18280, 13110, -1685, -4474, -3464, 24125, -17512, 4465, 24756, -14780]
697a4780K3732K155l1870J7144Q120P36q069m446K5545m2483K2987J1589m5958
710c5598M3079l456q727K50k756M220j9212K3816p64k6555L2549L403l1441K0694
724d98q139m118M709J0332N723l4542M3347j4217k5999L1909j8385N569P889P046
738A0626q851j4958K6457r268k2900L7222j6802r237L6086k9605M108n953J1804
751H729K382k4095M3174k9736m275L3316l3247k248J6858m102K16m53Q469j1667
765C321j3204L6061l5368o90L2011k6786J4152p469L882j4059k06K7771l6070
778a6654J3044K0453k8373J0154O948k1304Q236L169J0302j5833k939K9875m2213
791b5135K2128P525l0736K4449J139J854j5348Q710P409k3967K1353M483k6716
$$ y = [-14780, 8952, 11107, -20763, -3619, 4501, 5237, -2832, -7278, 18267, -24216, -1229, 10360, -35598, 7481, 4025, -4702, -4452, -7208, -2988, -22200, 1616, 852, -25703, 6846, 10249, -21192, -498, -8637, -12755, -8046, 2286, 8009, -26533, 16814, 2597, -23402, 8507, -9878, -4309, 3580, 10626, 1775, -13183, 13274, 4006, -18894, 18328, 1526, -7711, 28375, -1230, 2878, -3075, 8729, 11111, -12984, 30190, 454, -3821, 29495, -3752, -6000, 10858, 6756, 6972, 6519, 14988, 3321, -9883, 26178, -9190, -9880, 22131, -4655, 9497, 2028, 5910, -8149, -8355, 19416, -16654, -3610, 16843, -11530, -1376, 5572, -15732, -7496, -4327, 5975, -9858, -12797, 17078, -25135, -3007, 4518, -26218, -1769, -630, 1224, -14124, -5414, 1995, -21972, -619, 3864, -22852]
804b2852K5353O178j9671Q192o534J2811j7659J7847J0666m1516M5584j2170k0117
817a3888K1585j2535P347J305N737n45k0847K4905L678l4981L4933r551j1705
830d562K6988j7802K475j3602K2184k572k4279L2164j7520j404J6362j4562p487
843c617O978Q078l974j1640J8205j1170j1278L2684l6947N573J8420j1780N921
856E453j4790K0108j9641r73K7219l4338N082K5339j8781k289N325n544L215q074
870a2689K1681k2666k901L3656l4500J3249l12q153J0540l974R299j7864J0992
883c642J1917k3986J1814P978k1186K1924J27j1639L762k175J9591l2176J8921
896A230J3489l4403L4286q301j3841R034P36M014j0764O770J0292k1277J5138
$$ y = [-22852, 2501, 8679, -10992, -2800, -9334, 3477, -14182, 3665, 14331, -27185, 18399, 6229, -13888, 7697, -4838, 2509, 3814, 9551, 9006, -11841, 13064, 16742, -18239, 16694, 7143, -4562, 22426, 4624, 7099, -6503, 15681, 13109, -11170, 20994, 3474, 2070, 18432, 3870, -3617, 3361, 11439, 7465, -4175, 14030, 2860, -8418, 24266, -12681, -7108, 11312, -468, 5453, -9337, 10771, -8870, -9843, 17376, -16962, -11880, 13459, -5322, -7611, -2286, -7830, -4615, -12689, 8992, -13674, -16575, 17081, -17419, -4170, -4482, -12635, -2095, -6069, 3230, -14634, -3642, 8275, -15711, -3897, 4081, -17105, 4819, 4946, -6693, -2931, -5106, 14485, -17691, 1230, 14719, -19684, 14602, 6301, -7540, 1494, 2230, 6244, -4520, 2250, 12542, -8735, 6403]
909F403P640k9432K4212m665n655O441l109O079j9546K4588j1357j4938K3824
922A0485j1872m57M479j440l355n333J1653k275k0164K9723j2203j4090K9328
935A4479k8765J0763J906k949O306j6018K4204j5692o739K2465j8619m079K0867
948H129j1541k012N472J065k580j0587K6007k2404n38K4488k0619Q438m882O248
962D684o160j379J7336k0800O822J6924k0163M610Q531j6200J6076n322K275k796
976D438m510K3024l3383J6548Q966k3733K1738k860p327q16N300J639j3427O874
990B471J3036k2451J3622Q432k4012J3733m713M573q401N550Q217k2764K3477
1003A0770r857j2712J3855l951K54j78P09J092r941J0556O34k4423L1178r531
$$ y = [6403, 14043, -15389, 8823, 4158, -1497, 4944, 1835, 7914, -11632, 12956, 1599, -13339, 10485, -1387, -1844, 2635, 1195, -2160, -7493, 4160, 1885, -18279, 11444, -759, -14849, 14479, -14286, -3523, -1617, -4566, 1740, -14278, 9926, -5766, -12505, 9960, -8659, -12738, 8129, -3412, -5424, 48, 1113, -1467, -12054, 13953, -8451, -8989, 15499, -5120, 3318, -1564, 4684, -1476, -2855, 14481, -6319, 503, 17427, -2736, 1874, 10405, -5795, 10281, 4959, 7234, 4438, -72, 22952, -10431, 6117, 15083, -8650, 13088, 10228, 2901, 2085, 7385, 9024, -4403, 2471, 15507, -6944, 6678, 15110, -8902, 4831, 118, 4691, -3710, 1840, 10057, -12707, 10770, 913, -11799, 2056, -1895, -1641, -1819, -1110, -18, -9959, 597, 1231, -23192, 7986, -1545]
1017a545j1447J9560j8330R613p847P324P4j4564K4947r888j1659J5956p742p138
1031a2686J3068m840J906l407Q956k713j5737K4548j8641L705J2933r603N800
1044C289p632J1367j0406k916J6760j4572K180J8013j7325j10R020r742Q454r083
1058b703J4627r391l817K2212l0055J0704P478r543N673n71M110p784J702O610
1072I252j5609L905J6980k1103J1657K695j1892P239q952J2070j5958J0138J0518
1085A0940k3144J7308l941j1693P361K132k861m27K925N048j4790P711N616k2235
1099b0050K4482o660m643P182n855O969j5668J4366k414j0344K0270p312q977
1112h654J1258m524m005M077L0P216j2213J6601o372j5856K4534j7135M651N382
$$ y = [-1545, -12992, 6568, -11762, -2149, -9996, -2672, -2598, -17162, 7785, -2103, -13762, 2194, -5548, -12686, 382, -4458, -2552, -5959, 2997, 284, -15453, 9095, -9546, -5841, 7092, -2511, 3289, -4343, 7024, -3382, -6298, 10462, -4110, -1930, 16083, -1242, -1352, 7668, -2074, 6380, -2703, 11924, 2533, -1284, 20928, -9127, 1577, 9055, -488, 5185, 4614, 8724, 940, 2642, 9252, -6357, -2452, 14528, -6575, 5082, 7777, -4115, 3124, -5828, 6242, -9716, 422, 10940, -12204, 5104, 1163, -10530, -3169, -1037, -3898, -4325, -1400, 3648, -11142, -3431, 2185, -20050, 4432, -2228, -6871, 311, -5544, 1425, -14243, 123, -2291, -12635, 7635, 323, -8654, 2604, -1920, -5925, -1848, -1818, 5398, -6815, 9786, 3414, -12442, 12092, -5043, -392, 4990]
1126D990j237L829q933J1005q719o092J5400o877m533J6123j2979R54L025n795
1140A61N044r955J8957j2688j437J4355k0220P113O86n82j747J261Q168j0483
1154a367k171J0382j4951J900J4478j6641J1276l979J49j424r857J7712j8922
1167a3415J0134R733j7528J0528n18p548J903K090J414j550Q07J0222j8014P495
1181d247P092j7459J6058l516K896l625K618N322j8088J5467o78q449J2593r24
1195E060o820N738k566j39l357L943R654j7020J8829p463j1631J6759j1584M467
1209C870j290N861k35q773J0713p050q240J3851l395p423J2398p287J095m704
1223f09L485l05j0859K1254j3963j89Q229j0858L014k705M143l500K05Q471p586
$$ y = [4990, 3753, 7582, -1351, 9654, 935, -5157, 10243, 3366, -1167, 14956, 1977, 2931, 5956, 161, 5205, -4750, 14207, 1519, 82, 14437, -5783, 1330, 2016, 1434, -313, 948, 9116, -1367, -3538, 6844, -8107, -6207, 8271, -8370, 2906, -1073, -924, -2348, -12205, 5507, -13415, -3281, 6452, -11076, -548, -1066, -8614, -6711, -4621, -3207, -4757, -3950, 6272, -11742, -4247, 2845, -14614, 1444, -2072, 824, -2801, -183, 5139, -12949, 2518, 1840, -6609, 5984, 5060, -1760, 3978, 1412, 1273, -2084, 1859, 11513, -5507, 13322, 5859, -5772, 10987, -597, 3870, 2580, 8441, 8206, -567, 10146, 3096, -5144, 8707, 5312, -2111, 10287, 3000, 4095, -609, 2876, 2571, -8288, 12966, -997, -1186, 7043, -3815, -801, -3506, 637, -2863, -2658, 5813, -1773]
1238a773o078J2306j3113J375J0929j2008R425n665O727p476n878J5144j5575
1251a1660Q768O139r103K849K320k877k774J045N431l154m82J1567j7177P645
1265a463L579q593P663m496J0065r551N047M290j5256J0979K031o590N643K587
1279E935m531K753l990M584q185N219J0302j7388J5479o328n237O639m865L417
1293C804n515R404j093q411P200j917q778J0372j675n676P175l132L610j1623
1307f255Q838j977r345J7785j1297K28L758k735r69l885N709k344k472Q627m341
1322f75q750J3480j0653R23N232m906O292p215J0967j0887k564J1761j0229L956
1336c268M215l066o65K881j136k875j972R931n696k297J2233j4956Q068l83k553
$$ y = [-1773, -7851, 4455, -8658, -7283, 3646, -8362, 1063, -4602, 2125, -5351, -11229, 3915, -11660, -2892, 3247, -5856, -3007, -687, -3564, -6338, -5293, 138, -3016, -3498, 8069, -9108, -1463, 2116, -6477, 1186, -3310, 6755, -2796, 2251, 6541, -8715, 2264, 4295, -2295, 3348, 5935, 1404, 4157, 167, 4751, -3434, 1785, 12087, -5301, 10178, 3850, -1387, 5252, 387, 3804, -1711, 7693, 6600, -1811, 5389, 3472, -5306, 5066, 3391, -2285, 4890, 1758, 5368, -6255, 2583, 606, -8739, 9046, -2251, -2023, 1735, -1000, -1969, -5854, -145, -2489, -4961, 3666, -675, -9425, 4055, -6598, -5675, -443, -5349, 943, -6272, 4695, -6192, -8756, 3005, -7224, -3268, 947, -2119, -2784, 97, -1039, -3914, -5886, 4045, -1651, -3948, 8285, -6671, 1397, 1014, -1539]
1351a539J982l223J1082j0189M257L699r802N020M111o109K889K765k121R78m502
1366g02P646j1223O495P049j4153J1133m253m3j396o38L216p715Q482J040r269
1381d331N103K162r338P645l069m39Q45j106O986j4976J0491j155q169J1391n903
1396c863m4P89J772j855l723L692J720n462P905j431q267J1998p337J343j054
1411c817K277L397p355J2148r695o53Q742o092O10K828Q46q82j72K519j565o684
1427c548J4392q614j611J0143j1023P774m753L378j737m234J1104q235K8N106
1441H170n910O92M542o590K579L14J334r23n791R724j2066O264L005r474O489
1456B359k300L010o467J844L174p487N122K798q600M342L473p834M877m604N688
$$ y = [-1539, 443, -2780, 8302, -1887, 2370, 6069, -3733, 1287, 5398, -711, 2178, 4943, 2822, 3800, -702, 6944, -4279, 2216, 9265, -4888, 6245, 1992, 1949, 553, -85, 3131, -4584, 3898, 4938, -4331, 772, 2934, -6404, 1241, -1828, -2267, -1422, -2528, 4458, -10518, -27, -1182, -9351, 2040, -3863, -3907, -3118, -1346, -3201, -6924, -3232, -1512, -6974, 931, -500, -8767, 3231, -4106, -2763, -3817, -1540, 1857, -5498, 6650, -3045, -3698, 5044, -1048, -438, 2390, 3236, 2354, 2182, 4701, 3136, -3548, 10844, 2230, 619, 10762, -261, 7513, 2760, 6138, 4401, 167, 11271, 3036, 3064, 8170, 2260, 2952, 7494, 904, 3483, 3797, 5131, 4208, -1583, 8141, -3925, 2339, 5344, -4130, 2359, 59, 3069, -3398, -1554, 1620, -5867, -745, 2053, -6547, -2205, 1268, -6566, -1689, -6293, -605]
1471f05n079Q11Q507j4884J0975j939n289O116l280J779j011K223P55n143K461
1486c603N174r065Q348j233n159Q833o094M255o324N849J894p806J0504o250j99
1501h76L998j891k127J435K399K06l633M721q91p710J2607r091R09N012m755N254
1517E567p175O935m771l589R901o859r97N701m475l75K778m360K734m301P394
1532D108l296n939J0979j0812M672K07l810K795j202M802o878J298L146m655J067
1547c518M328o608L431K554l610J113m378Q437q562L732O152j1167Q944k498j448
1562c098J72k91L051k572K156L234o482K511N431r627Q460k366m37L022l901O232
1578E495r081O937Q20n812O943j902p57J257M25k430J80J973K678o297N971J82
$$ y = [-605, -5684, -4873, 3634, -11250, -275, -2214, -7503, -1387, -4667, -2888, -3899, -1676, -921, -6064, -3603, 1571, -7494, 854, -379, -5538, 3295, -2799, 1456, -4868, 981, 2875, -4931, 5573, -677, -876, 3122, 1231, -896, 539, 2938, 3144, -489, 4232, 3341, -4369, 8238, -853, 56, 5068, 313, 5567, -1608, 5327, 556, -3033, 6868, 9, -988, 4713, 238, -137, 2641, -1719, 1015, -3286, 4108, 812, -5127, 5852, -4960, -288, -81, -3891, -1096, -2298, 2504, -4374, -3076, 70, -4585, -3518, 810, -5798, -2367, 187, -3423, -2310, -6688, 1749, -6813, -3081, 3071, -8096, 848, -1650, -3098, -2926, -3217, -166, -2738, -582, 2652, -3830, -1319, 4112, -5515, 2945, 579, 142, 3164, -737, 5495, -3586, 3351, 4171, -1641, 5302, 3400, 2643, 3900, 4325, 1895, 2075, 4048, 6726, 429, 6400, 6582]
1594F582p336R045p478K780m39J211K394p746Q299n576k449N945l973j240M060
1609D079k366n11n24j582K425o900R911n919k921Q387q490L505l086J503p65o95
1625c949N029n484l44L990l564j989N230m677L463k92L43q57m223R140q674L908
1641b950L377n009M738k163J213k928J617L025k743J211M684o196K453L397p558
1656c832O443k617M186k461q58N544r341O967r65l253L247P05o09l78Mm93j832
1673D57O39M184p182O487j127m667M723n483L839l294L890j11n529O323l800k381
1689c032K850n47k162L578j219K34k980J569J733p502R913n540L42L635l774J773
1705a129l871M534k124n01M181k011k102M280l048j933M787l349L731l133M170
$$ y = [6582, -754, 8291, 813, 3593, 3154, 4365, 6759, -987, 7312, 1736, -713, 5232, 1259, 19, 4079, 1713, 1202, 678, -904, 1521, -5379, 4532, -1387, -4308, 4079, -4411, -906, -3992, -2489, -3254, -3949, 1080, -4404, -4748, -758, -4322, -6311, -1081, -5758, -2295, -2587, -2244, -3101, -7324, 1816, -6858, -2950, 427, -4582, 156, -2007, -794, -3722, -2105, 920, -1823, -612, 4072, -2124, 329, 3726, -3832, 2611, -6, 4180, 1719, 861, 6405, -2936, 4031, 3066, -187, 3060, 3765, 3156, 2778, 2782, 2289, 457, 1096, 5280, -1902, 4585, 3458, -1209, 3514, -1969, 1870, -1424, 2466, 2355, -3174, 3149, -651, -3032, -182, -729, -2891, 687, -532, -298, -3278, -1709, 24, -7478, 2435, -3105, -2763, 872, -2902, -1129, -5000, -466, -2590, -3091, 1090, -921, -3023, 1257, -1791, -3724, 1063, -2286, 1445, -1688, 2482]
1720B482k119l695P844p989M216J375r37P62o58J294l102R69K441j532j140O128
1736F339o373J869J688m744M016l052N879n501J455L623p324L974m79j418K20
1751A72K479j037r90r42J590l240p5N416p465O285k203j769J422l467M464n194
1767d554M870o63l564L597j045l044J926J127k464L078j333K713n780L629J047
1782d60o679Q629m185J515K08R4j7l613M824j324j070K775P69m001M795k849p10
1799a299K270j540M336n530O446l708k345N975n465K969l2J610j542K07R20j666
1815A606q76K982j230k430O772o211J987n52p76J273l750O892o246J932K498m376
1831e05P82J33j04p77J814o25j83l044M505m946K21M335n786N168k863O44j371
$$ y = [2482, 363, -3332, 4512, -3477, 739, 2114, 1177, 1939, 1281, 2575, -527, 442, 2883, 1351, 211, 6339, -34, 1835, 3523, -1221, 2795, -257, 5622, 121, 1576, 5199, -2125, 1849, 1370, -48, 172, 2651, 1614, 624, -318, 1272, -1968, -2043, 3373, -4092, 2193, -10, -1779, -357, -3824, 640, -4554, 316, -347, -3911, -314, -1359, -4403, -2477, -1350, -3814, -736, -2069, 644, -5136, -1507, -460, -7139, 1490, -2695, -1180, -972, -878, -895, -4508, 316, -1008, -2078, 697, 1466, -2535, 2260, -589, -1299, 971, -569, 3767, -1763, 4683, 975, -1370, 4605, -860, 2109, 2077, 3687, 2145, 2352, 3272, 1606, 730, 3712, 2482, 52, 6824, 613, 2600, 2048, 1272, 2545, -1205, 5687, -559, 1373, 3871, -505, 277, 410, 306, -471, 1343, 718, 535, -2509, 1996, -2950, -2729, 1606, -4180, 988, -1875, -1231, -2602]
1848b602r39L331n062L732N00j832L83J549l394J605O65m82J237j797M679o742
1864e169M823l15m045N395k527K697k974K902n4k897L301l57j962K990J573m129
1880g48M365l374J831j050M73L665o317P409m258n70K231k119J414n45J840j971
1896B276K52N38K4l763M609j902k203N043m733K588l164K406j315l083N935n376
1912a868K114L49j446j261Q03N9p85M3J114j016l245O218o234J711K277l216L599
1929g84l900M142l648N30K694m272K258J802j368l37K404k981K011j148K237j247
1945a607q51N606o648M375q90r98J221j24K701l732L466m76j744J505J124k565
1961C63K267J260k423K077k545L764m727L079J409n404O708l911L85j01j7K27
$$ y = [-2602, -3541, -210, -5272, -1540, -1040, -2872, -2489, -940, -4334, -2729, -2064, -2546, -1309, -3106, 1573, -5169, -346, -661, -4706, 689, -1838, 859, -2115, 787, 733, -2164, 1137, 780, -1182, 1808, 3381, -748, 3617, 243, 2074, 1024, 1497, 5162, -1155, 6254, 1996, 1426, 3657, 1538, 2952, 2407, 4247, 2276, 2528, 3066, 3090, -673, 3936, 2034, -169, 4874, 141, 2729, -435, 1971, 656, -2427, 3508, -1868, 246, 595, -851, -2112, -1309, -1250, -2035, -1992, -878, -1894, -5139, 1079, -5155, -3444, -1167, -4383, -784, -4684, -542, -4190, -3660, -966, -5238, -2980, -1178, -2546, -2883, -479, -3460, -1449, -2597, -360, -1607, -2458, 3148, -3500, 875, -15, -1013, 208, 84, 2785, -947, 2519, 2043, 299, 1804, 2928, 363, 2630, 3890, 1467, 3544, 999, 4763, 36, 3115, 4524, -880, 5828, 1917, 2302, 2201, 2184, 2411]
1977B411j572J638m11j677J214J594n822M953k216r61K198k580K740n059M613
1992A063k645j758L726k795R26n28P81k297J133J12k67j073K430o92l027N378
2008D67n513K867n07L77Q60l118N623m504J504J894k486L28K507j085m86J682
2024D10j390K030l157M628l332M51M533n655L959j662J378j331P37J753k873K545
2040C024K38j310n74K794l344K125Q9n64L81j929M529o441M139p29k534L709k211
2057A392J072k361J978n69j855R72J237k593J579J248n108M434k887J437j564
2072a588J15K381m876M710k741o04J077J84r17J03J327k244J331m49J381l669
2088d479M133o27k641M064l621K622k360L045j522j281M353l488J165N15j94j523
$$ y = [2411, 839, 2477, 2066, 389, 1603, 3197, -2625, 2328, 112, -849, 1349, -1231, 1509, -3550, 1063, -1582, -3340, 386, -2409, -1483, -2011, -1230, -3527, -2394, -2282, -2549, -3622, -1192, -1884, -4911, 467, -5046, -2179, -2686, -2309, -1449, -4567, 1056, -3448, -1944, -50, -2536, -2208, 299, -786, -1272, 410, -980, 1050, -2107, 2521, -811, -360, 4173, -1482, 2477, 815, 2193, 862, 1599, 3352, 479, 3024, 3262, 1952, 1378, 4172, 828, 2953, 3042, 2478, 2859, 930, 5459, -982, 3157, 2428, -106, 3603, 1392, 2464, 103, 2081, 1512, -343, 629, 1866, -727, 852, 2100, -3008, 1426, -1461, -24, -1588, -1473, 908, -3968, 742, -1999, -2603, -1526, -1342, -2259, -2156, -829, -3073, -1742, -2191, -810, -4479, -346, -973, -3614, 450, -3171, -549, -2909, 136, -1386, -2667, 1686, -1802, -637, -122, -316, -1839]
2104a839K893r27q8J87R86Q54m128N826m730J733K199k997K226j945K884l257
2120a23J155R99j223J36J677j264j499L078l294J877j518J974j509p19L757n920
2136b416L679j324m41J73j74J798k758K217j303p67m74K723l468J800R75l010
2152b770K628k595L137l709K459J184l651L724k054J93m57J833j754O87R09P0
2168a66p58P7K263m546M655j438l53J499j452K036l210L798k052l95K407o47q79
2185H39O38Q98k612K632j228J363j666K308l87l607M806m342K412o02L46N2j546
2202C04K880l332M27P15n4j478K858k144q89J676k350J818k718L514k719M2K816
2219A366m473K283j096R16j714J526R7j125M59L30j112j070M039l823K086k02
$$ y = [-1839, 1054, 127, 39, 226, 1212, 2066, -2062, 3764, -966, 767, 2966, -31, 2195, 250, 3134, -123, 1032, 2031, 808, 944, 2621, 1357, -142, 2936, -358, 1519, 1, 1975, 466, -253, 3504, -2416, 1263, -61, -502, -329, -503, 1295, -1463, 754, -549, -1316, -1790, 933, -2535, -735, 240, -2770, -142, -2737, 400, -3309, -850, 334, -3317, 407, -1647, -1454, -1911, -78, -1832, -1145, -236, -166, -924, -847, 1416, -3130, 1525, 87, -266, 1233, -219, 1817, -1393, 2405, 353, -42, 2365, 1718, 839, 1477, 2375, -237, 2395, 1167, 2530, 864, 3172, 2785, -822, 3984, -358, 2054, 1452, 1798, 1850, 304, 3184, -148, 279, 994, 940, -538, 2320, 176, -713, 963, -1387, 431, -2287, 1227, -1492, -1450, 1366, -3107, -824, -1920, -1004, -2718, -1192, -1095, -2220, -1761, -1431, -2543, -3613, 426, -3397, -1311, -1513]
2235a513n98Q60k025L598m315L359J66j450J217j64j25r37K237j420J030k30J994
2252A684k228O78J951m162M414j948J207n93N35J185l384L272j588J99P48J196
2268C166k166J039P18j781R02j319K726l477L656j439k118K981l188K128j673
2283A55J708j146p50J858k017l58N59P19k644L538k350N03l27o52J016l589N035
2300A258l846J185J307k134P07o93J639j938J527q0N6j221J883j331j142L303
2316D80k894K411j744J960j142r39L400m261L363k89rj44O34l61p74R92k92P33
2334A124j178L419l812J780Q44k519K696j812K438k699J766K55k423J938m06l49
2350A062j82J784k818J806p97R2q66k11K556m179M079k263o66Q22j246J346k394
$$ y = [-1513, -2111, -1251, -3276, 322, -3993, -634, -468, -1918, -701, -865, -990, -1927, 310, -1110, -80, -310, 1684, -544, 134, 2085, -2077, 2337, 389, 1596, 1003, 1538, 2723, -661, 2611, 1023, 1222, 1970, 3166, 1000, 2039, 2757, 976, 1878, 559, 3285, -192, 3464, 2025, -93, 2888, -300, 1828, 155, 1863, 717, -33, 1825, -192, -550, 9, 728, -1916, 1622, -728, -225, -552, -1204, -188, -3777, 1258, -2588, -1403, -96, -2230, -1523, -2216, -577, -2515, -988, -1068, -1012, -2233, -350, -1681, -2823, 480, -2414, -3, -1747, 213, -929, -1868, 1532, -2729, 634, 345, 336, 192, 826, 465, -309, 683, 391, 1124, -54, 3365, -447, 1333, 2177, -342, 2354, 542, 2980, 281, 2047, 2302, -121, 1817, 1411, 1062, 880, 2664, -154, 1652, 855, 947, 81, -130, 2426, -1753, 2326, 63, -603, 219, -1027, 319, -2075]
2367b075K876j738j20M49m98j436J218L95j911K468j969J615k297J804m13k424
2383d056M098k946J145J57j08p14J00J209j465J239L53Q13k457K976j765m05K429
2400F03j929K092k128L497k716L25J972j988J847l19P04j059J467p03j60J76J170
2417B851p90r18L486l886K440q70k14L62j055K926l569K474p22j201L65O64j033
2434A310j11J513k219J118j652K011k728Q84J647l727L342k228J137j605N97J
2450g10j687K094j274j2o94J726k601J614j47r13J211o11J265l189L168j286j317
2467c363K956j870Q68q29K604k160M09J103k60q68R33P28k312L659k613J128J55
2484B68l5J108k176L595k820Q52O56k86r2L68O86j379J667o69L10j413K156j377
$$ y = [-2075, 801, -937, -1057, -608, -1106, -2542, -1324, -929, -2840, -372, -2341, -726, -3023, -1219, -1632, -4056, 42, -2904, -1759, -1602, -1710, -2424, -2324, -1115, -2580, -1341, -988, -175, -2632, 344, -1421, -1826, 603, -1326, 766, -1362, 2135, -581, -256, 1716, -272, 1575, 1256, 1960, 901, 2368, 1665, 1505, 1681, 2851, 2061, 1143, 4629, 743, 3183, 2313, 2099, 2461, 1406, 4332, 763, 3237, 2515, 1314, 1679, 2343, 1310, 1199, 2712, 493, 1611, -41, 1970, -758, 126, 1773, -1954, 1388, -840, 297, -1308, -711, -710, -2397, -303, -1577, -1589, -2283, -557, -3158, -1544, -1691, -2604, -1393, -2004, -739, -3928, -760, -2046, -3363, -407, -2277, -1409, -2238, 366, -1794, -1385, -282, -542, -1410, -477, 251, -2061, 1598, -1015, 113, 268, 233, 1341, -835, 2760, -60, 792, 1448, 1162, 1070, 1438, 2124, 745, 2412, 1743, 2053, 640, 2796, 1419]
2502A419l95K215l110K133j667J567j691M1K169l030J837m93k58j008J276j379
2518c74J52N67l41J43k019L280l758J796O80k374J910j252R99j922J611o46p97
2535b345Q48N23o39n71J942k609J714m80J77j05J50J675l659L418j282K25M54
2552e64k85Q36j112K013j320R6K36J294j946J981J76j742K503k252K081j781J740
2569A954k31j784K996k039P42kK63j300J077K40p28L39r2N75k428K883j894j29
2587D42J251j465J594k243K073k737P46J131j450J78K09J75k012K099j559O26
2603i42p44J296q76j342L067l463K016l17n38M53n46J500j959J484k50l61k31
2620a753J453j270j08K009j677J178j175K138j815Q82J818k860K248q18P89j232
$$ y = [1419, 1024, 3239, 129, 2262, 595, 2162, 471, 512, 2681, -349, 1488, 995, 737, -271, 1005, -374, -222, 345, 4, 147, -1872, 1408, -2350, -554, 126, -2248, -338, -1590, -591, -2513, -902, -1548, -2345, -1497, -974, -1613, -2184, -242, -2851, -1137, -1617, -1440, -1545, -1395, 280, -3379, 39, -1243, -1018, -564, -849, -13, -1125, 888, -432, -336, -100, 1194, -752, 1229, 1405, -337, 2166, -86, 1995, 214, 1954, 1723, -61, 2935, 896, 1638, 1636, 1899, 599, 1676, 1916, 1188, 1527, 1435, 2010, -418, 2465, 571, 442, 1693, 228, 1822, -421, 1652, -1085, -339, 792, -658, -480, -271, -96, -2108, -9, -1568, -942, -1686, -390, -1266, -2608, 459, -3004, -988, -1305, -1843, -1390, -1936, -436, -2395, -911, -1161, -1522, -1753, -300, -1570, -1678, 331, -1346, -168, -1343, 795, -1020, -138, 1680, -1180, 1068, 250, 1039, -193]
2636a93J305P2o40J563o67j32j75J840k913K068l66l85P39j410J851k635K625
2653B547j105q04J487q71q5n42J190j830R27l36N39j506J012K49k543K982k360
2670a049P77m75O22k16j555K527k387P16k70K28q97P15L41j332J553j213Q38j620
2688b697K382j438m43K367k327J150q05J228j308J186Q73j221L65J40N19j434
2704a463K398j448N36O95n37Q33j702L030l002J553O91j162J000n92J065j791
2720A04J705q55J87l8J063j245p9J567k780K209j010P92q35K67R53k917K754j558
2738B84o3J47N09n67o58J081j662R43r33J575k297J732n5j959K277k029J081j407
2756b001J892p95j177J876j541K47m3J098j772J504k73k90J25R9Q58k286L020
$$ y = [-193, 1112, 1184, 544, 2107, 1440, 1308, 1133, 2973, 60, 2128, 1762, 1377, 2116, 706, 2557, -78, 2547, 1442, 638, 2125, 1254, 1169, 627, 1817, -13, 914, 578, 1117, -389, 623, 872, -1671, 1311, -1049, -272, -747, -125, -341, -1896, 631, -1756, -1040, -1310, -1082, -1979, -1264, -923, -2255, -702, -1915, -1077, -2697, -315, -1753, -2196, 171, -2156, -1006, -1811, -583, -1891, -705, 168, -1053, -688, -548, -29, -1463, 935, -513, 23, 718, 181, 1014, -688, 2342, -660, 893, 1584, 422, 1422, 830, 1895, 104, 1809, 954, 1141, 1103, 2166, 921, 842, 2409, -371, 1838, 828, 1620, 785, 1052, 2005, -912, 1842, 284, 221, 368, 877, 310, -348, 733, -929, 14, -919, 656, -1641, 91, 36, -1923, 354, -1675, -594, -2001, -109, -904, -2081, -205, -1746, -1499, -1542, -444, -2216, -712, -985, -1275, -1150, -1051, -193, -2479, 541]
2773E41j540J70R34p87Q49j343K118j760J204R3p0j60O94j61j157K328j939J441
2791A455o75J211q12q66K374k804J702m37J13k32P5K00j162J410r36L02r60J764
2809A722j947K40J287k159J647j491J724j842R39M60k179J453q67N14j055J403
2825a51j090Q9R7k19m3m57J954l092K449q38j68M40r43J574j937K450j395j8N72
2844g26j10o9j63J292j916K094j060J162j063O19M05j632K617j602R21k09P25
2861A285l45o23J641j688J109O6L28j121J388k28j099J359j267J521j920K484
2877B890k129K12J348j976J518j245J333j528J136m91m92J84k26M20j697K390
2893A647k177J003m59l65M20j094J980k612J561k40p74L74j76L90j513J868j409
$$ y = [541, -999, -829, 105, -682, 167, -1176, 942, -818, 386, 479, 409, 249, 943, 782, -375, 1953, 14, 1455, 780, 1991, 1179, 313, 2687, -117, 1585, 1148, 1261, 1029, 1104, 1304, 142, 1552, 616, 918, -42, 1722, -225, 15, 1302, -857, 790, -701, 1023, -819, 120, 580, -1599, -146, -1013, -499, -1554, -151, -1241, -1152, -1055, -1274, -1317, -1774, 180, -2912, -463, -1301, -1469, -1029, -1972, -398, -2335, 115, -1280, -1298, -726, -836, -905, -1068, 224, -1692, 402, -658, 504, -559, 60, 465, -1167, 1450, -152, 769, 560, 1285, 940, 317, 1958, 270, 1379, 1445, 1773, 652, 2040, 1812, 713, 2072, 805, 2326, 406, 2890, 761, 973, 2321, 345, 1863, 618, 1951, 423, 1559, 1068, 576, 760, 534, 954, -743, 1647, -530, 473, 14, -351, 69, -1025, 955, -1657, -96, -336, -1110, -736, -912, -522, -2035, -167, -1576]
2910a576N60o26Q56j116j78J718j950K017j548R41o48M30N78j724K133j062nj41
2928a341J404q57M8Q95j055J225j175J852j738J532j50j357K036j246J446j494
2944B5J525r27L37N88q36L76p2J035j901J646q57K55lm70J022k181K998k392L92
2963E60M94m64j02l19R97j574J075n51J05j098J325m88j431K173j597P72j185
2980a308Q01n71n15J836k135J388m94L35j156Q71L4p65J066l91K77j024J707j600
2998a644O29R02j310J447j365J955k278J731J37q16J056l65K03o61J907j887J152
3015G93j49J92m75O9J617k487K138q79k05O61q9N20j648J916j171L68l65N13j032
3034B87L12J006j668J356j042J093j333M75J85j248J843j726Q13q03P01r86K2
$$ y = [-1576, -1016, -1642, -786, -1902, -2080, -362, -2312, -295, -1843, -902, -1550, -1120, -542, -2266, -133, -1195, -1200, -1341, 63, -794, -746, 149, -906, 319, -856, 996, -742, 790, 640, -717, 1319, 73, 1519, 25, 1550, 623, 960, 1548, 712, 1088, 1016, 2051, 150, 1796, 939, 1194, 1191, 721, 1743, -438, 2560, 168, 560, 1054, 590, 488, 169, 1166, -408, 667, 116, 221, -877, 448, -40, -1471, 702, -895, -123, -1308, -507, -1078, -1593, 243, -1892, -504, -998, -663, -1819, -948, -914, -1679, -613, -1004, -727, -1751, -44, -1644, -1015, -113, -1423, 24, -1341, 614, -1664, 67, 204, -612, 444, 79, 282, -379, 1528, -359, 793, 644, 836, 361, 430, 2047, -440, 1698, 819, 614, 1275, 1186, 1706, 58, 1974, 803, 1171, 806, 1319, 287, 599, 1605, -63, 1293, 251, 1344, 11, 486, 671, -577, 1266, -460, 353, -450, 251, -735, -713]
3051g13O65j033O47n49P53j689J598r02o69J521j398J204j642J837j584M29P98
3068g27r91N63l06R18j357J323p20L38M8J40N80j410K217j804J360l00j02O00
3086C70n61J578j954J579n63J56J27M19K08q23J718j685J085j099J710j351K70
3103A184J416k387K158j386R12j038R81o07p46J304j104O17q03J348j950J030
3119I29j36q49P97j127J418k211J862r76o74J116j008P91j146J438j827O67l4
3136i70k2l93j39J085j996K422j558K54J79j8N61j552K254j871O89K67L21m36
3154i23J23Q21j427J542p97R96j163J319j19r50J507j422J507j085J186r43M59
3171F31Q78j118R84p83P81r54J453r96N4O70r36P84j283K032k164J060K05j220
$$ y = [-713, -48, -1081, -434, -983, -230, -1919, -321, -1223, -1892, -371, -1769, -565, -2207, -370, -1954, -1525, -727, -1718, -1155, -1461, -543, -1900, -577, -1297, -959, -911, -771, -191, -1601, 616, -1188, 172, -128, -230, 370, -191, 1387, -567, 1012, 449, 605, 732, 1151, 1359, 536, 2254, 569, 1654, 555, 2265, 914, 1184, 2600, 213, 2371, 985, 1897, 859, 1840, 1233, 487, 1791, 687, 1304, 501, 1849, -101, 929, 793, -56, 741, -386, 1032, -1179, 683, -293, -967, 149, -859, -68, -1214, 224, -1603, -936, -970, -992, -1385, -1524, -439, -2435, -13, -1571, -1317, -1138, -1156, -595, -2147, 107, -1764, -1075, -808, -487, -923, -800, 21, -1406, 136, -661, 335, -828, 491, 372, -578, 929, -493, 1014, -71, 1115, 172, 631, 1509, 391, 1375, 592, 1373, 419, 1872, 876, 930, 1600, 664, 1448, 165, 2197, 33, 1093, 1298, 78]
3189G8R19r63J412j684R84m69j93L82l11j46p85J750k077J260p00L62m12l96J235
3208B46k080K019j399L33k11L20O5o55J107j222O32m11Q84j248Q25N66j450J762
3226H3j110R16j006R53j74o75J501j204R86p14J166r16L48M25l33N61o91J128
3244A244j645J703q69K50M18m80P74j176J599j525Q41%m72K92j59M23j507J718
3262A429j205O27l97L09l07o89J542k208J284o56K86k53n15R86j436J505j079
3279g77K59p50J050p46k02P06r13Q07j158J485j426O90O44j274J206r04R59j437
3297a781J348n41%N34n75O72n89J626j885J397J39o58M96m53J300j516J429p37
3315B06J43O32n22O02n15J478j889J185l69L7J0K83N63j669J721j280Q08m48J64
$$ y = [78, 997, 34, 1446, -238, 746, 277, 84, 466, 155, 9, -776, 974, -1103, 157, -543, -181, -593, -989, 246, -1834, 185, -1214, -881, -1092, -772, -707, -1362, -255, -1477, -845, -1256, -372, -1620, -795, -229, -1679, 83, -1027, -111, -1117, -164, -338, -1013, 488, -716, 270, -444, 722, -194, 154, 579, 246, 807, 116, 1244, -401, 1302, 433, 683, 1101, 621, 1395, 219, 1818, 293, 1134, 1134, 662, 954, 795, 1218, -289, 1429, 224, 851, 454, 763, 456, -233, 1309, -899, 385, -271, 15, -238, -753, 233, -1203, 302, -777, -518, -1268, -218, -964, -1166, -460, -1373, -566, -1724, -239, -1665, -975, -331, -1605, -399, -1303, -344, -1781, -433, -974, -974, -440, -1015, -343, -932, 694, -1191, 206, 345, -313, 183, -270, 1030, -486, 943, 206, 349, 981, 459, 1061, 546, 2024, 135, 1320, 951, 988, 998, 1281, 1844, 175, 1896, 616, 1424, 976, 1140]
3334A140o5q94J430j575R46n78N10n66M37J45j118R35j264J242j506J312j024
3351d93j94Q45j326J205r16R63j369M97M58j064R16o83M23r33J209j321N18N30
3369g35n41O69j345J949j739J198o2n64L72J80L11j169J533j000Q43n32M79K64
3387A11o69J485j605J554r16P37n29R9Q37j511J595p88N90k64M77j91n14R80r32
3406E46N86o33J253j379P02P4j258J424j223Q86r12Q90n53l52N43n75N88j019
3424d12J230j320Q73l49m01J20j49O81j696J597r28J33K71p25P28j083J433j606
3442a603Q69p9J53j54J97M5p43J496j430R86p07Q63l22n84J267j213J140k54M29
3461C56p00K49M15r60J519m22M52j273J632r43OR03j152R62p08J163j185P45j07
$$ y = [1140, 1075, 181, 1611, 36, 982, 404, 914, 348, 785, 930, -188, 747, -517, 725, -781, 531, -493, -687, 158, -1168, 37, -879, 84, -1285, -788, -330, -1394, -478, -1161, -738, -1671, -462, -1783, -1265, -735, -1276, -607, -1952, -3, -1742, -544, -606, -1170, -798, -618, -307, -1476, 57, -943, -100, -632, -153, 111, -558, 927, -678, 876, -40, 697, 168, 267, 1104, -407, 1188, 400, 990, 726, 1203, 1012, 498, 1478, 546, 1132, 499, 1752, 373, 1075, 1149, -109, 1315, 92, 978, 66, 956, 403, 51, 594, 19, 607, -412, 818, -502, 371, 22, -379, -259, -408, 273, -1423, 174, -754, -621, -350, -1075, -347, -1430, 3, -1603, -734, -813, -660, -814, -617, -572, -1315, 181, -1249, -263, -970, -107, -429, -1013, 254, -959, 181, -73, 356, -344, -95, 320, -640, 879, 457, 909, -364, 1268, 325, 331, 1234, 82, 1044, 336, 1499, 314, 1059, 952]
3480I52l58M38n41N97j028J265j116J18K23k06J13o62J183j525J167r55K42J55
3498F2o79J155j611J448p65k45M3j08Q0l47P47j135Q68o64M77m35R6M18r38J136
3518c97r78N97k73L66k56l11R80j157J153o92R10j147P07L37n14P44m64R63j239
3537f71J403q05p5J251j164R35o24Q84r15R40l45L56k74%P01j326J560j205O12
3556A238Mn83N63n24Q16j052R86p33K22k16J05J32q70J081j013N64o63L48l50
3575E5k16Q22j344J004j084R40q17L78j57p01J000p80N81p60O43n52L12K11o75
3594a140P21p36P55j162R89j17o41Q48n65N29p85Q70o34O03K28m13M17l71R31
3613C27j440J306m16J68K61l6N58r50J438j084P11l82K54P0l64P49j071J238q78
$$ y = [952, 594, 1032, 491, 1088, 60, 1325, 209, 327, 550, 344, 457, -205, 978, -547, 620, -335, -93, 62, -617, 538, -1073, 375, -390, -635, -592, -700, -620, -967, -220, -1355, -487, -1151, -674, -1109, -1013, -595, -1533, -397, -1375, -778, -1051, -685, -941, -1252, -272, -1429, -276, -968, -58, -1205, -498, -161, -675, 69, -395, 568, -671, 732, -73, -148, 1103, -61, 874, 250, 1134, 219, 1159, 814, 1170, 896, 896, 1597, 271, 1831, 626, 1238, 1242, 659, 1222, 698, 1514, 462, 1448, 715, 937, 721, 826, 958, 88, 1169, 156, 720, 57, 405, 55, -161, 661, -683, 321, -763, 177, -640, -262, -419, -1120, -120, -900, -319, -1079, -436, -988, -676, -465, -1140, -419, -1155, -400, -1562, -573, -690, -1331, -483, -1048, -519, -1304, -434, -1068, -465, -237, -650, -233, -604, 327, -1113, 193, -223, -55, 206, 170, 728, -222, 1216, 132, 843, 461, 715, 785, 421, 1170, 99, 1337, 459]
3632D59O50p70N03J04o64J145j380J073r72P52l55l73Q66j242R84p21O50r18M25
3651B16P3p29N48o02O35j076R36p46M90Q4r56Q35o31O92j157J290p12j53N02n74
3671a035M09p04O33n72P17l14K70O2m16J251j648J370o26J34K71j70M94q15J215
3690E26q48O43m75P14l29N1O95j008J062q84O89o61N57J10q11J057q31P40n59
3709D38O25m97QJ73m86Q53r77Q88q88M95j52l68M29q07Q99j154J284j089K46J62
3729H2n22M44o77P37j130P66l92J63Q5k48M23j087J293j289P97j87r2J51l60R13
3749a30j170R99p37O83l46N06jn01R17j162J164r01J018n82K70N78j130J041o90
3768a74J076p79L86n7j11O99o60O73q01P37n22L49M49o01K47p66J341j151P55
$$ y = [459, 1109, 339, 842, 946, 282, 1427, 47, 1120, 148, 900, 545, 172, 1038, -204, 780, 59, 709, -209, 216, 289, -440, 108, -494, 141, -935, 1, -745, -255, -171, -1127, -292, -923, -231, -1388, -98, -810, -963, -461, -1035, -626, -1330, -697, -1269, -552, -866, -596, -534, -950, 301, -1347, 23, -603, -469, -198, -368, 126, -689, 526, -322, 321, -154, 560, 231, 282, 977, -31, 1031, 147, 836, 175, 732, 842, 31, 1088, 257, 997, 438, 1063, 566, 574, 747, 261, 1114, 137, 1025, 137, 632, 480, 112, 541, -266, 633, -521, 763, -326, -80, 82, -440, 4, -673, 64, -1066, -300, -692, -529, -444, -692, -269, -1356, -63, -1352, -555, -742, -834, -683, -1043, -130, -1300, -301, -1038, -355, -701, -195, -196, -697, 220, -942, 222, -679, 339, -243, 27, 605, -525, 516, -174, 902, 123, 509, 452, 341, 1040, 380, 1053, 252, 989, 467, 816, 1265, 664, 911, 145, 1486, 335, 1090]
3787A090k64J4J54p24N65q14Q23o48O40k68n8k64j61M91j201J290j081K34N6l77
3807e03L28o17Q76r83N93o11K91k02K3K20o67P31o07N64p35Q16j76l79J005j070
3827a103Q78o63M84m26L93Q9p70J055o80P13q22R59j7k84M20m92O60p95J294j163
3847b70O84j18j76N60n37P90p32P15k66p7J03P8J82q63J041j010R11o34J63%l14
3868B30P30j063J137j120N85m27J10J7m06N69r74R74n85M19l52k20L84r17Q56
3887e3r18J046j154O08j61l23R31j223J097q33P00o84K36R7k10M76m40Q61j366
3906a313J291m07l49O39k44O06r41J124r61P25q7m2J98r8P74j312J511q77M99
3925G36j88K7K77p04J105r56R05q29P08m23m54O76q16R84o28K12l65O00l15k99
$$ y = [1090, 826, 840, 994, 270, 835, 21, 844, 196, 836, 568, 510, 246, 85, 576, -625, 665, -416, -182, -126, -503, -175, -792, 84, -899, -306, -917, -626, -828, -805, -585, -1252, -521, -1128, -564, -1299, -483, -659, -1038, -33, -1103, -225, -888, -404, -830, -437, -348, -1118, -63, -743, -30, -852, 107, 90, -194, 226, -266, 394, -401, 893, -270, 414, 296, 120, 680, 143, 933, 201, 916, 650, 573, 676, 754, 936, 73, 1114, 104, 1015, 381, 544, 544, 230, 960, -103, 1034, -86, 499, 72, 182, 199, -207, 362, -612, 362, -223, 196, -156, -376, 8, -909, -53, -971, 75, -1079, -471, -632, -955, -24, -1247, -150, -983, -283, -967, -731, -634, -844, -368, -808, 53, -1313, -22, -429, -778, -139, -383, 223, -718, 406, -555, 170, 83, 41, 239, 141, 915, -397, 1114, 237, 736, 548, 575, 852, 148, 1253, 297, 1202, 373, 1081, 658, 204, 880, 64, 1048, 420, 632, 267, 867, 552, 253]
3945B53M97o08O35j247J028p96M98k9q73J020r43M90q23P64l04O2l4l17N82q69
3965a014R21r98M19L89p02M64m96P08j161J287o89M82r5k49L75q07J440j290P40
3984b76k58L24j91O8M99o93J250r00N65l17K2K21m17R00o45R14q33Q21n77P8M07
4005I62p93R67r32J126j070P31k98m49Q52o45P00q28Q90j217O70m7l81M42q45
4024a65Q52j060R95o91L13k95j17N62j055R18r42O73l32l27L35o20P88q28P83
4043b13r58Q35o08N05j7o16J220j345P71o25P04m28J08N60q20R30q51Q77n91O49
4063H7j88k87Q03p65O76p52J043r18P44n3l10P05q34R00n85P51l81k98N22o24
4083B36P17o31P42o78N53k35j75L96n78R04j303J158j046O17k22l39J95m75Q96
$$ y = [253, 750, 142, 777, -470, 558, -238, 260, 231, -642, 378, -565, -75, -898, -134, -438, -376, -410, -727, -145, -1014, -93, -1091, -672, -283, -985, -521, -1017, -309, -1470, -183, -872, -390, -485, -734, -359, -1166, 274, -1016, -276, -534, -210, -401, -333, 166, -527, 723, -177, 388, 71, 93, 314, -103, 797, 152, 1066, 233, 1054, 477, 555, 962, 169, 1136, 204, 1330, 260, 991, 693, 244, 1096, 451, 1151, 323, 1213, -4, 666, 619, 238, 680, -165, 687, -373, 622, -69, 244, -51, -168, 394, -661, 257, -685, -12, -344, -671, -336, -956, -168, -996, -213, -1171, -336, -944, -439, -456, -1072, 148, -1197, -426, -1051, -347, -775, -667, -107, -927, 3, -848, 29, -562, 87, -101, -388, 415, -350, 326, -426, 617, -301, 443, 390, 80, 785, -49, 851, 266, 1017, 636, 338, 860, 236, 953, 322, 1064, 386, 939, 704, 529, 925, 347, 1251, -52, 1106, 60, 677, 455, 116, 311, -164, 732]
4102G32j109R88p18K48j24j61K62r17P92o89P27o24K39J5m14N92o85Q15p41L35
4122d37k10j12K71n44N68n37R40r38R75p29MP99j020J021q82O30m05L27J68k12
4142c23O50n13N88r05R95p28M91O3l43O18m86R34q80Q17m25M0nj37P01j216J205
4163A141n90J54j67j70M09l06L97p39P16p82R73r61M03K33j362J688j655J174
4181E56l31j30J78n63M39m91N85j023J042o31M14j008m69J226p56R39r91P56n77
4200h35J26K98o22O90o28P74o04N77k34r3K93j71N62r38Q48m34M14K6l2L91o48
4221b40R99r94P96m32L30j11l1M41p61J051o63M62o54M75L1k90N51p56O80n51
4241C33N71o80N25k73n42R44m95L29o68O69o92J00N00q54P48p62O31r78Q03m70
$$ y = [732, -377, 611, -107, 141, 17, -144, 118, -799, -7, -696, 31, -593, -354, -339, -753, -161, -846, -31, -772, -437, -647, -759, -488, -1032, -464, -1001, -61, -999, -24, -753, -749, 50, -970, 51, -831, -201, -606, -279, -111, -323, 327, -186, 402, -503, 492, -236, 255, 318, -25, 593, 107, 1041, 161, 978, 553, 593, 588, 451, 1152, -64, 1141, 551, 705, 538, 368, 777, 471, 868, 129, 845, 63, 1036, 75, 478, 711, -651, 1037, -618, 556, 225, 95, 273, -290, 149, -342, 243, -780, 262, -369, 45, -963, -1432, -206, -962, -23, -1014, -258, -835, -709, -411, -1033, -343, -971, -197, -801, -224, -458, -551, -258, -429, 133, -805, 43, -391, 23, 49, 17, 408, -240, 759, -235, 561, 129, 459, 348, 317, 758, -3, 1048, 385, 847, 193, 668, 699, 409, 960, 204, 884, 333, 904, 224, 749, 476, -66, 878, 383, 712, 44, 713, 21, 121, 621, -233, 515, -247, 384, -594, 209, -261]
4261b61k36O58j105Q04p02P71m34M8k61J5L65r33J035p18Q37m81K1O2o7L67q26
4282a041J043q72R10o05M82k87j91Q42j012J046n90L22o8O1N15p33P95q45R07
4301F79o85O22j01k87P06q61Q66o38N00m27P20n27j81M64p19Q52o11J41l34O33
4321H12k21l82O98j014O15n27M38k57j59P9k59O20j195Q99p34M31k75K55j84n10
4341h70Q40r47Q15r73P32p6l10N98j057J312p05L72l45M25j48m2L22p44J246j357
4361i12Q87n12M00L92q44P60n68O99m89M30j97J00L00m57O05p64J007p72N15k3
4381E57q1L39n90P64p92Q73o55K66j80j17P45q24M69n86O88n84K55j12k37N87
4401G85r89R31j027O33p78J091j108M26N88j064Q62r71O92p58N69k51k54O14r92
$$ y = [-261, -497, 161, -944, -140, -842, -71, -505, -457, -718, -703, -338, -1271, -236, -954, -117, -598, -577, -515, -582, -215, -1041, 2, -870, 40, -565, -83, -370, -561, 281, -731, 315, -275, 47, -21, 40, 555, -178, 617, -228, 679, -6, 616, 515, 228, 934, 73, 939, 301, 801, 374, 1094, 567, 386, 850, 131, 983, 372, 513, 179, 812, 591, 209, 907, -107, 508, -19, 419, 162, 3, 82, -177, 443, -752, 147, -587, -156, -431, -176, -360, -870, -30, -977, -162, -1135, -403, -479, -789, -191, -1248, 64, -641, -269, -614, -189, -337, -379, -57, -801, 445, -912, -25, -537, -137, 255, -589, 171, -397, 302, -187, 243, 46, 146, 446, -11, 594, -170, 837, 65, 580, 557, 476, 815, 225, 989, 197, 1070, 415, 681, 501, 384, 1129, 305, 774, 188, 876, 292, 547, 435, 198, 785, -204, 727, -300, 333, -445, 646, -462, -36, 552, -512, 350, -621, 71, -687, -118, -369, -623, -9, -1001]
4420a001R79n53K60k28r4J67k06M51p16O25o97N42J26m33P58k83J17n55P31n21
4440e31N30l1j53M43p41J177j154P76l19j40O19n92O35q09P19r7N12m95K38j09
4460D78l39J004j105M41j58L64P0o44O38m07M04o26R90r11J60O1l13L78p58M59
4480A86k51Q02r35O14m01l09N69p81Q36p44M03n21J31n6q4L19l89O67r92P78o99
4501h57K90J99p71R75p17Q31m85J19O1j17J51l13P60o62O72o42N04P2k57L90o06
4522d03R60o51M00j88K18L2m82Q99r26J132r43L62q0Q3J39k67M55l32N77o96N85
4543H74m86J53K28p36R04j035O02m99L66K9l79O58p74L78p40Q56n00m0K68o18
4563d91O05p37O68q28Q78n48j12L02n10O58r41O70o16P04k22k7J24m50L90m75
$$ y = [-1001, -22, -575, -315, -543, -637, -470, -676, -225, -941, -316, -1013, -471, -345, -778, -20, -303, -186, -741, -10, -531, -1, -32, -185, 258, -483, 694, -460, 316, -3, -143, 476, -116, 519, -290, 429, 332, 844, 349, 587, 478, 139, 1143, 38, 479, 321, 685, 755, 111, 749, 342, 746, 120, 1110, 199, 359, 420, 107, 485, -273, 186, -65, 737, -198, 416, 15, -294, 275, -506, 330, -414, -11, -532, -401, -457, -541, -222, -611, 56, -936, -158, -857, -567, -368, -1139, -164, -881, -50, -535, -416, -355, -472, -321, -634, 126, -536, 136, -506, -2, 70, -187, 203, -403, 557, -94, 306, 118, 336, 368, -114, 785, -141, 991, 48, 410, 330, 413, 552, 285, 740, 408, 985, 289, 874, 388, 541, 769, 33, 937, -98, 504, 5, 371, 400, 21, 679, -95, 283, -457, 399, -101, -141, 127, -491, 114, -623, 45, -783, 95, -453, -565, -263, -773, -115, -1056, -386, -1002, -298, -520, -547, -423, -873, -483, -958]
4583i58P36o51N86l01J93K47m15P46r28J109q67O16%k84L36k87M40n23N20k85
4603C0M09k52k99P10n73P10q96R65o22J17K33l22P45o79L13o15Q35m76p1K42n74
4624g0N87l64O91q30L93k66PL17q30N87n33M40n02M95k47j12L66r84Q60q79P82
4645i2l55K55r8k10L06p53Q15o23M68j09N0K54n88O04p90Q04n17L30k01K78M53
4666B81m86L80o57Q03q09O22j09Q1J80m17N04m35L42j84K85K57m63L84m24N40
4686F75n02N35m08J40K06m54M61o18P55o62M73o6J04J12o70N46o06L96n19M32
4706C30k23j0J73n74N70o38Q56j034M03j67r2K77l44L85o58M96m65O89m54j82
4726f62L47n01P64n95M67n78K64J70k77N50n80O52p02P65n40R1K01j92L64n05
$$ y = [-958, -222, -873, -287, -588, -395, -148, -563, 183, -745, 364, -503, 113, 113, -171, 165, -122, 318, -205, 315, 30, 439, 187, -112, 598, 25, 735, -161, 804, 182, 299, 532, 210, 955, 276, 589, -26, 809, 333, 262, 504, -70, 517, 153, 844, 14, 407, 141, 148, 465, -365, 222, -311, 129, -373, 122, -125, -237, 129, -855, 5, -874, -92, -447, -192, -290, -500, -194, -947, -132, -755, -287, -396, -346, -92, -680, -76, -866, -62, -579, -249, -450, -172, 281, -205, 175, -482, 321, -488, 134, 25, 106, 286, -131, 373, -62, 280, 96, 381, 638, 175, 559, 135, 675, 173, 708, 300, 440, 646, 192, 653, 35, 790, 128, 601, 535, 639, 751, 81, 627, 21, 417, -102, 330, 107, 97, 270, -304, 266, -372, 484, -550, -147, -314, -406, -129, -473, -88, -746, -250, -715, -26, -480, -662, -315, -816, -52, -647, -180, -758, -494, -324, -601, -51, -631, 21, -681, 84, -456, -365, -164, -356, 8, -497]
$$ [...]
8191I
##END NTUPLES=NMR FID
##END=
