##TITLE=1H_TG-2307-O3
 CDCl3
 8 sc, 
 16.6.2023
##JCAMPDX= 6.0         $$ Bruker NMR JCAMP-DX V2.0
##DATA TYPE= NMR SPECTRUM
##DATA CLASS= NTUPLES
##ORIGIN= UXNMR, Bruker Analytische Messtechnik GmbH
##OWNER= root
$$ XWIN-NMR		Version 3.5
$$ Fri Jun 16 14:36:45 2023 Russian Standard Time (UT+4h)  she@DPX200
##.OBSERVE FREQUENCY= 200.13135
##.OBSERVE NUCLEUS= ^1H
##.ACQUISITION MODE= SIMULTANEOUS
##.ACQUISITION SCHEME= undefined
##.AVERAGES= 8
##.DIGITISER RES= 18
##SPECTROMETER/DATA SYSTEM= spect
##.PULSE SEQUENCE= zg30
##.SOLVENT NAME= CDCl3
##.SHIFT REFERENCE= (INTERNAL, CDCl3, 0, 15.7612)
##AUDIT TRAIL= $$ (NUMBER, WHEN, WHO, WHERE, WHAT)
$$ ##TITLE= Audit trail, XWIN-NMR		Version 3.5
$$ ##JCAMPDX= 5.01
$$ ##ORIGIN= Bruker BioSpin GmbH
$$ ##OWNER= she
$$ F:/spectra/data/she/nmr/H-F/1/pdata/1/auditp.txt
$$ ##AUDIT TRAIL=  $$ (NUMBER, WHEN, WHO, WHERE, WHAT)
(   1,<2023-06-16 14:35:37.67 +0400>,<she>,<DPX200>,
      <created by zg, POWCHK disabled, PULCHK disabled
       configuration hash MD5:
       00 E9 B6 7A A2 85 ED C7 34 08 36 98 17 FE 4E 26
       data hash MD5: 16K
       F4 26 EA 8D 24 6B DF F4 4C 58 52 D9 26 F0 B1 DD>)
(   2,<2023-06-16 14:35:39.90 +0400>,<she>,<DPX200>,
      <Start of raw data processing
       efp BC_mod = 2 LB = 0.24 FT_mod = 6 PKNL = 1 PHC0 = -20625.55 PHC1 = 10.45272 SI = 16K 
       data hash MD5: 16K
       1A F5 46 8B 0B 40 CC 2B 35 3C 01 C2 54 24 AE CD>)
(   3,<2023-06-16 14:35:57.81 +0400>,<she>,<DPX200>,
      <pk PHC0 = 2.155492 PHC1 = -3 
       data hash MD5: 16K
       15 D5 E3 86 48 55 5F EF 1B E3 68 71 A9 2A 8A 3D>)
(   4,<2023-06-16 14:36:01.57 +0400>,<she>,<DPX200>,
      <abs ABSG = 5 
       data hash MD5: 16K
       21 A7 15 DA E6 3A 8E BD 7A CB 5A 2F 46 17 93 EF>)
$$ ##END=
$$ 
$$ hash MD5
$$ E7 6A E0 57 AC 55 3E F0 DC 75 84 87 81 7F 09 87
##$RELAX= 
##$RELAX= 
##$RELAX= 
##$RELAX= 
##$RELAX= 
##$RELAX= 
$$ Bruker specific parameters
$$ --------------------------
##$DU= <F:/spectra>
##$EXPNO= 1
##$NAME= <H-F>
##$PROCNO= 1
##$TYPE= <nmr>
##$USER= <she>
##$AMP= (0..31)
100 100 100 100 100 100 100 100 100 100 100 100 100 100 100 100 100 100 
100 100 100 100 100 100 100 100 100 100 100 100 100 100 
##$AQSEQ= 0
##$AQ_mod= 1
##$AUNM= <au_zg>
##$AUTOPOS= <>
##$BF1= 200.13
##$BF2= 200.13
##$BF3= 200.13
##$BF4= 200.13
##$BF5= 200.13
##$BF6= 200.13
##$BF7= 200.13
##$BF8= 200.13
##$BYTORDA= 1
##$CFDGTYP= 0
##$CFRGTYP= 5
##$CHEMSTR= <none>
##$CNST= (0..31)
1 1 145 1 1 1 1 1 1 1 1 1 1 1 1 1 1 1 1 1 1 1 1 1 1 1 1 1 1 1 1 1 
##$CPDPRG= <>
##$CPDPRG1= <>
##$CPDPRG2= <>
##$CPDPRG3= <>
##$CPDPRG4= <mlev>
##$CPDPRG5= <mlev>
##$CPDPRG6= <mlev>
##$CPDPRG7= <mlev>
##$CPDPRG8= <mlev>
##$CPDPRGB= <>
##$CPDPRGT= <>
##$D= (0..31)
0 1.2 0 0 0 0 0 0 0 0.06 0 0.03 0 0 0 0 0.0002 0 0 0 0 0 0 0 0 0 0 0 0 
0 0 0 
##$DATE= 1686911737
##$DBL= (0..7)
120 120 120 120 120 120 120 120 
##$DBP= (0..7)
150 150 150 150 150 150 150 150 
##$DBP07= 0
##$DBPNAM0= <>
##$DBPNAM1= <>
##$DBPNAM2= <>
##$DBPNAM3= <>
##$DBPNAM4= <>
$$ [...]
##$SUBNAM3= <"">
##$SUBNAM4= <"">
##$SUBNAM5= <"">
##$SUBNAM6= <"">
##$SUBNAM7= <"">
##$SUBNAM8= <"">
##$SUBNAM9= <"">
##$SW= 18.05172834244
##$SWIBOX= (0..15)
0 0 2 0 0 0 0 0 0 0 0 0 0 0 0 0 
##$SW_h= 3612.71676300578
##$TD= 16384
##$TD0= 1
##$TE= 0
##$TE2= 300
##$TE3= 300
##$TEG= 300
##$TL= (0..7)
0 120 120 120 120 120 120 120 
##$TP= (0..7)
150 150 150 150 150 150 150 150 
##$TP07= 0
##$TPNAME0= <>
##$TPNAME1= <>
##$TPNAME2= <>
##$TPNAME3= <>
##$TPNAME4= <>
##$TPNAME5= <>
##$TPNAME6= <>
##$TPNAME7= <>
##$TPOAL= (0..7)
0.5 0.5 0.5 0.5 0.5 0.5 0.5 0.5 
##$TPOFFS= (0..7)
0 0 0 0 0 0 0 0 
##$TUNHIN= 0
##$TUNHOUT= 0
##$TUNXOUT= 0
##$USERA1= <user>
##$USERA2= <user>
##$USERA3= <user>
##$USERA4= <user>
##$USERA5= <user>
##$V9= 5
##$VALIST= <valist>
##$VCLIST= <CCCCCCCCCCCCCCC>
##$VD= 0
##$VDLIST= <DDDDDDDDDDDDDDD>
##$VPLIST= <PPPPPPPPPPPPPPP>
##$VTLIST= <TTTTTTTTTTTTTTT>
##$WBST= 1024
##$WBSW= 4
##$XGAIN= (0..3)
0 0 0 0 
##$XL= 0
##$YL= 0
##$YMAX_a= 300120
##$YMIN_a= -480883
##$ZGOPTNS= <>
##$ZL1= 120
##$ZL2= 120
##$ZL3= 120
##$ZL4= 120
##$ABSF1= 15.7546
##$ABSF2= -2.29725
##$ABSG= 5
##$ABSL= 3
##$ALPHA= 0
##$AQORDER= 0
##$ASSFAC= 0
##$ASSFACI= 0
##$ASSFACX= 0
##$ASSWID= 0
##$AUNMP= <proc_1d>
##$AZFE= 0.1
##$AZFW= 0.1
##$BCFW= 0
##$BC_mod= 2
##$BYTORDP= 0
##$COROFFS= 0
##$CY= -3
##$DATMOD= 1
##$DC= 0
##$DFILT= <>
##$DTYPP= 0
##$F1P= 0
##$F2P= 0
##$FCOR= 1
##$FTSIZE= 16384
##$FT_mod= 6
##$GAMMA= 0
##$GB= 0
##$INTBC= 1
##$INTSCL= 3.70164e-10
##$ISEN= 128
##$LB= 0.24
##$LEV0= 0
##$LPBIN= 0
##$MAXI= 10000
##$MC2= 0
##$MEAN= 0
##$ME_mod= 0
##$MI= 1.114404
##$NCOEF= 0
##$NC_proc= -7
##$NLEV= 6
##$NOISF1= 3.799351
##$NOISF2= 2.8
##$NSP= 0
##$NTH_PI= 0
##$NZP= 0
##$OFFSET= 15.76121
##$PC= 1
##$PHC0= -20623.39
##$PHC1= 7.45272
##$PH_mod= 1
##$PKNL= yes
##$PPARMOD= 0
##$PSCAL= 0
##$PSIGN= 0
##$REVERSE= no
##$SF= 200.130002066406
##$SI= 16384
##$SIGF1= 3
##$SIGF2= 2
##$SINO= 5.538805
##$SIOLD= 16384
##$SREGLST= <1H.CDCl3>
##$SSB= 0
##$STSI= 16384
##$STSR= 0
##$SW_p= 3612.71676300578
##$SYMM= 0
##$S_DEV= 0
##$TDeff= 16384
##$TDoff= 0
##$TI= <>
##$TILT= no
##$TM1= 0
##$TM2= 0
##$TOPLEV= 0
##$USERP1= <user>
##$USERP2= <user>
##$USERP3= <user>
##$USERP4= <user>
##$USERP5= <user>
##$WDW= 1
##$XDIM= 16384
##$YMAX_p= 405278544
##$YMIN_p= -570905
$$ End of Bruker specific parameters
$$ ---------------------------------
##NTUPLES= NMR SPECTRUM
##VAR_NAME=  FREQUENCY,     SPECTRUM/REAL,   SPECTRUM/IMAG
##SYMBOL=    X,             R,               I
##VAR_TYPE=  INDEPENDENT,   DEPENDENT,       DEPENDENT
##VAR_FORM=  AFFN,          ASDF,            ASDF
##VAR_DIM=   16384,         16384,           16384
##UNITS=     HZ,            ARBITRARY UNITS, ARBITRARY UNITS
##FACTOR=    0.220516191357247, 1,           1
##FIRST=     3154.29107824434, 0,            0
##LAST=      -458.425684761442, 0,           0
##MIN=       -458.425684761442, -570905,     0
##MAX=       3154.29107824434, 405278544,    0
$$ Real data points
##PAGE= N=1
##DATA TABLE= (X++(R..R)), XYDATA
$$ [...]
5592H585318J24790R0117J53083J36799K18735Q8319L05753M32731K86457J09964
$$ 8585318 8710108 8800225 8953308 9090107 9308842 9397161 9702914 10135645 10422102 10532066
5582A0532066L17377M43834M42378L78127M37017K98237K84758M78902L37181
$$ 10532066 10849443 11293277 11735655 12113782 12550799 12849036 13133794 13612696 13949877
5573A3949877K13509J65523L1091n2307j75433j13594m12347j97138k30963j43652
$$ 13949877 14163386 14328909 14360000 14307693 14132260 14018666 13606319 13409181 13178218 13034566
5563A3034566n5831k65627j77577k70528o5001J33675l6712L7017l7657K55185
$$ 13034566 12978735 12713108 12535531 12265003 12200002 12333677 12296965 12333982 12296325 12551510
5553A2551510j70568k60325K7686r6848j15952k71918n05856j63241k51617m05723
$$ 12551510 12380942 12120617 12148303 12051455 11935503 11663585 11157729 10994488 10742871 10337148
5543A0337148j05689l90843k28146m42956k82374j63082p8120l60949N8193J1716
$$ 10337148 10231459 9840616 9612470 9169514 8887140 8724058 8645938 8284989 8343182 8354898
5533H354898m9493k61996k09672N8768N4229O4114j87716j57246j56967Q6738
$$ 8354898 8305405 8043409 7833737 7892505 7946734 8010848 7823132 7665886 7508919 7595657
5523G595657J10066J6884j20878k47418J71352J85598k78481j80376k2576j4570
$$ 7595657 7705723 7722607 7601729 7354311 7525663 7711261 7432780 7252404 7229828 7215258
5513G215258J33015J40505J7651j03328L1782P1316J13359K06687L4298K20164
$$ 7215258 7348273 7488778 7506429 7403101 7434883 7506199 7619558 7826245 7860543 8080707
5503H080707n8717K10854j00097l25905p3101o5374k5452j45046l18326l3976
$$ 8080707 8021990 8232844 8132747 7806842 7733741 7668367 7642915 7497869 7179543 7145567
5493G145567j70613l2987J6471k51341j44029j94313p2671N7674j18502l5518
$$ 7145567 6974954 6941967 6958438 6707097 6563068 6368755 6296084 6353758 6235256 6199738
5483F199738K90732j2315j00770J3658P7410p8633r3773j46484K82207J38515
$$ 6199738 6490470 6478155 6377385 6391043 6468453 6389820 6296047 6149563 6431770 6570285
5473F570285L473K7511J66875Q426O8754K5085R2765K08738N5349R8399J72301
$$ 6570285 6573758 6601269 6768144 6776570 6845324 6870409 6963174 7171912 7227261 7325660 7497961
5462G497961K24218k0960N2166J17056J06722k36691J70958m0493q1856J86402
$$ 7497961 7722179 7701219 7753385 7870441 7977163 7740472 7911430 7870937 7789081 7975483
5452G975483j11785k60002j47055j01848N2447j21975J06265j79563n3267q5499
$$ 7975483 7863698 7603696 7456641 7354793 7407240 7285265 7391530 7211967 7158700 7073201
5442G073201k49546j0408q0145K21042o2177j54843K6073R480o3737l5488K8872
$$ 7073201 6823655 6813247 6733102 6954144 6891967 6737124 6763197 6772677 6708940 6673452 6702324
5431F702324J04860k01011K8910j20466N5560P1759p2041J40923J86521j55542
$$ 6702324 6807184 6606173 6635083 6514617 6570177 6641936 6569895 6710818 6897339 6741797
5421F741797j52175k8187O1225r131N3180k2009P2295l7329l8595J00015J42659
$$ 6741797 6589622 6561435 6622660 6613529 6666709 6644700 6716995 6679666 6641071 6741086 6883745
5410F883745K03097K83172l7021k74747N1221K4287J02485n4085O2030P8635N4130
$$ 6883745 7086842 7370014 7332993 7058246 7109467 7133754 7236239 7182154 7244184 7322819 7376949
5399G376949j96093O3098k8492K5476O9236J69600j7228j08716k74777O1638J68777
$$ 7376949 7180856 7243954 7215462 7240938 7310174 7479774 7462546 7353830 7079053 7140691 7309468
5388G309468J57738K8658j00092L0008R0950l6184J06801j2098m8749k3321k4431
$$ 7309468 7467206 7495864 7395772 7425780 7516730 7480546 7587347 7575249 7526500 7503179 7478748
5377G478748J49215K23250N7882k06748o4952K61241K94358J9416K38808Q3277
$$ 7478748 7627963 7851213 7909095 7702347 7637395 7898636 8192994 8212410 8451218 8534495
5367H534495j24800o3627J33539k06446o6640k381R5217J31949j3247r9895J02228
$$ 8534495 8409695 8346068 8479607 8273161 8206521 8204140 8299357 8431306 8418059 8318164 8420392
5356H420392M8170q6133k48814j23613j22234n1112p9492j00077k63969K2538
$$ 8420392 8468562 8382429 8133615 8010002 7887768 7836656 7757164 7657087 7393118 7415656
5346G415656k94903l05258l80493k0271n304j43809J19522k68748k80023j37224
$$ 7415656 7120753 6815495 6435002 6414731 6409427 6265618 6385140 6116392 5836369 5699145
5336E699145O7235J43238o6005k38482p4610o6480J2775k9326M2449N5093k84704
$$ 5699145 5766380 5909618 5843613 5605131 5530521 5464041 5476816 5447490 5489939 5545032 5260328
5325E260328k79554J43417J78063r5393j09528J22615N5988j76881k09572p7082
$$ 5260328 4980774 5124191 5302254 5206861 5097333 5219948 5275936 5099055 4889483 4812401
5315D812401J80797M4060k39787P1689M6943J80206J46837J71143n215M8929p3243
$$ 4812401 4993198 5037258 4797471 4869160 4916103 5096309 5243146 5414289 5409074 5458003 5384760
5304E384760p5834K93048O2475P7436K45794M2324K4334k51214J24184J11765
$$ 5384760 5308926 5601974 5664449 5741885 5987679 6030003 6054337 5803123 5927307 6039072
5294F039072l6248J37135O2840j13741J6768r1629k11588n4217m0522J53249o3767
$$ 6039072 6002824 6139959 6202799 6089058 6105826 6014197 5802609 5748392 5707870 5861119 5797352
5283E797352k13528j57570J3784j60082k68907j10960J27645J03735l72855l3800
$$ 5797352 5583824 5426254 5440038 5279956 5011049 4900089 5027734 5131469 4758614 4724814
5273D724814q2087j27897j87435J18632O0577k09124j96351L5085N6553k57896
$$ 4724814 4642727 4514830 4327395 4446027 4506604 4297480 4101129 4136214 4192767 3934871
5263C934871j27960j71472P1943P6121K47812j91676J6048J98234j32864j38690
$$ 3934871 3806911 3635439 3707382 3783503 4031315 3839639 3855687 4053921 3921057 3782367
5253C782367J57945k9647j49355K2938j03176J98270k012m0924j7095j92555r8989
$$ 3782367 3940312 3910665 3761310 3784248 3681072 3879342 3877330 3836406 3819311 3626756 3527767
5242C527767r7314O3347l1636N4978J11220j83118J12033o4085l9223J38378O6033
$$ 3527767 3430453 3493800 3462164 3517142 3628362 3445244 3557277 3493192 3453969 3592347 3658380
5231C658380m4407l3257O3322k5407k53881j2889J62930j95942l4702o060K01700
$$ 3658380 3613973 3580716 3644038 3618631 3364750 3351861 3514791 3318849 3284147 3278087 3479787
5220C479787J97911p8927m6203j17763J19346J85405j57017o3322J04600n3471
$$ 3479787 3677698 3598771 3552568 3434805 3554151 3739556 3582539 3519217 3623817 3570346
5210C570346P973K31080q4471j05072j87776L21003J51797k17650p2550k1946
$$ 3570346 3578319 3809399 3724928 3619856 3432080 3753083 3904880 3687230 3614680 3592734
5200C592734J06353J46608R4105j02665p2722J68874j6421k52943K18130p2619
$$ 3592734 3699087 3845695 3939800 3837135 3764413 3933287 3916866 3663923 3882053 3809434
5190C809434j47244l2926l2969J53314m2589M1592j06672J01617M8698J90904
$$ 3809434 3662190 3629264 3596295 3749609 3707020 3748612 3641940 3743557 3792255 3983159
5180C983159j20730O4332L9605q0520j6276K78n9529p1249M6787k62322K1575
$$ 3983159 3862429 3926761 3966366 3885846 3869570 3869848 3810319 3739070 3785857 3523535 3545110
5169C545110L29255J1740K7674k2460M3509N6193j4592O403K66609J87119L4439
$$ 3545110 3874365 3886105 3913779 3891319 3934828 3991021 3976429 3982832 4249441 4436560 4470999
5158D470999L37393j13984Q770P0263J53301m8652j2627R4181R6083j1893L4033
$$ 4470999 4808392 4694408 4703178 4773441 4926742 4878090 4865463 4959644 5055727 5043834 5077867
5147E077867r2158O28N5744k44O9463O9996O6846R0955k78470R7196L0508j08636
$$ 5077867 4985709 4986337 5042081 5041837 5111300 5181296 5248142 5339097 5060627 5157823 5188331 5079695
5135E079695L88740N8851l5020R980l6953J67560M5920k27507j9413R7031j58408
$$ 5079695 5468435 5527286 5492266 5502246 5465293 5632853 5678773 5451266 5431853 5528884 5370476
5124E370476K35995L2931K8838K77832L56416r187j42050K58345P3012J14476
$$ 5370476 5606471 5639402 5668240 5946072 6302488 6293301 6151251 6409596 6482608 6597084
5114F597084K74983J50266M42J14740L04700J24832J77486j96694k3475k9616
$$ 6597084 6872067 7022333 7022775 7137515 7442215 7567047 7744533 7547839 7524364 7494748
5104G494748j42317J56847j20870K8885p8983j22201K18045L3175J68209L88648
$$ 7494748 7352431 7509278 7388408 7417293 7338310 7216109 7434154 7467329 7635538 8024186
5094H024186L99093K29334J44569L71702L91602L63679J24900J15362j0958k0470
$$ 8024186 8423279 8652613 8797182 9168884 9560486 9924165 10049065 10164427 10153469 10132999
5084A0132999k1107M6980j41693j35321k10477k21200M504j7834k1533K8490O6394
$$ 10132999 10111892 10158872 10017179 9881858 9671381 9450181 9454685 9436851 9415318 9443808 9510202
5073I510202K09002J0148M39328L91084r3781J96576L62832K54988L36673M90730
$$ 9510202 9719204 9729352 10168680 10559764 10465983 10662559 11025391 11280379 11617052 12107782
5063A2107782L62301J62722K00399K85318L84770J14303p9272J58775L06658p0965
$$ 12107782 12470083 12632805 12833204 13118522 13503292 13617595 13538323 13697098 14003756 13932791
5053A3932791J7278J97774L18558j57320j48650J63187J14221J25516K21892j2273
$$ 13932791 13950069 14147843 14466401 14309081 14160431 14323618 14437839 14563355 14785247 14772974
5043A4772974j2634J1265J1662J35732l1735K7212j69309J3823j95947m7763l59599
$$ 14772974 14760340 14771605 14783267 14918999 14887264 14914476 14745167 14758990 14563043 14515280 14155681
5032A4155681l41398o1333J3358l85940m5767k5970r290J12746p5428j602L14855
$$ 14155681 13814283 13752950 13766308 13380368 13334601 13308631 13299341 13412087 13336659 13335057 13649912
5021A3649912J81189J76914K39411M47761K21950M9767L95337J44555M08225M50573
$$ 13649912 13831101 14008015 14247426 14695187 14917137 14966904 15362241 15506796 15915021 16365594
5011A6365594O48424K13952J56073P65459N72310O35040P62400L43279P64195
$$ 16365594 17014018 17227970 17384043 18149502 18721812 19356852 20119252 20462531 21226726
5002B1226726O27543P71208M78284O08040P01647O24315M74408L16326Q03017
$$ 21226726 21854269 22625477 23103761 23711801 24413448 25037763 25512171 25828497 26631514
4993B6631514N70125L54119L98700K40022K66287K22712Q497J68763j92541m91368
$$ 26631514 27201639 27555758 27954458 28194480 28460767 28683479 28691976 28860739 28668198 28176830
4983B8176830p7578o5780k18629m34490n15032n92222p85132o03232o52984q16687
$$ 28176830 28099252 28033472 27814843 27380353 26865321 26273099 25487967 24884735 24231751 23415064
4973B3415064q13176p60662q21855p61816n35185n17940k33063n62659o27847
$$ 23415064 22601888 21841226 21019371 20257555 19722370 19204430 18971367 18408708 17780861
4964A7780861l21724J11083K75m00723k11870l2156R6880k8657j72893R1055K35260
$$ 17780861 17459137 17570220 17570495 17169772 16957902 16925746 17022626 16993969 16821076 16912131 17147391
4953A7147391L93442J10706J08856L12950K46982O26039O50373Q4570L80397O47774
$$ 17147391 17540833 17651539 17760395 18073345 18320327 18946366 19596739 19681309 20061706 20709480
4943B0709480O33276P08108Q30604Q25800Q09065R21304R53757Q57371M58666
$$ 20709480 21342756 22050864 22881468 23707268 24516333 25437637 26391394 27248765 27707431
4934B7707431Q06555K64610K49940K31739o8441j38460l15362m7242K48757l7865
$$ 27707431 28513986 28778596 29028536 29260275 29191834 29053374 28738012 28690770 28939527 28901662
4924B8901662l31605m78858k73871m92005n22307p43511p90161q59453o91378
$$ 28901662 28570057 28091199 27817328 27325323 26803016 26059505 25269344 24409891 23718513
4915B3718513m73970n70596n57057m24264m48154m70209l07603k50282n4278k23230
$$ 23718513 23244543 22673947 22116890 21692626 21244472 20774263 20466660 20216378 20162100 19938870
4905A9938870l40799k02521j54608r2406J52504K9333J97729J26730K4286J49448
$$ 19938870 19598071 19395550 19240942 19148536 19301040 19330373 19528102 19654832 19679118 19828566
4895A9828566q905J11210K75733K74364O5943K92694Q6009K17415M21023O04749
$$ 19828566 19819661 19930871 20206604 20480968 20546911 20839605 20925614 21143029 21564052 22168801
4885B2168801L41754O84649M07753J015477O86662P96811R13040J097196P97520
$$ 22168801 22510555 23195204 23602957 24618434 25305096 26101907 27014947 28112143 28909663
4876B8909663P63498J206528Q96269J503610J636692J923471K128120K714279
$$ 28909663 29673161 30879689 31775958 33279568 34916260 36839731 38967851 41682130
4868D1682130L070608L377363L242947L537443L790064L100573Q92211j219996
$$ 41682130 44752738 48130101 51373048 54910491 58700555 61801128 62693339 61473343
4860F1473343j569946j282206j367634r55808q16499j0279L70822J001037J340197
$$ 61473343 59903397 58621191 57253557 56297749 55481250 55470971 55841793 56842830 58183027
4851E8183027J827381J728195J232327J061007J404412J293470J498389K233623
$$ 58183027 60010408 61738603 62970930 64031937 65436349 66729819 68228208 70461831
4843G0461831K583348K601224K580026K642943K921174L150960L656077M305481
$$ 70461831 73045179 75646403 78226429 80869372 83790546 86941506 90597583 94903064
4835I4903064M685624N754587O738565O951219P671164P938226N839121N89918
$$ 94903064 99588688 105343275 112081840 119033059 126704223 134642449 140481570 141071488
4827A41071488m776193p228651p845041p897006p193833n846787m939497l998802
$$ 141071488 136295295 129066644 121221603 113324597 106130764 100283977 95344480 91345678
4819I1345678l691527k873743k253334k506999k770636k824985j840370j231170
$$ 91345678 87654151 84780408 82527074 80020075 77249439 74424454 72584084 71352914
4811G1352914j180360p86061m32338j92727k73866p72206j127306p68604R2343
$$ 71352914 70172554 69386493 68954155 68761428 68487562 67715356 66588050 65819446 65911789
4802F5911789P24938J551703K284657K558525K563101K300547J527962P56193
$$ 65911789 66636727 68188430 70473087 73031612 75594713 77895260 79423222 80179415
4794H0179415q98080k918464m300164m326780m076980l306098k805249k375720
$$ 80179415 79281335 76362871 72062707 67735927 63658947 60352849 57547600 55171880
4786E5171880j792326j478190j278879j254067j351388r93059j044613j412512
$$ 55171880 53379554 51901364 50622485 49368418 48017030 47023971 45979358 44566846
4778D4566846j008433j159886j137862j301189j428329j465016j216276j334952
$$ 44566846 43558413 42398527 41260665 39959476 38531147 37066131 35849855 34514903
4770C4514903j202964j134393q14792q09943o89289o92968l33227j66911k91022
$$ 34514903 33311939 32177546 31362754 30552811 29863522 29170554 28837327 28670416 28379394
4761B8379394k42607L5437L99331P39664M75416j8204o28542q41577j120731j223437
$$ 28379394 28136787 28172224 28571555 29311219 29786635 29768431 29139889 28298312 27177581 25954144
4751B5954144q59027q25606n18901k51915k17751k05783k91765m39793l66941
$$ 25954144 25095117 24269511 23750610 23498695 23280944 23075161 22783396 22343603 21976662
4742B1976662j80326l78709k18219j42957l66785k11760k28300j31415L35878
$$ 21976662 21796336 21417627 21199408 21056451 20689666 20477906 20249606 20118191 20454069
4733B0454069k70874k24324j05166k35142n82133o36042m54704p06449m41452
$$ 20454069 20183195 19958871 19853705 19618563 19036430 18400388 17945684 17239235 16797783
4724A6797783q24392o58204m91315n99388m97033k79770n42792k96870k95153
$$ 16797783 15973391 15315187 14823872 14224484 13727451 13447681 12904889 12608019 12312866
4715A2312866k47268l09838j82295l03939J33759j97992n08191q0356k1624j07311
$$ 12312866 12065598 11755760 11573465 11269526 11403285 11205293 10697102 10616746 10595122 10487811
4705A0487811j94959j74633j70825J01652j78452j63029q7235K5015j27363n3306
$$ 10487811 10292852 10118219 9947394 10049046 9870594 9707565 9620330 9645345 9517982 9464676
4695I464676j2004L80N5109j69498r4865L90924K11175j002k44891J28325L34243
$$ 9464676 9452672 9453052 9508161 9338663 9243798 9634722 9845897 9844895 9600004 9728329 10062572
4684A0062572M23009M73866M73296M77632L32891P50395P86980N92812L91765
$$ 10062572 10485581 10959447 11432743 11910375 12243266 12993661 13780641 14373453 14765218
4675A4765218R5065q2945m18835p87638q54596n41769o64144o59921m47876l32689
$$ 14765218 14860283 14777338 14358503 13570865 12716269 12174500 11510356 10850435 10402559 10069870
4665A0069870m67271j4442o6024j49110q0160j84396j14627N2621L6952k25191
$$ 10069870 9602599 9588157 9522133 9373023 9292863 9108467 8993840 9046461 9083413 8858222
4655H858222J138K21785J60396k4764N4457q0590P787J11363P1421q1496N221
$$ 8858222 8859360 9081145 9241541 9216777 9271234 9190644 9198431 9309794 9381215 9299719 9304940
4644I304940k00406J32653q6894j64265O2426O2727J36366J7221r8904j82479
$$ 9304940 9104534 9237187 9150293 8986028 9048454 9111181 9247547 9264768 9165864 8983385
4634H983385r4609K85647o9377o904K02101r9866J90394O1950k15556M0483q5047
$$ 8983385 8888776 9174423 9105046 9098142 9300243 9200377 9390771 9452721 9237165 9277648 9192601
4623I192601j40139r2806K7956j82868r7861k01616K14212k61583N588K78109
$$ 9192601 9052462 8959656 8987612 8804744 8706883 8505267 8719479 8457896 8463484 8741593
4613H741593r2400p205j82201O8944P4195j2319k48242j0493j46364l0592N0612
$$ 8741593 8649193 8641988 8459787 8528731 8602926 8590607 8342365 8331872 8185508 8154916 8205528
4602H205528N510N951k14245j27212N1497M1635K32073K166j46989M4123p8249
$$ 8205528 8211038 8216989 8002744 7875532 7927029 7968664 8200737 8202903 8055914 8100037 8021788
4591H021788J36175L07726J04571o0971o8430J73241J84728M38724J53260R2786
$$ 8021788 8157963 8465689 8570260 8509289 8440859 8614100 8798828 9237552 9390812 9483598
4581I483598k8711j18943j30351J11397K64832p9787m1214l6950j14191R1865
$$ 9483598 9454887 9335944 9205593 9316990 9581822 9502035 9460821 9423871 9309680 9401545
4571I401545J51384o3258p4061J3211O1302k24542Q5010K06885O207J1446P7950
$$ 9401545 9552929 9489671 9415610 9428821 9490123 9265581 9350591 9557476 9563683 9575129 9653079
4560I653079L2122k282R0807j18986j62084j73867n4198j38561L7506j03569l25132
$$ 9653079 9685201 9682919 9773726 9654740 9492656 9318789 9264591 9126030 9163536 9059967 8734835
4549H734835J4751j38358k33986L8932k05562k44853n4011J26809j94999j12099
$$ 8734835 8749586 8611228 8377242 8416174 8210612 7965759 7911748 8038557 7843558 7731459
4539G731459j27205j49411R5336Q633k09426m2437L52052k26940j43768j81454
$$ 7731459 7604254 7454843 7550179 7558812 7349386 7306949 7659001 7432061 7288293 7106839
4529G106839O2577J73296l0593q1451j15983j512J40428J84476n5338J02445q1428
$$ 7106839 7169416 7342712 7312119 7230668 7114685 7113173 7253601 7438077 7382739 7485184 7403756
4518G403756p9006n1193j37978n811J47002O136L4585r555r5828k0522N6960K12504
$$ 7403756 7324750 7273557 7135579 7129768 7276770 7282906 7317491 7307936 7212108 7191586 7248546 7461050
4506G461050j22208j52368J11662l3712O1168j74805j48260M2601J28004J04129
$$ 7461050 7338842 7186474 7298136 7264424 7325592 7150787 7002527 7045128 7173132 7277261
4496G277261k01416K4760P3231K4481m3015j2651Q2289j28670r5240J26081K16647
$$ 7277261 7075845 7100605 7173836 7198317 7155302 7142651 7224940 7096270 7001030 7127111 7343758
4485G343758O0180j2945J45416L8313K89061K01815J28024P7937J59035L86468
$$ 7343758 7403938 7390993 7536409 7574722 7863783 8065598 8193622 8271559 8430594 8817062
4475H817062M83135M95587M32012J97957K38649L17267J33645k92162k62339m35381
$$ 8817062 9300197 9795784 10227796 10425753 10664402 10981669 11115314 10823152 10560813 10125432
4465A0125432n16358l72461l86605k90384J27030n48327l57801J24452q4215k31944
$$ 10125432 9609074 9236613 8850008 8559624 8686654 8138327 7780526 7904978 7820763 7588819
4455G588819R5024J10208J728q3797M7405j6698j52049N6302k8162j1204r8421
$$ 7588819 7683843 7794051 7795779 7711982 7759387 7742689 7590640 7646942 7618780 7607576 7509155
4444G509155Q1349J8967K4103j7730L12428J84581J71035J6729L29635o9292J49441
$$ 7509155 7590504 7609471 7633574 7615844 7928272 8112853 8283888 8300617 8630252 8560960 8710401
4433H710401J94355K43467K65625J09137J33825K00536N0886K22041N3113r8846
$$ 8710401 8904756 9148223 9413848 9522985 9656810 9857346 9908232 10130273 10183386 10084540
4423A0084540L64555J95579k71878O6350J49493j47833J80657P3428k2740P1699
$$ 10084540 10449095 10644674 10372796 10439146 10588639 10440806 10621463 10694891 10672151 10743850
4413A0743850J5012Q5809k38292l33534k10190k51089j25119K21786j0456k39919
$$ 10743850 10758862 10844671 10606379 10272845 10062655 9811566 9686447 9908233 9897777 9657858
4403I657858j18674j60112j62516k96691j31217j5356O269r4476m09325R7114
$$ 9657858 9539184 9379072 9216556 8919865 8788648 8773292 8779561 8685085 8275760 8372874
4393H372874R8548k26954l7597p8073k4145j12624l53257L8259J01899k20787
$$ 8372874 8471422 8244468 8206871 8128798 8104653 7992029 7638772 7677031 7778930 7558143
4383G558143j3171o0714P3998j52636j36153j69145M7808J96861J20937J01431
$$ 7558143 7544972 7484258 7558256 7405620 7269467 7100322 7148130 7344991 7465928 7567359
4373G567359P464N9575J48536M3418K8811k5403L72659K28016j36964N4178L4165
$$ 7567359 7574823 7634398 7782934 7826352 7855163 7829760 8202419 8430435 8293471 8347649 8381814
4362H381814L2224L01262p1098k88917Q945q5509J41785J78585N1520k5424M1083
$$ 8381814 8414038 8715300 8644202 8355285 8364230 8278721 8420506 8599091 8650611 8625187 8666270
4351H666270J2755j38185j69001J90305R317k2239J43132n5573J84208K5263p0566
$$ 8666270 8679025 8540840 8371839 8562144 8571461 8549222 8692354 8636781 8820989 8846252 8775686
4340H775686L90543J30125j60614K21473n1242J80081P6575k15747j93650k48698
$$ 8775686 9166229 9296354 9135740 9357213 9305971 9486052 9562627 9346880 9153230 8904532
4330H904532P942j50027m69964k2730j08485o7459j77444p7130m8466J46830j57720
$$ 8904532 8912474 8762447 8292483 8269753 8161268 8093809 7916365 7839235 7790769 7937599 7779879
4319G779879j58431J80014K18626K4386p766Q9452K80469K746Q6773j20811j34725
$$ 7779879 7621448 7801462 8020088 8044474 8036708 8126160 8406629 8409375 8496148 8375337 8240612
4308H240612L17486m3294J52485Q5922J01811J83681o4906J29686R0934l8514
$$ 8240612 8558098 8514804 8667289 8753211 8855022 9038703 8973797 9103483 9194417 9155903
4298I155903j42349j83082J20397j7404Q3894M0037r1910J09869J70121k05903
$$ 9155903 9013554 8830472 8950869 8933465 9017359 9057396 8965486 9075355 9245476 9039573
4288I039573Q5131R8122J39427j22172L753J4443j27983o4089R5621J18980k76
$$ 9039573 9124704 9222826 9362253 9240081 9243834 9258277 9130294 9066205 9161826 9280806 9280530
4277I280530K3518M4311L3952K24107R2563K44621N5714K04897p3512m1730J63590
$$ 9280530 9304048 9348359 9382311 9606418 9698981 9943602 9999316 10204213 10130701 10088971 10252561
4266A0252561N9968R7991r8681K61962j53851j18927K25542R5272j0483j5840
$$ 10252561 10312529 10410520 10311839 10573801 10419950 10301023 10526565 10621837 10611354 10595514
4256A0595514J55396J38841J77488L25217K75076K30600J42310K4516J75926K51995
$$ 10595514 10750910 10889751 11067239 11392456 11667532 11898132 12040442 12064958 12240884 12492879
4246A2492879l7293N08672K29432J27315L50311L19346J53664K41282N4303j37686
$$ 12492879 12455586 12964258 13193690 13321005 13671316 13990662 14144326 14385608 14439911 14302225
4236A4302225O3311L16042J88696p6176L86719L33483J69082q9658J88693K25878
$$ 14302225 14365536 14681578 14870274 14794098 15180817 15514300 15683382 15593724 15782417 16008295
4226A6008295r818O421J79462K76313N12059O8511K82379N48417L21070M7181
$$ 16008295 15998477 16004898 16184360 16460673 16972732 17041243 17323622 17872039 18193109 18240290
4216A8240290Q07173M56600M98681M50991J26684L33600P8095J14087K02102M15111
$$ 18240290 19047463 19504063 20002744 20453735 20580419 20914019 20992114 21106201 21308303 21723414
4206B1723414M8978L95126J85445J90837K97126M27600N98745K67388K20602M36572
$$ 21723414 21772392 22167518 22352963 22543800 22840926 23268526 23867271 24134659 24355261 24791833
4196B4791833L21765K98724Q36209M23362M41708O24282O07643O12932Q14407
$$ 24791833 25113598 25412322 26248531 26671893 27113601 27737883 28345526 28958458 29772865
4187B9772865O27264N23253O54397N93218R03207R44937P88720R41332J051247
$$ 29772865 30400129 30923382 31577779 32170997 33074204 34019141 34807861 35749193 36800440
4178C6800440J048516J192974R42343J051669J155892J090553J288772J192741
$$ 36800440 37848956 39041930 39984273 41035942 42191834 43282387 44571159 45763900
4170D5763900J174905R97526J248292J396509J270909J621815J501768J564615
$$ 45763900 46938805 47936331 49184623 50581132 51852041 53473856 54975624 56540239
4162E6540239J731962J717690J474142J237796J835535J925272J819090K182006
$$ 56540239 58272201 59989891 61464033 62701829 64537364 66462636 68281726 70463732
4154G0463732K260552K463121K701758L031592L365864L681895M224229M237105
$$ 70463732 72724284 75187405 77889163 80920755 84286619 87968514 92192743 96429848
4146I6429848M713445N779817O418844P244891P922025R250512J0814467J2548487
$$ 96429848 101143293 106923110 113341954 120586845 128508870 137759382 148573849 161122336
4138A61122336J4078185J6358998J8940583K1602674K4693142K7011107K8038545
$$ 161122336 175200521 191559519 210500102 232102776 256795918 283807025 311845570
4131C11845570K7692869K5183774J8736568O710865p010754j5988145j7916737
$$ 311845570 339538439 364722213 383458781 390169646 383158892 367170747 349254010
4124C49254010j8651251k0014438j9536357j7358332j6078388j5526961j4655059
$$ 349254010 330602759 310588321 291051964 273693632 257615244 242088283 227433224
4117B27433224j3275494j1948841j0727944r124621p085649n189672l343798j885034
$$ 227433224 214157730 202208889 191480945 182356324 175270675 170081003 166737205 164852171
4109A64852171m2173R99579J294174J934572K627588K424136K429353K052949
$$ 164852171 164809998 165809577 167103751 169038323 171665911 174090047 176519400 178572349
4101A78572349J614637K88067j764705l017116l532277l399868k333837j601342
$$ 178572349 180186986 180475053 178710348 175693232 172160955 168761087 166427250 164825908
4093A64825908K4497K218379M016158M947883N494829O473743P435762O472786
$$ 164825908 164850405 167068784 171084942 176032825 181527654 188001397 195437159 201909945
4085B01909945Q79877n413614q711050r579687q925104p701754o032502m511472
$$ 201909945 202789822 197376208 188665158 179085471 170160367 162458613 156426111 151914639
4077A51914639k505205j509109J13617N93411Q21964R18911Q25320K06986n09629
$$ 151914639 149409434 147900325 148013942 148607353 149429317 150348228 151173548 151380534 150870905
4068A50870905n17112J46325K64189K47906k6868O43869K244436L618258N202391
$$ 150870905 150353793 150500118 150764307 151012213 150985345 151629214 153873650 157491908 162694299
4059A62694299P041961Q991760R765543J0372243J1274092J3914630J7983939
$$ 162694299 169736260 178728020 188493563 198865806 210139898 224054528 242038467
4052B42038467K7998642K9296792K4356449L8319612M3268582n798581n3954151
$$ 242038467 270037109 299333901 323690350 362009962 405278544 399479963 345525812
4045C45525812o1850965n0401272m3153049l0958446k0939507j5554422j1693380
$$ 345525812 283674847 233273575 190120526 159162080 138222573 122668151 110974771
4038A10974771r604201p360947n944443m788546m235493l370738l684946k603082
$$ 110974771 101370570 94009623 88065180 83276634 79041141 75670403 71985457 69382375
4030F9382375k930452k848539k516770k501996k342842k350047j997949j638770
$$ 69382375 66451923 63603384 61086614 58584618 56241776 53891729 51893780 50255010
4022E0255010j502545j529441j709410j194960j274690j351927j346631p75855
$$ 50255010 48752465 47223024 45513614 44318654 43043964 41692037 40345406 39569551
4014C9569551j282665j021061p83672n69752p25802p52689j021293p69250p70036
$$ 39569551 38286886 37265825 36482153 35912401 35186599 34433910 33412617 32643367 31873331
4005C1873331l11074p61519r02642q25389q40510n78438m23418p67884n61111
$$ 31873331 31562257 30800738 29898096 29072707 28232197 27653759 27230341 26462457 25901346
3996B5901346l92645k47632n01094k67766o18437l95057p59087o97447l08519
$$ 25901346 25508701 25261069 24759975 24492209 23873772 23478715 22719628 22022181 21713662
3987B1713662k95710l60214m87443l86625k22303l90280l35392j20652l88958
$$ 21713662 21417952 21057738 20570295 20183670 19961367 19571087 19235695 19115043 18726085
3978A8726085m8159k94014n33312j54290m13582j98976l84541l52047n44718q3180
$$ 18726085 18677926 18383912 17850600 17696310 17282728 17083752 16699211 16347164 15802446 15719266
3968A5719266j26095N410j02262j86408L8668j61540m56883k46578p9982m2742
$$ 15719266 15593171 15598581 15496319 15309911 15348579 15187039 14730156 14483578 14403596 14360854
3958A4360854m11741m93811k88674l34443j70933q7510m1884j5709m8497p7203
$$ 14360854 13949113 13455302 13166628 12832185 12661252 12573742 12531858 12516149 12467652 12390449
3948A2390449q4459k04982K6086O9193k22738j65052n9275J18973o6492N2038
$$ 12390449 12305990 12101008 12127094 12196287 11973549 11808497 11749222 11868195 11801703 11853741
3938A1853741O2658j15733j13377l24j49782p7946N560j05752k52202j469J60464
$$ 11853741 11916399 11800666 11687289 11686965 11537183 11459237 11464797 11359045 11106843 11105374 11265838
3927A1265838j16623J24442l16917p984J75596J9537j61783M772J75557k07790
$$ 11265838 11149215 11273657 10956740 10948756 11124352 11143889 10982106 10986878 11162435 10954645
3917A0954645k39333j8402L9553m1600j49921J48613m1416m6902n1079K75187
$$ 10954645 10715312 10696910 10736463 10694863 10544942 10693555 10652139 10605237 10554158 10829345
3907A0829345l96072l5883O3744J38804O4425p5020J23105J24395L51466j25329
$$ 10829345 10433273 10397390 10461134 10599938 10664363 10589343 10712448 10836843 11188309 11062980
3897A1062980k33145Q6989j42044R6226K14203j72630k2941j30147N6275J0179
$$ 11062980 10829835 10916824 10774780 10871006 11085209 10912579 10889638 10759491 10815766 10825945
3887A0825945K15465j3649m0180k845j68884J44244K63639K01684K3378J90473
$$ 10825945 11041410 11027761 10987581 10984736 10815852 10960096 11223735 11425419 11448797 11639270
3877A1639270J67812L27952j35361J39112Q0711K31580K27902K76406P2327R1495
$$ 11639270 11807082 12135034 11999673 12138785 12219496 12451076 12678978 12955384 13027711 13119206
3867A3119206j64672l2641J7346K04864K1815n7018N1468l2571Q3962K67809P3242
$$ 13119206 12954534 12921893 12939239 13144103 13165918 13108900 13160368 13127797 13211759 13479568 13552810
3856A3552810j77490K23356K33088N7413p570n5982J3105L09678J54294J38192
$$ 13552810 13375320 13598676 13831764 13889177 13881607 13825625 13838730 14148408 14302702 14440894
3846A4440894J68820J3929K67396K60939L20668K86503L4923K17045K79111J56191
$$ 14440894 14609714 14623643 14891039 15151978 15472646 15759149 15794072 16011117 16290228 16446419
3836A6446419R29J86372R5555O4938M7168J00126l049R9624K20264J16096J24699
$$ 16446419 16447348 16633720 16729275 16794213 16841381 16941507 16938458 17038082 17258346 17374442 17499141
3825A7499141J71046J42162K52675J97924M16320M0173M70738L16167K06721K99767
$$ 17499141 17670187 17812349 18065024 18262948 18679268 18719441 19190179 19506346 19713067 20012834
3815B0012834O05646N17807K86670M15164L61907M73928O69489K55680K42142
$$ 20012834 20618480 21136287 21422957 21838121 22200028 22673956 23343445 23599125 23841267
3806B3841267P8148J69378L16017J56396L48508N33889K51869j48145K19018J98188
$$ 23841267 23919415 24088793 24404810 24561206 24909714 25443603 25695472 25547327 25766345 25964533
3796B5964533Q0444J14351L85883J04210K50149O7154J47016p2252J87343K70112
$$ 25964533 26044977 26159328 26545211 26649421 26899570 26966724 27113740 27041488 27228831 27498943
3786B7498943m1728p972q673Q9795L33610J21258L03824J71121K98962K83575
$$ 27498943 27457215 27449243 27440570 27530365 27863975 27985233 28289057 28460178 28759140 29042715
3776B9042715L95390M58042n1173Q93686P21375O01395L61513Q38579P31150Q98903
$$ 29042715 29438105 29896147 29844974 30738660 31460035 32061430 32422943 33261522 33992672 34891575
3766C4891575J187083J123055J114525J145912J386755J439393J206850J212581
$$ 34891575 36078658 37201713 38316238 39462150 40848905 42288298 43495148 44707729
3758D4707729J291505J012765J069721R77999Q22056R07935Q86191Q67685J130156
$$ 44707729 45999234 47011999 48081720 49059719 49881775 50789710 51675901 52543586 53673742
3749E3673742O61791O60392P49931P71008N52227K53475L28728M06810K28438
$$ 53673742 54335533 54995925 55745856 56516864 57069091 57322566 57651294 58058104 58286542
3740E8286542J26363J40777j26697J70099J03655O0232N9354j17951r5628K21226
$$ 58286542 58412905 58553682 58426985 58597084 58700739 58760971 58820325 58702374 58606746 58827972
3730E8827972R9678j26386K20833k151k3475J74018K22302K99082q0438j19104
$$ 58827972 58927650 58801264 59022097 59019946 58996471 59170489 59392791 59691873 59611435 59492331
3720E9492331m4554k18346k39961j85540l49366l89963n79009p48712n06803n53635
$$ 59492331 59447777 59229431 58989470 58803930 58454564 58064601 57485592 56736880 56230077 55676442
3710E5676442o14880k98432p37103o94336p68679j103870j043763r55242r98598
$$ 55676442 55061562 54763130 54026027 53331691 52563012 51459142 50415379 49460137 48461539
3701D8461539j195113j313087j368173j335454j512718j348237j180614j356343
$$ 48461539 47266426 45953339 44585166 43249712 41736994 40388757 39208143 37851800
3693C7851800j056954j190809r11710r43994q27942q06396p53341o07349o27080
$$ 37851800 36794846 35604037 34692327 33748333 32920391 32113995 31360654 30753305 30126225
3684C0126225m08206k75929k40709k95494k62187l23679J0646J31784p5490j50949
$$ 30126225 29718019 29442090 29201381 28905887 28643700 28320021 28330667 28462451 28386961 28236012
3674B8236012J03163m6262K82718J76435J52063L09858K97611M1798K07097J50701
$$ 28236012 28339175 28292913 28575631 28752066 28904129 29213987 29511598 29553396 29760493 29911194
3664B9911194l77K0921K06321k37982j28421K20337P6492j17798m9406j55305
$$ 29911194 29910817 29931738 30138059 29900077 29771656 29991993 30068485 29950687 29901281 29745976
3654B9745976L21801Q6348n0314l07609n5495Q4220J81489l13923m33172r9568
$$ 29745976 30067777 30154125 30103811 29796202 29740707 29824927 30006416 29692493 29259321 29159753
3644B9159753M4051k77338k16747j46358j35579K77022O8190k10275M4547N6351
$$ 29159753 29203804 28926466 28709719 28563361 28427782 28704804 28772994 28562719 28607266 28663617
3634B8663617K77875L79824r1693J90499J07737N91834K89040L10765M48020N85381
$$ 28663617 28941492 29321316 29229623 29420122 29527859 30119693 30408733 30719498 31167518 31752899
3624C1752899M98542O22107O48845O74911O08654O98296P97246R27195R88586
$$ 31752899 32251441 32873548 33522393 34197304 34805958 35504254 36301500 37228695 38217281
3615C8217281Q69706R28283J077862P20927P51261N71856K44234N85454K79925
$$ 38217281 39086987 40015270 41093132 41814059 42565320 43137176 43381410 43966864 44246789
3606D4246789J70759p2320j54315j56190m74995k47431k93522n29980l67240k71111
$$ 44246789 44417548 44345228 44190913 44034723 43559728 43312297 43018775 42488795 42121555 41850444
3596D1850444k93907m02396j44099n6487L3614j70426k11759J1010k5138J88066
$$ 41850444 41556537 41154141 41010042 40953555 40987169 40816743 40604984 40615994 40590856 40778922
3586D0778922J30872J93266L16200K26868N13333L53667N23619O54316M81017
$$ 40778922 40909794 41103060 41419260 41646128 42159461 42513128 43036747 43691063 44172080
3577D4172080O26270O43966R02827Q63472R44605P94624J637729J513195J301120
$$ 44172080 44798350 45442316 46345143 47208615 48153220 48947844 50585573 52098768 53399888
3568E3399888J611076J781957J411563J856276J826539J620016J641536J791026
$$ 53399888 55010964 56792921 58204484 60060760 61887299 63507315 65148851 66939877
3560F6939877J638658J674271J591497J486857J101009P59600Q51050P00369L68035
$$ 66939877 68578535 70252806 71844303 73331160 74432169 75191769 76042819 76743188 77111223
3551G7111223K96767J88883Q1179L08262R3166j47523j06136K5919K0893J74996
$$ 77111223 77407990 77596873 77678052 77986314 78079480 77931957 77825821 77851740 77872633 78047629
3541G8047629M57006O26634P51494J062092J027643J168203J471824J644778J402951
$$ 78047629 78504635 79131269 79882763 80944855 81972498 83140701 84612525 86257303 87660254
3532H7660254J682956J457630J585928J358281J095662J235717Q20004P41018
$$ 87660254 89343210 90800840 92386768 93745049 94840711 96076428 96896432 97637450
3524I7637450O25026M26501N35618N96589K67554L44809K46040L78345P26395
$$ 97637450 98262476 98688977 99224595 99821184 100088738 100433547 100679587 101057932 101784327
3515A01784327O03873O16812O37007Q81152N93999M16863m1709k76032n21696
$$ 101784327 102388200 103005012 103642019 104523171 105117170 105534033 105492324 105216292 104694596
3506A04694596n88640j138794j625923j868898j858647k323744k354212k413166
$$ 104694596 104105956 102967162 101341239 99472341 97613694 95289950 92935738 90522572
3498I0522572k503726k585567k443565k271267k083167k133558k011781j789313
$$ 90522572 88018846 85433279 82989714 80718447 78635280 76501722 74489941 72700628
3490G2700628j797499j757398j720624j428792j375753j410364j449342j304503
$$ 72700628 70903129 69145731 67425107 65996315 64620562 63210198 61760856 60456353
3482F0456353j289549j199394j133504r06698q26284q53578r20302q15926m29022
$$ 60456353 59166804 57967410 56833906 55927208 55100924 54247346 53327044 52511118 52082096
3473E2082096l30641m85483k96863l18498k82364J11913J45801R8742J75433J22764
$$ 52082096 51751455 51265972 50969109 50650611 50368247 50480160 50625961 50724703 50900136 51022900
3463E1022900J79044J88083O4090o729j57898j31987j23393j77766m25278n16649
$$ 51022900 51201944 51390027 51454117 51447388 51289490 51157503 51034110 50856344 50431066 49914417
3453D9914417m26941n22443n69220o46534o13808p01946p86783q29461p14070
$$ 49914417 49487476 48965033 48395813 47749279 47135471 46433525 45646742 44817281 44103211
3444D4103211o54489o11531o93932n50524n12578n43482m43118n72071n32235
$$ 44103211 43448722 42837191 42143259 41592735 41080157 40536675 40093557 39521486 38989251
3435C8989251l64876l38160m83776n42669l18935l29484j88991n60459m80492
$$ 38989251 38624375 38286215 37802439 37259770 36940835 36611351 36422360 35861901 35381409
3426C5381409k57002j97400n06707k65594k52884J9365M4896j85686J33484K3549
$$ 35381409 35124407 34927007 34420300 34154706 33901822 33921187 33966083 33780397 33913881 33937430
3416C3937430L08085P0160J10292M35781J21167J62656K38508K65130K98965Q3496
$$ 33937430 34245515 34315675 34425967 34861748 34982915 35145571 35384079 35649209 35948174 36031670
3406C6031670J18236r0717m7644l55680k85115q6669k71186k70488l14498j70088
$$ 36031670 36149906 36059189 36011545 35655865 35370750 35284081 35012895 34742407 34427909 34257821
3396C4257821j88478o11597m73827n21800m27432n88668k18147k0125m16822k25620
$$ 34257821 34069343 33457746 32983919 32462119 32034687 31446019 31227872 31207747 30790925 30565305
3386C0565305o2824j0053j98197r6304L8295O4817k55687J10462N4829K70777
$$ 30565305 30502481 30492428 30294231 30197927 30236222 30301039 30045352 30155814 30210643 30481420
3376C0481420L20659K94177L06165L33649K55556K20983K86174j608k97743r2000
$$ 30481420 30802079 31096256 31402421 31736070 31991626 32212609 32498783 32497175 32199432 32107432
3366C2107432J23853J83887J75144R2385L34498K15610K35810M09253K10312L45887
$$ 32107432 32231285 32415172 32590316 32682701 33017199 33232809 33468619 33877872 34088184 34434071
3356C4434071N66219N81848M02516N08781M82940M66673O45729O67579O44580
$$ 34434071 35000290 35582138 35984654 36493435 36976375 37443048 38088777 38756356 39400936
3347C9400936M53872O23043N73727P22978O36973O76631R93749Q79904R58867
$$ 39400936 39854808 40477851 41051578 41774556 42411529 43088160 44081909 44961813 45920680
3338D5920680R81998Q19381J006583R12644Q25054R81529J122504R84316J093853
$$ 45920680 46902678 47722059 48728642 49641286 50466340 51447869 52570373 53554689 54648542
3329E4648542R71265J286373J385437J130625J309320J455371J423403J595660
$$ 54648542 55619807 56906180 58291617 59422242 60731562 62186933 63610336 65205996
3321F5205996J715585J428185J403037J799401J633047J690551J729167J864471
$$ 65205996 66921581 68349766 69752803 71552204 73185251 74875802 76604969 78469440
3313G8469440K154482K056996K157892K498344K279448K295485K716937K883024
$$ 78469440 80623922 82680918 84838810 87337154 89616602 91912087 94629024 97512048
3305I7512048L006160L117953L250756L503837L573346L830397M049533M130818
$$ 97512048 100518208 103636161 106886917 110390754 113964100 117794497 121844030 125974848
3297A25974848M324233M495401M312415M583804M792862M645368M730558M567878
$$ 125974848 130299081 134794482 139106897 143690701 148483563 153128931 157859489 162427367
3289A62427367M308902M466419M485111L992852M184596L897795L489775K884310
$$ 162427367 166736269 171202688 175687799 179680651 183865247 187763042 191252817 194137127
3281A94137127K796955K101875J431133R16697m7257n57637j109866j593920k122988
$$ 194137127 196934082 199035957 200467090 201383787 201336530 200778893 199669027 198075107 195952119
3272A95952119k439164k770983k809084l196279l318991l552142l871353m245535
$$ 195952119 193512955 190741972 187932888 184736609 181417618 177865476 173994123 169748588
3264A69748588m652057m783074m812728n146090n341892n123719n096931m966157
$$ 169748588 165096531 160313457 155500729 150354639 145012747 139889028 134792097 129825940
3256A29825940m643910m189856m095308l647268l577651l434645k788626k706985
$$ 129825940 125182030 120992174 116896866 113249598 109671947 106237302 103448676 100741691
3248A00741691k490231k415700k184916j961526j455870j475558j522520j438707
$$ 100741691 98251460 95835760 93650844 91689318 90233448 88757890 87235370 85796663
3240H5796663j329376r38674j236530o01404o95045p90222o29741o22420l95260
$$ 85796663 84467287 83528613 82292083 81690679 80995634 80205412 79575671 78953251 78557991
3231G8557991l92969k94925k77259l89676k37347l70566p5711j12245k92301L2314
$$ 78557991 78165022 77870097 77592838 77203162 76965815 76595249 76519538 76407293 76114992 76147306
3221G6147306N08454M76146P16648N64121R51240Q90223K75888r64877k318654
$$ 76147306 76655760 77131906 77848554 78412675 79363915 80254138 80530026 79565149 77246495
3212G7246495k643059k596428j993004j653658j422699j027625q18460q16353
$$ 77246495 74603436 72007008 70014004 68360346 66937647 65910022 65091562 64275209
3204F4275209o15706m12037n52206n29845n77279m94616k55676l05401m21059
$$ 64275209 63659503 63247466 62695260 62165415 61588136 61093520 60837844 60532443 60111384
3195F0111384l49920k45624k90696j59388l28860j97753l89800l24650p8751j99278
$$ 60111384 59761464 59515840 59225144 59065756 58736896 58539143 58149343 57824693 57745942 57546664
3185E7546664l12285j10222l28143n07602m86129l24917l83415k66939o57005
$$ 57546664 57234379 57124157 56796014 56288412 55802283 55477366 55093951 54827012 54170007
3176E4170007k18817N1344k18602k98190k75738l11812J1108k2704K10440J57156
$$ 54170007 53951190 54002534 53783932 53485742 53210004 52898192 52909300 52886596 53097036 53254192
3166E3254192J80469L72365L62030L92785J41790N86201O47227O27508O22098
$$ 53254192 53434661 53807026 54169056 54561841 54703631 55289832 55937059 56564567 57186665
3157E7186665O70817O51175N38265Q07205J146543J135487J227970J144045J325826
$$ 57186665 57857482 58508657 59046922 59854127 61000670 62136157 63364127 64508172 65833998
3148F5833998J280935J288253J037973R33635J288412J516091J549935J537615
$$ 65833998 67114933 68403186 69441159 70374794 71663206 73179297 74729232 76266847
3140G6266847J732370J941961K363278K121589K260811K215015K555315K239314
$$ 76266847 77999217 79941178 82304456 84426045 86686856 88901871 91457186 93696500
3132I3696500K403978K200576J826336K218388J608388J176700J107957J001236
$$ 93696500 96100478 98301054 100127390 102345778 103954166 105130866 106238823 107240059
3124A07240059L40787J39446l7023k97010q78410j306813j761613j719872j840141
$$ 107240059 107580846 107720292 107683269 107386259 106507849 105201036 103439423 101719551 99879410
3115I9879410j978709j982460j849665j753721j874322j960884k175574j986297
$$ 99879410 97900701 95918241 94068576 92314855 90440533 88479649 86304075 84317778
3107H4317778j871612k415160k210003k567601k521842k677761k608841k593693
$$ 84317778 82446166 80031006 77821003 75253402 72731560 70053799 67444958 64851265
3099F4851265k455050k331501k211860j950665k062361j796160j485050j483239
$$ 64851265 62396215 60064714 57852854 55902189 53839828 52043668 50558618 49075379
3091D9075379j581878j143164j020701q22542r91615j053038o59725o43963q11290
$$ 49075379 47493501 46350337 45329636 44507094 43515479 42462441 41802716 41158753 40347463
3082D0347463q61284m60263q35201n59221n21773p48665p92338n76288n34211
$$ 40347463 39486179 39025916 38190715 37631494 37109721 36361056 35568718 34992430 34458219
3073C4458219p70167n33790p08730o33107k39454n29053n12358k84070l72693
$$ 34458219 33688052 33154262 32445532 31812425 31572971 31043918 30531560 30247490 29874797
3064B9874797k31473j87324j81428k23355k16224n95657j60663k17396Q6342o9264
$$ 29874797 29643324 29456000 29274572 29051217 28834993 28239336 28078673 27861277 27947619 27878355
3054B7878355J17216j1188k93926m76456k50976j30460q1482m90048k96128m15671
$$ 27878355 27995571 27984383 27690457 27214001 26963025 26832565 26751083 26261035 25964907 25549236
3044B5549236m24598l95018o83829l50293k70728m03492l61028n31706l41901
$$ 25549236 25124638 24729620 24045791 23695498 23424770 23021278 22660250 22128544 21786643
3035B1786643k35764k08621l84340l69711l19015j20765k29219k04406j17847
$$ 21786643 21550879 21342258 20957918 20588207 20269192 20148427 19919208 19714802 19596955
3026A9596955q1910j08331k72114j37474M1051j26739J3850J38590k13700J8029
$$ 19596955 19515045 19406714 19134600 18997126 19038177 18911438 18925288 19063878 18850178 18868207
3016A8868207j26504r1585l0949J04957l6634j3379k06592j01131r094M6396j24570
$$ 18868207 18741703 18650118 18619169 18724126 18687492 18674113 18467521 18366390 18357296 18403692 18279122
3005A8279122K3768N5346K63986p3647n1626J7970Q043n4391r5983j6078R193
$$ 18279122 18302890 18358236 18622222 18548575 18496949 18514919 18522962 18468571 18372588 18356510 18365703
2994A8365703M1525M3010m9235R5848j4206j19949m5661k1792K00842j00157m0141
$$ 18365703 18407228 18450238 18401003 18496851 18482645 18362696 18317035 18295243 18496085 18395928 18355787
2983A8355787J69009J94173M26444j94796m0363N6734J44837J53412j9816J47063
$$ 18355787 18524796 18718969 19145413 18950617 18910254 18966988 19111825 19265237 19245421 19392484
2973A9392484Q5832J98006K91024L06379J72176J97530J31899J89300K86954M02464
$$ 19392484 19478316 19676322 19967346 20273725 20445901 20643431 20775330 20964630 21251584 21654048
2963B1654048R5818J17311O42101L89783M37895K92781M06685N26025J07096L29777
$$ 21654048 21749866 21867177 22509278 22899061 23336956 23629737 24036422 24562447 24669543 24999320
2953B4999320M78285M13276O24885M88253M60382N21017N58594O49141L85775
$$ 24999320 25477605 25890881 26515766 27004019 27464401 27985418 28544012 29193153 29578928
2944B9578928O89429N56920L90685M71370O56964N32639P77128P48136Q56450
$$ 29578928 30268357 30825277 31215962 31687332 32344296 32876935 33654063 34402199 35258649
2935C5258649P75926Q79034Q61763Q45098R48875J182497J028300R29377J344343
$$ 35258649 36034575 36913609 37775372 38620470 39569345 40751842 41780142 42709519 44053862
2926D4053862J342909J381134J326578J540531J461136J833779K149602K045571
$$ 44053862 45396771 46777905 48104483 49645014 51106150 52939929 55089531 57135102
2918E7135102J935038K274825K110618K363699J870636J799658J575991J375318
$$ 57135102 59070140 61344965 63455583 65819282 67689918 69489576 71065567 72440885
2910G2440885J557907J468340J565082J783825J727207K065227K242626K297360
$$ 72440885 73998792 75467132 77032214 78816039 80543246 82608473 84851099 87148459
2902H7148459K620675K718664K945505K995956L287064L414644L460069L494778
$$ 87148459 89769134 92487798 95433303 98429259 101716323 105130967 108591036 112085814
2894A12085814L808025L451673L447357L352190L672928M246051M312975M732775
$$ 112085814 115893839 119345512 122792869 126145059 129817987 134064038 138377013 143109788
2886A43109788N593221O252271O785317P462960Q186747Q817245R367704R581633
$$ 143109788 148703009 154955280 161740597 169203557 177390304 186207549 195575253 205156886
2878B05156886R899893J0659600J1381275J2071574J3187488J4004080J4704302
$$ 205156886 215056779 225716379 237097654 249169228 262356716 276360796 291065098
2871B91065098J4971293J4417345J3085773J0804903P850901N272496K919799
$$ 291065098 306036391 320453736 333539509 344344412 352195313 357467809 360387608
2864C60387608J968457K064242L028310L994759M495865L999070J775113j776761
$$ 360387608 362356065 364420307 367448617 371443376 375939241 379938311 381713424 379936663
2856C79936663o946238j2188754j6916679k0126481k1727600k1688058k0553057
$$ 379936663 372990425 360801671 343884992 323758511 302030911 280342853 259789796
2849B59789796j9041809j7175589j5328723j3311767j1698487j0318737r237253
$$ 259789796 240747987 223572398 208243675 194931908 183233421 172914684 163677431
2842A63677431q313411p435348o560678o046018n556236m686152m306440l872495
$$ 163677431 155364020 147928672 141367994 135321976 129765740 125079588 120773148 116900653
2834A16900653l738755l363028k943431k714403k144329k345519k209852k122248
$$ 116900653 113161898 109798870 106855439 104141036 101996707 99651188 97441336 95319088
2826I5319088j657722j565755j583536j312136j045125r30557j001534n49475
$$ 95319088 93661366 92095611 90512075 89199939 88154814 87224257 86222723 85673248
2818H5673248p03763q19116n14115p86234j028450j278001j607141j731692k046245
$$ 85673248 84969485 84150369 83636254 82850020 81821570 80543569 78936428 77204736 75158491
2809G5158491j961256j963471j901788j917667j527084j769226j535199j406577
$$ 75158491 73197235 71233764 69331976 67414309 65887225 64117999 62582800 61176223
2801F1176223j651137j462633j569420j585847j669400j513246j451745j609042
$$ 61176223 59525086 58062453 56493033 54907186 53237786 51724540 50272795 48663753
2793D8663753j847382j731953k105198j858860j756434j386000j728934j739587
$$ 48663753 46816371 45084418 42979220 41120360 39363926 37977926 36248992 34509405
2785C4509405j194168j235216r23432j075683j011416r62862j110011r60755o04377
$$ 34509405 33315237 32080021 31156589 30080906 29069490 28106628 26996617 26035862 25431485
2776B5431485p19444n02379q37571m00536p86158o10497l96721n07735l03809
$$ 25431485 24712041 24209662 23372091 22971555 22185397 21574900 21178179 20670444 20366635
2767B0366635n72459l64047j74435m04136m25004m31872m39757j46976l77104
$$ 20366635 19794176 19430129 19255694 18851558 18426554 17994682 17554925 17407949 17030845
2758A7030845l06901k42776k88755r5778l91274m24286l16261j20969l47899O596
$$ 17030845 16723944 16481168 16192413 16096635 15705361 15281075 14964814 14843845 14495946 14502542
2748A4502542j02773j70262j61648m59655j98490q6788j48079j43500k34687l45203
$$ 14502542 14399769 14229507 14067859 13608204 13409714 13322926 13174847 13031347 12796660 12451457
2738A2451457j59350r3109j79746l31614O1838k97001j52656p640l5984n3862
$$ 12451457 12292107 12198998 12019252 11687638 11749476 11452475 11299819 11292179 11256195 11202333
2728A1202333j7367M6666p304K5099m3907P3883k2888m7582l3087P5365j46713
$$ 11202333 11184966 11231632 11224328 11249427 11205520 11279403 11256515 11208933 11175846 11251211 11104498
2717A1104498n40581k65291j32854j65612m12097l83471l47640k60922O1971j19450
$$ 11104498 10563917 10298626 10165772 10000160 9588063 9204592 8856952 8596030 8658001 8538551
2707H538551j06550l36772L7245j22747k16140R4977k05025k93095k41456l82353
$$ 8538551 8432001 8095229 8132474 8009727 7793587 7888564 7683539 7390444 7148988 6766635
2697F766635r2648J00539n3426r1074p3971j51707j27443m102k04242j19165j57698
$$ 6766635 6673987 6774526 6721100 6630026 6556055 6404348 6276905 6272803 6068561 5949396 5791698
2686E791698K9374j72317j43646j17139j89139M8706O8666j74626j84963j9261
$$ 5791698 5821072 5648755 5505109 5387970 5198831 5247537 5316203 5141577 4956614 4937353
2676D937353N6623k58976q4004K19863k34511j37983k7891J18943j35463J9797
$$ 4937353 4993976 4735000 4650996 4870859 4636348 4498365 4470474 4589417 4453954 4473751
2666D473751J00480l22911j8090j37594j48130M3580r5289Q4884j16793j92042
$$ 4473751 4574231 4251320 4233230 4095636 3947506 3991086 3895797 3980681 3863888 3671846
2656C671846q2196j0735K0852n2273p6305o4243p238k0205K5952K6204M9018r9080
$$ 3671846 3589650 3578915 3599767 3547494 3471189 3406946 3399708 3379503 3405455 3431659 3480677 3381597
2644C381597k58769r5227k5825j46052J20604j46512k41850J59264J16517j06074
$$ 3381597 3122828 3027601 3001776 2855724 2976328 2829816 2587966 2747230 2863747 2757673
2634B757673j06951k06288R4357Q5721k5283n866k2316j96862j16500k56142J00510
$$ 2757673 2650722 2444434 2538791 2624512 2599229 2593363 2571047 2374185 2257685 2001543 2102053
2623B102053O8455j8543m1920J64836p1814j72130j18273j01715J1521J17717
$$ 2102053 2170508 2151965 2110045 2274881 2203067 2030937 1912664 1810949 1822470 1940187
2613A940187J38494j55137o1631N8110L4160L7444n3477m7034J1524j30595L001
$$ 1940187 2078681 1923544 1861913 1920023 1954183 1991627 1938150 1891116 1902640 1772045 1775046
2602A775046j9628L17512J70113n1712l3225q4874R6619J05855M4913j54302P4695
$$ 1775046 1755418 2072930 2243043 2191331 2158106 2073232 2169851 2275706 2320619 2166317 2241012
2591B241012j36704J9792K50863K28531R4297j93532p4797r0208K43913J5715
$$ 2241012 2104308 2124100 2374963 2603494 2697791 2504259 2429462 2339254 2583167 2598882
2581B598882J21436J33710J52659k9764j45366j90068j75985J12905N9937l12214
$$ 2598882 2720318 2854028 3006687 2976923 2831557 2641489 2465504 2578409 2638346 2326132
2571B326132J63190J01684l8466P1843k70145j53604l6037l25319q3813o5712
$$ 2326132 2489322 2591006 2552540 2624383 2354238 2200634 2164597 1839278 1755465 1689753
2561A689753k12983p6824j19778j98106K52163K233q9899J45209j44007R8263
$$ 1689753 1476770 1399946 1280168 1082062 1334225 1336458 1246559 1391768 1247761 1346024
2551A346024K8279j81561k76491j5747O718J35006r7079j8362Q0820m2659O9141
$$ 1346024 1374303 1192742 916251 900504 907222 1042228 945149 926787 1007607 964948 1034089
2540A034089j02279o2582J20559K7769n1028l3360M7854j74274r885N4321j19224
$$ 1034089 931810 869228 989787 1017556 966528 933168 981022 806748 796863 851184 731960
2529G31960J59451j15023J045k44752R7651q9474l6157n9393L06655m9118O5160
$$ 731960 891411 776388 777433 532681 630332 540858 504701 445308 751963 702845 768005
2518G68005k3015j20661k1562l30538R0153J79323j44104j03183O9196M6728k3404
$$ 768005 744990 624329 602767 272229 362382 541705 397601 294418 363614 410342 386938
2507C86938J3609J41966l9543j16788q2545K04858j26737r2638O285p4445k6188
$$ 386938 400547 542513 502970 386182 303637 508495 381758 289120 295405 220960 194772
2496A94772j6377n2960K44487j73522M4456m9544O1366k7991K29225k6788j61672
$$ 194772 178395 125435 369922 196400 240856 191312 252678 224687 453912 427124 265452
2485B65452l9851j05208J51113k6979p9857n6574j3871j9827J13274j07940n8942
$$ 265452 225601 120393 271506 244527 164670 108096 94225 74398 187672 79732 20790
2474B0790K53068N2718P6626o1607p4427J98392k66197Q5617q2474n522k4815
$$ 20790 273858 326576 403202 341595 267168 465560 199363 284980 202506 196984 172169
2463A72169r5894Q6549J6245j5547j7820n1162O1051m5826J21990R2268j7994
$$ 172169 76275 162824 179069 163522 145702 94540 155591 109765 231755 324023 306029
2452C06029j51900o6169r8396j84815Q6772J01842j16078N9630K55102l1891J8550
$$ 306029 154129 87960 -10436 -195251 -108479 -6637 -122715 -63085 192017 160126 178676
2441A78676r4820Q416j06588Q8577o3507J09400j46202p8901K23391o2087P5527
$$ 178676 83856 92272 -14316 74261 10754 120154 -26048 -104949 118442 56355 131882
2430A31882n385j08677Q3945j01880n7453J44984j19592L8577P1887n5433J59178
$$ 131882 126497 17820 101765 -115 -57568 87416 -32176 6401 78288 22855 182033
2419A82033j41243k0790j54580k088J5097J61137k6359j64544J27183J00600J59262
$$ 182033 40790 20000 -134580 -136668 -121571 39566 13207 -151337 -24154 76446 235708
2408B35708q8127l02171q7138J305L25574j4061j44756J18816j01232K7214q6124
$$ 235708 147581 -154590 -241728 -240423 85151 71090 -73666 45150 -56082 -28868 -114992
2397a14992p7745K8457J01601J41885k73150R9669o6783k3221K8275O1498j7637
$$ -114992 -192737 -164280 -62679 79206 -193944 -94275 -161058 -184279 -156004 -94506 -112143
2386a12143k41816P3395O6991m5999p3443J9609J46234K22387p7373j23304j211
$$ -112143 -353959 -280564 -213573 -259572 -333015 -313406 -167172 55215 -22158 -145462 -146673
2375a46673J8731m6354J10896n4827m6623J95693K9855l4558j0855q4913m7501
$$ -146673 -127942 -174296 -63400 -118227 -164850 30843 60698 26140 15285 -69628 -117129
2364a17129r221O7342J6423q6238K5778l9322K2586J68150o1342j73737k9532
$$ -117129 -126350 -59008 -42585 -128823 -103045 -142367 -119781 48369 -12973 -186710 -216242
2353b16242O5034l5859L03153m2100J19305M4849J25739l0121J3323j57737r6063
$$ -216242 -151208 -187067 116086 73986 193291 238140 363879 333758 347081 189344 93281
2342I3281p9783j89767k3194q109O8605M7315J5547K22515l20822q0976J17771
$$ 93281 13498 -176269 -199463 -207572 -138967 -91652 -76105 146410 -174412 -255388 -137617
2331a37617l6643J24539L5484j41399R5724K4835l3084J85515j76764j4973O1061
$$ -137617 -174260 -49721 -14237 -155636 -59912 -35077 -68161 117354 -59410 -74383 -13322
2320a3322j55393k15212J99065N6163J72564l6991j11125j88967p7884J08355
$$ -13322 -168715 -383927 -184862 -128699 43865 6874 -104251 -293218 -371102 -262747
2310b62747J60313l730j52698P1184J73758j1000m9286K9697K25433j06536l45607
$$ -262747 -102434 -106164 -258862 -187678 -13920 -24920 -74206 -44509 180924 74388 -271219
2299b71219j86202J47455J54991j41235L0813o8625L41075K12756m1034j41425
$$ -271219 -457421 -309966 -154975 -296210 -265397 -334022 7053 219809 178775 37350
2289C7350j16248k14927J2064R5233j81035j96270K80638J29567J14838P4909
$$ 37350 -78898 -293825 -281761 -186528 -367563 -563833 -283195 -153628 -38790 36119
2279C6119J30251k0955j7935O6548p3489k17825j79396J36897J23073j16806j70805
$$ 36119 166370 145415 127480 194028 120539 -97286 -276682 -139785 -16712 -133518 -304323
2268c04323o4728J67327j5008p2810K24965K1561n8763k17492M6063K57886K9292
$$ -304323 -369051 -201724 -216732 -289542 -64577 -43016 -101779 -319271 -273208 -15322 13970
2257A3970j1453o0898R5642J4266k83289l4890P1754K69098m3159K9346o735Q6511
$$ 13970 2517 -58381 37261 51527 -231762 -266652 -194898 74200 31041 60387 53652 140163
2245A40163j5425j39156p6028r539J6176K24574l49610r866O697J93006J18690
$$ 140163 124738 -14418 -90446 -99985 -83809 140765 -208845 -218711 -212014 -19008 99682
2234I9682J03338q2139k0431J88677j20652p7796j64583R8495j42720Q1983k747
$$ 99682 203020 120881 100450 289127 168475 90679 -73904 24591 -118129 -36146 -38893
2223c8893m3799r6320P89n2323k3014L5262O2226J20127l4027K46914n4685k30284
$$ -38893 -82692 -179012 -178223 -230546 -253560 -218298 -156072 -35945 -69972 176942 122257 -108027
2211a08027j13216k6724J98065P7897j48099j44621N0207j178J183K87939P8304
$$ -108027 -221243 -247967 -49902 27995 -120104 -264725 -214518 -215696 -214513 73426 151730
2200A51730j30047k3290P2628J36019j36863j82082j0244K3404J41229J14493
$$ 151730 21683 -1607 71021 207040 70177 -111905 -122149 -98745 42484 156977
2190A56977k1682j88955N9502R0524q1264J7935O6656M984m3809J60090o8690
$$ 156977 135295 -53660 5842 96366 15102 33037 99693 104677 60868 220958 152268
2179A52268r5798N4483J53707P0962j45022J08795J34597M5648k24808J11237
$$ 152268 56470 110953 264660 335622 190600 299395 433992 479640 254832 366069
2169C66069J27844j10886J81784m857M3351K0669K2738J6417n471r8862K82285
$$ 366069 493913 383027 564811 559954 603305 623974 646712 663129 657658 558796 841081
2158H41081J6981j26148p8792j23962q7977J54876L6373l6440L1963j69861L19468
$$ 841081 858062 731914 653122 529160 441183 596059 632432 595992 627955 458094 777562
2147G77562N6375J52882j2336j62879L6574J40388r7744J09175Q2531J5512k9659
$$ 777562 833937 986819 974483 811604 848178 988566 890822 999997 1082528 1098040 1068381
2136A068381J76904J856O4129J70021P0033J30935l4065N8717J13600Q6344j16807
$$ 1068381 1245285 1247141 1311270 1481291 1551324 1682259 1648194 1706911 1820511 1906855 1790048
2125A790048P7674P9885K84468J4085J33110R7006j380J9164K47507J512K4394
$$ 1790048 1867722 1947607 2232075 2246160 2379270 2476276 2474896 2494060 2741567 2743079 2767473
2114B767473J51358J65311L28687M7845M2666J70119N0692L02867J42881J22861
$$ 2767473 2918831 3084142 3412829 3460674 3503340 3673459 3724151 4027018 4169899 4292760
2104D292760J66024K75153J61355J82148K89215K80277O71047M51420O22721J029973
$$ 4292760 4458784 4733937 4895292 5077440 5366655 5646932 6317979 6769399 7392120 8422093
2094H422093N92163M39774O12373O83714J119403J530455J754996K370198K773092
$$ 8422093 9014256 9454030 10066403 10750117 11869520 13399975 15154971 17525169 20298261
2085B0298261L741747M657131O818078Q107926P750251J0664584M015827r537187
$$ 20298261 24040008 28697139 35515217 43623143 51373394 62037978 66053805 56516618
2077E6516618j3368769j0475121p423262m959802l366234k469101k007439j546332
$$ 56516618 43147849 32672728 25249466 20289664 16923430 14454329 12446890 10900558
2069A0900558j339517r56766m50472l91371k36425l32860l90805n11079p62364
$$ 10900558 9561041 8604275 8153803 7762432 7526007 7193147 6802342 6291263 5528899
2060E528899m78806l27840m44198l16276m90655l12765k99899N1383j08027j97645
$$ 5528899 5050093 4722253 4278055 3961779 3471124 3158359 2858460 2909843 2801816 2604171
2050B604171j84029j02255N3307m02655k11861n9132N2249n2264k7027k4958j72467
$$ 2604171 2420142 2317887 2371194 1968539 1756678 1697546 1749795 1697531 1670504 1645546 1473079
2039A473079K7247j34766k05991k7244J6773j96186j24837n8753L2614Q8002p8816
$$ 1473079 1500326 1365560 1159569 1132325 1149098 952912 828075 769322 801936 889938 811122
2028H11122Q2268P3115k12566M353j78900k68393K19085K01811r837j18901m4407
$$ 811122 893390 966505 753939 758292 579392 310999 530084 731895 722058 603157 558750
2017E58750p4759m42J48010m7107l149j81251n2875Q7108j76141R2075M4166j95965
$$ 558750 483991 483549 631559 584452 581303 400052 347177 434285 258144 350219 394385 198420
2005A98420J34838n0065m2952N7892j76180o2400o5954R4673L706K80735r5146
$$ 198420 333258 283193 240241 298133 121953 59553 -6401 88272 91978 372713 277567
1994B77567L1201N5587q6012l8164J5346m6814k31516J59216O6729p4269l06127
$$ 277567 308768 364355 278343 240179 255525 208711 -22805 136411 203140 128871 -177256
1983a77256J56368j02345J61648P3046k07509J61061k56217L09036m7355m3473
$$ -177256 -20888 -123233 38415 111461 -96048 65013 -191204 117832 70477 27004
1973B7004J71638r480m1424p389J5452k41476r8930Q8975j06180r4133K01805
$$ 27004 198642 189162 147738 140349 155801 -85675 -184605 -95630 -201810 -295943 -94138
1962i4138J78677j59797M2972L2854Q1522J3528n912N0038J2656Q8215l95839
$$ -94138 84539 -75258 -32286 568 82090 95618 89706 139744 152400 240615 -155224
1951a55224j58054Q3060J8991L53629N4466K1918k5027j65002R1364k87627j77197
$$ -155224 -313278 -230218 -211227 142402 196868 218786 193759 28757 120121 -167506 -344703
1940c44703K52274n178p141k05142p2984R4038R8410m8674j0197p8494J96409
$$ -344703 -92429 -97607 -104748 -309890 -382874 -288836 -190426 -239100 -249297 -327791 -131382
1929a31382L1734q6283O9553j61657P3293O0209n4576p4035J06997J77055j53963
$$ -131382 -99648 -185931 -116378 -278035 -204742 -144533 -199109 -273144 -166147 10908 -143055
1918a43055K6563j05388j36512J07536J23493j3294r7746L00755N9307k76650
$$ -143055 -116492 -221880 -358392 -250856 -127363 -140657 -238403 62352 121659 -154991
1908a54991p3886j00932K6998k7969P1163P6913J2456q3523M4761K15450O2294
$$ -154991 -228877 -329809 -302811 -330780 -259617 -182704 -170248 -253771 -209010 6440 68734
1897F8734j23104j03327J02475j11521k9360J03338j95836k32858K09653K9786
$$ 68734 -54370 -157697 -55222 -166743 -196103 -92765 -288601 -521459 -311806 -282020
1887b82020k77954L3189L37302o4179K39219J18107j70819l24277J17769J15027
$$ -282020 -559974 -526785 -189483 -253662 -14443 103664 -67155 -391432 -273663 -158636
1877a58636N6473J1767q8183J5366K92643J43069j66640k39755k32018Q2296J97137
$$ -158636 -102163 -90396 -178579 -163213 129430 272499 105859 -133896 -365914 -283618 -86481
1866h6481o3920j57632J41409K41606j37313j39945K8885K17830p4484l19123
$$ -86481 -150401 -308033 -166624 74982 -62331 -202276 -173391 44439 -30045 -349168
1856c49168O2096J02691k1900k39594p6097L579m5065K92356k2861J96533j0860
$$ -349168 -287072 -184381 -206281 -445875 -521972 -518393 -563458 -271102 -293963 -97430 -108290
1845a08290J6467j32896j9171J69706o6475q3586O1022J1448O0859J7383p1295
$$ -108290 -91823 -224719 -243890 -74184 -140659 -224245 -163223 -151775 -90916 -73533 -144828
1834a44828p3792J06518j60458J31296J01398p2727q0147P246J02420m9216r9975
$$ -144828 -218620 -112102 -272560 -141264 -39866 -112593 -192740 -185494 -83074 -132290 -232265
1823b32265O7147J66567p3703K1924j99864q7690Q0827J24186k6357J65995M0820
$$ -232265 -165118 1449 -72254 -50330 -250194 -337884 -257057 -132871 -159228 6767 47587
1812D7587k1305J17311K8390r6427J53251j60196j89695J0921K2921M3587J3923
$$ 47587 26282 143593 171983 75556 228807 68611 -121084 -110163 -87242 -43655 -29732
1801b9732q1651N170j5066l8388M6775j10091p225L2984j09085O1831Q4544R1853
$$ -29732 -111383 -106213 -121279 -159667 -112892 -222983 -230208 -197224 -306309 -244478 -159934 -68081
1789f8081J9064r9040k03122P1548j13823l1711J45369M1426N0153M4269P3236
$$ -68081 -49017 -148057 -351179 -279631 -393454 -425165 -279796 -238370 -188217 -143948 -70712
1778g0712K4559n5624K10782j77387L6453m7017K1401r2031l23750l9561P3522
$$ -70712 -46153 -101777 109005 -68382 -31929 -78946 -57545 -149576 -473326 -512887 -439365
1767d39365P0208R2826j3582j8000J45100J4980k9406n8596k2765J9696K1884
$$ -439365 -369157 -276331 -289913 -307913 -162813 -147833 -177239 -235835 -258600 -238904 -217020
1756b17020j51794M0336o455o2259O7843J23169K83942j40575j08438M9172J53088
$$ -217020 -368814 -328478 -334933 -397192 -329349 -206180 77762 -62813 -171251 -122079 31009
1745C1009J9772P3082r9609l8970l64453J27397K45664j86691j78851N4650K84337
$$ 31009 50781 123863 24254 -14716 -379169 -251772 -6108 -192799 -371650 -317000 -32663
1734c2663P5214j20751n109j48738k59057n1840Q6933M4698L4903O3863j1724
$$ -32663 42551 -78200 -83309 -232047 -491104 -542944 -456011 -411313 -376410 -312547 -324271
1723c24271m587j72398L25556q2221O9368J2332n2032l9608k3824L88407k1609
$$ -324271 -328858 -501256 -175700 -257921 -188553 -176221 -228253 -267861 -291685 96722 75113
1712G5113l45150m318M6334j44535J25901o8592P8329J91706n946k0418j90093
$$ 75113 -270037 -274355 -228021 -372556 -246655 -315247 -236918 -45212 -51158 -71576 -261669
1701b61669J4413k882K1454n2539q7643P9437j20456J17214p6040k02194K59858
$$ -261669 -247256 -250138 -228684 -281223 -368866 -289429 -409885 -292671 -368711 -570905 -311047
1690c11047K43898j7152l367j40277j46782J19315m6505l7441j05483R8361O8523
$$ -311047 -67149 -84301 -87668 -227945 -374727 -255412 -301917 -339358 -444841 -346480 -277957
1679b77957M8952k43565R4514R8083J95303K5550m3174j80139J80657r9609R7191
$$ -277957 -229005 -472570 -378056 -279973 -84670 -59120 -102294 -282433 -101776 -201385 -104194
1668a04194J39535m0755J21365k56303P8621Q6654n3805q7720j93310J22303k5866
$$ -104194 35341 -5414 115951 -140352 -61731 24923 -28882 -116602 -309912 -187609 -213475
1657b13475M4107j7958k10135P1639M4883p0707J09902J20828J23735N6917q3556
$$ -213475 -169368 -187326 -397461 -325822 -280939 -351646 -241744 -120916 2819 59736 -23820
1646b3820J20254l2487K7519j12325J6286q6553j75569J50994L00608k31627j43226
$$ -23820 96434 63947 91466 -20859 -4573 -91126 -266695 -115701 184907 -46720 -189946
1635a89946M5253O8975M5328n9872k238j57165Q3070j51299Q0109J79698K8159
$$ -189946 -144693 -75718 -30390 -90262 -92500 -249665 -166595 -317894 -237785 -58087 -29928
1624b9928L192o8727k19922Q7873J56386n6230k6796m7442J05117L1356j97733
$$ -29928 -26736 -95463 -315385 -227512 -71126 -127356 -154152 -201594 -96477 -65121 -262854
1613b62854J22963K436k17819O6870J870j01573J70802O9622k29681R9869J04702
$$ -262854 -139891 -137455 -355274 -288404 -286534 -388107 -217305 -147683 -377364 -277495 -172793
1602a72793j20349J10104J10644l41363L16644l1008M5358J18803k33181J51655
$$ -172793 -293142 -183038 -72394 -413757 -97113 -128121 -82763 36040 -197141 -45486
1592d5486j3301j43057J21566J33804j34693J0559k5689j99964k8913l4007p6616
$$ -45486 -58787 -201844 -80278 53526 -81167 -70608 -96297 -296261 -325174 -359181 -435797
1581d35797J32999O3299J28585N6769o5716m8963k02900N4780R629l1876J55456
$$ -435797 -302798 -239499 -110914 -54145 -119861 -168824 -371724 -316944 -307315 -339191 -183735
1570a83735j65783j10280J9518J34017o213K3113K09786q6327q2182R8062r0825
$$ -183735 -349518 -459798 -440280 -306263 -312476 -289363 -79577 -165904 -248086 -150024 -240849
1559b40849J2547L368p2621q9597o5126K93371n6151P8041o2101N1755k0350r3362
$$ -240849 -228302 -224934 -297555 -387152 -452278 -158907 -215058 -137017 -199118 -147363 -167713 -261075
1547b61075p0869m4208M548J46072j90144J88325K825R7468M1547j63182p9406
$$ -261075 -331944 -376152 -371604 -225532 -415676 -227351 -224526 -127058 -85511 -248693 -328099
1536c28099K10579J45904n6628j96017L6261J26866N420j2409q076k2362j17926
$$ -328099 -117520 28384 -28244 -224261 -188000 -61134 -55714 -68123 -76199 -98561 -216487
1525b16487J29139j24209J41153R6098Q0849j88876k2816l2953L21Q3166k4191
$$ -216487 -87348 -211557 -70404 25694 106543 -82333 -105149 -138102 -137781 -54615 -78806
1514g8806j9338M1744J04439l21669k0620J81827j7089j6928J1257J35329j2476
$$ -78806 -98144 -56400 48039 -273630 -294250 -112423 -129512 -146440 -135183 146 -12330
1503a2330k7860k6215q5749J20487m2455o255R979j20140O2698j93313J9441q6073
$$ -12330 -40190 -66405 -152154 -31667 -74122 -80377 -70398 -190538 -127840 -321153 -301712 -387785
1491c87785L0723J71637M9000j00501m2020Q3156O7207q8826n0293K00664R7331
$$ -387785 -357062 -185425 -136425 -236926 -278946 -195790 -128583 -217409 -267702 -67038 30293
1480C0293p9715O771q8669n2982N8890k50088N5550R0057N0212J98182k7464j58536
$$ 30293 -49422 -42651 -131320 -184302 -125412 -375500 -319950 -229893 -179681 18501 -8963 -167499
1468a67499q6071P7970J1786J9488R0442J57069l3942n9567j72067l1936j0998
$$ -167499 -253570 -175600 -163814 -144326 -53884 103185 69243 9676 -162391 -194327 -205325
1457b05325J66706j01802n1487k51898P0871R5279L2218J84384n8187J42011M7961
$$ -205325 -38619 -140421 -191908 -443806 -372935 -277656 -245438 -61054 -119241 22770 70731
1446G0731j78772j54014K6016O2047r9511O1773J16996j29195j238M3611p7411
$$ 70731 -108041 -262055 -236039 -173992 -273503 -211730 -94734 -223929 -225167 -181556 -258967
1435b58967L9124K632o8828q020O8636P5801j5091o1865P011K21955k312k84610
$$ -258967 -219843 -217211 -286039 -294059 -225423 -149622 -164713 -226578 -219567 2388 76 -284534
1423b84534q7015R5528m4174q0121J4267J93429K10125j58459j08441O8600n3246
$$ -284534 -371549 -276021 -320195 -400316 -386049 -192620 17505 -140954 -249395 -180795 -234041
1412b34041J08643J54707n4539q6378L7275K2612J64672j19028k3315J3141j22291
$$ -234041 -125398 29309 -25230 -111608 -74333 -51721 112951 -6077 -29392 -16251 -138542
1401a38542J465M6996j27051J03309m3444l4671J4832j4101J79447n9222o5056
$$ -138542 -137077 -90081 -217132 -113823 -157267 -191938 -177106 -191207 -11760 -70982 -136038
1390a36038J24948k64623J32126J22990O6635q280n9084r1558j14212j8628O904
$$ -136038 -11090 -275713 -143587 -20597 46038 37758 -21326 -112884 -227096 -245724 -238820
1379b38820L4740n6383j64506M08838J81717j87916l7006k54279J23028n6526
$$ -238820 -204080 -260463 -424969 -16131 165586 -22330 -59336 -313615 -190587 -247113
1369b47113K7108J04371L0141J54297k9261j69413K05819j87011n2068m8420o5435
$$ -247113 -220005 -115634 -85493 68804 39543 -129870 75949 -111062 -163130 -211550 -276985
1358b76985r918J13156n6823J59716K75172j42248r3881l15j19213j42096o206
$$ -276985 -286903 -173747 -230570 -70854 204318 62070 -31811 -32126 -151339 -293435 -299641
1347b99641Q0996J38823Q7041k6400P1623p5320j5946n0877J8193Q0963j91934
$$ -299641 -218645 -79822 7219 -19181 52442 -22878 -38824 -89701 -71508 9455 -182479
1336a82479J2085N6295M96J13482j64467j24797O4655N387j468K4676R7333J02260
$$ -182479 -170394 -114099 -113603 -121 -164588 -289385 -224730 -219343 -220811 -196135 -98802 3458
1324C458q1407m6077n1503k54134J93887J34800O759n3551K09676P0839J50412
$$ 3458 -77949 -124026 -175529 -429663 -235776 -100976 -94217 -147768 61908 132747 283159
1313B83159l4168k32862N7730q2183j24830o1729r3672m9580J28023J01874j23177
$$ 283159 248991 16129 73859 -8324 -133154 -194883 -288555 -338135 -210112 -108238 -231415
1302b31415N0583R9961k77539K27827q9509o9816m5801J28533J84503j00971R4238
$$ -231415 -180832 -80871 -358410 -130583 -220092 -289908 -335709 -207176 -22673 -123644 -29406
1291b9406p5396l281j50296K05825J0213n1166n3286J2013k36109o225O0142J08892
$$ -29406 -104802 -108083 -258379 -52554 -42341 -93507 -146793 -134780 -370889 -377114 -316972 -208080
1279b08080J08239l7490p7027P4191N9563j21553l4084L7515P4486J22625m2645
$$ -208080 -99841 -137331 -214358 -140167 -80604 -202157 -236241 -198726 -124240 -1615 -44260
1268d4260Q537m821o1656J04511p0186j15098J68284o8392q7755N7543K9783J7743
$$ -44260 -35723 -40544 -102200 2311 -67875 -182973 -14689 -83081 -170836 -113293 -83510 -65767
1256f5767p3081M5790Q54n2257J11895P9835L2079n131N434o9297j45539J54164
$$ -65767 -138848 -93058 -92204 -144461 -32566 47269 79348 74217 79651 10354 -135185 18979
1244A8979n5112m5895o639K0624K60718m9939l00111p2209M5467O0935m7840p228
$$ 18979 -36133 -82028 -88667 -68043 192675 142736 -157375 -229584 -184117 -123182 -171022 -178250
1232a78250N9319K4958J9666j14834m038R2503j48790K5488j01020L6678q5202
$$ -178250 -118931 -93973 -74307 -189141 -193179 -100676 -249466 -223978 -324998 -288320 -373522
1221c73522L255K98233J68280j14259j32695P2571l2496r379M9869J65845J3213
$$ -373522 -370267 -72034 96246 -18013 -150708 -78137 -110633 -120012 -70143 95702 108915
1210A08915j48538j2224k3231J38197j52953j51268J01131N298N3797K5768j11837
$$ 108915 -39623 -51847 -75078 63119 -89834 -241102 -139971 -134673 -80876 -55108 -166945
1199a66945r1670M147J75484o9870J05637j4353j51857o6885N4060q20J48977
$$ -166945 -258615 -254468 -78984 -148854 -43217 -57570 -209427 -276312 -222252 -223072 -74095
1188g4095J2917q060J33247j24455o5825J60073N7199J06561l34839j10996J51344
$$ -74095 -61178 -69238 64009 -60446 -126271 33802 91001 197562 -137277 -248273 -96929
1177i6929N9107J85357j35722R6536l4619O1041j12324k07616J14568R1519M9632
$$ -96929 -37822 147535 11813 108349 73730 134771 22447 -185169 -70601 20918 70550
1166G0550J9787l5480k05553Q161J25228J23628o919j80650K11802j06043j41772
$$ 70550 90337 54857 -150696 -142535 -17307 106321 99402 -81248 130554 24511 -117261
1155a17261K1577j02270m9078J20830M0759L24168k11484l15055K7833J9497J76470
$$ -117261 -95684 -197954 -247032 -126202 -85443 238725 27241 -287814 -259981 -240484 -64014
1144f4014q4126j597j40560l1099N7256k3438n3701K09674J3383j303M2165L8374
$$ -64014 -148140 -149737 -290297 -321396 -264140 -287578 -341279 -131605 -118222 -119525 -77360 -38986
1132c8986r9636Q3982j3385J09063R1709q0678Q3935j24132q0039O5177L8775
$$ -38986 -138622 -54640 -68025 41038 132747 52069 136004 11872 -68167 -2990 35785
1121C5785O0278p4341k6668K07439r933j29425J616Q4081N9077n0557j52541P794
$$ 35785 96063 21722 -4946 202493 192560 63135 64751 148832 207909 157352 4811 12605
1109A2605K77150m6058j12555O8784j91798J09539O6853k0829j53742k04039j26177
$$ 12605 289755 243697 131142 199926 8128 117667 184520 163691 9949 -194090 -320267
1098c20267J45546K9206n8218j55152J34278j3069J65914J7998j55536J70246
$$ -320267 -174721 -145515 -203733 -358885 -224607 -237676 -71762 -53764 -209300 -39054
1088c9054N3564k44838N5365J98175M5224J2180m056R1210p0608j49672J0765
$$ -39054 14510 -230328 -174963 23212 68436 80616 76560 167770 97162 -52510 -41745
1077d1745j42127N2420L61137k41141m0138j32517r6174L10379L744J12303n7090
$$ -41745 -183872 -131452 229685 -11456 -51594 -184111 -280285 30094 33838 146141 89051
1066H9051j35864L2993j6019j71499J08397J46323j18078m5109N4411r862j02971
$$ 89051 -46813 -13820 -29839 -201338 -92941 53382 -64696 -109805 -55394 -65256 -168227
1055a68227Q6180J78392j25120O0449K8415r2215j0465R9164o9405M11956o0231
$$ -168227 -82047 96345 -28775 31674 60089 -32126 -42591 56573 -12832 399124 338893
1044C38893k81919j2566P7433Q5392K0056j43954j96658k18670K66790l5765o0171
$$ 338893 56974 44408 121841 207233 227289 83335 -113323 -331993 -65203 -100968 -161139
1033a61139K18937J17054o2440j15008K05847k882j25484k93487J2358j10283
$$ -161139 57798 174852 112412 -2596 203251 200369 74885 -218602 -206244 -316527
1023c16527J43528K6787L04236l79198K288P0389O6117P4778r9566J08532r0542
$$ -316527 -172999 -146212 158024 -221174 -218886 -148497 -82380 -7602 -107168 1364 -89178
1012h9178K346O7670K14980r7637j19112r8046j78474K35837J26556j45717j97899
$$ -89178 -86832 -19162 195818 98181 -20931 -118977 -297451 -61614 64942 -80775 -278674
1001b78674Q3098Q3615l2909R1446J7025j12397J8248J61357M544j10332j54470
$$ -278674 -195576 -111961 -144870 -53424 -36399 -148796 -130548 30809 35353 -74979 -229449
990b29449J11049J16847Q7961l4989j36806j0503o4669Q242P351L43692J1709
$$ -229449 -118400 -1553 86408 51419 -85387 -95890 -160559 -152317 -144966 198726 210435
979B10435k20346Q1365N7775l69526K21594J74694J88481k7857j69658r5050K58405
$$ 210435 -9911 71454 129229 -240297 -18703 155991 344472 316615 146957 51907 310312
968C10312j78368m99998K26862L3516J25334J36685j36946o2018M3469M544k47211
$$ 310312 131944 -368054 -141192 -107676 17658 154343 17397 -44621 -1152 3392 -243819
957b43819L8326q2691J76678N2744O465K29679j38519j12254q113k5755j04113
$$ -243819 -205493 -288184 -111506 -58762 -52297 177382 38863 -73391 -81504 -107259 -211372
946b11372K73507q9248Q8267J1158j4191l0790j10722N0859m1310M4156n220K14319
$$ -211372 62135 -27113 61154 72312 58121 27331 -83391 -32532 -73842 -29686 -34906 179413
934A79413m7719j52772l1631j54544J48098O654J24677N0701o5267l6246m5991
$$ 179413 131694 -21078 -52709 -207253 -59155 -52501 72176 122877 57610 21364 -24627
923b4627r4148M591l6885J28976P108M6211j07182j3640J69836N1906m0793J08281
$$ -24627 -118775 -114184 -151069 -22093 -14985 31226 -75956 -89596 80240 132146 91353 199634
911A99634K0257k70646K8073P0796J19702k348j13955l8447p3242R7908J03393
$$ 199634 219891 -50755 -22682 48114 167816 165468 51513 13066 -60176 37732 141125
900A41125l3615j95464j18694J94522J05550l2910K5583M6410j13962l90484P1556
$$ 141125 107510 -87954 -206648 -12126 93424 60514 86097 132507 18545 -371939 -300383
889c00383K68477J69514p414j97916l1487j05060k206n0047M3426J14226P9948
$$ -300383 -31906 137608 130194 -67722 -99209 -204269 -206475 -256522 -213096 -98870 -18922
878a8922o8145K38681J62758m1837p7698k26739K14012j39610l8907K0740O2732
$$ -18922 -87067 151614 314372 272535 194837 -31902 182110 42500 3593 24333 87065
867H7065o5359k4138O2267o7773N1382J26585O7564j92041k24344J23514r6310
$$ 87065 21706 -2432 59835 -7938 43444 170029 237593 45552 -178792 -55278 -151588
856a51588j9216l0960Q2140M2546J46688k9729J06417O3246p8647k34979M8388
$$ -151588 -170804 -201764 -119624 -77078 69610 39881 146298 209544 130897 -104082 -55694
845e5694J35801l1792j12883j5023J70320r3915J4338k1062o427O4232J22899
$$ -55694 80107 48315 -64568 -79591 90729 -3186 11152 -9910 -16337 47895 170794
834A70794K4027J78987k34313r6269J34423O9565r4890j78349p8571j7518J2417
$$ 170794 194821 373808 139495 43226 177649 247214 152324 -26025 -104596 -122114 -109697
823a09697J65321l5034J2145j02758k50447N5504J14194j07362J88363q525J35451
$$ -109697 55624 20590 32735 -70023 -320470 -264966 -150772 -258134 -69771 -78296 57155
812E7155j80248J24592J59091k27110M8800J07827j06580J1774r8374J40345K91400
$$ 57155 -123093 1499 160590 -66520 -17720 90107 -16473 -4699 -103073 37272 328672
801C28672j19728L6747k20326j18464J93991q7303k26870N082K41800J3718p4519
$$ 328672 208944 245691 25365 -93099 100892 13589 -213281 -208199 33601 47319 -27200
790b7200m0091m0883K27666J8701r4896J41463J58692Q6003j15125r2667j4984
$$ -27200 -67291 -108174 119492 138193 43297 184760 343452 429455 314330 221663 206679
779B06679N3737j10484r1134m6547p9832m6923N9130K48288j52955q7420J52305
$$ 206679 260416 149932 58798 12251 -67581 -114504 -55374 192914 39959 -47461 104844
768A04844j52505j48796J10767J70172l5001j80663K8973n533J67129j0484j43623
$$ 104844 -47661 -196457 -85690 84482 49481 -131182 -102209 -107742 59387 48903 -94720
757i4720O0850j4754j15656k9331M8144j75450L784J28180J73149j9489j25604
$$ -94720 -33870 -48624 -164280 -193611 -145467 -320917 -317133 -188953 -15804 -35293 -160897
746a60897K99727k2380j77760j18J26449Q2038N1149J21609Q9518j57168k57854
$$ -160897 138830 116450 -61310 -61428 65021 147059 198208 319817 409335 252167 -5687
735e687J8234r5929j00772k0309J53882L40483m0248J9405j52678j50064M6704
$$ -5687 12547 -83382 -184154 -204463 -50581 289902 249654 269059 116381 -33683 13021
724A3021P8833J00267j46021k87491J45093J69911J22893J19382M1682j02316
$$ 13021 91854 192121 46100 -241391 -96298 73613 196506 315888 357570 255254
714B55254j6966p0143r3999j21086J1117K03501k05808n1841K11527j20200N9527
$$ 255254 238288 168145 74146 -46940 -35823 167678 -38130 -89971 121556 1356 60883
703F0883R6566q4594l704K5939O0589j17566l5776L4002Q7192N5738K5842L5102
$$ 60883 157449 72855 69151 95090 155679 38113 2337 36339 123531 179269 205111 240213
691B40213l3753j48831L5800k1176M0758j2387j3486k0631k60133k8516J23831
$$ 240213 206460 57629 93429 72253 113011 100624 87138 66507 -193626 -222142 -98311
680i8311k302K12365J54992k9520j78445M7357r5760n8800J19254J60061j75225
$$ -98311 -100613 111752 266744 237224 58779 106136 10376 -48424 70830 230891 55666
669E5666l5004k0541J76742J3821m3848j468n5570j20305j60197j1054K12594
$$ 55666 20662 121 176863 190684 146836 145368 89798 -30507 -190704 -201758 10836
658A0836o436j53557K44722K09665j0891j63113j01824O8717k0634k08034J57432
$$ 10836 4400 -149157 95565 305230 294339 131226 29402 98119 77485 -130549 26883
647B6883k7949o5818P9340Q5700j55523J13411O0242j23275n566o1745P4125q2096
$$ 26883 -1066 -66884 12456 98156 -57367 56044 116286 -6989 -12555 -74300 -175 -82271
635h2271r8494J11608R4133R057j03743J4753J0597J44305P9160K01942j24204
$$ -82271 -180765 -69157 24976 34033 -69710 -54957 -44360 99945 179105 381047 256843
624B56843j43909Q7444J50265J7967j07345j17973J83825k31140L3038L9649k07591
$$ 256843 112934 200378 350643 368610 261265 143292 327117 95977 129015 168664 -38927
613c8927J29622J13003r4688r7470l6941K9135K36998N6229j72838j9239R8516
$$ -38927 90695 203698 109010 11540 -25401 3734 240732 296961 124123 104884 203400
602B03400J69918k25780r3161Q420k16192K23017J00018q8609L7744K97818j09502
$$ 203400 373318 147538 54377 62797 -153395 69622 169640 81031 118775 416593 307091
591C07091L324j5668j61390J34552j24803J8019P1931l3919q9153N0624j87684
$$ 307091 310415 294747 133357 267909 143106 161125 233056 199137 109984 160608 -27076
580b7076J51505j3081m4667J7980o4992J06203j34889P9143J55158m9008m60381
$$ -27076 124429 111348 66681 84661 19669 125872 -9017 70126 225284 176276 -284105
569b84105r7777K42806O7176M7199J43830k7906j62576J86400K90405j06540j04948
$$ -284105 -381882 -139076 -71900 -24701 119129 91223 -71353 115047 405452 298912 193964
558A93964k5466p3939Q8809K1330n0587j17206k09009K16046j607J03141k5533
$$ 193964 168498 94559 183368 204698 154111 36905 -172104 43942 42335 145476 119943
547A19943m1865M4622k06Q094j39612k2788K03996k14510J27426P3292j34315
$$ 119943 78078 122700 122494 130588 -9024 -31812 172184 -42326 85100 158392 24077
536B4077j7736k192K7733J31057k12013o5990J80563l0790j95759O5821J02067
$$ 24077 6341 4149 31882 162939 -49074 -115064 65499 34709 -161050 -95229 6838
525F838k2504n2532J87966K90512k95813M5398J95623o1708q5532J34618k65457
$$ 6838 -15666 -68198 119768 410280 114467 159865 355488 293780 208248 342866 77409
514G7409j7530R9696l49690Q5732K1220K09942J61193q5191L9735J08690N4623
$$ 77409 59879 159575 -190115 -104383 -83163 126779 287972 202781 242516 351206 405829
503D05829o9774o5033l30155J06098K72589r5519j37530j71833j01924J03998
$$ 405829 336055 271022 -59133 46965 319554 224035 86505 -85328 -187252 -83254
493h3254M4969J33694q044j64067m2895l7641K05814J12902j47998J41206M1506
$$ -83254 -38285 95409 87365 -76702 -119597 -157238 48576 161478 13480 154686 196192
482A96192k91196p876M5991Q5441P1770J4573k252Q1724N5654q4729j13341o1377
$$ 196192 -95004 -102880 -56889 28552 100322 114895 112643 194367 250021 165292 51951 -9426
470i426K4550n3553J90074n2293k51924K63798n0714P1343r8803j12270J01083
$$ -9426 15124 -38429 151645 99352 -152572 111226 60512 131855 33052 -79218 21865
459B1865J66785J71810l7378L9161q2215q9037n1976J6149j50994J14360K2064
$$ 21865 188650 360460 323082 362243 280028 190991 139015 155164 4170 118530 140594
448A40594J74232j25320j07328P6468n8575l001j2466J58810o3308n8404K11021
$$ 140594 314826 189506 82178 158646 100071 97070 84604 243414 180106 121702 332723
437C32723j00308k956P2690k8171K1862j11676j03455q6140n4644J56382J60945
$$ 332723 232415 229459 302149 273978 295840 184164 80709 -5431 -60075 96307 257252
426B57252q1668q9162J52759k58454k817J52010j57628k5242K21116J27312j17500
$$ 257252 175584 86422 239181 -19273 -22090 129920 -27708 -52950 168166 295478 177978
415A77978q6834p3679k96570K15561K29403Q1413k56774J30952L4749j49027P7881
$$ 177978 91144 17465 -279105 -63544 165859 247272 -9502 121450 156199 7172 85053
404H5053J16877K39822k97427K3320q2136m3501L1854K174L6211K9114Q1479Q8326
$$ 85053 201930 441752 144325 167645 85509 42008 73862 76036 112247 141361 222840 311166
392C11166M0095j34151r7994O8736R994j19894K810L2620J32013l3097p7540Q3826
$$ 311166 351261 217110 119116 187852 197846 77952 80762 113382 245395 212298 134758 218584
380B18584p7351r15q2796R160J676J03359N051M0721k54562Q2643J89559L8199
$$ 218584 141233 140318 57522 66682 68358 171717 176768 217489 -37073 45570 235129 273328
368B73328k86657l05223L23876J82357p4687O4430m5973p402L06647k06954j49322
$$ 273328 -13329 -318552 5324 187681 112994 177424 131451 124049 430696 223742 74420
357G4420j36672J8359J95831p8999J75495J49971k13730q9214O614M4123N2073
$$ 74420 -62252 -43893 151938 72939 248434 398405 184675 95461 102075 146198 198271
346A98271J59615r9102k94164L1625q3616j2457J26689l815J9526L4383O5295
$$ 198271 357886 258784 -35380 -3755 -87371 -99828 26861 23046 42572 76955 142250
335A42250o0593j40312n2818L08562J9909j19028r7807R8917P5326j5069L2742
$$ 142250 81657 -58655 -111473 197089 216998 97970 163 99080 174406 159337 192079
324A92079j50834j69454M9136K81229q2912K24025q7103k10490m4954N3567P7833
$$ 192079 41245 -128209 -79073 202156 119244 343269 256166 45676 722 54289 132122
313A32122K8090o0788q0013J97329p6972n8136j24321J41886J08349k08322o079
$$ 132122 160212 99424 19411 216740 139768 81632 -42689 99197 207546 -776 -6855
302f855r52J72675J26052M7728k9699p2476j33975P2347J44262M2810j16172j47246
$$ -6855 -7807 164868 290920 338648 308949 236473 102498 174845 319107 361917 245745 98499
290I8499j92920N7077o9313M6294J76533Q5216M3041p1038k35696J16991J40608
$$ 98499 -94421 -37344 -106657 -60363 116170 201386 244427 173389 -62307 54684 195292
279A95292q2026M0071J12520J04071R6673k42955j7430Q6673j78038O549J7956
$$ 195292 113266 153337 265857 369928 466601 223646 206216 292889 114851 121400 139356
268A39356J72074k63181j78876q0635J44439J89905j14706O9104J3394O8204l0104
$$ 139356 311430 48249 -130627 -211262 -66823 123082 8376 77480 90874 159078 128974
257A28974o7158Q3011j88186q35R1170J65326R9862k24376k3501J51392k7174
$$ 128974 61816 144827 -43359 -44194 46976 212302 312164 87788 64287 215679 188505
246A88505n4715N2368Q1115j48450j12766r4956q373K90766q0172l07202J88691
$$ 188505 133790 186158 267273 118823 6057 -88899 -97272 193494 113322 -193880 -5189
235e189N7530m3202n2259N9775Q5310n5264R1852J74297j05825r5469j7107n3979
$$ -5189 52341 9139 -43120 16655 101965 46701 138553 312850 207025 111556 94449 40470
223D0470k9054M9040K7221m6234r8250j0789k15057L5998K46411K2104J44237
$$ 40470 11416 60456 87677 41443 -56807 -67596 -282653 -246655 -244 21860 166097
212A66097j1716J0104K4499l2497N5020J04970j00439o2520Q3058J4933J6043
$$ 166097 154381 164485 188984 156487 211507 316477 216038 153518 236576 251509 267552
201B67552k26367p90J25509r6410J06597l5452M3007p5018L2732R758q0453J8854
$$ 267552 41185 40395 165904 69494 176091 140639 183646 108628 141360 151118 70665 89519
189H9519J39189l4433l7114J3757J52944q4678j15634J25536l7327L2128K2749
$$ 89519 228708 194275 157161 170918 323862 239184 123550 249086 211759 243887 266636
178B66636N8229j13957j212j17444L26000j8534o1897N2189J6541p9591P935k28579
$$ 266636 324865 210908 209696 92252 418252 399718 337821 390010 406551 326960 334895 106316
166A06316L4147m0984k74412K08164M6504k1779p2525J89483p2386l782l686Q6986
$$ 106316 140463 99479 -174933 33231 79735 57956 -14569 174914 102528 98746 95060 182046
154A82046J4771n2738r8663K799J33938M8146l6225K8241k3298k0184m0069k15964
$$ 182046 196817 144079 45416 48215 182153 230299 194074 222315 199017 178833 138764 -77200
142g7200j0037j3018K21811J02554r1746L9948L8439j6434k5974r2674k4411M2579
$$ -77200 -87237 -100255 121556 224110 132364 172312 210751 194317 168343 75669 51258 93837
130I3837J0678n497J5210m0800R4343J1681m563j0876j02749L0773q837p7471
$$ 93837 104515 99018 114228 73428 167771 179452 174889 164013 61264 92037 83200 5729
118E729m8894M8028o1360J21630Q8872J4572o7001m780k23827j14233K04728J38734
$$ 5729 -43165 4863 -56497 65133 154005 168577 101576 96796 -127031 -241264 -36536 102198
106A02198j3271q9770k6239N5939J19729p5697j89462n8728J4196J22047k8955
$$ 102198 88927 -843 -27082 28857 148586 72889 -116573 -175301 -161105 -39058 -68013
95f8013M2327n2994j02697J6377m6651p4556N0889l7813K00358O3097j52979J09476
$$ -68013 -25686 -78680 -181377 -165000 -211651 -286207 -235318 -273131 -72773 -9676 -162655 -53179
83e3179k1598l3198p5331o0692m608Q9954P0690P2236j7621O6517j06150n0769
$$ -53179 -74777 -107975 -183306 -243998 -248606 -158652 -87962 -15726 -33347 33170 -72980 -123749
71a23749p990Q0616J01122p2173Q9893j83093r4971N742J09138r5262o8902K34925
$$ -123749 -131739 -51123 49999 -22174 67719 -115374 -210345 -204603 -95465 -190727 -259629 -24704
59b4704m2569L6637L4165n4318j36477K0788k6488j16275K3226R5043j18810o2092
$$ -24704 -67273 -30636 3529 -50789 -187266 -166478 -192966 -309241 -286015 -190972 -309782 -371874
47c71874K03045K5755k7736J48633J83341j06710j03345m4828j12358m8987L0712
$$ -371874 -168829 -143074 -170810 -22177 161164 54454 -48891 -93719 -206077 -255064 -224352
36b24352j60857q0380J57292Q4733j8151l7350n1990j884n3030o2622J56749P9910
$$ -224352 -385209 -465589 -308297 -223564 -241715 -279065 -331055 -332939 -385969 -448591 -291842 -211932
24b11932J31861l0545m8210m8937r1458J9443J24075n7255q9924j20962K1878
$$ -211932 -80071 -110616 -158826 -207763 -299221 -279778 -155703 -212958 -302882 -423844 -401966
13d01966J45318K0635M2467j13432J08884J02781j04560n1432p9744p4353L6208
$$ -401966 -256648 -236013 -193546 -306978 -198094 -95313 -199873 -251305 -331049 -405402 -369194
2c69194k6488J59645
$$ -369194 -395682 -236037
0b36037
$$ -236037
$$ Imaginary data points
##PAGE= N=2
##DATA TABLE= (X++(I..I)), XYDATA
16383c980211J08386J13883J10469j4056Q4697J12834L8841m4425l6334J80881
$$ -3980211 -3871825 -3757942 -3647473 -3661529 -3576832 -3463998 -3425157 -3469582 -3505916 -3325035
16373c325035P0460J0137J02142R5144J01935L9839K1459o2217K7107J61015J08599
$$ -3325035 -3254575 -3244438 -3142296 -3047152 -2945217 -2905378 -2883919 -2946136 -2919029 -2758014 -2649415
16362b649415l6565L5801r5044J89752Q4052J41653K19306J9164J14617j56742
$$ -2649415 -2685980 -2650179 -2745223 -2555471 -2471419 -2329766 -2110460 -2091296 -1976679 -2133421
16352b133421O0041l0679k0173P8814J37850M7563K14852k6075N8544Q8515n7105
$$ -2133421 -2073380 -2104059 -2124232 -2045418 -1907568 -1860005 -1645153 -1671228 -1612684 -1524169 -1581274
16341a581274O2207Q2024Q8291J395L62L2468K55139K03755j51780r4892K49909
$$ -1581274 -1519067 -1437043 -1348752 -1347357 -1346995 -1314527 -1059388 -855633 -1007413 -1102305 -852396
16330h52396J5156J2923J18555R7928j10978K9371K4252J7736K21444Q0511n4224
$$ -852396 -837240 -824317 -705762 -607834 -718812 -689441 -665189 -647453 -426009 -345498 -399722
16319c99722N2728J57872J17815j04704j2319n413Q5178J46082J26006l64P2498
$$ -399722 -346994 -189122 -71307 -176011 -188330 -193743 -108565 37517 163523 163159 235657
16308B35657J2896O999Q2060n8742Q4601K05204J49896j05503J24238m6885N0811
$$ 235657 248553 255552 337612 278870 363471 568675 718571 613068 737306 690421 741232
16297G41232J67432J0544j31207J29977J41299M4690n909O6920J6154q3293K52572
$$ 741232 908664 919208 788001 917978 1059277 1103967 1098058 1164978 1181132 1097839 1350411
16286A350411K7560p5739j03880L00328M433J00701M961j17000R2672M3598P9521
$$ 1350411 1377971 1302232 1198352 1498680 1503113 1603814 1608775 1491775 1584447 1628045 1707566
16275A707566P2960p128k7578N5780J7314K17668J23020q4834j6801Q2813r0119
$$ 1707566 1780526 1773398 1745820 1801600 1818914 2036582 2159602 2074768 2057967 2140780 2050661
16264B050661J46599J56382L3642k8961L5101n4939j0839j2935k2529l3028o8417
$$ 2050661 2197260 2353642 2387284 2358323 2393424 2338485 2327646 2314711 2292182 2259154 2190737
16253B190737L69295J22130j6011P0415L5773j24744J02732L9816p4755J22202
$$ 2190737 2560032 2682162 2666151 2736566 2772339 2647595 2750327 2790143 2715388 2837590
16243B837590J5202K45004m7528M4569K2912j94646L19050o4899j62563R3086
$$ 2837590 2852792 3097796 3050268 3094837 3117749 2923103 3242153 3177254 3014691 3107777
16233C107777K08469O4129N9541L6065j89695l9470j05696K1177K0369J34265
$$ 3107777 3316246 3380375 3439916 3475981 3286286 3246816 3141120 3162297 3182666 3316931
16223C316931j7869J39384P1004k2357M1708M9698k5726J32522J6162j72788P2661
$$ 3316931 3299062 3438446 3509450 3487093 3528801 3578499 3552773 3685295 3701457 3528669 3601330
16212C601330k5885k03244K92642L93956j54702o2232l8896O1975J93100q4650
$$ 3601330 3575445 3372201 3664843 4058799 3904097 3841865 3802969 3864944 4058044 3973394
16202C973394O6856l185n552O9046n9242j42938R9192J03473K5466j4316k5976
$$ 3973394 4040250 4037065 4031513 4100559 4041317 3898379 3997571 4101044 4126510 4112194 4086218
16191D086218O1170m330Q601J36972P242J49562j3081k15597J6046K6823J2975
$$ 4086218 4147388 4143058 4151659 4288631 4295873 4445435 4432354 4216757 4232803 4259626 4272601
16180D272601j16267M9166M8149O3557J56477O9639j40699O1435J34667l1401
$$ 4272601 4156334 4205500 4253649 4317206 4473683 4543322 4402623 4464058 4598725 4567324
16170D567324k33788M8483K7779J00637J62010p6488K63306k67144k08869K02681
$$ 4567324 4333536 4382019 4409798 4510435 4672445 4595957 4859263 4592119 4383250 4585931
16160D585931m335M1749j8859P1673j3150j4344J30815J31624j86743l2807M2910
$$ 4585931 4581596 4623345 4604486 4676159 4663009 4648665 4779480 4911104 4724361 4691554 4734464
$$ [...]
##END NTUPLES=NMR SPECTRUM
##END=
