##TITLE=1H_TG-2307-01
 CDCl3
 8 sc, 
 14.6.2023
##JCAMPDX= 6.0         $$ Bruker NMR JCAMP-DX V2.0
##DATA TYPE= NMR SPECTRUM
##DATA CLASS= NTUPLES
##ORIGIN= UXNMR, Bruker Analytische Messtechnik GmbH
##OWNER= root
$$ XWIN-NMR		Version 3.5
$$ Wed Jun 14 13:59:08 2023 Russian Standard Time (UT+4h)  she@DPX200
##.OBSERVE FREQUENCY= 200.13135
##.OBSERVE NUCLEUS= ^1H
##.ACQUISITION MODE= SIMULTANEOUS
##.ACQUISITION SCHEME= undefined
##.AVERAGES= 8
##.DIGITISER RES= 18
##SPECTROMETER/DATA SYSTEM= spect
##.PULSE SEQUENCE= zg30
##.SOLVENT NAME= CDCl3
##.SHIFT REFERENCE= (INTERNAL, CDCl3, 0, 15.7447)
##AUDIT TRAIL= $$ (NUMBER, WHEN, WHO, WHERE, WHAT)
$$ ##TITLE= Audit trail, XWIN-NMR		Version 3.5
$$ ##JCAMPDX= 5.01
$$ ##ORIGIN= Bruker BioSpin GmbH
$$ ##OWNER= she
$$ F:/spectra/data/she/nmr/H-F/1/pdata/1/auditp.txt
$$ ##AUDIT TRAIL=  $$ (NUMBER, WHEN, WHO, WHERE, WHAT)
(   1,<2023-06-14 13:57:26.42 +0400>,<she>,<DPX200>,
      <created by zg, POWCHK disabled, PULCHK disabled
       configuration hash MD5:
       00 E9 B6 7A A2 85 ED C7 34 08 36 98 17 FE 4E 26
       data hash MD5: 16K
       53 BC 95 C6 B1 D2 A9 6C F4 E3 A2 CA 70 CD 0C 0B>)
(   2,<2023-06-14 13:57:29.17 +0400>,<she>,<DPX200>,
      <Start of raw data processing
       efp BC_mod = 2 LB = 0.24 FT_mod = 6 PKNL = 1 PHC0 = -20350.31 PHC1 = 19.45272 SI = 16K 
       data hash MD5: 16K
       BE 18 6A D8 51 DF 42 6A DF EB 41 DE 5D 11 80 D1>)
(   3,<2023-06-14 13:57:46.45 +0400>,<she>,<DPX200>,
      <pk PHC0 = 6.214765 PHC1 = -6 
       data hash MD5: 16K
       BA EB 10 38 BF 5D 0B ED 4D A5 DB E1 88 DC 7A C1>)
(   4,<2023-06-14 13:57:49.95 +0400>,<she>,<DPX200>,
      <abs ABSG = 5 
       data hash MD5: 16K
       0D 81 B7 76 E7 66 07 FE CC 98 E1 81 CC 51 2A F9>)
(   5,<2023-06-14 13:58:15.59 +0400>,<she>,<DPX200>,
      <abs ABSG = 5 
       data hash MD5: 16K
       A9 00 E0 C3 60 37 69 2A A0 83 45 E7 A4 9A 49 5C>)
$$ ##END=
$$ 
$$ hash MD5
$$ D2 74 96 44 C2 0E AF B8 44 0B 39 8D 67 A8 47 98
##$RELAX= 
##$RELAX= 
##$RELAX= 
##$RELAX= 
##$RELAX= 
##$RELAX= 
$$ Bruker specific parameters
$$ --------------------------
##$DU= <F:/spectra>
##$EXPNO= 1
##$NAME= <H-F>
##$PROCNO= 1
##$TYPE= <nmr>
##$USER= <she>
##$AMP= (0..31)
100 100 100 100 100 100 100 100 100 100 100 100 100 100 100 100 100 100 
100 100 100 100 100 100 100 100 100 100 100 100 100 100 
##$AQSEQ= 0
##$AQ_mod= 1
##$AUNM= <au_zg>
##$AUTOPOS= <>
##$BF1= 200.13
##$BF2= 200.13
##$BF3= 200.13
##$BF4= 200.13
##$BF5= 200.13
##$BF6= 200.13
##$BF7= 200.13
##$BF8= 200.13
##$BYTORDA= 1
##$CFDGTYP= 0
##$CFRGTYP= 5
##$CHEMSTR= <none>
##$CNST= (0..31)
1 1 145 1 1 1 1 1 1 1 1 1 1 1 1 1 1 1 1 1 1 1 1 1 1 1 1 1 1 1 1 1 
##$CPDPRG= <>
##$CPDPRG1= <>
##$CPDPRG2= <>
##$CPDPRG3= <>
##$CPDPRG4= <mlev>
##$CPDPRG5= <mlev>
##$CPDPRG6= <mlev>
##$CPDPRG7= <mlev>
##$CPDPRG8= <mlev>
##$CPDPRGB= <>
##$CPDPRGT= <>
##$D= (0..31)
0 1.2 0 0 0 0 0 0 0 0.06 0 0.03 0 0 0 0 0.0002 0 0 0 0 0 0 0 0 0 0 0 0 
0 0 0 
##$DATE= 1686736645
##$DBL= (0..7)
$$ [...]
##$SUBNAM3= <"">
##$SUBNAM4= <"">
##$SUBNAM5= <"">
##$SUBNAM6= <"">
##$SUBNAM7= <"">
##$SUBNAM8= <"">
##$SUBNAM9= <"">
##$SW= 18.05172834244
##$SWIBOX= (0..15)
0 0 2 0 0 0 0 0 0 0 0 0 0 0 0 0 
##$SW_h= 3612.71676300578
##$TD= 16384
##$TD0= 1
##$TE= 0
##$TE2= 300
##$TE3= 300
##$TEG= 300
##$TL= (0..7)
0 120 120 120 120 120 120 120 
##$TP= (0..7)
150 150 150 150 150 150 150 150 
##$TP07= 0
##$TPNAME0= <>
##$TPNAME1= <>
##$TPNAME2= <>
##$TPNAME3= <>
##$TPNAME4= <>
##$TPNAME5= <>
##$TPNAME6= <>
##$TPNAME7= <>
##$TPOAL= (0..7)
0.5 0.5 0.5 0.5 0.5 0.5 0.5 0.5 
##$TPOFFS= (0..7)
0 0 0 0 0 0 0 0 
##$TUNHIN= 0
##$TUNHOUT= 0
##$TUNXOUT= 0
##$USERA1= <user>
##$USERA2= <user>
##$USERA3= <user>
##$USERA4= <user>
##$USERA5= <user>
##$V9= 5
##$VALIST= <valist>
##$VCLIST= <CCCCCCCCCCCCCCC>
##$VD= 0
##$VDLIST= <DDDDDDDDDDDDDDD>
##$VPLIST= <PPPPPPPPPPPPPPP>
##$VTLIST= <TTTTTTTTTTTTTTT>
##$WBST= 1024
##$WBSW= 4
##$XGAIN= (0..3)
0 0 0 0 
##$XL= 0
##$YL= 0
##$YMAX_a= 10076
##$YMIN_a= -7543
##$ZGOPTNS= <>
##$ZL1= 120
##$ZL2= 120
##$ZL3= 120
##$ZL4= 120
##$ABSF1= 15.74469
##$ABSF2= -2.307159
##$ABSG= 5
##$ABSL= 3
##$ALPHA= 0
##$AQORDER= 0
##$ASSFAC= 0
##$ASSFACI= 0
##$ASSFACX= 0
##$ASSWID= 0
##$AUNMP= <proc_1d>
##$AZFE= 0.1
##$AZFW= 0.1
##$BCFW= 0
##$BC_mod= 2
##$BYTORDP= 0
##$COROFFS= 0
##$CY= -3
##$DATMOD= 1
##$DC= 0
##$DFILT= <>
##$DTYPP= 0
##$F1P= 0
##$F2P= 0
##$FCOR= 1
##$FTSIZE= 16384
##$FT_mod= 6
##$GAMMA= 0
##$GB= 0
##$INTBC= 1
##$INTSCL= 3.70164e-10
##$ISEN= 128
##$LB= 0.24
##$LEV0= 0
##$LPBIN= 0
##$MAXI= 10000
##$MC2= 0
##$MEAN= 0
##$ME_mod= 0
##$MI= 1.114404
##$NCOEF= 0
##$NC_proc= -12
##$NLEV= 6
##$NOISF1= 3.799351
##$NOISF2= 2.8
##$NSP= 0
##$NTH_PI= 0
##$NZP= 0
##$OFFSET= 15.74469
##$PC= 1
##$PHC0= -20344.1
##$PHC1= 13.45272
##$PH_mod= 1
##$PKNL= yes
##$PPARMOD= 0
##$PSCAL= 0
##$PSIGN= 0
##$REVERSE= no
##$SF= 200.1300053749
##$SI= 16384
##$SIGF1= 3
##$SIGF2= 2
##$SINO= 5.538805
##$SIOLD= 16384
##$SREGLST= <1H.CDCl3>
##$SSB= 0
##$STSI= 16384
##$STSR= 0
##$SW_p= 3612.71676300578
##$SYMM= 0
##$S_DEV= 0
##$TDeff= 16384
##$TDoff= 0
##$TI= <>
##$TILT= no
##$TM1= 0
##$TM2= 0
##$TOPLEV= 0
##$USERP1= <user>
##$USERP2= <user>
##$USERP3= <user>
##$USERP4= <user>
##$USERP5= <user>
##$WDW= 1
##$XDIM= 16384
##$YMAX_p= 480796394
##$YMIN_p= -19851732
$$ End of Bruker specific parameters
$$ ---------------------------------
##NTUPLES= NMR SPECTRUM
##VAR_NAME=  FREQUENCY,     SPECTRUM/REAL,   SPECTRUM/IMAG
##SYMBOL=    X,             R,               I
##VAR_TYPE=  INDEPENDENT,   DEPENDENT,       DEPENDENT
##VAR_FORM=  AFFN,          ASDF,            ASDF
##VAR_DIM=   16384,         16384,           16384
##UNITS=     HZ,            ARBITRARY UNITS, ARBITRARY UNITS
##FACTOR=    0.220516191357247, 1,           1
##FIRST=     3150.98488259977, 0,            0
##LAST=      -461.731880406013, 0,           0
##MIN=       -461.731880406013, -19851732,   0
##MAX=       3150.98488259977, 480796394,    0
$$ Real data points
##PAGE= N=1
##DATA TABLE= (X++(R..R)), XYDATA
$$ [...]
11640a94783M0935K39189j2441k01620J62353j88043l54352J57745J83299L43846
11630A76128p3349m07883j24540L39680l18308M11871J74478j38148L12395j59649
11620A92675j13423k96191j62528Q3159J35826K30270k19588j15237p0548l3415
11610c69000k9258k41386K68466j40857L90978R1118O3055k41745j9313k02843
11600d30785J59443Q0027p523p6081k30782K72236k8102k55094o8511p7037N12609
11589a49600J70418l06498K06338k64140K23160L19499k10733q1575N36806n83252
11579a39577J13557J43517k34342J07955j26385k11492j29279M38074k13112m5464
11569b96548K37580k07834m2058l30358j07232L08841N433j51072j25547K49623
$$ plain form
11640 -194783 -153848 85341 72900 -128720 33633 -154410 -508762 -351017 -167718 176128
11630 176128 102779 -305104 -429644 -89964 -408272 3599 178077 39929 352324 192675
11620 192675 79252 -216939 -379467 -296308 -160482 69788 -149800 -265037 -335585 -369000
11610 -369000 -398258 -639644 -371178 -512035 -121057 -29939 33116 -208629 -227942 -430785
11600 -430785 -271342 -191315 -198838 -274919 -505701 -233465 -261567 -516661 -585172 -662209 -149600
11589 -149600 20818 -285680 -79342 -343482 -120322 199177 -11556 -93131 443675 -139577
11579 -139577 -26020 117497 -116845 -8890 -135275 -346767 -476046 -37972 -251084 -296548
11569 -296548 -58968 -266802 -308860 -639218 -746450 -437609 -432176 -583248 -708795 -459172
11559d59172N63187j872P0023n5145M7738j54076l5221l52715Q5991P1671r473
11548b29064K00670j87956o7269j96139P2103K34760J45037J69723k10177k88932
11538c57244J758L09688L92217k51438l21643J9542k08182m8108M25195L64991
11528C26776j05271k73310n13845J66592j37740Q9508Q0469K18288N5745o18J71362
11517G7956j25428j0119j24860J79851j00212P8268K51049J09504k30570k73677
11507a68238J35263O6200j38962L032K71445M8590l46399J72441j38935l6109
11497a31672q4657o5914J53853J78510k24585M666N748O1090j0235O8991j20544
11486a64749K81884J57983K54267k30859n8600L46526k71010l42021M10004j57385
$$ plain form
11559 -459172 104015 102143 172166 117021 164759 10683 -24538 -377253 -291262 -219591 -229064
11548 -229064 -28394 -216350 -283619 -479758 -407655 -172895 -27858 141865 -68312 -357244
11538 -357244 -355486 -45798 346419 94981 -226662 -207120 -415302 -463410 -38215 326776
11528 326776 221505 -51805 -565650 -399058 -536798 -447290 -366821 -148533 -92788 -93406 77956
11517 77956 -47472 -57591 -182451 -2600 -102812 -24544 226505 336009 105439 -168238
11507 -168238 -32975 33225 -105737 -102705 168740 217330 -129069 43372 -95563 -131672
11497 -131672 -216329 -282243 -128390 50120 -174465 -169799 -164051 -102961 -113196 -44205 -164749
11486 -164749 117135 275118 529385 298526 239926 586452 315442 -26579 383425 226040
11476B26040k85506J12512l68950M05498j77269K0553L0975l4790j97428K16156
11466e2209K83796k62106K1454l29113n1957L36172r6977K22780j07179J11152
11456G5813K95108J2911k61440m38797J22825L96694j78196l76635j10578j24420
11446e86715K71111P7641J92812K33656j01251j27198j2257l7633J25270L7504
11436G2940L48757k33632j05886j61637R2726j30123M9524K84275j92510r7064
11426g2630j01500j41881J14073r5499p3674J82800J53093M61922k21886j75668
11416B9150k60199J84338R4152j14151R7077j14963j57053m2435J46212j83843
11406c21715K26390J81147J1011j51619j36702M17125r8142R3328k19252m80058
$$ plain form
11476 226040 -59466 53046 -315904 89594 -87675 -67122 -36147 -70937 -268365 -52209
11466 -52209 231587 -30519 -9065 -338178 -390135 -53963 -150940 71840 -35339 75813
11456 75813 370921 383832 122392 -316405 -193580 203114 24918 -351717 -462295 -586715
11446 -586715 -315604 -237963 -45151 188505 87254 -39944 -52201 -89834 35436 72940
11436 72940 421697 188065 82179 -79458 13268 -116855 -67331 216944 24434 -72630
11426 -72630 -174130 -316011 -201938 -297437 -371111 -188311 -35218 426704 204818 29150
11416 29150 -231049 -46711 47441 -66710 30367 -84596 -241649 -284084 -137872 -321715
11406 -321715 -95325 85822 96833 -54786 -191488 225637 127495 220823 1571 -478487
11396d78487l1475K90322L78390J85636n7951j92326l04420j39505L05545L30396
11386B86125N7684Q765k09562o7119q1833l62844N69309L26483k07057m54269
11376a34318j41898J39964M54156j11597k88596J91517j76711n6527k12564M00102
11366F3528j90684K68706p5194Q3290k36370J6114N8303L5328j7657k81984j66144
11355d42764M01930L47320o4538j04460R0631l59422L2300N13480o80778j36015
11345d02316J01986N43377l13305k26929J03739J22640J23588l40214L9656M16128
11335A68350l7944p0650k30537L88189K12140l57651l3189n9028P2839q0945o6199
11324i4625p4607K11678M8954q4210k31516K9520J4985K61793L71679l47876N2044
$$ plain form
11396 -478487 -509962 -219640 158750 344386 286435 94109 -210311 -349816 -44271 286125
11386 286125 343809 352574 143012 75893 -5940 -368784 200525 527008 319951 -134318
11376 -134318 -276216 -136252 317904 206307 -82289 109228 -67483 -124010 -336574 63528
11366 63528 -127156 141550 66356 149646 -86724 -70610 -12307 23021 5364 -276620 -442764
11355 -442764 -40834 306486 241948 137488 228119 -131303 -99003 414477 -266301 -402316
11345 -402316 -300330 243047 -70258 -297187 -193448 -70808 52780 -287434 -247778 168350
11335 168350 130406 59756 -170781 217408 429548 71897 38708 -20320 52519 -28426 -94625
11324 -94625 -169232 42446 91400 7190 -224326 -194806 -179821 81972 453651 105775 157819
11313A57819R6096N4386k10770m9736o4755J8065k42393j0561O6729Q1547K18991
11302A15418J4343j74677K28804N8072o93026l09819K49121J80082K07749J25216
11292A283k63831J59302K07506K90594J42015j24523l22825j18375r0795j54315
11282b73964N62549M5368N9406k46515j46486N40822j5361k84622k56116m9745
11272f4664p4514j16926r6956K96037q7496j20905N0122p6386K22046J7498p7530
11261a29674L6289j40870J20412J600n7216k83843M41760k237k86567L39482j39119
11250i9983J06735J60438r3396L25702L56478o5135n73874L1079L77354P7680
11240F03078n80968j02780K39991l13353L5072m44029k7292J63130K00068K38606
$$ plain form
11313 157819 253915 308301 97531 47795 -16960 1105 -241288 -251849 -185120 -103573 115418
11302 115418 129761 -44916 183888 241960 -451066 -760885 -511764 -331682 -123933 1283
11292 1283 -262548 -103246 104260 394854 536869 412346 89521 -28854 -119649 -273964
11282 -273964 288585 333953 393359 146844 358 541180 525819 241197 -14919 -64664
11272 -64664 -139178 -256104 -353060 -57023 -144519 -265424 -215302 -291688 -69642 -52144 -129674
11261 -129674 -93385 -234255 -113843 -112243 -169459 -453302 -11542 -13779 -300346 39136 -99983
11250 -99983 6752 167190 73794 399496 755974 690839 116965 148044 525398 603078
11240 603078 22110 -80670 159321 -154032 -118960 -562989 -590281 -427151 -227083 11523
11230A1523p8261m79055J73660N3262n4462L33340M95820p23496k91421L00419
11220b58671K18590j37150k39738J62912M09155L58333m89273l16886J94145R0689
11210g894k41844J17306M8708L43698j01352Q6578l47747k99600k19035L10928
11200c10254N92265j18276O3662k14624n74784L00102l2756N6727L00530L57485
11190D20077k10048m29682q6580j80808J7330N3167M16063j69341K91867k49315
11180a27270k45727K22704K78680Q0695j80732J52245j9103m70561j17581K17599
11170b09051K23337j96786q0017K37530l8825l87552Q0080L0263q3406m1363J70783
11159b95007L163K36394j05471M6219k13371j7421M22656k73013k34208K74688
$$ plain form
11230 11523 -66738 -545793 -372133 -318871 -373333 -39993 455827 -267669 -559090 -258671
11220 -258671 -40081 -177231 -416969 -254057 155098 513431 24158 -292728 -98583 -7894
11210 -7894 -249738 -132432 -83724 259974 158622 245200 -102547 -402147 -621182 -310254
11200 -310254 282011 163735 227397 12773 -562011 -261909 -294665 -237938 62592 420077
11190 420077 210029 -219653 -306233 -487041 -469711 -416544 -481 -169822 122045 -127270
11180 -127270 -372997 -150293 128387 209082 28350 180595 161492 -309069 -426650 -209051
11170 -209051 14286 -182500 -262517 -24987 -63812 -451364 -371284 -341021 -424427 -465790 -295007
11159 -295007 -291844 -55450 -160921 -114702 -328073 -345494 77162 -195851 -430059 -155371
11149a55371m5847p9096N7024j11930O1287j16212L58645J4757r8003K24825M68333
11138E78412m66217m6090j15192l08774k30551J76202L48855j98529J60248j15406
11128b17042m24163P6303L77703L30035m50736J07139L4197r3273K51170P3447
11118F4780J7364J23853m07446R0009k09538k61408M61272L10843J73246l84255
11108b1280n9048o5574L1758M575J2645o0598k92996K43985L4696J95545K42882
11097B66590k57199m12856K75351L8126K78688J07501m39019j91052L66410J28522
11087A61062K7282O4899n72409J52174M59963J26934l66819R6599L16933l44271
11077A22347p8995k791m46655J70456j97945M51814K48397Q1239k1851l86465
$$ plain form
11149 -155371 -201218 -280314 -223290 -335220 -273933 -390145 -31500 -16743 -114746 110079 578412
11138 578412 112195 66105 -49087 -357861 -588412 -412210 -63355 -261884 -101636 -217042
11128 -217042 -641205 -564902 -187199 142836 -307900 -200761 -166564 -259837 -8667 64780
11118 64780 82144 205997 -201449 -111440 -320978 -582386 -121114 189729 362975 -21280
11108 -21280 -80328 -145902 -114144 -109569 -96924 -157522 -450518 -206533 -171837 23708 266590
11097 266590 9391 -403465 -128114 -89988 188700 296201 -142818 -333870 32540 161062
11087 161062 188344 253243 -319166 -166992 292971 419905 53086 149685 466618 122347
11077 122347 43352 40561 -406094 -235638 -433583 18231 266628 347867 326016 -60449
11067f0449k13523o7150K12932L26753o51784K09100J76610l14951K5587o5626
11057d22501K3344L23681N6820o31234K13206K19313J11543K10944m89234J75121
11047b08997M64153J15782k10086l72198l9590j16413J8919j41506j90996p4517
11037g55449J35365N47970k12315r5414K14242o6278j5787q9173O2027L50030
11027G5218o4620j29057J87531m31290L23842p140q7527J9146j9167j56375j17698
11016d07137r1224K01417k47737j82761n7991K34897O68543p8500j92282p0806
11006b23581N2915l1660J95103J08566N3557k01731l6256J42494J84496K4583
10996B68486l34574k88779L11984L42662J03245j79438r4051k7777m5643k01793
$$ plain form
11067 -60449 -273972 -341122 -128190 198563 -453221 -244121 -67511 -382462 -356875 -422501
11057 -422501 -399157 -75476 -18656 -649890 -436684 -217371 -105828 105116 -384118 -208997
11047 -208997 255156 370938 160852 -211346 -250936 -367349 -348430 -489936 -680932 -755449
11037 -755449 -620084 -72114 -284429 -379843 -165601 -231879 -247666 -336839 -274812 75218
11027 75218 10598 -118459 69072 -362218 -38376 -45516 -133043 -113897 -133064 -289439 -407137
11016 -407137 -498361 -296944 -544681 -727442 -785433 -550536 118007 39507 -152775 -223581
11006 -223581 -170666 -202326 -7223 101343 154900 -46831 -83087 59407 243903 268486
10996 268486 -66088 -354867 -42883 299779 403024 223586 129535 101758 56115 -145678
10986a45678J35790J02708l61504L79954j60121R0042k1531J3543m4781j40185
10976a51763J48025q314l6795l21556J03453J99530R1501J45587j23789j01113
10966e5234L23203J232k79667P5163K35579k87633k8949R1244m39040K34837l9614
10955a68879J50816J20784n507M83055j15759k49638o09605M34615J43418k10308
10945b7008K68620O1849m0207k4191q6800J8463k5909k55932M59928j05202j70311
10934G3300O6364K2905j14032K0927j0165k71831k63725r06k0845L28831R6305
10923g2872K97213l1772j65297l87979q1893K68214J22166n1433P6199R0221q2980
10912b0213j5793o13695Q84488n3561j50808l17362R8958J70296k46656r1023
$$ plain form
10986 -145678 -9888 92820 -268684 111270 -48851 41191 19660 33203 -11578 -151763
10976 -151763 -3738 -12052 -48847 -370403 -266950 -67420 24081 169668 45879 -55234
10966 -55234 267969 269201 -10466 64697 300276 12643 -16306 74938 -364102 -129265 -168879
10955 -168879 -18063 102721 97214 580269 464510 214872 -394733 39882 183300 -27008
10945 -27008 241612 303461 263254 239063 152263 170726 144817 -111115 348813 243611 73300
10934 73300 139664 162569 48537 69464 59299 -212532 -476257 -477163 -498008 -169177 -72872
10923 -72872 224341 192569 27272 -360707 -442600 -174386 -52220 -103653 -27454 62767 -20213
10912 -20213 -36006 -649701 234787 181226 30418 -286944 -187986 -17690 -264346 -355369
10902c55369j9837K81394P9295j0215K58712K21467R8173o8323m66994J18699
10892A37002J96350K9458l83696j97832j4719K90347K6684j30971P3394m5340
10882a9323M05161J18592j38714o713p0520J1685j51074k31570J53333l8722M5634
10871G7769l027l39492O8941j03266J12551k58474q288K60923M31154J25280k47929
10860A16142M9948K23208j29738l88134J20613J41873k67973l12811K60125J84803
10850a944k62138J75760K47510l88555L36847M7345Q4421n37289J76109K18974
10840I7040l77731J00749O2695j65872K54013M7612K20380L00897m96554j01185
10830e7956K03974J7688j81046p9989l63622J63550K81052J20398K92735p1803
$$ plain form
10902 -355369 -375206 -93812 -14517 -24732 233980 455447 553620 485297 18303 137002
10892 137002 333352 362810 -20886 -218718 -233437 56910 83594 -47377 26017 -19323
10882 -19323 385838 504430 365716 359003 288483 300168 149094 -82476 70857 32135 77769
10871 77769 74742 -264750 -195809 -299075 -186524 -444998 -453286 -192363 238791 364071 116142
10860 116142 166090 389298 259560 -128574 -7961 133912 -134061 -446872 -186747 -1944
10850 -1944 -264082 -88322 159188 -229367 107480 154825 239246 -298043 -121934 97040
10840 97040 -280691 -179942 -117247 -283119 -29106 18506 238886 539783 43229 -57956
10830 -57956 146018 163706 -17340 -97329 -460951 -297401 -16349 104049 396784 324981
10820C24981l61738O9552P0016R3321k14045o2890k31989l78239K92379K52578
10810a46074k79403j822K87324K9771k57732L87047L08811k60182M377J87406
10800B59523o4031k95147r2281R4733K38599Q1922l87147J6804O0938M6600Q494
10789c0993J66819j57128K02679L1356k05132J78715R4243l19276J8465m34255
10779d54507N29704J99587l62088J73072Q1928k22460k48485K50324r1591m9579
10769a94095k66354J78272J31499q5450k0709K86117j24327m0564k43842J63636
10759b15817K38734n9320m85662L04534K10454l71995J24015O7948K48103k87222
10749b26228k70055r0167L39362M53524j38257n558p601K05159k19220n59670
$$ plain form
10820 324981 -36757 32795 102811 196132 -17913 -80803 -312792 -691031 -398652 -146074
10810 -146074 -425477 -427299 -139975 -110204 -367936 19111 327922 67740 72117 259523
10800 259523 195492 -99655 -191936 -97203 141396 223318 -163829 -147025 -86087 -39487 -30993
10789 -30993 135826 -21302 181377 212733 7601 186316 280559 -38717 -20252 -454507
10779 -454507 75197 274784 -87304 85768 167696 -54764 -303249 -52925 -144516 -194095
10769 -194095 -460449 -282177 -150678 -236128 -256837 29280 -95047 -135611 -379453 -215817
10759 -215817 22917 -36403 -522065 -217531 -7077 -379072 -255057 -187109 60994 -226228
10749 -226228 -496283 -586450 -247088 206436 68179 62621 55020 260179 40959 -518711
10739e18711L9602q9291J93866M28908j5040n7605m67188j17355M9806L50794
10729b02214K85617P2943o6055j42157j34271M77062J28902l94841K77796J42322
10719D45104j85088l52760J4935L93368k45697m69277J48508O17042j3878q7389
10709B64868o9072l47093r166j34777K34013L18836l93579j59928n603K65640
10699c5861L55767k28081K4316L18104k77263l09474j2960J83725m8413M4264
10689A4124j79216J61891M26048L47565n08696o32219O6967j49872M12463J56840
10679A15895j10058R3313l58364k06868N13479K04464k28266P7242j83870n26744
10669f09777J9293K39287K83755j91518L99806L1706m64960J33234J66655k71782
$$ plain form
10739 -518711 -479109 -568400 -374534 54374 39334 -18271 -485459 -602814 -553008 -202214
10729 -202214 83403 156346 90291 -51866 -186137 290925 419827 24986 302782 445104
10719 445104 260016 -92744 -77809 315559 69862 -399415 -250907 366135 352257 264868
10709 264868 195796 -151297 -160463 -295240 -61227 257609 -135970 -295898 -301501 -35861
10699 -35861 319906 91825 116141 434245 156982 -152492 -165452 18273 -30140 14124
10689 14124 -165092 -3201 422847 770412 261716 -370503 -303536 -453408 -40945 115895
10679 115895 5837 99150 -259214 -466082 47397 251861 23595 100837 -83033 -609777
10669 -609777 -590484 -351197 -67442 -258960 140846 172552 -292408 -159174 7481 -264301
10659b64301L22789Q7846j47279j74345j73198k714L17887K96332k97174j43141
10649a77298r9723j33322j3677M10986k7335k70161J44041K0263k00817J42282
10639b04761j15215j56389K19737N8457L56067l5083J15310J60339K521n00155
10629i9172j85422k11285N3317L44873k84655J67549K00044m8784j26652K01531
10619A1344M38656q7019M1914m20692R7771J3134R4267K1908k62836k94314m1125
10608c86992K36856l08671L94312O1762k41536k06023J1195n6413r2457J03728
10598d84239J49521M83394k7271j01440K26746j69194l57003m1137j914m0467
10588c63004J3505K01224K38165k2113J28186J74607q4004j55966J44266j12332
$$ plain form
10659 -264301 58488 146334 -945 -175290 -348488 -351202 -33315 263017 -34157 -177298
10649 -177298 -277021 -410343 -424020 -13034 -40369 -310530 -166489 -146226 -347043 -204761
10639 -204761 -319976 -476365 -256628 -198171 157896 122813 238123 398462 400983 -99172
10629 -99172 -284594 -495879 -442562 -97689 -382344 -214795 -14751 -63535 -190187 11344
10619 11344 450000 362981 404895 -15797 81974 95108 189375 211283 -51553 -345867 -386992
10608 -386992 -150136 -458807 -64495 -2733 -244269 -450292 -439097 -495510 -587967 -484239
10598 -484239 -334718 148676 121405 19965 246711 77517 -279486 -320623 -322537 -363004
10588 -363004 -349499 -148275 89890 67777 195963 370570 286566 130600 274866 162534
10578A62534J64652l21958n70732J01753L39810p2613m32539l8460M22920L19022
10568G4389l04503p327P2749k3314n1696p0444J81633k23438N58085l39374K26292
10557I3052L5789n82331m72276J38937K69847M74741K44967l68282K11522J7554
10547F3520k30672n8138K68302K21498j28804n09449J25109L10497j15300R6041
10537D2604N9893p9514l1072j31935K36549j63768J84626K65459m56250k84029
10527c57437J66753J98073l25277J24908K89111k90459k32020L35620q4569m04167
10517e79464J23435J15050M55371q0546j8164k74842j5120P0984L00890k67310
10507a69716n7606O9277j68790p6028K34139j20919m00884K74863J52308o0533
$$ plain form
10578 162534 327186 5228 -565504 -463751 -123941 -196554 -629093 -667553 -244633 74389
10568 74389 -230114 -237441 -164692 -188006 -239702 -310146 -128513 -351951 206134 -133240 93052
10557 93052 128841 -453490 -925766 -786829 -516982 -42241 202726 -165556 45966 63520
10547 63520 -167152 -225290 43012 264510 135706 -373743 -248634 61863 -53437 42604
10537 42604 102497 22983 -8089 -140024 96525 -67243 117383 382842 -73408 -357437
10527 -357437 -190684 7389 -317888 -192980 96131 -194328 -426348 -90728 -175297 -579464
10517 -579464 -456029 -340979 114392 33846 15682 -259160 -274280 -203296 97594 -169716
10507 -169716 -227322 -158045 -326835 -402863 -168724 -289643 -690527 -415664 -263356 -323889
10497c23889j2184P8640J99756J23067l025p3836K5048j91624K22422P5734j92487
10486g2378p6531P550K55704L1150k17754j94631M31306n60878k3987r5036K46672
10475b68813K60350K3981j2196m14349O3578M51206k19668o8718L37351J1117
10465A63839k93953L6931M3673l71236o0828M032j08230J73442K21485J45217
10455d5628J49583n13232Q3454J36285n5405O0349j25152K15323J71847n33732
10445d56308J05171N27413J66659k09001k13600J32303L5630Q1441l92791J83231
10435c9852k1855L32640J24435l8195P4040k68679l63303J6878K12673j66222
10425a37440o2511J26720m39143k9882M44051l92040K41112N60570J56896j11149
$$ plain form
10497 -323889 -336073 -257433 -57677 65390 62365 -11471 13577 -178047 44375 120109 -72378
10486 -72378 -148909 -141359 114345 145495 -72259 -266890 164416 -396462 -420449 -515485 -268813
10475 -268813 -8463 15518 3322 -411027 -347449 103757 -115911 -184629 152722 163839
10465 163839 -130114 -93183 -49510 -420746 -481574 -477542 -585772 -412330 -190845 -45628
10455 -45628 103955 -409277 -325823 -189538 -244943 -184594 -309746 -94423 77424 -456308
10445 -456308 -351137 176276 342935 133934 -79666 52637 88267 169708 -223083 -39852
10435 -39852 -61707 270933 395368 357173 431213 162534 -200769 -183891 28782 -137440
10425 -137440 -199951 -73231 -512374 -542256 -98205 -490245 -249133 311437 468333 357184
10415C57184k29116J19058n05121J23602L40055o09197o3981L76893L0207m1246
10405a01662M02254l43174N2343r508j4981J83607l36356o13759k57064L69549
10395f68751N76376K13015j56539q3999o1636j71331K0142J33343K62280j12047
10385d9147k61276l6775J45970J65804k358Q8422r9354l01936M86167J48719l31768
10374d7532j68059j85254K07085J05671j2788o5935k0570P2460j28691K971L21568
10363H0926j24949n09511O17756o4303j40006J74986m6231k36173j52930k05729
10353f06164J47277N21381j41242m18074J70979r3659K24042J93652J02466k24474
10343a23816J80161k15490j88406N8511k41510p8950K1734R21712m95614n34335
$$ plain form
10415 357184 128068 247126 -257995 -134393 205662 -403535 -467516 -90623 -60416 -101662
10405 -101662 300592 -42582 9761 253 -14728 168879 -167477 -781236 -1038300 -668751
10395 -668751 -92375 120640 -35899 -119898 -181534 -352865 -332723 -199380 62900 -49147
10385 -49147 -310423 -347198 -201228 -35424 -37782 50640 -48714 -350650 135517 284236 -47532
10374 -47532 -215591 -400845 -193760 -88089 -100877 -166812 -187382 -114922 -243613 -240642 80926
10363 80926 -44023 -553534 64222 -81 -140087 34899 -11332 -247505 -400435 -606164
10353 -606164 -458887 62494 -78748 -496822 -325843 -419502 -195460 -1808 100658 -123816
10343 -123816 56345 -159145 -347551 -289040 -530550 -609500 -587766 333946 -161668 -696003
10333f96003M6008K70717l9027J75301j35051N8623J79177J43866k9863J51759
10323A25507K48653k47074k44641J59993j90204l90497j68198K21477N5958J47688
10313b81338l9581K70912K29626j70126J16986j24185N5700l52499j1663o67j59967
10302d66802K67216L10959k98946k21636K6127P6330q3114N08688k62266L5031
10292a08413J67300m0338Q4226j24038R0077q8779O1118m10214J9944M25109K080
10281G8072j86756J33862n7214n2125k88853K45865K40482k98079N6946q4639
10271b12439p9057j84248m81226N65158K68259R8763r21m37289Q4144J33017j26718
10260c72557j70587J16102O83453k04868R4968l8158L6660l16615O7961J65828
$$ plain form
10333 -696003 -649995 -379278 -418305 -243004 -378055 -319432 -140255 3611 -26252 125507
10323 125507 374160 127086 -117555 42438 -147766 -538263 -706461 -484984 -429026 -281338
10313 -281338 -320919 -50007 179619 9493 126479 2294 57994 -294505 -306168 -306835 -466802
10302 -466802 -199586 111373 -187573 -409209 -383082 -306752 -389866 118822 -143444 -108413
10292 -108413 58887 18549 102775 -21263 68814 -19965 41153 -369061 -349117 75992 78072
10281 78072 -108684 25178 -32036 -84161 -373014 -127149 113333 -184746 -127800 -212439
10271 -212439 -291496 -475744 -956970 -391812 -123553 -24790 -25711 -463000 -378856 -245839 -372557
10260 -372557 -543144 -427042 256411 51543 146511 108353 145013 -171602 -103641 62187
10250F2187l8340r2111L8151m15802m7919J47220k58639K39756J5716l40629J06958
10239e83452J19605K93466J07311K2409k31149L17869q78129M12078Q38564l39481
10229G9091N18319o79097m2678L61629j92025k34567J16345m0011K55971j07774
10219C5203J7485J0316n1942J61040J47970o84781k3445J65247L93569k07046
10209c6384k15271R9708J11694J33354j86728j83172L34704K6787L0548j29187
10199a3947O9275J07175l41316j65403R9809Q0730P4974k17942q2423k82501O93503
10188B1934J1523J09596p7514j13953j12232J30446K69191n34499j7759J28405
10178a84862k6894J22676K18322K13499O7629l39256m66914J35639k53613j7729
$$ plain form
10250 62187 23847 -68264 -30113 -445915 -493834 -346614 -605253 -365497 -349781 -690410 -583452
10239 -583452 -463847 -170381 -63070 -40661 -271810 46059 -832070 -419992 418572 79091
10229 79091 597410 -81687 -124365 237264 45239 -189328 -72983 -112994 142977 35203
10219 35203 52688 63004 11062 172102 320072 -364709 -388154 -222907 170662 -36384
10209 -36384 -251655 -151947 -40253 93101 -93627 -276799 57905 84692 115240 -13947
10199 -13947 55328 162503 -178813 -344216 -244407 -163677 -88703 -306645 -389068 -671569 21934
10188 21934 33457 143053 65539 -48414 -160646 -30200 238991 -295508 -313267 -184862
10178 -184862 -211756 -89080 129242 342741 410370 71114 -395800 -260161 -513774 -531503
10168e31503L46076J08918N3720J6282K04131r4478m7492K91334J18450j23439
10158C41999m77900p6973k8917k71961M79344R4451R0199l61894j12159M07651
10148H3840J1334n2975K76915k10998k56590l51747k67832L09103J95029l37456
10138f01377L50189J78616n10417J04088P0714k94297O81416L0988O7429l1387
10128D5962k74977L16713q9956j91193J27436L02869k83788P3248k46731k66307
10118d86724K61891L58328J57025l99554l2121k66809J58084L36050j78593L08237
10108B15814J52827n24028j25554N1933J10479L88709k00209j3234J20884j93585
10098a5964N769k97399l21992q2783O01179j30793P5525m3542n0619l70161L03175
$$ plain form
10168 -531503 -185427 -76509 -22789 -6507 197624 103146 55654 346988 465438 341999
10158 341999 -135901 -212874 -241791 -513752 -34408 60043 150242 -211652 -323811 83840
10148 83840 95174 42199 319114 108116 -148474 -500221 -768053 -458950 -263921 -601377
10138 -601377 -251188 -72572 -582989 -478901 -408187 -702484 -21068 9920 77349 45962
10128 45962 -229015 87698 -2258 -193451 -66015 236854 -46934 26314 -220417 -486724
10118 -486724 -224833 133495 290520 -109034 -141155 -407964 -249880 86170 -92423 215814
10108 215814 368641 -155387 -280941 -229008 -118529 270180 69971 56737 177621 -15964
10098 -15964 -10195 -307594 -629586 -712369 -111190 -241983 -166458 -210000 -260619 -630780 -327605
10087c27605j24773M8789O64405J30243j64374m57995J91249K1524k89033j56482
10077d64052L03278K81940K06373l25265r9001L89909n12190j30952J39044j7563
10067b28479j26532K48849q3938K1221k3763k07472m0900M45588j12971q9215
10057a97612K06610j51994j35072j34491K17063j73075J14457k63436J33998M16139
10047C2587k41309j01392j91765j98086j06445J43196M69091J34364J97887O4740
10037B02868n07842R3552K75145j44841K45805k23908m92755n0224O14526l03963
10027b91637N1426J79768q4175j0932M11456k14001J96752j6009k60618R6284
10017E8314J96011k14967k02404l0356K02592P7920o24337j50353K4521M0150
$$ plain form
10087 -327605 -452378 -403589 260816 391059 226685 -231310 -40061 -18537 -307570 -464052
10077 -464052 -160774 121166 327539 2274 -96727 293182 -219008 -349960 -210916 -228479
10067 -228479 -355011 -106162 -190100 -168879 -192642 -400114 -441014 4574 -108397 -197612
10057 -197612 8998 -142996 -278068 -412559 -195496 -368571 -254114 -517550 -383552 32587
10047 32587 -208722 -310114 -501879 -699965 -806410 -663214 -194123 -59759 138128 202868
10037 202868 -304974 -211422 63723 -81118 164687 -59221 -551976 -602200 12326 -291637
10027 -291637 -240211 -60443 -144618 -155550 255906 41905 238657 222648 -37970 58314
10017 58314 254325 39358 -163046 -193402 9190 87110 -537227 -687580 -663059 -622909
10007f22909L92734r0612K58983q7735j31428n2618J60415J97135k84359n3544
9997c13938l30950K84535L58755k95790j75634j0142o3018K67604j84714r7889
9987e61181J49874j28572K65579L68897l78381L179J3095m39757J74187L18076
9977b15004j34978K80886K56141k03870m5148j28401j92943L68578Q5643k15512
9967a44608n02937O1822J83121L9219L04935J22256J5634j20273j9813l9284J35695
9956C5767p4162j92934R7456k42651J45844k75479L27995J94748m32222Q4261
9946c31377K03375r6703j40370K65891j03709K25541J57257j04562J5767j21863
9936c0753l41699M098K32921K55657N1583k51269l11103N15258N6016k82582K878
$$ plain form
10007 -622909 -230175 -320787 -61804 -149539 -280967 -333585 -173170 23965 -260394 -313938
9997 -313938 -644888 -360353 -1598 -297388 -473022 -483164 -546182 -278578 -463292 -561181
9987 -561181 -411307 -539879 -274300 94597 -283784 -280605 -267510 -707267 -533080 -215004
9977 -215004 -349982 -69096 187045 -16825 -61973 -190374 -383317 -14739 70904 -144608
9967 -144608 -647545 -585723 -402602 -363383 -58448 63808 79442 -40831 -60644 -99928 35767
9956 35767 -38395 -231329 -133873 -376524 -230680 -506159 -178164 16584 -415638 -331377
9946 -331377 -128002 -224705 -365075 -99184 -202893 22648 179905 75343 91110 -30753
9936 -30753 -372452 -368354 -135433 120224 171807 -79462 -390565 124693 180709 -101873 -98995
9925i8995j71180L28435J94131j01955O4545K93339k15674l6576k31805k27634
9915b03369M29618j43102j46693J43467j04301n54671n6899M05922R1993J03667
9905c4368J50153k04575p2869q1912K35628m60704k29333K90497L02315L76163
9895B70995l6558M5481J82010k54293j45260J378K873k51373n32J76475j55161
9884a63965m6689j71916J90123J46833N03723j8838m99159k54158J5142L63361
9874F4457m6222r8551K02732k7279n11097n1350N00828L36913k69777j92718J41045
9863D8981l90682L84070L26588J04322n66821m92419K25525M40746J90486J07559
9853C78355j55586l81156M38801j13003m23809M51053J94311j67917K01492J58466
$$ plain form
9925 -98995 -270175 58260 252391 150436 214981 508320 292646 256070 24265 -203369
9915 -203369 226249 83147 -63546 79921 -24380 -579051 -635950 -230028 -138035 -34368
9905 -34368 115785 -88790 -161659 -243571 -7943 -468647 -697980 -407483 -105168 270995
9895 270995 234437 279918 461928 207635 62375 63753 66626 -184747 -185279 -8804 -163965
9884 -163965 -210654 -382570 -192447 -45614 458109 439271 -59888 -314046 -298904 64457
9874 64457 18235 -80316 122416 95137 -415960 -467310 33518 370431 100654 -92064 48981
9863 48981 -341701 42369 368957 473279 -93542 -585961 -360436 80310 270796 378355
9853 378355 222769 -158387 280414 167411 -256398 194655 388966 221049 422541 581007
9843E81007k10819Q0336J86912m09942l94345L59768J44010l2620n71230m9441
9833c16364O48979J66675k23759k22331m11705k20449N14612L77536k27209L02
9823H6287L1931M6257j23556j21716m53330K56410K06217K96477J6568l8668J8271
9812B21148j78543j88054L48104j83516k15856o0230k45355M70437K55614p6856
9802A46893k53515K65027O302K77824l63670J67414k10885l18784L68688m60570
9792c75276j39469k40583J41739L61024j8839N39896j06701K99979j10871j65491
9782A85408R7292L60720m65721R47813J94964p73297j21095j68607k0836k40135
9772c494L52162k39028k4327k8887j28159K00303j28947K87271o027k49427l49887
$$ plain form
9843 581007 370188 450524 637436 227494 -166851 192917 336927 304307 -266923 -316364
9833 -316364 332615 499290 275531 53200 -358505 -578954 -64342 313194 85985 86287
9823 86287 118218 164475 40919 -80797 -534127 -277717 -71500 224977 241545 202877 221148
9812 221148 42605 -145449 202655 19139 -196717 -256947 -502302 -31865 223749 146893
9802 146893 -106622 158405 164707 442531 78861 246275 35390 -283394 85294 -375276
9792 -375276 -514745 -755328 -613589 -252565 -271404 268492 161791 461770 350899 185408
9782 185408 282700 643420 177699 1125512 1320476 547179 426084 257477 236641 -3494
9772 -3494 348668 109640 85313 56426 -71733 128570 -377 286894 280867 31440 -318447
9761c18447K47064K05702j3320j38330j95981J50851P8425N6490L7470J02857
9751B12781n46280K62148L85593j29975n5822J69179j17530j50443M1450m68538
9741c97437J11893M85368l13728j94402j65197K23094N10068q3859j4746k07405
9731d6351j24204K26764J50905Q6421o1690P2489k44243R8772Q2800k21220K12360
9720B32803J45037k00642p8126k5425j99107L34793N216K97325o53147j08687
9710b49960L40887J60528J638r1421L14500n1251l5924j42282j0616j47344J77274
9699B66029R6408M40631J99054k09388n10824k62687J75066K10786K99422k33740
9689D70757m27795M8983j91064j34692M12062q8323J50810o7788N0781o159j47378
$$ plain form
9761 -318447 -71383 134319 120999 -17331 -213312 -62461 15964 72454 109924 212781
9751 212781 -333499 -71351 314242 184267 128445 297624 180094 29651 71101 -397437
9741 -397437 -285544 199824 -113904 -308306 -473503 -250409 259659 175800 161054 -46351
9731 -46351 -170555 56209 207114 293535 231845 304334 60091 158863 241663 20443 232803
9720 232803 377840 177198 99072 73647 -125460 209333 214549 511874 -141273 -249960
9710 -249960 90927 251455 253093 161672 476172 424921 388997 246715 236099 88755 266029
9699 266029 362437 803068 1002122 792734 281910 19223 194289 405075 704497 470757
9689 470757 42962 91945 -99119 -233811 178251 89928 240738 172950 223731 217572 70194
9678G0194K67825k90099j2405P1742j26983J59810k19839P8407J71798Q1327K76384
9667E28161l09028j87980M4747L16000l6729m50382n9951J47883Q6079J51027
9657B29827p4758k51764J15146P4094J03540j43887j95073L45919P7254q9824
9647A90474K54487K1619n46901J5305J84709J49472L1471N2898l30354J19681
9637A42861J58533k85874J52288j55112o66637L76218J80569L12454K77838j71221
9627C21917l42686J16900J22927l58088l83641K37560L59409L35222n56642j19925
9617b67047L38271j01199m5668R1503k27996k37056j79343o3999M82138m8608
9607b59004L57894m24213K30813N16025j27776K77095P7012k02223k3512P1309
$$ plain form
9678 70194 338019 47920 35515 107257 -19726 140084 -79755 -1348 170450 251777 528161
9667 528161 219133 31153 75900 391900 355171 -95211 -155162 -7279 78800 229827
9657 229827 155069 -96695 18451 92545 196085 52198 -142875 203044 280298 190474
9647 190474 444961 466580 -80321 -65016 119693 269165 300636 353534 23180 142861
9637 142861 301394 15520 167808 12696 -653941 -277723 -97154 215300 493138 321917
9627 321917 -20769 96131 219058 -139030 -522671 -285111 74298 409520 -147122 -267047
9617 -267047 71224 -29975 -75643 15860 -212136 -449192 -628535 -692534 -210396 -259004
9607 -259004 98890 -325323 -94510 421515 293739 570834 647846 445623 422111 493420
9597D93420j21096J37977J91000j60866l8114j75377J00825l71994k74832K98266
9587G9209n6468p9526m17742J24686N75683M90981K24592o03484j40711Q3745
9577B80965m4143K9018j64355M6776J29405k15059J6848j80963J74832k22024
9567a48700j10373K71325k76779j23812M77623L8626j36142J58303j07031q4964
9557d1924L68331j63541M55137r2653n07298K07544N4159o8913j31706K26435
9547C05571j24544k33602K85408M2238K67032k8075j11992K70621j98705l80894
9537I3058o47840o7757N56629N07448o7206L9355m82128J72487k6435m5111K05151
9526B37651O1040L58013M8915m39443k70239J3364J665J15085J78518L87177j35553
$$ plain form
9597 493420 372324 510301 701301 540435 502321 326944 427769 55775 -219057 79209
9587 79209 22741 -56785 -474527 -349841 225842 716823 941415 337931 197220 280965
9577 280965 236822 265840 101485 148261 277666 62607 79455 -101508 73324 -148700
9567 -148700 -259073 12252 -264527 -388339 89284 127910 -8232 150071 43040 -41924
9557 -41924 326407 162866 618003 525350 18052 225596 279755 210842 79136 305571
9547 305571 181027 -52575 232833 275071 542103 514028 402036 672657 473952 93058
9537 93058 -554782 -622539 -65910 441538 374332 413687 -68441 104046 77611 32500 237651
9526 237651 298691 656704 705619 266176 -4063 9301 10966 126051 304569 691746 556193
9515E56193k21227J63185L5050k61598L54927l17527J32163J52964j29662k98103
9505A66365N88339N5959k68972j25879n28058l77181k03879K33118L05213M22161
9495B67186J08666o0257q4006J34698j75205k48663L86305R0454l72754n3011
9485f587J32058J12787k24445L5001L1246J25037m2029K04590K19458N1054k24036
9474D14134l20217J76222j05319P997J89752J06547K02775r3117l11893l4159
9464B32722Q9558J81556l6276K00526J35631j46107K62904r0913l23006M71020
9454I77615M4416n98771K54590j1914Q6442j64273L44467j73332k57596R8397
9444F00041r0843K2474m1974J13907k5230j8228Q2904N17206k6691r2143l84972
$$ plain form
9515 556193 334966 498151 533201 271603 626530 309003 441166 594130 464468 166365
9505 166365 754704 810663 541691 415812 -112246 -489427 -693306 -460188 -154975 267186
9495 267186 375852 315595 231589 366287 191082 -57581 328724 419178 46424 -6587
9485 -6587 125471 238258 13813 48814 80060 205097 163068 367658 587116 638170 414134
9474 414134 93917 270139 164820 172817 362569 469116 671891 578774 266881 232722
9464 232722 322280 503836 467560 668086 803717 657610 920514 829601 506595 977615
9454 977615 1022031 423260 677850 665936 752378 588105 932572 759240 501644 600041
9444 600041 509198 531672 489698 603605 578375 560147 643051 1160257 1133566 1041423 656451
9433F56451J31467O2518l24571m0453m9090J89755J56113j97011m7800M39870
9423I77249j74705K31936k83833j2736l87821O247M20479l4529J72782J0057R0053
9412A015179l6049l82459K2938J20999l11374L84944Q4562R6133l52339m1268
9402F01266j34926j610K01537L08949l20775j94711L57968O772L91030k61934
9392I53566m20658n8878J47826O10896R490l56551L44968P2866j4407r4315K63230
9381A458033J56325J74066J22952p7741m5453j71861j17060o5934j95935R0822
9371A328214k39059r1871J36899j94355q7683K41756J74410l73226l23275M27414
9361I99224j32540j35532J45112o4020k02957J4248L91794o7646k97402M2494
$$ plain form
9433 656451 787918 850436 525865 485412 436322 626077 782190 585179 537379 977249
9423 977249 802544 1034480 750647 737911 350090 356337 776816 742287 915069 925126 1015179
9412 1015179 979130 596671 619609 740608 429234 814178 898740 994873 642534 601266
9402 601266 466340 464730 666267 975216 654441 459730 817698 824470 1215500 953566
9392 953566 532908 474030 621856 1232752 1242242 885691 1230659 1303525 1289118 1194803 1458033
9381 1458033 1614358 1788424 1911376 1833635 1788182 1616321 1499261 1433327 1237392 1328214
9371 1328214 1089155 997284 1134183 939828 852145 1093901 1268311 895085 571810 999224
9361 999224 866684 731152 876264 812244 609287 623535 1015329 947683 650281 692775
9351F92775o6057L98696j10938o7560L86523P9432J10387m73127j98760J78930
9341I30301J35997o6424l32737L13089K15203M52509n0047K0418r8919j01982
9331A417408K54356M03978o92178l38681J34515J392189J137438j779700l80912
9322A548413l94562J77381j91488k51824K61144J07320j03055J01166J15231L09619
9312A679345J06218k06922k74651J66355j3406j44812K22053O49644J6156r8293
9302B101687l31712j83867n102N47131k0227q4860K3945K03443j51966k90597
9292A807875j10362K35050k2601O3679m0897m43644K91594K36287j56476K2695
9282A883200L56903M0230l14181J4810L6542K45159J2823J1801K04153P6120n09086
$$ plain form
9351 692775 626718 1025414 914476 846916 1233439 1312871 1423258 950131 751371 930301
9341 930301 1066298 999874 667137 980226 1195429 1647938 1597891 1618309 1519390 1417408
9331 1417408 1671764 2075742 1383564 1044883 1179398 2571587 3709025 1929325 1548413
9322 1548413 1153851 1331232 1139744 887920 1149064 1256384 1153329 1254495 1369726 1679345
9312 1679345 1785563 1578641 1303990 1470345 1456939 1312127 1534180 2183824 2199980 2101687
9302 2101687 1769975 1586108 1581006 2128137 2107910 2023050 2046995 2250438 2098472 1807875
9292 1807875 1697513 1932563 1909962 1973641 1932744 1489100 1780694 2016981 1860505 1883200
9282 1883200 2240103 2280333 1966152 1980962 2017504 2262663 2275486 2287287 2491440 2567560 2058474
9271B058474N6256K03428j62124K4987N1207k53952l28630K80223L87794P609
9261B325272n43041j86784N37213N91586k23508K96651O0731j45248k09538L06865
9251B810199k51806P3185p7713j08950K95116J88941l02239l72056J47450k6092
9241B376035m8532K07576J38245K17077j5052P6738K11106l03006L0425N18686
9231C409298l1115J08551p0997k63702j131l27254M6454J01869N6086J63858k69557
9220B922360R3055J56282k42657j5990K92503j96620l9315L71293M5488J37315
9210C523714j73719o16559K54639J16257r2381N30624J46359k06952K04091r8975
9200C587098K42819K32424J29313m0897M14049j80575n7974K39270Q3290q4853
$$ plain form
9271 2058474 2114730 2318158 2156034 2181021 2232228 1978276 1649646 1929869 2317663 2325272
9261 2325272 1782231 1595447 2132660 2724246 2500738 2797389 2858120 2712872 2503334 2810199
9251 2810199 2558393 2631578 2553865 2444915 2740031 2928972 2626733 2254677 2402127 2376035
9241 2376035 2327503 2535079 2673324 2890401 2875349 2952087 3163193 2860187 2890612 3409298
9231 3409298 3378183 3486734 3415737 3152035 3150904 2823650 2870104 2971973 3028059 3191917 2922360
9220 2922360 3015415 3171697 2929040 2913050 3205553 3008933 2969618 3340911 3386399 3523714
9210 3523714 3349995 2733436 2988075 3104332 3011951 3542575 3688934 3481982 3686073 3587098
9200 3587098 3829917 4062341 4191654 4150757 4564806 4384231 4326257 4565527 4648817 4563964
9190D563964l04418l06727N20302J33028J36458k93772m65620K69217M07747k11858
9180D448321j6724L50441O88490P27883Q1330J99993L32334K9961M27561l09701
9170F959889m91882k83021j09738m63358k21721L61884k88965j80332n1084K05632
9160E437304l13358P3657J97291j62089k13897K34422n0464J35660m65610K40833
9150E113749M13414O40260j36740P3340j89932j96177K32142j05308M40590J03011
9140F388349K22320L97630M75936J96275q3338O20944M18761j12689l31307P77337
9130H970218P76329M25563L88306L76292l5574L73959Q6647K33843L18591N21939
9120A2436113K53441N07779L84867k88692j3135J9924o9721M33894O33366N72401
$$ plain form
9190 4563964 4259546 3952819 4473121 4606149 4742607 4448835 3983215 4252432 4660179 4448321
9180 4448321 4431597 4782038 5470528 6198411 6279741 6479734 6812068 6842029 7269590 6959889
9170 6959889 6468007 6184986 6075248 5611890 5390169 5752053 5463088 5282756 5231672 5437304
9160 5437304 5123946 5197603 5394894 5232805 5018908 5253330 5202866 5338526 4872916 5113749
9150 5113749 5527163 6167423 6030683 6104023 5914091 5717914 5950056 5844748 6285338 6388349
9140 6388349 6610669 7008299 7484235 7680510 7597172 8218116 8636877 8524188 8192881 8970218
9130 8970218 9746547 10172110 10560416 10936708 10901134 11275093 11361740 11595583 11914174 12436113
9120 12436113 12689554 13197333 13582200 13293508 13280373 13300297 13230576 13664470 14297836 14870237
9110A4870237M38088O11249R77819J135912Q28352J266834J310570J594643J691384
9101B4725088J843663J916417K060527K766850K464096K410567J856307J290617
9093D1334132P71429Q77909J831659J749404J12058p79360k249104k897169l127686
9084C7623272k368037k208523j008652p13516r31368j526172o39694o90490p61597
9075B6775223j36299k30183J12858K80326R33999R12419R36003J483367J656318
9066C2724031J763672K341538K439360K283635K385511J993349J103275J661404
9058D8695775K501343K292833K074737R89269m76792n08901j097456k345808l508903
9049D8616097n013288m858184m217892l931424k479617k198958j382026p80059
$$ plain form
9110 14870237 15308325 15919574 16897393 18033305 18861657 20128491 21439061 23033704 24725088
9101 24725088 26568751 28485168 30545695 33312545 35776641 38187208 40043515 41334132
9093 41334132 42105561 42983470 44815129 46564533 46676591 45897231 43648127 40750958 37623272
9084 37623272 35255235 33046712 32038060 31324544 30393176 28867004 28227310 27536820 26775223
9075 26775223 26638924 26408741 26521599 26801925 27735924 28648343 29584346 31067713 32724031
9066 32724031 34487703 36829241 39268601 41552236 43937747 45931096 47034371 48695775
9058 48695775 51197118 53489951 55564688 56553957 56077165 55568264 54470808 52125000 48616097
9049 48616097 43602809 38744625 34526733 30595309 28115692 25916734 24534708 23754649
9041B3754649j109453r67437m04299o74316p75254r38412p71386k11714k76497
9032A7625881m12858m60819o427r0419j42446q2627k38545N045l37204m77458
9022A5382123n45442j47751k65762j11270k77296m44245j92095n48960n04195
9013A2345107k9824K4128n25597p2113j58519l89641m16237K69373l15207l11130
9003A0420340P4738j73920k55737K56439j41554n6071l2278m4533n47915j41957
8993I357552K3262L32497J93273o9906l01703k37329j5308j50537J00650j43845
8983I088606J64772K70852L2774r33583k09878M7699k84594j37187j36182l89657
8973G513622k62611M00531l96353K10988L86496l01752r8207l40076K25766K29990
$$ plain form
9041 23754649 22645196 21677759 21273460 20599144 19823890 18885478 18114092 17902378 17625881
9032 17625881 17213023 16752204 16745777 16655358 16512912 16430285 16191740 16196785 15859581 15382123
9022 15382123 14836681 14688930 14423168 14311898 14034602 13590357 13398262 12849302 12345107
9013 12345107 12315283 12339411 11813814 11741701 11583182 11193541 10777304 11046677 10731470 10420340
9003 10420340 10495078 10321158 10065421 10321860 10180306 10124235 10091957 10047424 9499509 9357552
8993 9357552 9380814 9713311 9906584 9836678 9534975 9297646 9282338 9131801 9232451 9088606
8983 9088606 9253378 9524230 9557004 8623421 8413543 8461242 8176648 8039461 7903279 7513622
8973 7513622 7251011 7651542 7255189 7466177 7852673 7550921 7452714 7112638 7338404 7568394
8963G568394j68989N01810j36079j40738K12990k30189l513J16553O53564J02764
8953H476567o3403q33237R1311L22245O08363N90872n21723k00221K44978M09485
8943I125237o2280J20939J61204K22641K49011j02091L66573L84749l78173m24443
8933I663367N31413L36892N56081J57676J81008J158932M75242l6413O10561N75059
8923A4209818R98616L04717o7253M06088L23573O68266L09370K33993K1391j64269
8913A7244310k26690l98287n52287K86880p5095J23819j43484j93858K67666k99357
8903A6033617k5009M22981L4562J54947K08494P87522P51259L73497K14743R91540
8893A9948153R40602P10926Q32325M95704Q69903P31718N76674R15970J017584
$$ plain form
8963 7568394 7399405 7901215 7765136 7624398 7837388 7607199 7603686 7720239 8373803 8476567
8953 8476567 8413164 7579927 7671238 7993483 8601846 9192718 8670995 8470774 8715752 9125237
8943 9125237 9062957 9183896 9345100 9567741 9816752 9714661 10081234 10465983 10087810 9663367
8933 9663367 10194780 10531672 11087753 11245429 11426437 12585369 13060611 13024198 13634759 14209818
8923 14209818 15208434 15513151 15445898 15851986 16175559 16843825 17153195 17387188 17408579 17244310
8913 17244310 17017620 16619333 16067046 16353926 16278831 16402650 16259166 16065308 16332974 16033617
8903 16033617 16008608 16431589 16466151 16621098 16829592 17617114 18368373 18741870 18956613 19948153
8893 19948153 20888755 21599681 22432006 22927710 23797613 24529331 25106005 26021975 27039559
8884B7039559R10469P00775P15469O41324M29180R44859M52448p8444J75042M20472
8874C2351153K96925J401102N18519O62792J729965J591017J637873J208137O46238
8865D2043721q75820q43202j482152j454470j495297j331977l28835K75553P11
8856C4508232J25291k86289k16862L21400k1560k19388M78471R32321O75638J486595
8846C7783849M86312J221938J361345J634806J552251J786425J902203J753475
8838D9482604L107250L681780L015996L708172L128038K731640R50719p57771
8830F9048428j698052k983611k634869k585918j660036j241222j867206j911425
8822E2466089j570867j586088j034449o93658q23102q97407j89896m25952n11052
$$ plain form
8884 27039559 27950028 28650803 29366272 30007596 30436776 31381635 31834083 31755639 31930681 32351153
8874 32351153 32648078 34049180 34567699 35230491 36960456 38551473 40189346 41397483 42043721
8865 42043721 41167901 40324699 38842547 37388077 35892780 34560803 34231968 34507521 34508232
8856 34508232 34633523 34347234 34130372 34451772 34430212 34210824 34689295 35621616 36297254 37783849
8846 37783849 38270161 39492099 40853444 42488250 44040501 45826926 47729129 49482604
8838 49482604 52589854 56271634 59287630 62995802 66123840 68855480 69806199 69048428
8830 69048428 67350376 64366765 61731896 59145978 57485942 56244720 54377514 52466089
8822 52466089 50895222 49309134 48274685 47581027 46757925 45860518 45670622 45244670 44733618
8813D4733618J86555M76404O05916N27556R16276N98742J274451K158315J706730
8804E3184563K013584K576387K152030K178575K060301K351133K271974K134931
8796G0923478K029896J333823N6812m62026k010191k697120k802876k305501k343491
8787F1722804k630785k581851k192689k044069k242674j532408k344145k221885
8779D3932298j628668j055877m58247p45651o23046n04229m26303j65730K93348
8770C8617895M28650l63660O5730J46775Q21530K69376L0478N72684J87220l13912
8760D0462766L20281R4056k28976m76486K55359K28494M94963j73126K06969R8079
8750D1282379q80476o57406l20234k49818P4134Q9319M88712Q69259n25k24718
$$ plain form
8813 44733618 44920173 45396577 46002493 46530049 47446325 48045067 49319518 51477833 53184563
8804 53184563 55198147 57774534 59926564 62105139 64165440 66516573 68788547 70923478
8796 70923478 72953374 74287197 74344009 73881983 71871792 69174672 66371796 64066295 61722804
8787 61722804 59092019 56510168 54317479 52273410 50030736 48498328 46154183 43932298
8779 43932298 42303630 41247753 40789506 40043855 39420809 38916580 38490277 38324547 38617895
8770 38617895 39046545 38682885 38748615 38895390 39716920 39986296 40016774 40589458 40776678 40462766
8760 40462766 40783047 40877103 40648127 40171641 40427000 40655494 41150457 40977331 41184300 41282379
8750 41282379 40401903 39744497 39424263 39174445 39248579 39337898 39826610 40695869 40695344 40470626
8740D0470626n5941N98507M85423L18034L2340L07774N78528P35963K81521M12068
8730D4164843J346439J006349J388389R40856J558892J275107J711123J631419
8722E5023417J487910J601643K490374K427752L041646L651415M313845M314495
8714G8352497M662348M565947N911488O530285Q419374R352871J1762433J4880860
8706A44438103K0293387K6606432L6101504M5939350O4326534P5913744O7177340
8699D80796394n203819q1534005q0212482p0580405n1680272l4314940k3678630
8692A33591841j7980765j3694971j0796032q701896o522361n013432l200597k108754
8684F5573033j898431j505430j188880j029620j104863j627619j821856j993527
$$ plain form
8740 40470626 40414685 41013192 41498615 41816649 41848989 42156763 42735291 43471254 43752775 44164843
8730 44164843 45511282 46517631 47906020 48846876 50405768 51680875 53391998 55023417
8722 55023417 56511327 58112970 60603344 63031096 66072742 69724157 74038002 78352497
8714 78352497 83014845 87580792 93492280 100022565 108441939 117794810 129557243 144438103
8706 144438103 164731490 191337922 227439426 273378776 337705310 413619054 480796394
8699 480796394 475592575 394058570 313846088 243265683 191585411 157270471 133591841
8692 133591841 115611076 101916105 91120073 82418177 75895816 70882384 67681787 65573033
8684 65573033 63674602 62169172 60980292 59950672 58845809 57218190 55396334 53402807
8676E3402807k075374j338517j224050j788319j512754j606503k012199p64555
8668D1080536j426652j415125j382020p61519j407271m92487m91512n65451j42120
8659C2996379J5055k53424M21383P37999L73532l17978L4749P65625P77884J015392
8649C6566596J636455J215121N95072M29729n29451j849007k645086k456600k066543
8640C0896286j691275r08864l55517l29802l77033j240525j275689j185898j129118
8631B2402565l58507n25727r20000L8624m71353n69607n90042K1647L55404J54757
8621A9537761k95250j585N08319K56301n80474k12800j09577K61979k24567K31959
8611A9372066r82354r89097r10891M7130p96064r87190j066593m41164n82763
$$ plain form
8676 53402807 51327433 49988916 48764866 46976547 45463793 43857290 41845091 41080536
8668 41080536 39653884 38238759 36856739 36095220 34687949 34195462 33703950 33138499 32996379
8659 32996379 33011434 32758010 33179393 33917392 34290924 33972946 34007695 34773320 35551204 36566596
8649 36566596 38203051 39418172 40013244 40442973 39913522 38064515 35419429 32962829 30896286
8640 30896286 29205011 28296147 27940630 27610828 27233795 25993270 24717581 23531683 22402565
8631 22402565 22044058 21518331 20598331 20636955 20165602 19595995 19005953 19027600 19383004 19537761
8621 19537761 19242511 19240926 19749245 20005546 19425072 19212272 19102695 19364674 19140107 19372066
8611 19372066 18389712 17400615 16489724 16536854 15740790 14753600 13687007 13245843 12663080
8602A2663080j81792o16040l20460k09281j99837j100817j93033p0430l11834
8593I459556l16310j01868l75074k07923m43242k52544k04782J17607j21388m30754
8583G123278n68481Q5184l67544p50021k28619J29266m34848N52709p37141J78902
8573D982685o82533J042817M864263k036877k68043j136972l67879m05383k5044
8564E967034K24207n71019j82860j94494j69852k68763K83556J7055m11076l71976
8554D321812L76451j24324j27825j46262j61694j23704k29135J99520j1107Q0049
8544D053781J08593J85011o14427r9688K08472k67744j62076l62540j74330K73891
8534C148943J0128K53923r09295J57640L13436k28730j81693n4984p9776J56445
$$ plain form
8602 12663080 12481288 11865248 11544788 11335507 11135670 10034853 9841820 9771390 9459556
8593 9459556 9143246 9041378 8666304 8458381 8015139 7762595 7557813 7675420 7554032 7123278
8583 7123278 6554797 6639981 6272437 5522416 5293797 5423063 4988215 5540924 4803783 4982685
8573 4982685 4300152 5342969 10207232 8170355 7902312 6765340 6397461 5992078 5967034
8564 5967034 6191241 5620222 5437362 5242868 5073016 4804253 5087809 5104864 4693788 4321812
8554 4321812 4698263 4573939 4446114 4299852 4138158 4014454 3785319 3984839 3973732 4053781
8544 4053781 4162374 4347385 3732958 3633270 3841742 3573998 3411922 3049382 2875052 3148943
8534 3148943 3159071 3412994 2503699 2661339 2974775 2746045 2564352 2509368 2429592 2586037
8524B586037q7646J45599r1003j86870J65528m81758J25855k57368N47882K23403
8514B689659n06121K32821L01172P1793L602o74322l19626j59493J82306L21971
8504B143762k73734J32948J60255j01339k2336k9011M2688j45267L66100j10494
8494B163572m91311J64692J79700Q6858l11731m57865L78155K37060n37017j7067
8484A395046J82106j60095p1193J81284R557j68697K05740n26368l04605K83929
8474A026704j3142K3521K65062K55729K69708M97034m50832j66929J20159k2118
8464A804896k27089o80367K7433j2811K11761J87387p61563J47863N67208k16371
8454A048347K3345K12238l84388J62326j29376n40874K48275k43574K32795N5764
$$ plain form
8524 2586037 2498391 2643990 2552987 2366117 2531645 2049887 2175742 1918374 2466256 2689659
8514 2689659 2183538 2416359 2717531 2789324 2792926 2118604 1798978 1639485 1821791 2143762
8504 2143762 1870028 2002976 2163231 2061892 2039556 2010545 2053233 1907966 2274066 2163572
8494 2163572 1672261 1836953 2016653 2103511 1791780 1333915 1712070 1949130 1412113 1395046
8484 1395046 1577152 1417057 1345864 1527148 1536705 1368008 1573748 1047380 742775 1026704
8474 1026704 1013562 1037083 1302145 1557874 1827582 2324616 1873784 1706855 1827014 1804896
8464 1804896 1577807 897440 924873 912062 1123823 1311210 549647 697510 1264718 1048347
8454 1048347 1071692 1283930 899542 1061868 932492 391618 639893 396319 629114 684878
8444F84878P9138j5912L4230J54366M48537j57580M790N2221j03716M3587k30881
8433I93658M21934p4818j24045l16042k1012M43665p94063L15395M55817n16486
8423G84003j79241q1744L9528n6114K44110l11008p4256K41500j03669K91862
8413G94971o5608m89091l94059J80464O92373l51872K98970L00897l92440l34536
8403B40069R9046L14002O3887l9802l48595K39016L75232l97799n35878k5693
8393a6515K45689r3932L81032l29438Q12991l35366m57120K19299j74068J02060
8383C54632q1085M1408O02463J64889o88974Q3048j9800q269l59661K61433p90273
8372d40189K52039M05752K99700P5185K55315n7595J40747L5120m39452j91875
$$ plain form
8444 684878 764016 748104 782334 936700 1385237 1227657 1232447 1284668 1180952 1224539 993658
8433 993658 1415592 1340774 1216729 900687 879675 1323340 529277 844672 1300489 784003
8423 784003 604762 523018 562546 506432 750542 439534 365278 606778 503109 794971
8413 794971 729363 240272 -153787 26677 719050 367178 666148 967045 574605 240069
8403 240069 339115 653117 717004 677202 328607 567623 942855 545056 9178 -16515
8393 -16515 229174 135242 516274 186836 999827 664461 207341 426640 252572 354632
8383 354632 273547 314955 917418 1082307 393333 476381 456581 448312 88651 350084 -440189
8372 -440189 -188150 217602 517302 592487 847802 790207 930954 966074 526622 334747
8362C34747j57972J29613k34342L2319j007M18720l5819l37351k96823k1063N9924
8351a09054M94765K41625J3461l78358K9422j08762j34059O19842j75069j86460
8341C07353r3160j88285M68680l84968o64907M11912M5473k89220q9091N27092
8331E0879K56811K74376J10320q86198j66255L66668r3927L14453L96802l32599
8321B91330j26441L29731l1733L5754n22400J68958L21424k7650k77079J13059
8311B74953L09848l45111J56568K57577J83544J43883m47896j021696J3149M58307
8301a6874L06265J44373k89667l48064K19580m5351N1379N89298p45991k2866
8291a57918J13305K12999o3710p3582j8509k71822M92775m0653K0792N05020K81402
$$ plain form
8362 334747 176775 306388 72046 104365 103358 522078 486259 148908 -147915 -168978 -109054
8351 -109054 385711 627336 640797 262439 291861 183099 49040 668882 493813 307353
8341 307353 214193 25908 494588 109620 -555287 -143375 -97902 -387122 -476213 50879
8331 50879 307690 582066 692386 -193812 -360067 6601 -87326 227127 623929 291330
8321 291330 164889 494620 462887 498641 -23759 145199 466623 438973 161894 274953
8311 274953 584801 239690 396258 653835 837379 981262 533366 -488330 -475181 -16874
8301 -16874 289391 433764 144097 -203967 15613 -29738 21641 610939 -135052 -157918
8291 -157918 -44613 168386 104676 31094 12585 -259237 233538 192885 213677 718697 1000099
8280A000099K24752J83436p50253J18027K35086K82632m12869l88383J49599L70972
8270A013098k23202L04101n1732n65265j52191K44265O80591j25589k14347K81142
8260A190871J78006q89258p79892R71928M95595J29712j00179l16883o11190J12210
8250C80920j2577r367j05430J43845J69198k8584M86406p37742K92080l42684
8240B36065N50143m46986L420j71701R13770J20449k85642J474725o29219p34097
8230A030927K80169j51617k13998P31685J130142n24874J080382N23668n76242
8221C310242p48688J055822o87524n56592p76651l75024Q25800o84985n51683
8212H10717j061556J459466K02248J50803k34035J410541J229107p79805p43015
$$ plain form
8280 1000099 1224851 1408287 658034 776061 1011147 1293779 880910 492527 642126 1013098
8270 1013098 789896 1093997 1042265 477000 324809 569074 1249665 1124076 909729 1190871
8260 1190871 1368877 479619 -300273 671655 1167250 1296962 1196783 879900 268710 380920
8250 380920 368343 358976 253546 397391 566589 538005 1024411 286669 578749 236065
8240 236065 786208 339222 342642 170941 1084711 1205160 919518 2394243 1765024 1030927
8230 1030927 1311096 1159479 945481 1677166 2807308 2282434 3362816 3886484 3310242
8221 3310242 2561554 3617376 2929852 2373260 1596609 1221585 2047385 1362400 810717
8212 810717 -250839 1208627 1410875 1561678 1327643 2738184 3967291 3187486 2444471
8203B444471k14692j804501k91418L002231R98365m08423K13867k600636K370211
8194C709475j835052N649473j7069161j0306467J5479549o66365K249611J636153
8186a152784J136515N13485K14435k208939L53601p2637K47921P92553J328422
8177A152572r6948m96772o09956M6953p55417n18530R85291m88644M83730M00479
8167A02758L61235r00682N4327J134907L40594q73580J41746j004745r79015O12554
8157a009901J032519P2149n66241k24359N76273M33912j071761M38176Q71395
8148E52162k43111p52130K82594p42506k46623N16116L23199L21877m99810n8773
8138e47005J73451m3322j24826J90228K67625J78954O2733o99637M17578L17324
$$ plain form
8203 2444471 2229779 425278 133860 3136091 4134456 3726033 3939900 1339264 3709475
8194 3709475 1874423 7523896 -9545265 -19851732 -4372183 -5038548 -2788937 -1152784
8186 -1152784 -16269 497216 711651 -1497288 -1143687 -1216324 -968403 -175850 1152572
8177 1152572 1055624 558852 -51104 -4151 -759568 -1278098 -292807 -781451 -297721 102758
8167 102758 463993 -436689 -382362 752545 1093139 219559 361305 -643440 -1622455 -1009901
8157 -1009901 22618 94767 -471474 -695833 -119560 314352 -757409 -319233 552162
8148 552162 309051 -443079 -160485 -902991 -1149614 -633498 -310299 11578 -488232 -547005
8138 -547005 -373554 -416876 -541702 -351474 -83849 95105 157838 -541799 -124221 193103
8128A93103J5566J62019j024010R71824m3384l98757j66964l82004J85873J12513
8118c74221r07535j1963L22903J39363j10722m15763P55657l34918M81082N66871
8108A10754L85524j02951M9336K03045k38850p64705K98615L85669j38443m3913
8098A44081n9810N44427o16455p59205N19935K69066J54817J93333N63089l26850
8088F26428q01696J2032J61657o2357l38553J4962m33565J10370P53936l95361
8078c52147K497k15382L25991O02094j66345L95714m79309l6670K19109Q6031
8068C81583K88721M3203k51760j59540k43668j9235k93136j56881O40816O85418
8058I15521j43314k29607l18756l51748p2053Q7802k0961J16291K98905K55826
$$ plain form
8128 193103 208669 370688 -653322 318502 275118 -123639 -290603 -672607 -486734 -374221
8118 -374221 -1281756 -1293719 -970816 -831453 -942175 -1357938 -602281 -937199 -456117 110754
8108 110754 496278 393327 442663 645708 406858 -357847 -59232 326437 187994 144081
8098 144081 84271 628698 12243 -746962 -227027 42039 196856 390189 953278 626428
8088 626428 -175268 -163236 -1579 -63936 -402489 -387527 -821092 -710722 43214 -352147
8078 -352147 -349650 -565032 -239041 363053 196708 592422 113113 76443 295552 381583
8068 381583 670304 713507 461747 302207 58539 39304 -253832 -410713 230103 915521
8058 915521 772207 542600 223844 -127904 -199957 -112155 -133116 -16825 282080 537906
8048E37906k46653L76986j40726k81999N88843o02342l43316O46326j58267j73232
8038B03526J70209J02728j47593L8274j07526J46648M9125K25533o90805j13401
8028a23282q2273N97035O32259o08067K52076l22426N05339l24339N8949J26762
8018G12033k86449p6812r0612L59126k94535L33845o21977N5527k06563k06176
8008c22593J54479o9776P04609K07915l07038n7543j63039J00900j20599p6307
7998E1008K75214k64067J97863k32280r1828N2498K47318o36993J50814L40592
7988I0139j32183K38454j11951j80907r7429M50526R64055q3002n30016l92846
7978B14840m82735P5530L68242J23013k9020K65684J10922m6910k99068L97947
$$ plain form
8048 537906 291253 668239 527513 245514 834357 232015 -111301 535025 376758 203526
8038 203526 373735 476463 328870 367144 259618 406266 455391 680924 -9881 -123282
8028 -123282 -205555 391480 1023739 415672 667748 345322 850661 526322 585271 712033
8018 712033 425584 348772 258160 617286 322751 656596 34619 90146 -116417 -322593
8008 -322593 -168114 -237890 466719 674634 367596 310053 147014 247914 127315 51008
7998 51008 326222 62155 260018 27738 -64090 -11592 235726 -401267 -250453 90139
7988 90139 -42044 196410 84459 -96448 -193877 256649 1220704 1137702 607686 214840
7978 214840 -267895 -192365 175877 298890 269870 535554 646476 599566 300498 698445
7968F98445K61376k83741q0729k13918M96700K6862l82198N3675J42126K33916
7958I52514J26139o42778m44098N36951J36070k12090k19942m80325M13120P00382
7948H65943M9903l04004K70044j23749l46248l08768K54460M8317k10684k74431
7938g9217n6631M67196j79206K55736m1708n54955J38302M06126K70505m02290
7928B23858j84934L78449k87074o9166j12473k5780M38693j58625q1496m46395
7918c24943J14490M44478L83479K3161L4232j32351J37709K19134l01291n16777
7908H1321j91124M31537K10530l89767N14576Q1998n63074r2161J25449O9448
7898B78733O36993J02988K06110j53642n05098K2803k30480l06530j20177K32817
$$ plain form
7968 698445 959821 676080 595351 381433 878133 904995 522797 576472 718598 952514
7958 952514 1078653 435875 -8223 528728 664798 452708 232766 -247559 165561 865943
7948 865943 915846 611842 881886 758137 411889 103121 357581 405898 195214 -79217
7938 -79217 -135848 331348 152142 407878 366170 -188785 -50483 355643 626148 223858
7928 223858 38924 417373 130299 61133 -51340 -77120 361573 202948 121452 -324943
7918 -324943 -210453 234025 617504 640665 674897 542546 680255 899389 598098 81321
7908 81321 -109803 321734 532264 142497 657073 739071 175997 83836 209285 278733
7898 278733 915726 1018714 1224824 1071182 566084 588887 358407 51877 -68300 164517
7888A64517K18257P5950K49047j19542o142P02807k41488m53556L77446j88558
7878G78738m18295K78104L53051K43157m41993L04162j92471j46841O3344o5233
7868G55723j88812l63006m76929O34572O20106j40617j20388J59125r1606j72368
7858F15800k21568O7340J75962R3377k45914J85871j52803K09786k5328M63130
7848A165653l15874l22345R4434O0759j87027M36456k10491K60366l60204m7941
7838E73786L96836N2412M6538m89893j56899K22260n65840L24621J20031k6766
7828D97086k29926K59080n92695N97518j17457l4102j71269o991o12805J15244
7818b96317l40819K4772n50833J43035j318547J025843P247077k930535k87481
$$ plain form
7888 164517 382774 458724 707771 588229 582087 1284894 1043406 589850 967296 778738
7878 778738 360443 638547 991598 1234755 792762 1096924 904453 757612 820956 755723
7868 755723 566911 203905 -273024 361548 981654 841037 720649 879774 788168 615800
7858 615800 394232 461572 637534 730911 484997 670868 518065 727851 702523 1165653
7848 1165653 849779 527434 621868 682627 495600 932056 721565 981931 621727 573786
7838 573786 970622 1023034 1069572 579679 422780 645040 79200 403821 523852 497086
7828 497086 267160 526240 -66455 531063 413606 379504 208235 201244 -411561 -296317
7818 -296317 -637136 -612364 -1163197 -1020162 -2338709 -1312866 5934211 3003676 2716195
7809B716195p24018n91720l24495N25051n51254K4759k07135P4721Q65913L06612
7799B114629l55519M1338J25133J22600n90413K1851l85732l73135M2515N3814
7789H17081j17885l67674M38511K20687K60845k02428l6971Q7636L17667l30311
7779A087158N14189J00682n93665P4067L15019j77760j03072P7403M15208O1058
7769A770287o8514k13943J07093n37357K60094P7011j5008n5413K67786O19583
7759B211619l12203p35710l34809P471L58845L47738J13305k36817Q9333j85070
7749A323702J96939J2144k09173r4618k15137R6627R32569P3075m93606p9853
7739A542669J97705J26754j30855j13640L15186J5752K35827L03590n631j91887
$$ plain form
7809 2716195 1992177 1400457 1075962 1601013 1049759 1074518 867383 942104 1808017 2114629
7799 2114629 1759110 1800448 1925581 2048181 1457768 1479619 1093887 720752 763267 817081
7789 817081 699196 331522 770033 990720 1251565 1049137 1012166 1099802 1417469 1087158
7779 1087158 1601347 1702029 1108364 1182431 1497450 1319690 1216618 1294021 1709229 1770287
7769 1770287 1701773 1487830 1594923 1057566 1317660 1394671 1379663 1324250 1592036 2211619
7759 2211619 1899416 1163706 828897 836368 1195213 1542951 1656256 1419439 1508772 1323702
7749 1323702 1520641 1532785 1323612 1228994 1013857 1110484 2043053 2116128 1622522 1542669
7739 1542669 1740374 1867128 1736273 1622633 1937819 1953571 2189398 2492988 2487357 2295470
7729B295470j12930J50839k96153L29584L82010J8578l18643O3260l57927p293
7719B146795l41921R5814J13271m26104J65196L73229j42664j48934J74509k17511
7709A791680M26680J30444L48159l50804J44743N34847m43672o09311j14821J48521
7699B006466l00491j01K19430K44869m11382l36697L53769J49943J84065j97696
7689A912175J54515J21248K03865m8320K20736Q1171j5956r2574j18220P2006
7679B490646K59343l23443l8923K55004k71992j02162k93637P12196L33424k96031
7669B724425J42587j13091P5385R8786l36445K11331J01586q2431k55993n3897
7659B512243l6523J55285n5256K81007k58693j6959O40740k01521J8120j29539
$$ plain form
7729 2295470 2182540 2333379 2037226 2366810 2748820 2767398 2448755 2512015 2154088 2146795
7719 2146795 1804874 1900688 2013959 1587855 1753051 2126280 1983616 1834682 2009191 1791680
7709 1791680 2218360 2348804 2696963 2346159 2490902 3025749 2582077 1972766 1857945 2006466
7699 2006466 1705975 1705874 1925304 2170173 1758791 1422094 1775863 1925806 2109871 1912175
7689 1912175 2066690 2187938 2391803 2343483 2564219 2645390 2629434 2536860 2418640 2490646
7679 2490646 2749989 2426546 2387623 2642627 2370635 2268473 1974836 2687032 3020456 2724425
7669 2724425 2867012 2753921 2829306 2928092 2591647 2802978 2904564 2822133 2566140 2512243
7659 2512243 2475720 2631005 2575749 2856756 2598063 2581104 3221844 3020323 3038443 2908904
7649B908904P6412j75892J61240K37279K74441l73730k79628N94449J14017p2077
7639C465415j15043L55562k25508k07815k98803L92568K87019m4485J94466j91974
7629C611402j70633K41996l75211M2121M5159P2030j30228k34893J84234M6939
7619C332916M60343j33855o4423l667j98060L75193P68012J62413j35968k30296
7609D332608p5725J68561n1976k97300K30769J65655K6534K63459j1261o86912
7599D064412K04482P2687L58525L91063j36317l16673j5649J55696l84890L32446
7589D725782O9845j61891q340J56337j00119P1248P1283K89907N98431k94887
7579E417596o77661n4794Q9233M64349K18539k53030O86810o511m27589n7775
$$ plain form
7649 2908904 2985316 2809424 2970664 3207943 3482384 3108654 2829026 3423475 3537492 3465415
7639 3465415 3350372 3705934 3480426 3272611 2973808 3366376 3653395 3608910 3803376 3611402
7629 3611402 3440769 3682765 3307554 3349675 3394834 3466864 3336636 3101743 3285977 3332916
7619 3332916 3793259 3659404 3594981 3591314 3393254 3768447 4536459 4698872 4562904 4332608
7609 4332608 4256883 4425444 4373468 4076168 4306937 4472592 4499126 4762585 4751324 4064412
7599 4064412 4268894 4341581 4700106 5091169 4954852 4638179 4622530 4778226 4393336 4725782
7589 4725782 4795627 4633736 4625396 4781733 4681614 4752862 4824145 5114052 5712483 5417596
7579 5417596 4739935 4685141 4774374 5238723 5457262 5204232 5891042 5884531 5456942 5399167
7569E399167l47023N17330J88433K4421q3434q7957O0076k05961j81672P9590
7559E362970M52897M04203l31141R5381L78013l16104J81275M3507K70634L01671
7549F843306Q9748k79247M8366J33064J40307J15857j35799M00198Q8061l29291
7539G114570J8284K47013K15177j63883k16683M7827j29003J09987O82496j45776
7529G780009j14379N33875m854K27569o78434L59724M62897j05346k62989K15743
7519H413815n45021O6625L66123O063j27769J21027p14773N03123J929086m43944
7509I574355j49548N1584J35142j35113J36070K42391L28508N5659n9743j18727
7499A0060578O5840K14613J12224j51076J93625K7940J21961N22845n7599J51745
$$ plain form
7569 5399167 5052144 5569474 5757907 5782328 5698894 5610937 5671013 5465052 5283380 5362970
7559 5362970 5815867 6220070 5888929 5984310 6362323 6046219 6227494 6271001 6541635 6843306
7549 6843306 6933054 6653807 6702173 6835237 6975544 7091401 6955602 7355800 7443861 7114570
7539 7114570 7132854 7379867 7595044 7431161 7214478 7262305 7133302 7243289 7925785 7780009
7529 7780009 7665630 8199505 8194651 8422220 7743786 8103510 8566407 8461061 8198072 8413815
7519 8413815 7868794 7935419 8301542 8307605 8179836 8300863 7586090 8089213 10018299 9574355
7509 9574355 9424807 9476391 9611533 9476420 9612490 9854881 10183389 10239048 10179305 10060578
7499 10060578 10126418 10341031 10453255 10302179 10495804 10523744 10645705 11168550 11110951 11262696
7489A1262696L29608N5540m8700j64816L04478K41610O0381K2527M98500P9308
7479A2641132j7629L55823O043J21354k49800j19162K17395N26661L66386Q143
7469A3856346L4267m727K54470J81847L77684j14974M12804Q7347j22371J5759
7459A4978452K91071K37050k45331j74231M44337M64061Q7421J18974J14561M16143
7449A6732508N28423o6690Q1705L09121j58058K99248M83664J52160J86036N98649
7439A9146766n8502p8392K18993N26323L17400N13875N00660k4924K1233k4936
7429B1058496L21354l95655j11138N17641Q5285K98361J40385P01337O02407j09336
7419B3109137J50947M58686L33362k96511K48479K91380L00810P60M33921K29963
$$ plain form
7489 11262696 11592304 11647844 11599144 11434328 11738806 11980416 12040797 12063324 12561824 12641132
7479 12641132 12623503 12979326 12985369 13106723 12856923 12737761 12955156 13481817 13848203 13856346
7469 13856346 13890613 13885886 14140356 14322203 14699887 14584913 14997717 15085064 14962693 14978452
7459 14978452 15269523 15506573 15261242 15087011 15531348 15995409 16082830 16201804 16316365 16732508
7449 16732508 17260931 17194241 17275946 17585067 17427009 17726257 18209921 18362081 18548117 19146766
7439 19146766 19088264 19009872 19228865 19755188 20072588 20586463 21087123 21062199 21083432 21058496
7429 21058496 21379850 20984195 20873057 21390698 21475983 21774344 21914729 22616066 23218473 23109137
7419 23109137 23260084 23718770 24052132 23755621 24004100 24295480 24596290 24597050 25030971 25260934
7409B5260934N2429Q44342J7418J88869N23997M09936l6696J83993O5504N73879
7399B8084605Q4489J12808N49828m054J3979L89629M67803p2780J49484O8372
7389B9844163O99690K72687J85037J95403J59272M79894k28646K68418O62702
7380C2538620j47794k97554P97904N34061K1605j29667r5112J70211J39247K23415
7370C3754936L11995K35480R9906J12853P33156K90491k81285j67308J56372m5179
7360C5201417N11426K94097q9020N6528J21923k42554M25870j37073k32923J50389
7350C6060080R2058j01595k8097o4821k06547l18j30557K18314J79239r6854n13423
7339C5407479m85971o4058J21734J24857j07004m80000Q6986M5384k63372j33854
$$ plain form
7409 25260934 25313363 26157705 26175123 26363992 26887989 27297925 27261229 27445222 27510726 28084605
7399 28084605 28169094 28281902 28831730 28827676 28841655 29231284 29699087 29626307 29775791 29844163
7389 29844163 30543853 30816540 31001577 31196980 31356252 31836146 31607500 31875918 32538620
7380 32538620 32390826 32093272 32891176 33425237 33446842 33317175 33222063 33392274 33531521 33754936
7370 33754936 34066931 34302411 34402317 34515170 35248326 35538817 35257532 35090224 35246596 35201417
7360 35201417 35712843 36006940 35917920 35974448 36096371 35853817 36279687 36142614 35909691 36060080
7350 36060080 36152138 36050543 36022446 35957625 35751078 35750760 35620203 35838517 36017756 35920902 35407479
7339 35407479 34921508 34857450 34979184 35104041 34997037 34517037 34604023 34649407 34386035 34252181
7329C4252181k24382k6147r6709J85409k75851m70393k05608k00453O1426k71662
7319C2727811k38945n86356n2608k23108l19004j00006O2981k19980k65407n73401
7309C0211977o7425K21991j5947o54462l32053l84836l79542M6493k23340o28498
7299B7794358l18314k62265k63444l58334k82318p8150L45536l86656j19887k94386
7289B5776140o54212L3161m68971m04390K5729k65749l23226j78623o6196m1704
7279B3431959l96767r8187l55686l37943m41863j07471m26421l35652n21302R39
7269B0411606M51792j67638K03504k95670l47616j76093l49461j70299n43762
7260A9016363J32579J21673n48254k56886k63715l83983l00719k4842L966j10954
$$ plain form
7329 34252181 34027799 34001652 33904943 34090352 33814501 33344108 33138500 32938047 32999473 32727811
7319 32727811 32488866 31902510 31849902 31626794 31307790 31207784 31270765 31050785 30785378 30211977
7309 30211977 30144552 30366543 30350596 29696134 29364081 28979245 28599703 28646196 28422856 27794358
7299 27794358 27476044 27213779 26950335 26592001 26309683 26231533 26577069 26190413 26070526 25776140
7289 25776140 25121928 25155089 24686118 24281728 24307457 24041708 23718482 23539859 23473663 23431959
7279 23431959 23035192 22937005 22581319 22243376 21801513 21694042 21267621 20931969 20410667 20411606
7269 20411606 20863398 20695760 20899264 20603594 20255978 20079885 19730424 19560125 19016363
7260 19016363 19148942 19270615 18722361 18465475 18201760 17817777 17517058 17492216 17496182 17385228
7250A7385228J43496l9940p41708l62251R5289k70313l04275l28987M79313R0602
7240A6146454m16546l50586k86000m03552m73265o5481K8696j58738J98641J08501
7230A4328124n18061Q2598n9715l17381l94594J29087l7450k81533L12455l02881
7220A2940649l7797J49511K21137l37790j62182j41426r7409L68540r4967o92253
7210A2116013j25851l93421k2151k26874Q6455l88182j34876J64394k86641K92978
7200A1081844L33238l183l67481N64189l36363m38001k65906k77946j34552P14909
7190A0870748K33074r9113k86543o2577k14788J71687j53824l67646L24640J9957
7180A0435615m9502M3079L56199j63710n74599n9231L06008J57734k25755q1651
$$ plain form
7250 17385228 17528724 17488784 16747076 16384825 16480114 16209801 15905526 15576539 16055852 16146454
7240 16146454 15729908 15379322 15093322 14689770 14216505 14151024 14179720 14020982 14219623 14328124
7230 14328124 13810063 13892661 13832946 13515565 13120971 13250058 13212608 12931075 13243530 12940649
7220 12940649 12902852 13052363 13273500 12935710 12773528 12632102 12534693 12903233 12808266 12116013
7210 12116013 11990162 11596741 11574590 11347716 11434171 11045989 10911113 11075507 10788866 11081844
7200 11081844 11415082 11411899 11044418 11608607 11272244 10834243 10568337 10290391 10155839 10870748
7190 10870748 11103822 11004709 10718166 10655589 10440801 10612488 10458664 10091018 10415658 10435615
7180 10435615 10386113 10429192 10785391 10621681 10047082 9987851 10293859 10451593 10225838 10144187
7170A0144187j19920j9956Q2006M29882P8217M13974M31793M4388q3844j57178
7160A1243549m30163j70618M04517M9023L57028m36496j42800N10051k23262K77988
7150A1438817P0393j1783r819K50447K71788N2075J94720M08928M41822J49697
7140A3257085N60798N28252O8654j60442L15436K81990O45324J280982R81689
7131A7759768O81365J236986P99017R98027J776274J729063J972356K823648L864288
7122C3640792M429409N296102O315685N976779M752316J527425k273561n358446
7114E4306501o728516o767739n513806n131639l299360k306163k343636j513491
7106B0702151j350499j016843q51806q78781n41997j18734K26146l87992k28748
$$ plain form
7170 10144187 10024267 10004311 10086317 10516199 10594416 11008390 11440183 11484571 11400727 11243549
7160 11243549 10813386 10642768 11047285 11096308 11453336 11016840 10874040 11384091 11160829 11438817
7150 11438817 11509210 11497427 11487608 11738055 12009843 12061918 12256638 12665566 13107388 13257085
7140 13257085 13817883 14346135 14414789 14254347 14569783 14851773 15497097 16778079 17759768
7131 17759768 18441133 19678119 20477136 21475163 23251437 24980500 26952856 29776504 33640792
7122 33640792 38070201 43366303 49681988 55658767 60411083 61938508 59664947 54306501
7114 54306501 47577985 40810246 35296440 30164801 26865441 24559278 22215642 20702151
7106 20702151 19351652 18334809 17483003 16604222 16062225 15943491 16169637 15781645 15552897
7097A5552897m41166n09678m30402m5505l27373k76699l17938o14036k19973m41931
7087A1928196J44057n39892n85575j057295o82678o3704k5306k85439l48466j11184
7077H372714l95113o9585j64251l96272l48620l61328L2973p0725j57339Q7523
7067F529977J89918l13267j41846j60891K7268k32988M9629q22315j432906K342793
7057F035372P03545k87258O97791n481k66691J72124L29168K4103o1673n65173
7047F775827q9856o55479q7349l66867k33610k80584q0723l3893M05456k48340
7037E104582n88659O0562N6954J92271L53128m82838l37806Q8857L11508M752
7027D763311k5517L91209r2475j69805k21596K1919j2094Q9465m41856q8849J35325
$$ plain form
7097 15552897 15111731 14602053 14171651 14126146 13798773 13522074 13204136 12590100 12370127 11928196
7087 11928196 12072253 11532361 10946786 9889491 9206813 9143109 9117803 8832364 8483898 8372714
7077 8372714 7977601 7908016 7743765 7347493 6998873 6637545 6670518 6599793 6442454 6529977
7067 6529977 6719895 6406628 6264782 6103891 6131159 5898171 5947800 5125485 3692579 6035372
7057 6035372 6738917 6451659 7149450 7143969 6877278 7049402 7378570 7402673 7341000 6775827
7047 6775827 6685971 6030492 5943143 5576276 5342666 5062082 4981359 4947466 5352922 5104582
7037 5104582 4515923 4576485 4633439 4825710 5178838 4696000 4358194 4447051 4758559 4763311
7027 4763311 4737794 5129003 5036528 4866723 4645127 4667046 4654952 4744417 4302561 4213712 4349037
7016D349037J19618R3296J876p576l30860M72714K05875l02979m05984k73895
7006C921122K41451j0640K29224O49192R8069j17809K55251q37561M90691M69141
6996E388131k04854K12038j50184J82416P2089O3040j05805M18641j6172L82222
6986F241562j63471R5146N79684M05570N70487M98523J453698Q64856R87012J161490
6976A2694557K06292p3532j028690j494728o89641j343563r40328m66691o70508
6967F193168m54334n87391l14019l37494j53886L59052L3156l03948l78492M43670
6957D499482J91585j52721k34004l54993K45440L13197J89616J26894Q3411j17532
6947D790375K44619p1197p13936J38398J28755j96290k7753k28953l06982J75303
$$ plain form
7016 4349037 4468655 4561951 4563827 4556251 4225391 4698105 4903980 4601001 4195017 3921122
7006 3921122 4162573 4151933 4381157 5030349 5128418 5010609 5265860 4428299 4918990 5388131
6996 5388131 5183277 5395315 5245131 5427547 5499636 5562676 5456871 5875512 5859340 6241562
6986 6241562 6078091 6173237 6752921 7158491 7728978 8227501 9681199 10546055 11533067 12694557
6976 12694557 12900849 12827317 11798627 10303899 9614258 8270695 7330367 6863676 6193168
6967 6193168 5738834 5151443 4837424 4499930 4346044 4705096 4738252 4434304 4055812 4499482
6957 4499482 4691067 4538346 4304342 3949349 4194789 4507986 4697602 4824496 4907907 4790375
6947 4790375 5034994 4963797 4249861 4388259 4517014 4320724 4292971 4064018 3757036 3932339
6937C932339N21285L02229k34530Q6180K9892k86665o3275M67667O27166M6514
6927E428802p0519L8706O06859J64450L13830M85992N11760O60556O65570O59253
6917I465259O33735K13945j1702L00640j67332n6070j167589j131760o90664o51685
6907F736777o76905p81068o00822l42200k06814n22075l84593l26365l35651J85782
6897B746066K30761j05494j73424m23435j83224L87754J85689Q6638k49601k06
6887B501524m10481l56495N51325K24655l65890o22654j44458K39343R4124J91760
6877A902753p7993n7763Q1228K37410m0163L5443k30293j3669K66555l21309p3011
6866A709188j1720R428l45815l64567K9964K50683J75770L88510k87705R7800
$$ plain form
6937 3932339 4453624 4755853 4521323 4607503 4637395 4350730 4287455 4755122 5382288 5428802
6927 5428802 5358283 5396989 6003848 6168298 6482128 6968120 7479880 8140436 8806006 9465259
6917 9465259 10098994 10312939 10301237 10601877 10434545 10378475 9210886 8079126 7388462 6736777
6907 6736777 6059872 5278804 4677982 4335782 4128968 3606893 3222300 2895935 2560284 2746066
6897 2746066 2976827 2871333 2697909 2274474 2091250 2479004 2664693 2751331 2501730 2501524
6887 2501524 2091043 1734548 2285873 2510528 2144638 1521984 1377526 1616869 1710993 1902753
6877 1902753 1824760 1766997 1848225 2085635 2045472 2080915 1850622 1836953 2103508 1782199 1709188
6866 1709188 1697468 1706896 1361081 996514 1026478 1277161 1452931 1841441 1553736 1651536
6856A651536o48619J74899O41324q7299p774P7681j16679m42723K04640K03889
6846A650875K2657j09710k22463J8871M7336l18061P9310K246L03765p3104k95396
6835A106326O7415k76175J01331J07836M57081m6675l38532j44046m684j00940
6825I28937m57524M55178K96044l68778K03338m35960p7957J68830M334K4266
6815G40708L4355j8845L22633M17043m01422j70150j82447N131L95612O8128n35126
6804F75620L01399L62776k72269j70937K12770L49102l69851o2559J29545J1974
6794A167570m98007M6052J57710J49779K06111M2300k7093k99480K84887J33757
6784A363586m7405J29546j12649k4284J02931j97271L8813l86227k01533m5287
$$ plain form
6856 1651536 1002917 1177816 1819140 1731841 1724067 1801748 1685069 1242346 1446986 1650875
6846 1650875 1673532 1563822 1341359 1360230 1407566 1089505 1168815 1171061 1474826 1401722 1106326
6835 1106326 1173741 897566 998897 1106733 1563814 1517139 1178607 1034561 1029877 928937
6825 928937 471413 926591 1222635 853857 1057195 621235 543278 712108 716442 740708
6815 740708 775063 756218 1078851 1495894 1094472 924322 741875 747006 1142618 1210746 675620
6804 675620 977019 1339795 1067526 896589 1109359 1458461 1088610 1026051 1155596 1167570
6794 1167570 669563 715615 873325 1023104 1229215 1271515 1244422 944942 1229829 1363586
6784 1363586 1316181 1445727 1333078 1308794 1411725 1214454 1253267 867040 665507 620220
6774F20220l3880j55865n0876J98065J02865L12085J29776k31719l8132P3096
6764I25635j94070N1911k99175k56798j42022n3361K47173N72810N48381o07948
6754G92536o5360L21016m19635j93583Q7247j16242L29901K9634j9281L81804
6744A128037k05332k53744O9738K35766l37461J02762l42538j60200j906J42491
6734C77613K12958Q799M06872p8769o9838l81096K68086r8271J6459k35513J19664
6723E46964P2848J01224l668k77917m7305j90577L19237N6582n5894K72286R6385
6712H90165K59334j83767k70975p8814K70585p5017k53433m07556L95200N8179
6702F03901m31242j62508N30901J03227J09754k7333n18759K89339l00055J44439
$$ plain form
6774 620220 586340 430475 379599 577664 680529 992614 1122390 890671 852539 925635
6764 925635 731565 783476 484301 227503 85481 32120 279293 852103 1400484 792536
6754 792536 727176 1048192 628557 434974 522221 405979 735880 765514 746233 1128037
6744 1128037 922705 668961 738699 974465 637004 739766 397228 237028 235122 377613
6734 377613 590571 599370 1006242 927473 857635 476539 744625 646354 662813 427300 546964
6723 546964 619812 721036 717368 439451 392146 201569 520806 577388 521494 793780 890165
6712 890165 1149499 965732 694757 615943 886528 811511 558078 150522 545722 603901
6702 603901 172659 10151 541052 644279 754033 726700 207941 497280 197225 341664
6692C41664K02319J88733m02675j86032M98842l361k80237J16753j58790m58555
6682a41339j80975r3326K65407L99427j06616L09957j18637m09996K78448K59450
6672D61800j83689o1792L07086L67057p1409k52091k98131l29241L6466J93522
6662A69578L97692L4464J31600l54858O3070Q4362m25586N2295K85256O0632k16022
6651B82483J58340q2624k55907M0064o2781o7715K03284k81974M43874j10832
6641B66212k32630J45245J54215l07528J06490N7946J04729k34483j12415K79746
6631B27527K51078l278J84176n45734k33811L82811q8451J42641l56803J457p0184
6620a08571k52550k91062j47136L96135K12488l10574K0652K71536p3150M47608
$$ plain form
6692 341664 543983 732716 330041 144009 642851 639490 359253 476006 317216 -141339
6682 -141339 -322314 -415640 -150233 249194 142578 452535 333898 -76098 202350 461800
6672 461800 278111 216319 523405 890462 819053 566962 268831 -60410 -23944 169578
6662 169578 567270 601734 733334 378476 441546 525908 100322 152617 437873 498505 282483
6651 282483 440823 358199 102292 142356 79575 11860 215144 -66830 377044 266212
6641 266212 33582 178827 333042 25514 132004 189950 294679 60196 -52219 227527
6631 227527 478605 475327 659503 113769 -120042 262769 174318 316959 -39844 -38387 -108571
6620 -108571 -361121 -652183 -799319 -403184 -190696 -501270 -480618 -209082 -282232 165376
6610A65376j96571k80987K8229O11021j2576K61368J51084j28431k13177o8036
6600C17300l1155J8130L84753k54643q347k07199J44181r5974q8868Q4128k66698
6589d392q5729J86169J60365L52560j72447l67289j58508L77357J67931m83777
6579b7760Q3649P3231l57417K15941L83717M22632n70821n6043q4787J24208J40093
6568C46643L5778J78441J36567j82432l03854q9977L27617j87130l21476k33720
6558b93543L74973J56046j55522K51641J00246K35907k37102m81196J71217J65021
6548B87688Q9221l20753j94664L78821j43725k78128o0057j65920L19063k05829
6538b94283K68660L55411m40902O6215k39021R1791O85409k08726K01959J01195
$$ plain form
6610 165376 -31195 -312182 -283953 327068 314492 575860 726944 598513 385336 317300
6600 317300 286145 304275 689028 434385 426038 218839 363020 267046 178178 262306 -4392
6589 -4392 -90121 96048 256413 608973 436526 69237 -89271 288086 456017 -27760
6579 -27760 55889 129120 -228297 -12356 371361 793993 223172 167129 82342 206550 346643
6568 346643 382421 560862 697429 514997 211143 121166 448783 261653 -59823 -293543
6558 -293543 81430 237476 81954 333595 433841 669748 432646 -48550 122667 287688
6548 287688 376909 56156 -138508 240313 96588 -181540 -241597 -407517 -88454 -294283
6538 -294283 -25623 329788 -111114 -44899 -283920 -192129 493280 284554 486513 587708
6528E87708k01678M7695k6210k63431M77799q746P4808p0530o60488N9717R9077
6517A15721l9847Q1740J95027m6176l0617N7951l9568k02453L70872j10282R6124
6506D48492J3627J25628l44288K09991l69111J05792J86597O9203O504k05761
6496B46674k10704k86403L5422J84113N1345K37602L85131j39744j64301K58010
6486E97145o8793N4627J49294n64892j43959M791j64317L80828M00985k6758o5030
6475E53921m01452m57907m2220J30617L79918l9834l6929L47871L94550p7681
6465G50854l63119l3251K96869l54858J7692M55172n59818k41392L90135J12864
6455D71148l76938l7243L63117O9458K03493J8359K90383j19236L55402k33887
$$ plain form
6528 587708 386030 433725 407515 144084 621883 613137 687945 617415 -43073 16644 115721
6517 115721 75874 157614 352641 306465 275848 333799 294231 91778 462650 352368 448492
6506 448492 462119 587747 243459 453450 84339 190131 376728 445931 452435 246674
6496 246674 35970 -250433 -215011 -30898 20447 258049 643180 503436 339135 597145
6486 597145 528352 582979 732273 167381 23422 28213 -136104 244724 645709 618951 553921
6475 553921 152469 -305438 -347658 -217041 162877 123043 86114 433985 828535 750854
6465 750854 387735 354484 651353 296495 314187 769359 209541 -31851 358284 471148
6455 471148 94210 56967 420084 489542 693035 711394 1001777 882541 1237943 1004056
6445A004056n99903O8416j87055K92515j3439k68729o2295N4563K23298K38167
6435G49594Q864k44213k05483Q5316J40828L59031k28756k47177Q0564O2400Q2700
6424F43668k58838L25150M19276j40844p3379J5957J3561o13098K55487p2603
6414E14337N437k9008j3731K20922j88834K7828M1132J42126j29019k40700K02721
6403E53211R0935k6182j42638K20334k7106j67426J33556j8555k39067n6021J21360
6392D42401l6369N39373Q3563m37689P740J0184M79809k48901J00659k62330k09527
6381D68913K43256J24946J28976l27103J36182L9600n5290J13541k84444j40799
6371D47778J0506K16142J43685m07022K26957R1154j30662Q7946L13485l75879
$$ plain form
6445 1004056 404153 472569 285514 578029 564590 295861 233566 288129 511427 749594
6435 749594 758458 514245 308762 394078 534906 893937 665181 418004 498568 560968 643668
6424 643668 384830 709980 1129256 988412 915033 930990 944551 331453 586940 514337
6414 514337 519774 490766 477035 697957 509123 536951 578083 720209 591190 350490 553211
6403 553211 644146 617964 475326 695660 668554 501128 634684 616129 377062 321041 442401
6392 442401 406032 945405 1028968 591279 599019 609203 1089012 840111 940770 678440 468913
6381 468913 712169 837115 966091 638988 775170 814770 759480 873021 588577 447778
6371 447778 458284 674426 818111 411089 638046 729200 598538 686484 999969 624090
6361F24090m9529J74367l9311k5830K53178J47104q176k87088L09715K48399l67453
6350I79466M2433L508j63058M21184N07246j4796L22808k62097r86222J03319
6340I53791L78302N06418k12488l96920J19662L37738j4970j81158r3855J81943
6330A578463m00317K48881K01950k05749K95234k18797J18220J33000k21272q1578
6320A448035K60196j56357J25552N8315J23261l01062K22371K65638J58687m46810
6310A757826L16595j41416l21275j35837K79886k01460M7218J13332K98171l08020
6300A705020K73455K97109j53562P4202N9799K06653o62949M17398K24912k51070
6290B190967N7198L34137k57156P1005M94491L49055k90884O437N98742J84496
$$ plain form
6361 624090 574561 748928 709617 683787 936965 1084069 1075893 788805 1098520 1346919 979466
6350 979466 1021899 1025407 862349 1283533 1790779 1775983 2098791 1836694 850472 953791
6340 953791 1332093 1838511 1626023 1229103 1348765 1686503 1671533 1490375 1396520 1578463
6330 1578463 1178146 1427027 1628977 1423228 1718462 1499665 1617885 1750885 1529613 1448035
6320 1448035 1708231 1551874 1677426 1735741 1859002 1557940 1780311 2045949 2204636 1757826
6310 1757826 2074421 1933005 1611730 1475893 1755779 1554319 1601537 1714869 2013040 1705020
6300 1705020 1978475 2275584 2122022 2196224 2256023 2462676 1799727 2217125 2442037 2190967
6290 2190967 2248165 2582302 2325146 2396151 2890642 3239697 2948813 2955250 3553992 3738488
6280C738488k81185k41150j39096L16223J06193L16038K54817L39658K33338L86656
6270E029980J01839j31871M57900K30861M26586l6789k5640J70462K53985J54808
6260F632121j03663L73624j67549J97852J03230N95451M15040L8772k21092P01662
6250H565448L95103K55553N82551j24642L38614R99625m18339k50831P66170m5304
6240A1063948M30958N40411l31180n5800O7902L74560J85381K34023O1860N06945
6230A3079008L25778K21764L19457K1722K99291j42965j19884K53599L23286l48561
6220A4232495L40753k47853M55950M2448j35203M47262N84691k53209L3167R6473
6210A5596974p8777M54955K87874N47992K9018r1026K70692o3514K39645L49910
$$ plain form
6280 3738488 3457303 3216153 3077057 3393280 3499473 3815511 4070328 4409986 4643324 5029980
6270 5029980 5131819 4999948 5457848 5688709 6115295 6078506 6052866 6223328 6477313 6632121
6260 6632121 6528458 6902082 6734533 6932385 7035615 7631066 8046106 8084878 7863786 8565448
6250 8565448 8960551 9216104 9798655 9674013 10012627 11012252 10593913 10343082 11109252 11063948
6240 11063948 11494906 12035317 11704137 11648337 11716239 12090799 12276180 12510203 12572063 13079008
6230 13079008 13404786 13626550 13946007 13967729 14267020 14124055 14004171 14257770 14581056 14232495
6220 14232495 14573248 14325395 14781345 14823793 14688590 15135852 15720543 15467334 15500501 15596974
6210 15596974 15518197 15973152 16261026 16809018 16838036 16747010 17017702 16954188 17193833 17543743
6200A7543743O7913K32838j74368m90163j14526Q3729j73591j21203J13482J31121
6190A7098975j80138R3601J34923j70857m40711L7264R2255l94118l50959L43196
6180A6263431k52000k20038j03962j26484j66478R332j53060q22603J34635k17591
6170A4345182l60522k74851o46761m50980N8904m9954o27031m2110J34192m05976
6160A1680093K58917n83117p62050R6848n90872M6581N2790K60431r54405j372790
6150H132426j20759l85577q342j20623k6348k29745j44203n40947J16473J12722
6140F785077l33644m63461M4405j05960j68449r4138K1168o3918j67671m63515
6130D989894j81257q1621k28614M42316k59922n69899k5009K26660L71619k83203
$$ plain form
6200 17543743 17611656 17844494 17670126 17179963 17065437 17149166 16975575 16854372 16967854 17098975
6190 17098975 16918837 17012438 17147361 16976504 16535793 16573057 16665312 16271194 15920235 16263431
6180 16263431 16011431 15791393 15687431 15560947 15394469 15403801 15250741 14428138 14562773 14345182
6170 14345182 13984660 13709809 13063048 12612068 12670972 12621018 11993987 11951877 12086069 11680093
6160 11680093 11939010 11355893 10593843 10690691 10099819 10146400 10199190 10459621 9505216 8132426
6150 8132426 8011667 7626090 7617748 7497125 7470777 7241032 7096829 6555882 6672355 6785077
6140 6785077 6451433 5987972 6032377 5926417 5757968 5663830 5684998 5621080 5453409 4989894
6130 4989894 4808637 4727016 4498402 4940718 4680796 4110897 4085888 4312548 4684167 4400964
6120D400964J12141k06195r76767J6791M24451n0495n7162o0491n07227N8441
6110C154451N02917k16745k11416r4091j22346J79178k15753k20493P882M20698
6100C184282j78889n5115L58337o14604n19269J91623J96024l6081K29842N8094
6090B814244N9946p2053q7941j09874J51916J54560k43408M6789l10114k5147
6080B378918o7441l8484p3720K06923R3969K62113j31850k86449K45213K34878
6070B824070r0045J77827l02320O9084J34896l26363L51514M30376k02070m0175
6060C026794r9459o8209M40205j77434n58624M99823j51623J821p0513l46281
6050B496500L06685K2120K06401j26169l10674M81247m1898l10325p405J56781
$$ plain form
6120 4400964 4513105 4306910 3330143 3346934 3771385 3720890 3663728 3603237 3096010 3154451
6110 3154451 3657368 3440623 3229207 3135116 3012770 3191948 2976195 2755702 2763584 3184282
6100 3184282 3005393 2950278 3308615 2694011 2174742 2366365 2562389 2526308 2756150 2814244
6090 2814244 2874190 2802137 2714196 2604322 2756238 2910798 2667390 2714179 2404065 2378918
6080 2378918 2311477 2272993 2199273 2406196 2500165 2762278 2630428 2343979 2589192 2824070
6070 2824070 2734025 2911852 2609532 2678616 2813512 2487149 2838663 3269039 3066969 3026794
6060 3026794 2927335 2859126 3299331 3121897 2563273 3063096 2911473 2913294 2842781 2496500
6050 2496500 2803185 2825305 3031706 2905537 2594863 3076110 3034212 2723887 2716482 2873263
6040B873263M6700J36467m4807j31047j49917J27926k63245J46304P1818L77992
6030C191454K92798j43758l43121k05713M62156J7065L78460l23804j10114j395
6020C214028J3565J00203k48140j97063J96339j3941L44784P19605k27327j80298
6010C721755J97422M86193J27922o1991J02688j11879N58062j08480j04550M85
6000D807627N8025j75255n216N8247K57290j48723N5134N6329j96549n3438K57288
5989D970759N50804R6790J52519K31632j91373j15112l840l53807p6074o3331
5979E198967k00405J97261J22936O9954P7523M33208l082k6040L0697O93034L58984
5968F953037j81284j77742K08936J77422k83127j41506j90949m50378m18221N80473
$$ plain form
6040 2873263 2919963 3056430 3011623 2880576 2730659 2858585 2595340 2741644 2813462 3191454
6030 3191454 3484252 3340494 2997373 2791660 3253816 3270881 3649341 3325537 3215423 3214028
6020 3214028 3227593 3327796 3079656 2882593 3078932 3064991 3409775 4129380 3902053 3721755
6010 3721755 3919177 4405370 4533292 4471301 4573989 4462110 5020172 4911692 4807142 4807627
6000 4807627 4865652 4690397 4685181 4743428 5000718 4851995 4907129 4963458 4766909 4713471 4970759
5989 4970759 5521563 5618353 5770872 6002504 5811131 5696019 5692179 5338372 5262298 5198967
5979 5198967 4998562 5195823 5318759 5388713 5466236 5899444 5896362 5870322 5901019 6594053 6953037
5968 6953037 6771753 6594011 6802947 6980369 6697242 6555736 6364787 5914409 5496188 6076661
5958F076661J69750q6464L44093m98600j52585R0071J18639K86506k5404J1588
5948F334255M3880j60350J4597L28431j78977j53182m0402j6676M2330J37438
5938F351344j13315j26436L8284K4819N85416l29915k21471J82151n5278M91011
5928F826610N21558P94402J1158m56146M23446Q05862J24268M72642K90116L48753
5918A0162669J5768N01063K48345O52169M72684M0423K07241l98431L35703m1909
5908A2195725j76695p3882l07397n6638L20819O16658N19328O65256J55409P41408
5898A4599991N39193j53262j00905L58490O94479L47231P992L48440M78506K06259
5888A7326414k53388J03773L32282j80132N6400K84632K54652M77099N49241O02607
$$ plain form
5958 6076661 6246411 6159947 6504040 6005440 5852855 5942926 6061565 6348071 6322667 6334255
5948 6334255 6378135 6217785 6232382 6560813 6381836 6228654 6188252 6171576 6213906 6351344
5938 6351344 6238029 6111593 6149877 6174696 6760112 6430197 6208726 6390877 6335599 6826610
5928 6826610 7348168 8142570 8153728 7697582 8121028 8926890 9051158 9523800 9813916 10162669
5918 10162669 10178437 10679500 10927845 11580014 12052698 12093121 12300362 11901931 12237634 12195725
5908 12195725 12019030 11945148 11637751 11581113 11901932 12518590 13037918 13703174 13858583 14599991
5898 14599991 15139184 14985922 14885017 15243507 15937986 16285217 16293209 16641649 17120155 17326414
5888 17326414 17073026 17176799 17509081 17328949 17385349 17669981 17924633 18401732 18950973 19553580
5878A9553580O43207Q37681J103340R89126J395203J197879J412010J432005J973496
5869C0537527J435249J066069P09722J27771N10933k76481q35765m87579J11798
5860C2899244k1757m9800L90161P11959M21056J447953J546578J668131J730203
5851D0743728J249062O61318K95019k15941j206769q72650j697958j804396k056955
5842C5094458j544006j636491j639896j117172r68594m03279j58428m72566j43842
5833B7010184M6076M22790K82054O39927N45968M70482Q3604m90141M5757j125322
5823B7931379j032627j263671p19057j428124j484248j169018j052741q43989
5815A8937904r72917m01436n16991n83171n03023j18236P4827o29322n07588N12892
$$ plain form
5878 19553580 20196787 21034468 22137808 23126934 24522137 25720016 27132026 28564031 30537527
5869 30537527 31972776 33038845 33748567 33876338 34387271 34110790 33275025 32787446 32899244
5860 32899244 32877487 32827687 33217848 33929807 34350863 35798816 37345394 39013525 40743728
5851 40743728 41992790 42654108 42949127 42733186 41526417 40653767 38955809 37151413 35094458
5842 35094458 33550452 31913961 30274065 29156893 28188299 27785020 27626592 27154026 27010184
5833 27010184 27056260 27479050 27761104 28401031 28946999 29417481 29501085 29010944 29056701 27931379
5823 27931379 26898752 25635081 24916024 23487900 22003652 20834634 19781893 18937904
5815 18937904 17964987 17563551 17046560 16463389 15960366 15842130 15916957 15287635 14780047 15292939
5805A5292939L79952M9475q35580k36034k99756m75728o36939n99714l49817j96084
5795A2092714k27142m1793Q4889J28302m12293k66648q3715K49579q4538k32354
5785A1207001O56865l5922j3408K13623J31435l31445m95723j01210J1686l28378
5775A0914524n49802k59107l32264j58448K72674n3570n41990k03618l48898k26258
$$ plain form
5805 15292939 15672891 15722366 14886786 14650752 14350996 13875268 13238329 12638615 12288798 12092714
5795 12092714 11865572 11823779 11908668 12036970 11624677 11358029 11274314 11523893 11439355 11207001
5785 11207001 11863866 11827944 11814536 12028159 12159594 11828149 11332426 11231216 11242902 10914524
5775 10914524 10364722 10105615 9773351 9614903 9887577 9834007 9292017 9088399 8739501 8513243
$$ [...]
##END NTUPLES=NMR SPECTRUM
##END=
