##TITLE=1H_TG-2307-0
 CDCl3
 8 sc, 
 14.6.2023
##JCAMPDX= 6.0         $$ Bruker NMR JCAMP-DX V2.0
##DATA TYPE= NMR SPECTRUM
##DATA CLASS= NTUPLES
##ORIGIN= UXNMR, Bruker Analytische Messtechnik GmbH
##OWNER= root
$$ XWIN-NMR		Version 3.5
$$ Wed Jun 14 13:51:21 2023 Russian Standard Time (UT+4h)  she@DPX200
##.OBSERVE FREQUENCY= 200.13135
##.OBSERVE NUCLEUS= ^1H
##.ACQUISITION MODE= SIMULTANEOUS
##.ACQUISITION SCHEME= undefined
##.AVERAGES= 8
##.DIGITISER RES= 18
##SPECTROMETER/DATA SYSTEM= spect
##.PULSE SEQUENCE= zg30
##.SOLVENT NAME= CDCl3
##.SHIFT REFERENCE= (INTERNAL, CDCl3, 0, 15.7667)
##AUDIT TRAIL= $$ (NUMBER, WHEN, WHO, WHERE, WHAT)
$$ ##TITLE= Audit trail, XWIN-NMR		Version 3.5
$$ ##JCAMPDX= 5.01
$$ ##ORIGIN= Bruker BioSpin GmbH
$$ ##OWNER= she
$$ F:/spectra/data/she/nmr/H-F/1/pdata/1/auditp.txt
$$ ##AUDIT TRAIL=  $$ (NUMBER, WHEN, WHO, WHERE, WHAT)
(   1,<2023-06-14 13:50:07.37 +0400>,<she>,<DPX200>,
      <created by zg, POWCHK disabled, PULCHK disabled
       configuration hash MD5:
       00 E9 B6 7A A2 85 ED C7 34 08 36 98 17 FE 4E 26
       data hash MD5: 16K
       8F DD 2D C0 E1 E2 28 73 34 D7 F3 A3 8B BA 60 27>)
(   2,<2023-06-14 13:50:11.00 +0400>,<she>,<DPX200>,
      <Start of raw data processing
       efp BC_mod = 2 LB = 0.24 FT_mod = 6 PKNL = 1 PHC0 = -20427.75 PHC1 = 16.85272 SI = 16K 
       data hash MD5: 16K
       B3 4A 1E F6 63 A9 EE E0 9D 0E 75 C5 83 58 2D 3A>)
(   3,<2023-06-14 13:50:29.53 +0400>,<she>,<DPX200>,
      <pk PHC0 = 77.44222 PHC1 = 2.6 
       data hash MD5: 16K
       BC 8B 47 42 3E BF CA FE A0 C2 46 5D A1 01 B1 8C>)
(   4,<2023-06-14 13:50:32.60 +0400>,<she>,<DPX200>,
      <abs ABSG = 5 
       data hash MD5: 16K
       7E 7E 3F 72 07 81 22 1F E8 0D 88 5E 29 1E 17 A9>)
$$ ##END=
$$ 
$$ hash MD5
$$ FB 65 D8 5D 8D A2 B1 54 63 DB AF C3 66 83 62 33
##$RELAX= 
##$RELAX= 
##$RELAX= 
##$RELAX= 
##$RELAX= 
##$RELAX= 
$$ Bruker specific parameters
$$ --------------------------
##$DU= <F:/spectra>
##$EXPNO= 1
##$NAME= <H-F>
##$PROCNO= 1
##$TYPE= <nmr>
##$USER= <she>
##$AMP= (0..31)
100 100 100 100 100 100 100 100 100 100 100 100 100 100 100 100 100 100 
100 100 100 100 100 100 100 100 100 100 100 100 100 100 
##$AQSEQ= 0
##$AQ_mod= 1
##$AUNM= <au_zg>
##$AUTOPOS= <>
##$BF1= 200.13
##$BF2= 200.13
##$BF3= 200.13
##$BF4= 200.13
##$BF5= 200.13
##$BF6= 200.13
##$BF7= 200.13
##$BF8= 200.13
##$BYTORDA= 1
##$CFDGTYP= 0
##$CFRGTYP= 5
##$CHEMSTR= <none>
##$CNST= (0..31)
1 1 145 1 1 1 1 1 1 1 1 1 1 1 1 1 1 1 1 1 1 1 1 1 1 1 1 1 1 1 1 1 
##$CPDPRG= <>
##$CPDPRG1= <>
##$CPDPRG2= <>
##$CPDPRG3= <>
##$CPDPRG4= <mlev>
##$CPDPRG5= <mlev>
##$CPDPRG6= <mlev>
##$CPDPRG7= <mlev>
##$CPDPRG8= <mlev>
##$CPDPRGB= <>
##$CPDPRGT= <>
##$D= (0..31)
0 1.2 0 0 0 0 0 0 0 0.06 0 0.03 0 0 0 0 0.0002 0 0 0 0 0 0 0 0 0 0 0 0 
0 0 0 
##$DATE= 1686736206
##$DBL= (0..7)
120 120 120 120 120 120 120 120 
##$DBP= (0..7)
150 150 150 150 150 150 150 150 
##$DBP07= 0
##$DBPNAM0= <>
##$DBPNAM1= <>
##$DBPNAM2= <>
##$DBPNAM3= <>
##$DBPNAM4= <>
$$ [...]
##$SUBNAM3= <"">
##$SUBNAM4= <"">
##$SUBNAM5= <"">
##$SUBNAM6= <"">
##$SUBNAM7= <"">
##$SUBNAM8= <"">
##$SUBNAM9= <"">
##$SW= 18.05172834244
##$SWIBOX= (0..15)
0 0 2 0 0 0 0 0 0 0 0 0 0 0 0 0 
##$SW_h= 3612.71676300578
##$TD= 16384
##$TD0= 1
##$TE= 0
##$TE2= 300
##$TE3= 300
##$TEG= 300
##$TL= (0..7)
0 120 120 120 120 120 120 120 
##$TP= (0..7)
150 150 150 150 150 150 150 150 
##$TP07= 0
##$TPNAME0= <>
##$TPNAME1= <>
##$TPNAME2= <>
##$TPNAME3= <>
##$TPNAME4= <>
##$TPNAME5= <>
##$TPNAME6= <>
##$TPNAME7= <>
##$TPOAL= (0..7)
0.5 0.5 0.5 0.5 0.5 0.5 0.5 0.5 
##$TPOFFS= (0..7)
0 0 0 0 0 0 0 0 
##$TUNHIN= 0
##$TUNHOUT= 0
##$TUNXOUT= 0
##$USERA1= <user>
##$USERA2= <user>
##$USERA3= <user>
##$USERA4= <user>
##$USERA5= <user>
##$V9= 5
##$VALIST= <valist>
##$VCLIST= <CCCCCCCCCCCCCCC>
##$VD= 0
##$VDLIST= <DDDDDDDDDDDDDDD>
##$VPLIST= <PPPPPPPPPPPPPPP>
##$VTLIST= <TTTTTTTTTTTTTTT>
##$WBST= 1024
##$WBSW= 4
##$XGAIN= (0..3)
0 0 0 0 
##$XL= 0
##$YL= 0
##$YMAX_a= 21687
##$YMIN_a= -16531
##$ZGOPTNS= <>
##$ZL1= 120
##$ZL2= 120
##$ZL3= 120
##$ZL4= 120
##$ABSF1= 15.76673
##$ABSF2= -2.285119
##$ABSG= 5
##$ABSL= 3
##$ALPHA= 0
##$AQORDER= 0
##$ASSFAC= 0
##$ASSFACI= 0
##$ASSFACX= 0
##$ASSWID= 0
##$AUNMP= <proc_1d>
##$AZFE= 0.1
##$AZFW= 0.1
##$BCFW= 0
##$BC_mod= 2
##$BYTORDP= 0
##$COROFFS= 0
##$CY= -3
##$DATMOD= 1
##$DC= 0
##$DFILT= <>
##$DTYPP= 0
##$F1P= 0
##$F2P= 0
##$FCOR= 1
##$FTSIZE= 16384
##$FT_mod= 6
##$GAMMA= 0
##$GB= 0
##$INTBC= 1
##$INTSCL= 3.70164e-10
##$ISEN= 128
##$LB= 0.24
##$LEV0= 0
##$LPBIN= 0
##$MAXI= 10000
##$MC2= 0
##$MEAN= 0
##$ME_mod= 0
##$MI= 1.114404
##$NCOEF= 0
##$NC_proc= -11
##$NLEV= 6
##$NOISF1= 3.799351
##$NOISF2= 2.8
##$NSP= 0
##$NTH_PI= 0
##$NZP= 0
##$OFFSET= 15.76672
##$PC= 1
##$PHC0= -20350.31
##$PHC1= 19.45272
##$PH_mod= 1
##$PKNL= yes
##$PPARMOD= 0
##$PSCAL= 0
##$PSIGN= 0
##$REVERSE= no
##$SF= 200.13000096529
##$SI= 16384
##$SIGF1= 3
##$SIGF2= 2
##$SINO= 5.538805
##$SIOLD= 16384
##$SREGLST= <1H.CDCl3>
##$SSB= 0
##$STSI= 16384
##$STSR= 0
##$SW_p= 3612.71676300578
##$SYMM= 0
##$S_DEV= 0
##$TDeff= 16384
##$TDoff= 0
##$TI= <>
##$TILT= no
##$TM1= 0
##$TM2= 0
##$TOPLEV= 0
##$USERP1= <user>
##$USERP2= <user>
##$USERP3= <user>
##$USERP4= <user>
##$USERP5= <user>
##$WDW= 1
##$XDIM= 16384
##$YMAX_p= 303184795
##$YMIN_p= -4422161
$$ End of Bruker specific parameters
$$ ---------------------------------
##NTUPLES= NMR SPECTRUM
##VAR_NAME=  FREQUENCY,     SPECTRUM/REAL,   SPECTRUM/IMAG
##SYMBOL=    X,             R,               I
##VAR_TYPE=  INDEPENDENT,   DEPENDENT,       DEPENDENT
##VAR_FORM=  AFFN,          ASDF,            ASDF
##VAR_DIM=   16384,         16384,           16384
##UNITS=     HZ,            ARBITRARY UNITS, ARBITRARY UNITS
##FACTOR=    0.220516191357247, 1,           1
##FIRST=     3155.39365241886, 0,            0
##LAST=      -457.323110586921, 0,           0
##MIN=       -457.323110586921, -4422161,    0
##MAX=       3155.39365241886, 303184795,    0
$$ Real data points
##PAGE= N=1
##DATA TABLE= (X++(R..R)), XYDATA
$$ [...]
$$ plain form
7024 5672726 5982686 6019932 6169633 6456670 6582321 6650061 6933450 7505920 7730826 7982079
7014 7982079 8200296 8924023 9565943 10261658 11104371 12127355 13102500 14111738 15248225
7005 15248225 16572392 18181663 19961456 21929226 23719047 25761918 27675063 28669774
6997 28669774 28992872 27923341 25606041 22383873 18799180 15080743 12304557 10030844
6989 10030844 8519061 7438806 6521309 5782879 5549817 5339776 5012858 4741389 4483188
6980 4483188 4128784 3804394 3742139 3682670 3528262 3319872 3299641 3066374 3042412 3080963
6970 3080963 3012673 2972851 2929948 2701507 2761296 2634365 2354515 2222197 2068525 2043752
6960 2043752 2122984 2042548 1983389 1824165 1935569 1903131 1685233 1764792 1620294 1873737
$$ packed form
7024E672726L09960L7246J49701K87037J25651O7740K83389N72470K24906K51253
7014G982079K18217P23727O41920O95715Q42713J022984R75145J009238J136487
7005A5248225J324167J609271J779793J967770J789821K042871J913145R94711
6997B8669774L23098j069531k317300l222168l584693l718437k776186k273713
6989A0030844j511783j080255r17497p38430k33062k10041l26918k71469k58201
6980D483188l54404l24390o2255n9469j54408k08390k0231k33267k3962L8551
6970C080963o8290l9822m2903k28441N9789j26931k79850j32318j53672k4773
6960B043752P9232q0436n9159j59224J11404l2438k17898P9559j44498K53443
$$ plain form
6950 1873737 1713779 1657566 1486173 1224854 1198216 1408304 1418341 1089018 1184262 1231313
6940 1231313 1251782 1417863 1496118 1356865 1246521 1105921 1042327 1084158 1231822 1018760
6930 1018760 970283 1238508 1326415 1404237 1222859 1219543 1140338 1031053 1068017 1008269 972799
6919 972799 952838 1083051 793984 864736 936356 825044 674207 845028 1047284 964479
6909 964479 722309 621768 587853 621339 605529 680394 772963 897684 774762 673283 700266
6898 700266 663458 615219 645390 653775 612124 673696 810279 991858 934869 645750 602778
6887 602778 673041 571625 739753 845788 649430 648181 608908 360107 240464 500509
6877 500509 592218 681029 428025 377290 528262 727144 533636 349148 191445 144277
$$ packed form
6950A873737j59958n6213j71393k61319k6638K10088J0037l29323R5244M7051
6940A231313K0469J66081P8255j39253j10344j40600o3594M1831J47664k13062
6930A018760m8477K68225Q7907P7822j81378l316p9205j09285L6964n9748l5470
6919I72799j9961J30213k89067P0752P1620j11312j50837J70821K02256q2805
6909I64479k42170j00541l3915L3486j5810P4865R2569J24721j22922j01479K6983
6898G00266l6808m8239L0171Q385m1651O1572J36583J81579n6989k89119m2972
6887F02778P0263j01416J68128J06035j96358j249l9273k48801j19643K60045
6877E00509R1709Q8811k53004n0735J50972J98882j93508j84488j57703m7168
$$ plain form
6867 144277 353369 186738 174483 2031 20933 259582 285041 273558 113794 208673 408631
6856 408631 162316 140752 266190 328523 370885 301698 281118 303612 100104 108758 103881
6845 103881 108171 174167 239632 297950 275018 244752 157851 82722 74349 95773 51547 126951
6833 126951 205626 132483 122109 274253 148492 217161 161358 111083 386896 341008 222598
6822 222598 232286 257744 147750 221530 212935 179619 121708 -8504 156130 208218 164064
6811 164064 291576 176975 314763 255288 427458 388780 201547 241527 101292 43731
6801 43731 82889 64708 230138 208132 235563 193016 173903 -39841 115777 185128 158505
6790 158505 148871 150931 33588 73526 245287 284823 241828 282554 431199 452047 475225
$$ packed form
6867A44277K09092j66631j2255j72452J8902K38649K5459j1483j59764R4879J99958
6856D08631k46315k1564J25438O2333M2362o9187k0580K2494k03508Q654m877
6845A03881M290O5996O5465N8318k2932l0266q6901p5129q373K1424m4226P5404
6833A26951P8675p3143j0374J52144j25761O8669n5803n0275K75813m5888j18410
6822B22598R688K5458j09994P3780q595l3316n7911j30212J64634N2088m4154
6811A64064J27512j14601J37788n9475J72170l8678j87233L9980j40235n7561
6801D3731L9158j8181J65430k2006K7431m2547j9113k13744J55618O9351k6623
6790A58505r634K060j17343L9938J71761L9536m2995M0726J48645K0848K3178
$$ plain form
6779 475225 213727 182968 136345 197239 265379 143344 255018 170627 185562 373796 137674
6768 137674 128559 260761 269584 39397 -3444 135196 120420 123070 44414 217970 92924
6757 92924 -72989 4717 -77563 -10968 -61361 -61498 32731 -28646 -107283 -151926 -126629 -253127
6745 -253127 -152439 27902 -32253 -54348 67312 136618 81425 35464 -260913 -75802 -13493
6734 -13493 131945 288299 166200 60917 -74250 -44389 -21290 -212640 59033 224337
6724 224337 23400 -17943 -21384 -90113 -37018 -223692 -88199 -59240 -80644 -29289 -25488
6713 -25488 -217227 -27231 -46970 -314327 -162105 129485 152466 244472 323752 274776 194927
6702 194927 261401 260740 215188 229825 240686 254577 168171 116948 3173 70376 -76000 -52001
$$ packed form
6779D75225k61498l0759m6623O0894O8140j22035J11674q4391J4935J88234k36122
6768A37674r115J32202Q823k30187m2841J38640j4776K650p8656J73556j25046
6757I2924j65913P7706q2280O6595n0393j37R4229o1377p8637m4643K5297j26498
6745b53127J00688J80341o0155k2095J21660O9306n5193m5961k96377J85111O2309
6734a3493J45438J56354j22099j05283j35167K9861K3099j91350K71673J65304
6724B24337k00937m1343l441o8729N3095j86674J35493K8959k1404N1355L801
6713b5488j91739J89996j9739k67357J52222K91590K2981R2006P9280m8976p9849
6702A94927O6474o61m5552J4637J0861J3891q6406n1223j13775O7203j46376K3999
$$ plain form
6690 -52001 -12299 76858 155606 200736 129362 94123 -7592 181235 -9475 -22614 112873
6679 112873 -89250 -220865 -148022 -371494 -356397 -59048 356 -126929 -42813 -66361 9606
6668 9606 -134059 -108428 3751 76729 49099 -215022 -140834 -209754 -154079 -54354 -128322
6657 -128322 -36423 -8396 -150145 -290771 -337825 -300411 -206846 -49633 25073 142469 55137
6646 55137 12557 -94708 -121346 -259454 -232204 -81032 -292723 -266235 -114435 -42860 189020
6635 189020 112486 -37279 -181064 -125502 -160508 -219538 -222937 -49687 -136002 -92683 -26783
6624 -26783 17012 146594 266550 -11796 52777 112539 -23504 -7042 -129090 -169626 -429760
6613 -429760 -284695 -13572 -15553 -30814 -169018 -291434 -172702 120032 133194 -226363
$$ packed form
6690e2001L9702Q9157P8748M5130p1374l5239j01715J88827j90710j3139J35487
6679A12873k02123j31615P2843k23472J5097K97349N9404j27285Q4116k3548P5967
6668I606j43665K5631J12179P2978k7630k64121P4188o8920N5675R9725p3968
6657a28322R1899K8027j41749j40626m7054L7414R3565J57213P4706J17396q7332
6646E5137m2580j07265k6638j38108K7250J51172k11691K6488J51800P1575K31880
6635A89020p6534j49765j43785N5562l5006n9030l399J73250q6315M3319O5900
6624b6783M3795J29582J19956k78346O4573N9762j36043J6462j22048m0536k60134
6613d29760J45065K71123j981j5261j38204j22416J18732K92734J3162l59557
$$ plain form
6603 -226363 -168246 -73614 -212685 -193537 -99768 -32695 26398 -30077 24952 -188986 -236111
6592 -236111 -153456 -211488 -99697 -222829 -253546 -141279 -121576 -29305 47444 47566 -147636
6581 -147636 -31373 155245 -13385 -174087 -160297 -278517 -237797 -274034 -219700 -179180 -167441
6570 -167441 -122145 -87704 -153234 117765 177726 74324 27870 -56994 -109096 -256688 -187316
6559 -187316 -293251 -126381 97664 -73841 -295313 -221120 -262819 -465974 -377478 -124520
6549 -124520 5324 -158958 -127840 -79999 -180552 -25417 60114 158953 301877 231586 169420
6538 169420 288868 111132 196577 141469 68087 270115 97451 72820 -11760 106268 160363
6527 160363 161111 23701 70290 -28488 -88633 10979 38340 213887 223688 325556 176389
$$ packed form
6603b26363N8117R4632j39071J9148R3769O7073N9093n6475N5029k13938m7125
6592b36111Q2655n8032J11791j23132l0717J12267J9703R2271P6749J22j95202
6581a47636J16263J86618j68630j60702J3790j18220M0720l6237N4334M0520J1739
6570a67441M5296L4441o5530K70999N9961j03402m6454q4864n2102j47592O9372
6559a87316j05935J66870K24045j71505k21472P4193m1699k03155Q8496K52958
6549a24520J29844j64282L1118M7841j00553J55135Q5531R8839J42924p0291o2166
6538A69420J19448j77736Q5445n5108p3382K02028j72664k4631q4580J18028N4095
6527A60363P48j37410M6589r8778o0145R9612K7361J75547R801J01868j49167
$$ plain form
6516 176389 227705 199410 334751 482865 413081 271794 332571 493340 568705 766847 564884
6505 564884 376829 467465 380848 601400 765927 680358 751555 763361 709531 816618 948371
6494 948371 1077403 1333294 1162306 1131338 998907 1032810 1219256 1250890 1479560 1514819
6484 1514819 1472034 1546178 1428526 1540096 1738195 1551660 1394125 1501995 1542790 1497053
6474 1497053 1642102 1678437 1622786 1834617 1723624 1731989 1960801 1888494 1779340 1838743 1871007
6463 1871007 1977520 2045205 1864456 2134446 2209698 2161893 1987505 2068038 2176964 2283687
6453 2283687 2296095 2446837 2606107 2609438 2485446 2484701 2577822 2621526 2569887 2641112 2699634
6442 2699634 2819560 2971748 2971402 2874368 2968517 2957986 2833070 2872494 2872614 3053220 3037302
$$ packed form
6516A76389N1316k8295J35341J48114o9784j41287O0777J60769P5365J98142k01963
6505E64884j88055R0636q6617K20552J64527q5569P1197J1806n3830J07087J31753
6494I48371J29032K55891j70988l0968j32431L3903J86446L1634K28670L5259
6484A514819m2785P4144j17652J11570J98099j86535j57535J07870M0795m5737
6474A497053J45049L6335n5651K11831j10993Q365K28812p2307j09154N9403L2264
6463A871007J06513O7685j80749K69990P5252m7805j74388Q0533J08926J06723
6453B283687J2408J50742J59270L331j23992p45R3121M3704n1639P1225N8522
6442B699634J19926J52188l46r7034R4149j0531j24916L9424J20J80606j5918
$$ plain form
6431 3037302 3178388 3269008 3226634 3210358 3234705 3250504 3395080 3435343 3457308 3550060 3584562
6420 3584562 3563479 3741295 3801988 3784402 3750638 3591864 3761861 3859579 3898241 4056185 4331091
6409 4331091 4338304 4277504 4510093 4647080 4606803 4695389 4727261 4660306 4757994 5021314 5198618
6398 5198618 5193373 5368855 5498993 5347106 5413250 5725427 5644140 5791218 5843405 5847805 5862429
6387 5862429 6072378 5994965 6030002 6075451 6193904 6246209 6009012 6121618 6250878 6368260
6377 6368260 6179188 6103263 6338865 6398807 6550766 6575971 6501060 6717333 6514153 6476030
6367 6476030 6388035 6337525 6361969 6494229 6581000 6609572 6552221 6601654 6401914 6536920 6805542
6356 6805542 6703599 6420138 6365174 6348974 6302955 6424128 6545292 6576791 6222705 6247480
$$ packed form
6431C037302J41086R0620m2374j6276K4347J5799J44576M0263K1965R2752L4502
6420C584562k1083J77816O0693j7586l3764j58774J69997R7718L8662J57944K74906
6409D331091P213o0800K32589J36987m0277Q8586L1872o6955R7688K63320J77304
6398E198618n245J75482J30138j51887O6144L12177q1287J47078N2187M400J4624
6387E862429K09949p7413L5037M5449J18453N2305k37197J12606J29260J17382
6377F368260j89072p5925K35602N9942J51959K5205p4911K16273k03180l8123
6367F476030q7995n0510K4444J32260Q6771K8572n7351M9433j99740J35006K68622
6356F805542j01943k83461n4964j6200m6019J21173J21164L1499l54086K4775
$$ plain form
6346 6247480 6411685 6379332 6126524 6018613 6264275 6278545 6195959 6181859 5884237 5910759
6336 5910759 5773767 5693255 5679304 5801373 5828583 5396432 5368295 5148615 5056400 5277248
6326 5277248 4996933 4829914 4695230 4784701 4748534 4700193 4529004 4406041 4555908 4458782
6316 4458782 4188327 3809133 3659184 3776561 3888902 3658687 3576611 3592322 3424237 3353177
6306 3353177 3211765 3369864 3418400 3378199 3208238 3286313 3346586 3522606 3594749 3443349
6296 3443349 3563570 3734209 3508554 3745158 3806292 3950270 3969906 4126383 4377220 4155063
6286 4155063 4049045 4024610 4340826 4298325 4292813 4419743 4816560 4759367 4769308 4868590 5179058
6275 5179058 5353811 5475864 5765661 5930764 6254853 6611733 6801694 7228434 7448640 8030498
$$ packed form
6346F247480J64205l2353k52808j07911K45662J4270q2586j4100k97622K6522
6336E910759j36992q0512j3951J22069K7210m32151k8137k19680r2215K20848
6326E277248k80315j67019j34684Q9471l6167m8341j71189j22963J49867r7126
6316D458782k70455l79194j49949J17377J12341k30215q2076J5711j68085p1060
6306C353177j41412J58099M8536m0201j69961P8075O0273J76020P2143j51400
6296C443349J20221J70639k25655K36604O1134J43978J9636J56477K50837k22157
6286D155063j06018k4435L16216m2501n512J26930L96817n7193R941R9282L10468
6275E179058J74753J22053K89797J65103L24089L56880J89961M26740K20206N81858
$$ plain form
6265 8030498 8396322 9076455 9891352 10894199 12155931 13517696 14960989 16597153 18402593
6256 18402593 20537967 23102292 25233461 27718359 30907741 34457381 37347815 37492373
6248 37492373 33544882 26774785 20302454 15945072 12961610 10785305 9271810 8284404
6240 8284404 7460518 6540181 5985552 5579978 5175540 5103559 4868440 4767861 4472290 4185079
6230 4185079 4292776 3996120 3722572 3608563 3470489 3246726 3260235 3251715 3291888 3159287
6220 3159287 3074764 3142816 3047185 3023600 2924834 2854353 2971280 3089445 2812035 2829579 2770691
6209 2770691 2855158 2793633 2656363 2800532 2704985 2650411 2841701 2764965 2691787 2615561 2613851
6198 2613851 2519672 2502745 2454858 2291596 2164197 2358033 2437411 2342869 2442290 2520292 2281604
$$ packed form
6265H030498L65824O80133Q14897J002847J261732J361765J443293J636164J805440
6256A8402593K135374K564325K131169K484898L189382L549640K890434J44558
6248C7492373l947491o770097o472331m357382k983462k176305j513495r87406
6240H284404q23886r20337n54629m05574m04438p1981k35119j00579k95571k87211
6230D185079J07697k96656k73548j14009j38074k23763J3509q520M0173j32601
6220C159287q4523O8052r5631k3585r8766p0481J16927J18165k77410J7544n8888
6209B770691Q4467o1525j37270J44169r5547n4574J91290p6736p3178p6226j710
6198B613851r4179j6927m7887j63262j27399J93836P9378r4542R9421P8002k38688
$$ plain form
6187 2281604 2332312 2494071 2261831 2189513 2346114 2448281 2520827 2544234 2344067 2374588
6177 2374588 2372765 2514632 2490151 2446121 2613439 2630353 2602353 2594075 2604455 2577070 2476094
6166 2476094 2526732 2684777 2936869 3052985 3059137 2895227 2804951 2963861 2990742 3047198 3019877
6155 3019877 3038251 2834685 3287882 3000985 2125197 2415383 2713647 2836471 2915077 2928416
6145 2928416 2856200 3098400 3024645 2788698 2983351 2934329 2996857 3044826 2779553 3005736
6135 3005736 3307762 3277097 3215035 3157777 3008515 2864498 3023626 3241051 3351104 3393201
6125 3393201 3206423 2989742 3123961 3319792 3185039 3205916 3165344 3312445 3482275 3430513
6115 3430513 3286130 3314010 3344909 3429599 3562880 3643504 3505335 3389838 3502698 3463298
$$ packed form
6187B281604N0708J61759k32240p2318J56601J02167P2546K3407k00167L0521
6177B374588j823J41867k4481m4030J67318J6914k8000q278J0380k7385j00976
6166B476094N0638J58045K52092J16116O152j63910r0276J58910K6881N6456k7321
6155C019877J8374k03566M53197k86897q75788K90186K98264J22824P8606J3339
6145B928416p2216K42200p3755k35947J94653m9022O2528M7969k65273K26183
6135C005736L02026l0665o2062n7258j49262j44017J59128K17425J10053M2097
6125C393201j86778k16681J34219J95831j34753K0877m0572J47101J69830n1762
6115C430513j44383K7880L0899Q4690J33281Q0624j38169j15497J12860l9400
$$ plain form
6105 3463298 3232047 3454101 3537045 3369544 3441155 3365018 3596165 3620433 3529742 3547257 3525746
6094 3525746 3552508 3454466 3533665 3440926 3247764 3325877 3345800 3392945 3605894 3534835 3520868
6083 3520868 3529535 3522213 3612634 3480867 3739663 3670394 3585562 3607110 3586843 3698579 3785049
6072 3785049 3893691 3905549 3936373 3924210 3985399 3866966 3845715 3899444 3744878 4055326 4191516
6061 4191516 4099830 4093659 4148314 3987197 4046399 4268859 4176621 4273152 4369568 4541072 4610616
6050 4610616 4491996 4560437 4463144 4334658 4502948 4636033 4540395 4611261 4690140 4780218 4842673
6039 4842673 4926299 5043598 5101702 5099813 5198875 5478332 5560708 5617512 5626540 5746294 6011403
6028 6011403 6060818 6193321 6149586 6320941 6405708 6654645 6959997 7175223 7537530 7657784
$$ packed form
6105C463298k31251K22054Q2944j67501P1611p6137K31147K4268r0691J7515k1511
6094C525746K6762r8042P9199r2739j93162P8113J9923M7145K12949p1059j3967
6083C520868Q667p322R0421j31767K58796o9269q4832K1548k0267J11736Q6470
6072C785049J08642J1858L0824j2163O1189j18433k1251N3729j54566L10448J36190
6061D191516r1686o171N4655j61117N9202K22460r2238R6531R6416J71504O9544
6050D610616j18620O8441r7293j28486J68290J33085r5638P0866P8879R0078O2455
6039D842673Q3626J17299N8104j889R9062K79457Q2376N6804R028J19754K65109
6028F011403M9415J32503m3735J71355Q4767K48937L05352K15226L62307J20254
$$ plain form
6018 7657784 7757413 8078193 8223733 8354365 8457228 8523203 8594602 8837622 8938337 8864666
6008 8864666 8783831 8613941 8465740 8168984 8220111 7977770 8041727 8024320 8071261 8290921
5998 8290921 8460074 8201990 8477376 8713750 8790614 8866632 9088112 9067361 8955711 9190040
5988 9190040 9103316 9227538 9347268 9137063 9097156 9204841 9078807 9197868 9413698 9510978
5978 9510978 9412610 9517107 9470393 9524952 9618326 9660452 9533549 9843730 10022326 10079690 10236953
5967 10236953 10493034 10548271 10561271 10717892 10608040 10716322 10686489 10783933 10929536 10948689
5957 10948689 11026320 11088492 11106010 11317739 11531274 11751662 11759317 11782346 11727585 11846603 12190811
5946 12190811 12214319 12386850 12605880 12548235 12666148 12714272 12887670 13241292 13435986 13238673
$$ packed form
6018G657784R9629L20780J45540J30632J02863O5975P1399K43020J00715p3671
6008H864666q0835j69890j48201k96756N1127k42341O3957j7407M6941K19660
5998H290921J69153k58084K75386K36374P6864P6018K21480k0751j11650K34329
5988I190040q6724J24222J19730k10205l9907J07685j26034J19061K15830R7280
5978I510978r8368J04497m6714N4559R3374M2126j26903L10181J78596N7364J57263
5967A0236953K56081N5237J3000J56621j09852J08282k9833R7444J45603J9153
5957A0948689P7631O2172J7518K11729K13535K20388P655K3029n4761J19018L44208
5946A2190811K3508J72531K19030n7645J17913M8124J73398L53622J94694j97313
$$ plain form
5936 13238673 13258173 13162659 12952715 12860761 12740982 12603836 12723008 12850448 12760247 12749253
5926 12749253 12962814 13059538 13209117 13336044 13471311 13609375 13882857 14312694 14473165 14512216
5916 14512216 14803158 14761323 14615818 14713716 14989361 15190545 15649986 15750946 15820877 16376269
5906 16376269 16463754 16637978 16467681 16566353 16502513 16626697 16522136 16600606 16532980 16669785
5896 16669785 16844088 16698614 16659619 16776644 16759964 16796307 16780262 17118709 17348937 17671343
5886 17671343 17894818 18013776 18319012 18341557 18634537 18680029 18863965 19260277 19544015 19875729
5876 19875729 20272978 20521842 20993878 21406349 21808829 22572310 22894840 23367790 23716049
5867 23716049 24298059 25022675 25311018 25833954 26202210 26786931 27342926 27641351 27828215
$$ packed form
5936A3238673J9500r5514k09944r1954j19779j37146J19172J27440r0201j0994
5926A2749253K13561R6724J49579J26927J35267J38064K73482M29837J60471L9051
5916A4512216K90942m1835j45505R7898K75645K01184M59441J00960O9931N55392
5906A6376269Q7485J74224j70297R8672o3840J24184j04561P8470o7626J36805
5896A6669785J74303j45474l8995J17025j6680L6343j6045L38447K30228L22406
5886A7671343K23475J18958L05236K2545K92980M5492J83936L96312K83738L31714
5876A9875729L97249K48864M72036M12471M02480P63481L22530M72950L48259
5867B3716049N82010P24616K88343N22936L68256N84721N55995K98425J86864
$$ plain form
5858 27828215 28174966 28618675 28897585 29302088 29773983 30414791 31081874 31662961 32430215
5849 32430215 33250883 34089947 34797053 35734483 36704197 37628572 38532665 39353296 39959618
5840 39959618 40306655 40499706 40245393 39697724 39232794 38262240 36726681 35431782 34372433
5831 34372433 33392313 32935886 32444254 32272674 32351230 32491350 32291572 32558178 32837364 33012813
5821 33012813 33586037 33933341 34310030 34959872 35172027 35088676 34685587 34209379 33527708 32730801
5811 32730801 32210941 31495959 30788677 30226762 29687013 29349381 29265783 29187181 29485196 29617864
5801 29617864 29706004 29962099 30272102 29876818 29707238 29173462 28482841 27615281 26450082
5792 26450082 25469069 24698016 23779863 23056993 22444405 21771712 21262482 20810507 20540085
$$ packed form
5858B7828215L46751M43709K78910M04503M71895O40808O67083N81087P67254
5849C2430215Q20668Q39064P07106R37430R69714R24375R04093Q20631O06322
5840C9959618L47037J93051k54313n47669m64930r70554j535559j294899j059349
5831C4372433r80120m56427m91632j71580P8556J40120j99778K66606K79186J75449
5821C3012813N73224L47304L76689O49842K12155q3351m03089m76208o81671p96907
5811C2730801n19860p14982p07282n61915n39749l37632q3598p8602K98015J32668
5801B9617864Q8140K56095L10003l95284j69580n33776o90621q67560j165199
5792B6450082r81013p71053r18153p22870o12588o72693n09230m51975k70422
$$ plain form
5783 20540085 20452546 20283400 19879416 19558365 19310445 19122515 18948245 18623130 18398900 18044984
5773 18044984 17670806 17257166 16583680 16154237 15596374 15012451 14333984 13775866 13171438
5764 13171438 12571790 12404394 12281033 11788568 11372193 11067772 11025236 10545121 9950908 9686909
5754 9686909 9410545 9384422 8997786 8871376 8644517 8408363 8302755 7938360 7794344 7731961
5744 7731961 7471590 7251043 7166517 7098403 7028363 6860524 6654624 6601645 6455862 6144617
5734 6144617 6131160 6046805 6050106 6122100 6232089 5898695 5796484 5652593 5633814 5459141 5696501
5723 5696501 5753167 5473028 5500676 5617644 5461036 5393409 5426827 5543146 5472602 5404202 5312830
5712 5312830 5215994 5208052 5186344 5282193 5270597 5321780 5281310 5123599 5145180 5222250 5169113
$$ packed form
5783B0540085q7539j69146m03984l21051k47920j87930j74270l25115k24230l53916
5773A8044984l74178m13640o73486m29443n57863n83923o78467n58118o04428
5764A3171438n99648j67396j23361m92465m16375l04421m2536m80115n94213k63999
5754I686909k76364k6123l86636j26410k26859k36154j05608l64395j44016o2383
5744G731961k60371k20547q4526o8114p0040j67839k05900n2979j45783l11245
5734F144617j3457q4355L301P1994J09989l33394j02211j43891j8779j74673K37360
5723E696501N6666k80139K7648J16968j56608o7627L3418J16319p0544o8400r1372
5712E312830r6836p942k1708R5849j1596N1183m0470j57711K1581P7070n3137
$$ plain form
5701 5169113 5267365 5267736 5434595 4832705 4283914 4364563 4484463 4648358 4806835 4540723
5691 4540723 4434648 4436455 4457679 4315048 4461589 4508750 4493723 4511799 4723012 4528056 4438103
5680 4438103 4546779 4397370 4400495 4575918 4763881 4882414 5099341 5028702 4693846 4547104
5670 4547104 4517067 4408748 4529396 4697591 4601130 4639526 4464510 4352832 4375422 4404256
5660 4404256 4288067 4363202 4586946 4577964 4589596 4833887 4931743 4971921 5223754 5345542 5457608
5649 5457608 5319492 5447780 5468379 5634721 5534824 5367167 5088276 4917411 4709843 4562538
5639 4562538 4436702 4423876 4440540 4491502 4646509 4648313 4739219 4832764 4903372 4917240 4990625
5628 4990625 5016630 5383121 5668097 5735773 5648815 5604732 5565936 5492379 5185233 4930892 4893759
$$ packed form
5701E169113R8252L71J66859o01890n48791Q0649J19900J63895J58477k66112
5691D540723j06075J807K1224j42631J46541M7161j5027J8076K11213j94956q9953
5680D438103J08676j49409L125J75423J87963J18533K16927p0639l34856j46742
5670D547104l0037j08319J20648J68195r6461L8396j75016j11678K2590K8834
5660D404256j16189P5135K23744q982J1632K44291R7856M0178K51833J21788J12066
5649E457608j38116J28288K0599J66342r9897j67657k78891j70865k07568j47305
5639D562538j25836j2826J6664N0962J55007J804R0906R3545P0608J3868P3385
5628D990625K6005L66491K84976O7676q6958m4083l8796p3557l07146k54341l7133
$$ plain form
5617 4893759 4688524 4469951 4235023 4133942 4100615 4190834 4105016 4083761 4143884 4036197
5607 4036197 4158830 4135866 4235725 4238185 4306119 4457964 4543076 4623683 4634892 4519271 4357158
5596 4357158 4175869 4221788 4120584 3862583 3810913 3603522 3548414 3762749 3653470 3809925
5586 3809925 3686158 3398548 3584574 3635461 3686549 3803356 3625866 3327776 3319450 3361480
5576 3361480 3298412 3366867 3422059 3474398 3575378 3323703 3469556 3534053 3518704 3314466 3374579
5565 3374579 3560347 3395683 3656782 3650398 3533607 3682955 3590217 3594838 3658315 3720280 3593438
5554 3593438 3452947 3304428 3341077 3334033 3468735 3290719 3226533 3507904 3501947 3339529 3344890
5543 3344890 3319944 3219544 3324859 3336496 3186190 3096076 2960202 2804380 2901461 2951540
$$ packed form
5617D893759k05235k18573k34928j01081l3327R0219q5818k1255O0123j07687
5607D036197J22633k2964R9859K460O7934J51845Q5112Q0607J1209j15621j62113
5596D357158j81289M5919j01204k58001n1670k07391n5108K14335j09279J56455
5586C809925j23767k87610J86026N0887N1088J16807j77490k98090q326M2030
5576C361480o3068O8455N5192N2339J00980k51675J45853O4497j5349k04238O0113
5565C374579J85768j64664K61099o384j16791J49348r2738M621O3477O1965j26842
5554C593438j40491j48519L6649p044J34702j78016o4186K81371n957j62418N361
5543C344890k4946j00400J05315J1637j50306r0114j35874j55822R7081N0079
$$ plain form
5533 2951540 2989747 2951712 2930310 2875543 2922584 2994860 2874419 3063774 3070205 2889291 3020423
5522 3020423 2916004 2969479 2926185 2781282 2861800 2784141 2736693 2891807 2954911 2873426 2829728
5511 2829728 2841667 3036157 2923168 2932787 2993806 2974157 3054358 3194555 3037636 3055466 3157113
5500 3157113 2864412 3006209 2946133 2852234 3017098 3008588 3002083 2898523 2898883 3044054 2952414
5489 2952414 2890006 2961361 2902178 2827350 2804521 2666090 2789210 2684061 2731398 2785399 2823111
5478 2823111 2817065 2746598 2777733 2727207 2834280 2774340 2999442 3016120 3075679 3053862 2962050
5467 2962050 3044961 2983059 3180729 3264530 3151128 3181675 3334292 3343548 3197232 3474993 3733869
5456 3733869 3470832 3286277 3124245 3356842 3473278 3587432 3559059 3501945 3565360 3753870
$$ packed form
5533B951540L8207l8035k1402n4767M7041P2276j20441J89355O431j80914J31132
5522C020423j04419N3475m3294j44903Q0518p7659m7448J55114O3104q1485m3698
5511B829728J1939J94490j12989R619O1019j9649Q0201J40197j56919J7830J01647
5500C157113k92701J41797o0076r3899J64864q510o505j03560L60J45171r1640
5489B952414o2408P1355n9183p4828k2829j38431J23120j05149M7337N4001L7712
5478B823111o046p0467L1135n0526J07073n9940K25102J6678N9559k1817r1812
5467B962050Q2911o1902J97670Q3801j13402L0547J52617R256j46316K77761K58876
5456C733869k63037j84555j62032K32597J16436J14154k8373n7114O3415J88510
$$ plain form
5446 3753870 3883418 3949333 3911780 4026426 4172365 4159871 4123991 4088797 4061845 4165905 4067171
5435 4067171 4067256 3995287 4070830 4292968 4244961 4271373 4328007 4534934 4537933 4549131 4394230 4147105
5423 4147105 4074836 3867498 3774416 3622473 3424039 3208478 3234907 3457631 3275761 3484259
5413 3484259 3525297 3460709 3425699 3398042 3474872 3636399 3632544 3576688 3582850 3484694 3590475
5402 3590475 3634866 3467400 3481124 3778409 4041139 4010368 4140885 4242178 4407611 4419039
5392 4419039 4141472 3920849 3934198 3912456 4086511 4069189 4101246 4045288 3932748 3928963 3930997
5381 3930997 3746399 3634854 3800184 3838999 3706671 3617970 3820574 3705381 3561267 3637907
5371 3637907 3805241 3751346 3776946 3750902 3698066 3824125 3816043 3523698 3458472 3227603 3078839
$$ packed form
5446C753870J29548O5915l7553J14646J45939j2494l5880l5194k6952J04060r8734
5435D067171Q5p1969P5543K22138m8007K6412N6634K06927K999J1198j54901k47125
5423D147105p2269k07338r3082j51943j98434k15561K6429K22724j81870K08498
5413C484259M1038o4588l5010k7657P6830J61527l855n5856O162r8156J05781
5402C590475M4391j67466J3724K97285K62730l0771J30517J01293J65433J1428
5392D419039k77567k20623J3349k1742J74055j7322L2057n5958j12540l785K034
5381C930997j84598j11545J65330L8815j32328q8701K02604j15193j44114P6640
5371C637907J67334n3895K5600k6044n2836J26059q082k92345o5226k30869j48764
$$ plain form
5360 3078839 2951606 3200162 3179531 3079296 3127159 3042418 3036754 3033821 3164848 3079513 2987097
5349 2987097 2910871 2978168 2782035 2644724 2628547 2404893 2334558 2429219 2590176 2607106 2462557
5338 2462557 2447103 2555941 2489880 2525166 2638621 2624532 2526779 2458103 2463343 2489211 2505853
5327 2505853 2564068 2602022 2800648 2403318 2113656 2172706 2363739 2337208 2308824 2585740
5317 2585740 2489560 2483757 2178950 2026045 2085381 2243695 2048020 2059685 1999423 2016432 2060585
5306 2060585 2200640 2256846 2200023 2131735 2149403 2301453 2197794 2282714 2298780 2465402 2496262
5295 2496262 2507230 2570123 2456641 2523126 2393542 2557216 2512890 2452036 2465325 2481640 2492234
5284 2492234 2470619 2370518 2378628 2519723 2447563 2495896 2541693 2369631 2482778 2623251 2688096
$$ packed form
5360C078839j27233K48556k0631j00235M7863q4741n664k933J31027q5335r2416
5349B987097p6226O7297j96133j37311j6177k23654p0335R4661J60957J6930j44549
5338B462557j5454J08838o6061L5286J13455j4089r7753o8676N240K5868J6642
5327B505853N8215L7954J98626l97330k89662N9050J91033k6531k8384K76916
5317B585740r6180n803l04807j52905N9336J58314j95675J1665o0262J7009M4153
5306B060585J40055N6206n6823o8288J7668J52050j03659Q4920J6066J66622L0860
5295B496262J0968O2893j13482O6485j29584J63674m4326o0854J3289J6315J0594
5284B492234k1615j00101Q110J41095p2160M8333M5797j72062J13147J40473O4845
$$ plain form
5273 2688096 2647189 2518760 2586859 2577625 2666438 2589527 2529428 2518282 2666137 2678475 2797624
5262 2797624 2946248 3039439 2984299 2948197 2898123 2727256 2857628 2771091 2572406 2650269 2651232
5251 2651232 2701231 2738827 2755023 2850279 2992482 3111497 2988086 2620804 2592875 2636186 2606756
5240 2606756 2666900 2776415 2774049 2540278 2654246 2669476 2776512 2910243 2718532 2754900
5230 2754900 2876622 2928576 2751860 2722241 2818383 2943132 3153105 3025355 2834183 2907457
5220 2907457 2829145 2845968 2875804 2967178 2985334 2881736 2933551 3079587 2983788 2865718 3162777
5209 3162777 3250560 3109034 3190194 3260665 3306985 3384601 3553014 3511597 3383592 3540300 3774261
5198 3774261 3876486 3802560 3790590 3658785 3743142 4159524 4134949 4001802 4068541 4021930 4109977
$$ packed form
5273B688096m0907j28429O8099r234Q8813p6911o0099j1146J47855J2338J19149
5262B797624J48624R3191n5140l6102n0074j70867J30372q6537j98685P7863R63
5251B651232M9999L7596J6196R5256J42203J19015j23411l67282k7929M3311k9430
5240B606756O0144J09515k366k33771J13968J5230J07036J33731j91711L6368
5230B754900J21722N1954j76716k9619R6142J24749K09973j27750j91172P3274
5220B907457p8312J6823K9836R1374J8156j03598N1815J46036r5799j18070K97059
5209C162777Q7783j41526Q1160P0471M6320P7616J68413m1417j28005J56708K33961
5198C774261J02225p3926j1970j31805Q4357M16382k4575j33147O6739m6611Q8047
$$ plain form
5187 4109977 4125354 4154425 4377035 4432892 4596182 4534245 4518611 4774249 4821378 4896479 4924698
5176 4924698 4995309 4955114 4842359 4901264 5026370 5295685 5321802 5334643 5559055 5492939 5388294
5165 5388294 5512530 5644138 5893574 5961771 6232357 6426271 6584366 6533816 6587762 6924626
5155 6924626 7163993 7263795 7376046 7635129 7385321 7153348 7609548 7951468 7974335 8153006
5145 8153006 8134730 8362581 8279775 8243765 8420871 8588245 8755856 8768952 8709518 8622549 8648740
5134 8648740 8425098 8076990 8212573 8460892 8383789 8203423 8172041 8305132 8144082 8290880
5124 8290880 8558401 8670543 8566639 8518850 8662585 8667792 8781183 9021997 9244669 9217231
5114 9217231 9213723 9312094 9513951 9519681 9799875 9723643 10124664 10457208 10563831 10659090 10696604
$$ packed form
5187D109977J5377K9071K22610N5857J63290o1937j5634K55638M7129P5101K8219
5176D924698P0611m0195j12755N8905J25106K69315K6117J2841K24412o6116j04645
5165E388294J24236J31608K49436O8197K70586J93914J58095n0550N3946L36864
5155F924626K39367R9802J12251K59083k49808k31973M56200L41920K2867J78671
5145H153006j8276K27851q2806l6010J77106J67374J67611J3096n9434q6969K6191
5134H648740k23642l48108J35583K48319p7103j80366l1382J33091j61050J46798
5124H290880K67521J12142j03904m7789J43735N207J13391K40814K22672k7438
5114I217231l508R8371K01857N730K80194p6232M01021L32544J06623R5259L7514
$$ plain form
5103 10696604 11056477 11490713 11782015 11758708 11904344 12016437 12234490 12582014 12987190 13276489
5093 13276489 13427430 13608093 13647229 13625368 13480424 12882440 12688473 12581165 12318035 12294433
5083 12294433 12002835 12183625 12246447 12077030 12100664 12199103 12443940 12637960 12674740 12905791
5073 12905791 13395318 13720934 13893793 13994039 13506190 13049231 12618984 12276179 11943914
5064 11943914 11442364 11052626 10635368 10416037 10150609 10158575 10105201 9882459 10255258 10451868
5054 10451868 10501563 10645731 10397054 10530530 11063919 11257296 11378823 11457060 11730106 11672484
5044 11672484 11384189 10896995 10589176 10350135 10007722 10226017 10023125 9801182 10009254
5035 10009254 9992248 9862595 9954580 9966589 10225928 10161147 10358043 10667541 10834984 10744898
$$ packed form
5103A0696604L59873M34236K91302k3307J45636J12093K18053L47524M05176K89299
5093A3276489J50941J80663L9136k1861j44944n97984j93967j07308k63130k3602
5083A2294433k91598J80790O2822j69417K3634R8439K44837J94020L6780K31051
5073A2905791M89527L25616J72859J00246m87849m56959m30247l42805l32265
5064A1943914n01550l89738m17258k19331k65428P966n3374k22742L72799J96610
5054A0451868M9695J44168k48677J33476N33389J93377J21527P8237K73046n7622
5044A1672484k88295m87194l07819k39041l42413K18295k02892k21943K08072
5035A0009254j7006j29653R1985J2009K59339o4781J96896L09498J67443r0086
$$ plain form
5025 10744898 10795782 10917342 11276476 11323861 11279582 11417833 11723236 11883439 11885307 11870479
5015 11870479 12120279 12290815 12421972 12526015 12804511 13012921 13242610 13405304 13331933 13380130
5005 13380130 13354503 13474608 13440953 13203986 13260574 13271402 13401779 13403663 13223561 12867915
4995 12867915 12750489 12716963 12529440 12360292 12195221 12362107 12054153 11950875 11776734 11970467
4985 11970467 12156688 12171978 12225471 12091189 12252288 12479045 12869096 13018134 12962585 12986820
4975 12986820 13006348 13278371 13356075 13432998 13739210 14078678 14426007 14925501 15096860 15323989
4965 15323989 15671297 16147609 16456822 16844988 17041376 17163599 17651764 18104640 18352202
4956 18352202 18348686 18424186 18502402 18485488 18715952 18774442 18731407 18435053 18139113 18273729 18389114
$$ packed form
5025A0744898N0884J21560L59134M7385m4279J38251L05403J60203J868j4828
5015A1870479K49800J70536J31157J04043K78496K08410K29689J62694p3371M8197
5005A3380130k5627J20105l3655k36967N6588J0828J30377J884j80102l55646
4995A2867915j17426l3526j87523j69148j65071J66886l07954j03278j74141J93733
4985A1970467J86221J5290N3493j34282J61099K26757L90051J49038n5549K4235
4975A2986820J9528K72023P7704P6923L06212L39468L47329M99494J71359K27129
4965A5323989L47308M76312L09213L88166J96388J22223M88165M52876K47562
4956A8352202l516P5500P8216j6914K30464N8490m3035k96354k95940J34616J15385
$$ plain form
4945 18389114 18000307 17641959 17414902 17340562 17102612 16740807 16421247 16144227 16019394 15814897
4935 15814897 15631202 15536984 15509074 15405486 15508985 15430388 15365980 15441465 15366649 15468817
4925 15468817 15965844 16070944 16099181 16175587 16373508 16431735 16530068 16921507 16985485 17090102
4915 17090102 17284850 17733423 17852205 17780749 17955608 18099250 18171317 18394607 18564842 18609517
4905 18609517 18902405 19121320 19355151 19445954 19429579 19563137 19633227 19904440 20130963 20032552
4895 20032552 20207569 20152622 20392195 20619679 21044479 21229753 21246826 21469789 21614652 22168641
4885 22168641 22419045 22897116 23351524 23682617 24037014 24575426 25130195 25799249 26442705
4876 26442705 27085693 27807436 28414982 29441297 30499095 31224088 32305978 33513262 34738167
$$ packed form
4945A8389114l88807l58348k27057p4340k37950l61805l19560k77020j24833k04497
4935A5814897j83695r4218k7910j03588J03499p8597o4408P5485p4816J02168
4925A5468817M97027J05100K8237P6406J97921N8227R8333L91439O3978J04617
4915A7090102J94748M48573J18782p1456J74859J43642P2067K23290J70235M4675
4905A8609517K92888K18915K33831R0803j6375J33558P0090K71213K26523r8411
4895B0032552J75017n4947K39573K27484M24800J85274J7073K22963J44863N53989
4885B2168641K50404M78071M54408L31093L54397N38412N54769O69054O43456
4876B6442705O42988P21743O07546J026315J057798P24993J081890J207284J224905
$$ plain form
4867 34738167 35812615 36849283 38078915 39381327 41099230 42659910 44246296 46226720
4859 46226720 48259980 50345808 52251358 54241959 56495829 59123155 61533656 63435469
4851 63435469 64624789 63972877 61994070 59682009 57981555 56885068 56196410 55756686 55708536
4842 55708536 56244254 57397452 58582710 59823665 60903640 61746288 62443200 63144077 64129388
4833 64129388 65481605 67248512 69157148 71220474 73137556 75179162 77642951 80551556
4825 80551556 83454847 86270613 88989639 92263643 96643420 101874694 107069866 111303733
4817 111303733 113596482 111283361 104366028 96544904 89582588 83944660 79322403 75278135
4809 75278135 72360408 69851061 67998513 66275239 64480096 62618168 60359734 58358919
$$ packed form
4867C4738167J074448J036668J229632J302412J717903J560680J586386J980424
4859D6226720K033260K085828J905550J990601K253870K627326K410501J901813
4851F3435469J189320o51912j978807k312061j700454j096487o88658m39724m8150
4842E5708536N35718J153198J185258J240955J079975Q42648O96912P00877R85311
4833F4129388J352217J766907J908636K063326J917082K041606K463789K908605
4825H0551556K903291K815766K719026L274004M379777N231274N195172M233867
4817A11303733K292749k313121o917333p821124o962316n637928m622257m044268
4809G5278135k917727k509347j852548j723274j795143j861928k258434k000815
$$ plain form
4801 58358919 56764494 55868334 55099442 54597508 54091926 53774174 53618648 52768554 51559656
4792 51559656 51014194 50832439 51160466 52018499 52941176 54234917 55665473 56369786 55979353
4783 55979353 54979487 52375070 48456859 43795755 39419883 36053553 33411369 31124006
4775 31124006 29450462 28039346 26950190 26231990 25482685 24666110 23919448 23492720 22638729
4766 22638729 22195649 21461848 20734165 20289680 19759947 19492777 19069516 18666827 18378588
4757 18378588 18131833 17794236 17446411 17336534 17007397 16503096 16032537 15691017 15353391
4748 15353391 15085926 14977154 14795404 14630168 14273631 13918532 13418936 13202364 12899217
4739 12899217 12788148 12712079 12371206 12285825 11949824 11744808 11532560 11148947 11143852 11064691
$$ packed form
4801E8358919j594425q96160p68892n01934n05582l17752j55526q50094j208898
4792E1559656n45462j81755L28027Q58033R22677J293741J430556P04313l90433
4783E5979353r99866k604417l918211m661104m375872l366330k642184k287363
4775C1124006j673544j411116j089156p18200p49305q16575p46662m26728q53991
4766B2638729m43080p33801p27683m44485n29733k67170m23261m02689k88239
4757A8378588k46755l37597l47825j09877l29137n04301m70559l41520l37626
4748A5353391k67465j08772j81750j65236l56537l55099m99596k16572l03147
4739A2899217j11069p6069l40873q5381l36001k05016k12248l83613n095p9161
$$ plain form
4729 11064691 10933453 10793201 10598955 10293331 10152518 10075394 9966966 9919432 9828864 9727850
4719 9727850 9591892 9728429 9514819 9116430 9116880 9001514 8763838 8570953 8598976 8630403
4709 8630403 8526445 8288088 8310794 8365102 8250160 8336463 8176533 8004428 8048802 7860708
4699 7860708 7921134 7846063 7896510 7872712 7757223 7811603 7660028 7475540 7238612 7509227
4689 7509227 7484904 7423144 7267349 7250304 7121542 6873538 6995414 7020298 6989878 6970761 7019901
4678 7019901 6797263 6645658 6471507 6532066 6691803 6557091 6577498 6522850 6696132 6776335
4668 6776335 6597289 6788952 6843659 6758762 6793293 6841806 6813202 6776958 6620756 6418348 6216599
4657 6216599 6073234 5974870 6073166 6163147 6104379 6097478 5836044 5883906 5798230 5755439 5732391
$$ packed form
4729A1064691j31238j40252j94246l05624j40813p7124j08428m7534r0568j01014
4719I727850j35958J36537k13610l98389M50j15366k37676j92885K8023L1427
4709H630403j03958k38357K2706N4308j14942Q6303j59930j72105M4374j88094
4699G860708O0426p5071N0447k3798j15489N4380j51575j84488k36928K70615
4689G509227k4323o1760j55795j7045j28762k48004J21876K4884l0420j9117M9140
4678G019901k22638j51605j74151O0559J59737j34712K0407n4648J73282Q0203
4668F776335j79046J91663N4707q4897L4531M8513k8604l6244j56202k02408k01749
4657F216599j43365r8364R8296Q9981n8768o901k61434M7862q5676m2791k3048
$$ plain form
4646 5732391 5883081 5943461 5900306 5653839 5646955 5531418 5444219 5420187 5448647 5214326 5067213
4635 5067213 5177964 5161287 5079277 5047191 5125121 5121749 5231662 5294849 5458867 5386481 5265084
4624 5265084 5128395 5125744 4950936 4884475 4886175 4842309 4656843 4624807 4821705 4797221 4726562
4613 4726562 4642135 4593663 4530488 4617487 4423694 4364405 4373582 4279692 4066186 4096694 4118717
4602 4118717 3954513 4091188 3935529 3836123 3998280 3974307 3872495 4013516 3924564 3937136
4592 3937136 3702142 3450621 3573189 3342940 3623712 3706760 3755768 3821114 4003630 4043581
4582 4043581 3729525 3847567 3948976 4028458 3894487 3959704 3883775 4225424 4049680 4046064
4572 4046064 3889709 3851528 3803086 3940805 3938679 3856884 4110514 4115768 3952738 4046726 4144541
$$ packed form
4646E732391J50690O0380m3155k46467o884j15537q7199k4032K8460k34321j47113
4635E067213J10751j6677q2010l2086P7930l372J09913O3187J64018p2386j21397
4624E265084j36689k651j74808o6461J700m3866j85466l2036J96898k4484p0659
4613D726562q4427m8472o3175Q6999j93793n9289R177r3890k13506L0508K2023
4602D118717j64204J36675j55659r9406J62157k3973j01812J41021q8952J2572
4592C937136k34994k51521J22568k30249K80772Q3048M9008O5346J82516L9951
4582D043581l14056J18042J01409P9482j33971O5217p5929L41649j75744l616
4572D046064j56355l8181m8442J37719k126q1795K53630N254j63030R3988R7815
$$ plain form
4561 4144541 4319301 4564916 4555389 4440259 4393478 4641103 4469458 4362826 4184328 4264830
4551 4264830 4499651 4560279 4454957 4393886 4450528 4378135 4290204 4439702 4503977 4396001 4186087
4540 4186087 4235444 4449399 4293021 4250391 4177851 4243680 4050507 3834950 3860404 3914637 3868882
4529 3868882 3606659 3601886 3643741 3430805 3336923 3322589 3234186 3405679 3228713 3344556 3368043
4518 3368043 3317120 3326469 3279486 3144495 3247905 3173102 3277662 3241249 3306465 3245256 3097806
4507 3097806 3196161 3114077 3121436 3104521 3266223 3340520 3344428 3358191 3448392 3385929 3457240 3461136
4495 3461136 3614697 3573745 3571865 3711960 3761562 3498284 3467761 3492211 3601120 3742966 3657386
4484 3657386 3730493 3777729 3618358 3426563 3394156 3273038 3234486 3217439 3418757 3550004
$$ packed form
4561D144541J74760K45615r527j15130m6781K47625j71645j06632j78498Q0502
4551D264830K34821O0628j05322o1071N6642p2393q7931J49498O4275j07976k09914
4540D186087M9357K13955j56378m2630p2540O5829j93173k15557K5454N4233m5755
4529C868882k62223m773M1855k12936r3882j4334q8403J71493j76966J15843K3487
4518C368043n0923R349m6983j34991J03410p4803J04560l6413O5216o1209j47450
4507C097806R8355q2084P359j6915J61702P4297L908J3763R0201o2463P1311L896
4495C461136J53561m0952j880J40095M9602k63278l0523K4450J08909J41846q5580
4484C657386P3107M7236j59371j91795l2407j21118l8552j7047K01318J31247
$$ plain form
4474 3550004 3287021 3357627 3484572 3542598 3679582 3728271 3789871 3630070 3782849 3815434
4464 3815434 4007155 4053037 4258432 4349542 4217438 4185514 4113167 3841136 3808839 3735125 3637431
4453 3637431 3524971 3458855 3492631 3306286 3388327 3467978 3744635 3852349 3745002 3677742
4443 3677742 3682489 3658150 3745554 3641542 3501705 3644775 3738852 3595018 3488796 3475690 3639563
4432 3639563 3845861 3980902 3896195 4029072 4202093 4085218 4144679 4206969 4281362 4370509
4422 4370509 4515342 4624543 4685919 4634452 4787669 4901539 4977514 5202194 5500462 5713807
4412 5713807 5921262 6065341 6138793 6433098 6529321 6641747 6465903 6415778 6456076 6285845
4402 6285845 6031682 5877576 5766380 5615992 5628261 5480055 5566266 5550780 5554296 5620943 5653600
$$ packed form
4474C550004k62983P0606J26945N8026J36984M8689O1600j59801J52779L2585
4464C815434J91721M5882K05395R1110j32104l1924p2347k72031l2297p3714r7694
4453C637431j12460o6116L3776j86345Q2041P9651K76657J07714j07347o7260
4443C677742M747k4339Q7404j04012j39837J43070R4077j43834j06222j3106J63873
4432C639563K06298J35041q4707J32877J73021j16875N9461O2290P4393Q9147
4422D370509J44833J09201O1376n1467J53217J13870P5975K24680K98268K13345
4412E713807K07455J44079P3452K94305R6223J12426j75844n0125M0298j70231
4402F285845k54163j54106j11196j50388J2269j48206Q6211j5486L516O6647L2657
$$ plain form
4391 5653600 5674450 5640586 5563960 5635743 5728984 5775061 5668273 5537135 5571022 5464905 5392160
4380 5392160 5430332 5408206 5211618 5061668 4857547 4759736 4848201 4898681 4791139 4764419 4888280
4369 4888280 4907016 4913753 4983362 4939906 5117628 5272438 5271510 5266097 5479532 5453930 5285465
4358 5285465 5260090 5232666 5238088 5254212 5511940 5452448 5480156 5734721 5625650 5678798 5854929
4347 5854929 5938116 5689373 5551059 5647047 5718123 5853851 5808206 5814090 5846088 6323580 6578925
4336 6578925 6186450 6265612 6372404 6230562 6164627 6243646 6412189 6540289 6628758 6818267
4326 6818267 6799869 6822910 6963011 7029342 6894955 6744794 6673375 6728941 6608162 6725356
4316 6725356 6850607 6747021 6585954 6765899 6831700 6854872 7092326 7041041 6994793 6984173
$$ packed form
4391E653600K0850l3864p6626P1783R3241M6077j06788j31138L3887j06117p2745
4380E392160L8172k2126j96588j49950k04121r7811Q8465N0480j07542k6720J23861
4369D888280J8736O737O9609m3456J77722J54810r28n413K13435k5602j68465
4358E285465k5375k7424N422J6124K57728n9492K7708K54565j09071N3148J76131
4347E854929Q3187k48743j38314R5988P1076J35728m5645N884L1998M77492K55345
4336F578925l92475P9162J06792j41842o5935P9019J68543J28100Q8469J89509
4326F818267j8398K3041J40101O6331j34387j50161p1419N5566j20779J17194
4316F725356J25251j03586j61067J79945O5801K3172K37454n1285m6248j0620
$$ plain form
4306 6984173 6778087 6815794 7045857 6952559 7107251 6944735 6984369 6860373 6743375 6826741
4296 6826741 6845508 6931650 7047087 7135457 7235572 7092467 7134138 7155294 7113484 7116823 7291901
4285 7291901 7513367 7489868 7424696 7500908 7567793 7541928 7751184 7706903 7761493 8056914 8202561
4274 8202561 8372993 8451950 8418654 8660557 8495461 8718977 9026134 9134073 9182103 9388046
4264 9388046 9398712 9419211 9678683 9931103 9879888 9712585 9782515 9871832 10114460 10306323
4254 10306323 10510402 10574417 10423842 10310461 10594986 10631657 11041437 11120591 11097094 11403061
4244 11403061 11629005 11799406 11969268 12181949 12278524 12356015 12504841 12750923 13096673 13437025
4234 13437025 13726156 13727627 13936647 14058575 14214577 14344822 14575248 14977312 15236225 15329214
$$ packed form
4306F984173k06086L7707K30063r3298J54692j62516L9634j23996j16998Q3366
4296F826741J8767Q6142J15437Q8370J00115j43105M1671K1156m1810L339J75078
4285G291901K21466k3499o5172P6212O6885k5865K09256m4281N4590K95421J45647
4274H202561J70432P8957l3296K41903j65096K23516L07157J07939M8030K05943
4264I388046J0666K0499K59472K52420n1215j67303O9930Q9317K42628J91863
4254A0306323K04079O4015j50575j13381K84525L6671M09780P9154k3497L05967
4244A1403061K25944J70401J69862K12681R6575P7491J48826K46082L45750L40352
4234A3437025K89131J471K09020J21928J56002J30245K30426M02064K58913R2989
$$ plain form
4224 15329214 15552538 15921488 16178009 16376238 16679565 16936922 17008177 17390325 17738471 17816418
4214 17816418 17876094 18056848 18014468 18219419 18760720 18905377 19024169 19440776 19799709 20138767
4204 20138767 20272268 20643930 20935249 21037959 21291933 21558524 21730908 22035431 22326867
4195 22326867 22651696 22884412 23195964 23460537 23770385 24308762 24542966 24900473 25276288
4186 25276288 25805950 26240213 26557222 27071086 27642794 28406039 29003193 29487260 30213004
4177 30213004 30862709 31574018 32247439 32945315 33568606 34547205 35434753 36330457 37207446
4168 37207446 38068696 39147620 40320989 41666090 42718011 43773310 44831562 46155068
4160 46155068 47650967 48792624 50194245 51896530 53378482 55005716 56516063 58383428
$$ packed form
4224A5329214K23324L68950K56521J98229L03327K57357P1255L82148L48146P7947
4214A7816418N9676J80754m2380K04951N41301J44657J18792M16607L58933L39058
4204B0138767J33501L71662K91319J02710K53974K66591J72384L04523K91436
4195B2326867L24829K32716L11552K64573L09848N38377K34204L57507L75815
4186B5276288N29662M34263L17009N13864N71708P63245N97154M84067P25744
4177C0213004O49705P11309O73421O97876O23291R78599Q87548Q95704Q76989
4168C7207446Q61250J078924J173369J345101J051921J055299J058252J323506
4160D6155068J495899J141657J401621J702285J481952J627234J510347J867365
$$ plain form
4152 58383428 59943459 61844730 63829720 65909021 68187070 70373239 72863233 75491395
4144 75491395 78422010 81555634 84932179 88556385 92566071 96991022 101943843 107204192
4136 107204192 113594641 120530561 127865003 135854396 144713592 154804425 165581056 177786693
4128 177786693 191099279 205203299 220165453 235389377 251048413 267057094 282085984
4121 282085984 294480465 301547713 303184795 299907125 293281447 285383314 277363189 270908101
4113 270908101 262283823 246728678 228121319 211160532 197365549 185843420 175997927
4106 175997927 166764146 157089877 148065638 140512166 134505342 129582048 125890115 123518839
4098 123518839 121976790 121229662 121433711 122042283 122545040 122713809 122709538 122745760 122633038 122031588
$$ packed form
4152E8383428J560031J901271J984990K079301K278049K186169K489994K628162
4144G5491395K930615L133624L376545L624206M009686M424951M952821N260349
4136A07204192O390449O935920P334442P989393Q859196J0090833J0776631J2205637
4128A77786693J3312586J4104020J4962154J5223924J5659036J6008681J5028890
4121B82085984J2394481P067248J637082l277670o625678p898133q020125o455088
4113B70908101q624278j5555145j8607359j6960787j3794983j1522129r845493
4106A75997927r233781r674269r024239p553472o006824m923294l691933k371276
4098A23518839j542049p47128K04049O08572N02757J68769m271L6222j12722o01450
$$ plain form
4088 122031588 121845067 121506402 120938715 120251564 119603405 119362039 119637076 120517393 121449669
4079 121449669 122883937 125541463 129287916 133875517 138579414 142708909 145877022 144573841
4071 144573841 136419415 125289022 115328152 107686569 102235042 98301596 95624984 94058296
4063 94058296 93434590 93861143 94503345 95039193 95177482 94974414 94326104 93293014 92116908
4054 92116908 91513178 91171918 90881104 90257584 89176838 88521666 89487072 92102814 95620322
4045 95620322 98599028 101450038 105361318 109485716 113388629 115147146 116475794 114061938
4037 114061938 101367714 85109090 72100576 63229466 56989043 52249444 48429977 45447666
4029 45447666 42964168 40888391 39296111 38075263 37024237 35745810 34606427 33612511
$$ packed form
4088A22031588j86521l38665n67687o87151o48159k41366K75037Q80317R32276
4079A21449669J434268K657526L746453M587601M703897M129495L168113j303181
4071A44573841q154426j1130393r960870p641583n451527l933446k676612j566688
4063I4058296o23706M26553O42202N35848J38289k03068o48310j033090j176106
4054I2116908o03730l41260k90814o23520j080746o55172R65406K615742L517508
4045I5620322K978706K851010L911280M124398L902913J758517J328648k413856
4037A14061938j2694224j6258624j3008514q871110o240423m739599l819467k982311
4029D5447666k483498k075777j592280j220848j051026j278427j139383r93916
$$ plain form
4021 33612511 32771371 32037774 31233351 30542595 30107110 29706436 29224386 28380716 27711375
4012 27711375 27042373 26490389 25792924 25085060 24642863 24132562 23541327 22915928 22561274
4003 22561274 22226946 21706143 21629031 21409422 20938025 20689869 20358005 19845687 19383502 19094993
3993 19094993 18769911 18540555 18378658 18006377 17716508 17665079 17391864 16949687 16903945 16637120
3983 16637120 16410470 16189775 16085208 15696171 15408436 15118226 15038475 14900372 14653084 14240657
3973 14240657 14027935 14110953 14055062 13856375 13749622 13630561 13764482 13713794 13410376 13511167
3963 13511167 13576194 13591021 13551651 13732102 13873917 13752726 13593843 13616837 13518536 13424209
3953 13424209 13354077 13273029 13302092 13397340 13338462 13079874 12910810 12960019 13033234 13095500 12828187
$$ packed form
4021C3612511q41140p33597q04423o90756m35485m00674m82050q43670o69341
4012B7711375o69002n51984o97465p07864m42197n10301n91235o25399l54654
4003B2561274l34328n20803p7112k19609m71397k48156l31864n12318m62185k88509
3993A9094993l25082k29356j61897l72281k89869n1429k73215m42177m5742k66825
3983A6637120k26650k20695j04567l89037k87735k90210p9751j38103k47288m12427
3973A4240657k12722Q3018n5891j98687j06753j19061J33921n0688l03418J00791
3963A3511167O5027J4827l9370J80451J41815j21191j58883K2994r8301r4327
3953A3424209p0132q1048K9063R5248n8878k58588j69064M9209P3215O2266k67313
$$ plain form
3942 12828187 12791681 12688473 12527435 12601699 12614420 12680517 12913060 12950699 12912038 12847476 12912918
3931 12912918 13024507 13099741 13229299 13294905 13256351 13329475 13398239 13464737 13716426 13609578
3921 13609578 13271952 13461241 13413957 13386376 13590373 13553727 13691508 13779227 13819759 14098846
3911 14098846 14201922 14226931 14343267 14221094 14420952 14765987 14648835 14640094 14775541 14889467
3901 14889467 14869241 14955564 15066902 15180128 15383117 15516726 15823890 15809537 15748420 15741199
3891 15741199 15778134 15675424 15956539 16048691 16068550 16120196 16249256 16769282 16892113 16832637
3881 16832637 16917293 17036386 17262074 17363913 17519685 17516963 17448136 17749893 18073950 18239620
3871 18239620 18420753 18777622 18964009 19081285 19222851 19530690 19837161 20177014 20243346 20237832
$$ packed form
3942A2828187l6506j03208j61038P4264J2721O6097K32543L7639l8661o4562O5442
3931A2912918J11589P5234J29558O5606l8554P3124O8764O6498K51689j06848
3921A3609578l37626J89289m7284k7581K03997l6646J37781Q7719M0532K79087
3911A4098846J03076K5009J16336j22173J99858L45035j17152q741J35447J13926
3901A4889467k0226Q6323J11338J13226K02989J33609L07164j4353o1117p221
3891A5741199L6935j02710K81115R2152J9859N1646J29060N20026J22831n9476
3881A6832637Q4656J19093K25688J01839J55772k722o8827L01757L24057J65670
3871A8239620J81133L56869J86387J17276J41566L07839L06471L39853O6332n514
$$ plain form
3861 20237832 20511448 20848574 21168819 21320947 21285857 21369694 21378331 21167139 21153656 21410005
3851 21410005 21496966 21673540 21625287 21632350 21581282 21471092 21706017 21866970 22125627 22184250
3841 22184250 22028010 22103467 22390735 22441134 22443739 22488458 22609029 22803836 22883181 23113199
3831 23113199 23338870 23386474 23506147 23530597 23504812 23783386 23734583 23666862 23683621 24157895
3821 24157895 24106484 24029697 24081967 23992690 24015599 23897535 23978462 24186542 24319445 24260452 24440659
3810 24440659 24331556 24279634 24469872 24644979 24633211 24764105 24889171 24972641 24999455 25140885
3800 25140885 25117782 25209904 25433812 25428426 25512798 25691434 25682276 25671808 25673679 25657245 25894231
3789 25894231 26095334 26114018 26209706 26189642 26243068 26267496 26164482 25947243 26146537 26401309
$$ packed form
3861B0237832K73616L37126L20245J52128l5090Q3837Q637k11192j3483K56349
3851B1410005Q6961J76574m8253P063n1068j10190K34925J60953K58657N8623
3841B2184250j56240P5457K87268N0399K605M4719J20571J94807P9345K30018
3831B3113199K25671M7604J19673K4450k5785K78574m8803o7721J6759M74274
3821B4157895n1411p6787N2270q9277K2909j18064Q0927K08080J32903n8993J80207
3810B4440659j09103n1922J90238J75107j1768J30894J25066Q3470K6814J41430
3800B5140885k3103R2122K23908n386Q4372J78636r158j0468J871j6434K36986
3789B5894231K01103J8684R5688k0064N3426K4428j03014k17239J99294K54772
$$ plain form
3779 26401309 26381937 26328138 26380752 26246801 26308223 26250569 26246601 26330938 26345623 26495161 26111872
3768 26111872 26076634 26020425 26062659 26106169 26168730 26037131 26144796 26206556 26107238 26167420 26161937
3757 26161937 26260959 26218618 26254875 26651779 26613579 26627505 26923379 26934298 26963005 27040029 27331460
3746 27331460 27360715 27446098 27399416 27463526 27473204 27478669 27677517 27723293 27858110 28055544 28038599
3735 28038599 28223453 28128913 28053215 28021589 28183722 28271800 28121331 28237876 28113683 27873487
3725 27873487 27747663 27649287 27677390 27748434 27618075 27261836 26943140 27146376 27019341 26835620
3715 26835620 26713129 26486456 26363678 26403645 26457117 26498365 26321007 26235461 26156295 26405007
3705 26405007 26645380 26633456 26689235 26754830 26679273 26903846 26890889 27106783 27332441 27400534
$$ packed form
3779B6401309j9372n3799N2614j33951O1422n7654l968Q4337J4685J49538l83289
3768B6111872l5238n6209M2234M3510O2561j31599J07665O1760r9318O0182n483
3757B6161937R9022m2341L6257L96904l8200J3926K95874J0919K8707P7024K91431
3746B7331460K9255Q5383m6682O4110R678N465J98848M5776J34817J97434j6945
3735B8038599J84854r4540p5698l1626J62133Q8078j50469J16545j24193k40196
3725B7873487j25824r8376K8103P1044j30359l56239l18696K03236j27035j83721
3715B6835620j22491k26673j22778L9967N3472M1248j77358q5546p9166K48712
3705B6405007K40373j1924N5779O5595p5557K24573j2957K15894K25658O8093
$$ plain form
3695 27400534 27402829 27454551 27609473 27669624 27919092 27976685 28246161 28447376 28652981 28686646
3685 28686646 28744121 29186495 29310280 29626801 29960299 30114128 30434464 30733501 30871166 31087208
3675 31087208 31588477 31681280 31807260 32042363 32116237 32238183 32531699 32799740 33182834 33333335
3665 33333335 33677547 33785778 34151804 34440770 34878340 35208778 35297372 35664441 35978615 36108386
3655 36108386 36462694 36981228 37376440 37742602 38178153 38718385 39118034 39367097 39647348
3646 39647348 40128697 40293553 40600863 41012159 41209958 41441262 41503533 41599641 41942829 41864147
3636 41864147 41768909 41966000 41819838 41401481 41316803 41053583 40666007 40304969 40037585 39693786
3626 39693786 39261031 38752947 38320413 37942778 37505178 37094840 36891235 36592175 36233945
$$ packed form
3695B7400534K295N1722J54922O0151K49468N7593K69476K01215K05605L3665
3685B8686646N7475M42374J23785L16521L33498J53829L20336K99037J37665K16042
3675C1087208N01269R2803J25980K35103P3874J21946K93516K68041L83094J50501
3665C3333335L44212J08231L66026K88966M37570L30438Q8594L67069L14174J29771
3655C6108386L54308N18534L95212L66162M35551N40232L99649K49063K80251
3646C9647348M81349J64856L07310M11296J97799K31304O2271R6108L43188p8682
3636D1864147r5238J97091j46162m18357q4678k63220l87576l61038k67384l43799
3626C9693786m32755n08084m32534l77635m37600m10338k03605k99060l58230
$$ plain form
3617 36233945 36092135 36081804 35994585 35827610 35681399 35525241 35353215 35417094 35483567 35460092
3607 35460092 35368855 35273537 35396073 35591378 35707808 35716315 35830544 36216833 36430968 36698238
3597 36698238 37119939 37222822 37509037 37941893 38339440 38649606 38937444 39140488 39414980
3588 39414980 39843088 40141850 40552653 40854597 40973810 41237769 41191816 41121863 41193723 41096415
3578 41096415 40834488 40544886 40343674 40347638 40176616 39838507 39607131 39233397 38940348 38677074
3568 38677074 38331699 37993921 37841637 37384404 37144496 36916126 36653518 36486367 36226645
3559 36226645 36181551 36058195 36075424 36283568 36352930 36245927 36328089 36544401 36592299 36860650
3549 36860650 37152899 37510546 37979273 38338290 38860283 39276044 39910429 40493063 41241679
$$ packed form
3617C6233945j41810j0331q7219j66975j46211j56158j72026O3879O6473k3475
3607C5460092r1237r5318J22536J95305J16430Q507J14229L86289K14135K67270
3597C6698238M21701J02883K86215M32856L97547L10166K87838K03044K74492
3588C9414980M28108K98762M10803L01944J19213K63959m5953o9953P1860r7308
3578D1096415k61927k89602k01212L964j71022l38109k31376l73734k93049k63274
3568C8677074l45375l37778j52284m57233k39908k28370k62608j67151k59722
3559C6226645m5094j23356J7229K08144O9362j07003Q2162K16312M7898K68351
3549C6860650K92249L57647M68727L59017N21993M15761O34385N82634P48616
$$ plain form
3540 41241679 41764761 42610536 43318382 43953599 44428378 44979645 45781072 46328734 46816616
3531 46816616 47270809 47754006 48099021 48204211 48283523 48277341 47966667 47610669 47274124 46881083
3521 46881083 46026156 45510195 45027627 44228510 43331349 42603587 41929283 40957784 40114449
3512 40114449 39419500 38931256 38395733 38014273 37417948 36774975 36101898 35819195 35489181
3503 35489181 35255275 34959254 34790045 34668520 34276311 34175657 34170779 33970245 33719055 33590915
3493 33590915 33753066 33876254 33675527 33631798 33767291 33952099 33879931 33800816 33873028 34255996
3483 34255996 34199491 34233185 34360100 34445350 34589065 34714251 34375480 34326487 34240199 34415100
3473 34415100 34392171 34028321 33700861 33459744 33218406 33223349 33115214 32552314 32134020 31876644
$$ packed form
3540D1241679N23082Q45775P07846O35217M74779N51267Q01427N47662M87882
3531D6816616M54193M83197L45015J05190P9312o182l10674l55998l36545l93041
3521D6881083q54927n15961m82568p99117q97161p27762o74304r71499q43335
3512D0114449o94949m88244n35523l81460n96325o42973o73077k82703l30014
3503C5489181k33906k96021j69209j21525l92209j00654m878k00534k51190j28140
3493C3590915J62151J23188k00727m3729J35493J84808p2168p9115P2212L82968
3483C4255996n6505L3694J26915Q5250J43715J25186l38771m8993q6288J74901
3473C4415100k2929l63850l27460k41117k41338M943j08135n62900m18294k57376
$$ plain form
3463 31876644 31410109 30952509 30613992 30305293 29990388 29679965 29282527 28902671 28509306
3454 28509306 28241648 28097553 27750427 27542344 27603491 27313400 26935390 26743040 26586259 26308745
3444 26308745 26219027 26204251 26192085 26264746 26170761 26305596 26419147 26479328 26543169 26634652 26639006
3433 26639006 26811384 26997100 27511826 27748982 27890173 28153142 28199308 28263001 28564227 28920287
3423 28920287 28928759 28883605 29012626 29244638 29395956 29273992 29467926 29651834 29388227 29450984
3413 29450984 29513993 29410733 29253470 29265731 29405059 29369566 29100904 29151612 29171038 29183400
3403 29183400 29174255 28906469 28877611 28806792 28912658 28865419 29074713 29237058 29363789 29656314
3393 29656314 30018004 30141495 30443229 30681550 30774567 30694633 30643434 30900955 31089802 31227436
$$ packed form
3463C1876644m66535m57600l38517l08699l14905l10423l97438l79856l93365
3454B8509306k67658j44095l47126k08083O1147k90091l78010j92350j56781k77514
3444B6308745q9718j4776j2166P2661r3985J34835J13551O0181O3841R1483M354
3433B6639006J72378J85716N14726K37156J41191K62969M6166O3693L01226L56060
3423B8920287Q472m5154J29021K32012J51318j21964J93934J83908k63607O2757
3413B9450984O3009j03260j57263J2261J39328l5493k68662N0708J9426J2362
3403B9183400r145k67786k8858p0819J05866m7239K09294J62345J26731K92525
3393B9656314L61690J23491L01734K38321R3017p9934n1199K57521J88847J37634
$$ plain form
3383 31227436 31577790 31792937 32061997 32282427 32606380 32864413 33316121 33762272 34132304
3374 34132304 34539651 34757576 34861405 35176658 35545205 35653544 35841154 35876057 36400990 36961557
3364 36961557 37324011 37671663 38099473 38481583 38707106 38978017 39330252 39605611 40038476
3355 40038476 40534788 40697109 41079364 41495289 41928566 42567673 42777165 43015058 43586172
3346 43586172 44108338 44577709 45159376 45783929 46246420 46727022 47151017 47628244 47713767 48064387
3336 48064387 48711866 49361500 49909181 50403800 51145793 52005501 53120694 53970801 55071543
3327 55071543 56023876 57181643 58306659 59477650 60817466 62036692 62970064 64018049
3319 64018049 65214158 66413750 67594768 68952777 70355333 71844269 73068758 74209149
$$ packed form
3383C1227436L50354K15147K69060K20430L23953K58033M51708M46151L70032
3374C4132304M07347K17925J03829L15253L68547J08339J87610L4903N24933N60567
3364C6961557L62454L47652M27810L82110K25523K70911L52235K75359M32865
3355D0038476M96312J62321L82255M15925M33277O39107K09492K37893N71114
3346D3586172N22166M69371N81667O24553M62491M80602M23995M77227Q5523L50620
3336D8064387O47479O49634N47681M94619P41993Q59708J115193Q50107J100742
3327E5071543R52333J157767J125016J170991J339816J219226R33372J047985
3319F4018049J196109J199592J181018J358009J402556J488936J224489J140391
$$ plain form
3311 74209149 75454593 76761956 78104657 79437159 80865274 82215618 83518128 84595371
3303 84595371 86055517 86998140 88058746 89331944 90439427 91366540 92239886 93371211 94385048
3294 94385048 95351700 96205068 97209961 98111922 98908003 99635352 100616906 101627133 102438918
3285 102438918 103217431 104286271 105383238 106271378 107336370 108459283 109482105 110381670
3277 110381670 111376151 112055885 112760271 113451220 113634312 113915348 114037000 113986660 113732118
3268 113732118 113303544 112561673 111704149 110867962 109952561 108958610 107679339 106461005 105456158
3259 105456158 103999194 102580399 101066751 99338956 97657158 95941413 94312231 92542170
3251 92542170 90558325 88783610 87105500 85436550 84077334 82678836 81452247 80192783
$$ packed form
3311G4209149J245444J307363J342701J332502J428115J350344J302510J077243
3303H4595371J460146R42623J060606J273198J107483R27113Q73346J131325J013837
3294I4385048R66652Q53368J004893R01961P96081P27349R81554J010227Q11785
3285A02438918P78513J068840J096967Q88140J064992J122913J022822Q99565
3277A10381670R94481O79734P04386O90949J83092K81036J21652n0340k54542
3268A13732118m28574p41871q57524q36187r15401r93951j279271j218334j004847
3259A05456158j456964j418795j513648j727795j681798j715745j629182j770061
3251I2542170j983845j774715j678110j668950j359216j398498j226589j259464
$$ plain form
3243 80192783 79196560 78292252 77426236 76409818 75643119 74734536 73781738 73288756 72771317
3234 72771317 72128581 71632597 71324691 71037008 70771112 70413301 70080675 69746382 69368427
3225 69368427 68977113 68756059 68800589 68565990 68045676 67745482 67864785 67941761 67876932 67912442
3215 67912442 67781488 67506730 67356519 67190844 66607263 66409907 65995965 65894141 65598213
3206 65598213 64706135 63633169 62361013 61310662 60491696 59377900 58213857 57489183 56851412
3197 56851412 56529389 55773799 55115262 54408966 53912304 53295747 52776906 52239499 51628829
3188 51628829 51031975 50478069 50153348 49810781 49468640 49229110 48934610 48780699 48706450 48569239
3178 48569239 48556671 48468804 48389578 48490432 48705328 48852979 49069913 49243111 49426312 49314048
$$ packed form
3243H0192783r96223r04308q66016j016418p66699r08583r52798m92982n17439
3234G2771317o42736m95984l07906k87683k65896l57811l32626l34293l77955
3225F9368427l91314k21054M4530k34599n20314l00194J19303P6976o4829L5510
3215F7912442j30954k74758j50211j65675n83581j97356m13942j01824k95928
3206F5598213q92078j072966j272156j050351q18966j113796j164043p24674o37771
3197E6851412l22023p55590o58537p06296m96662o16557n18841n37407o10670
3188E1628829n96854n53906l24721l42567l42141k39530k94500j53911p4249j37211
3178D8569239j2568q7867p9226J00854K14896J47651K16934J73198J83201j12264
$$ plain form
3168 49314048 49047889 48882773 48856841 49011045 49151144 49270514 49849907 50215355 50478476 50822171
3158 50822171 51276231 51969959 52500514 53149958 53874857 54519269 55197506 56006402 56977946
3149 56977946 57789236 58621548 59405523 60085072 60789073 61520282 62503767 63311278 64002971
3140 64002971 64657294 64951637 64487352 63868268 63407578 62578702 61836265 61404560 60761736
3131 60761736 60370397 60025965 59516651 58929604 58420744 57887283 57381269 56997966 56762455
3122 56762455 56523660 56205748 55916021 55956658 56033763 56000147 56082032 56166469 56079349 56276389
3112 56276389 56124684 55694861 54547356 53419090 52846017 51813058 51055854 50521291 50020416
3103 50020416 49190805 48432941 47889407 47270003 46378445 45657339 44760613 43839418 42906813
$$ packed form
3168D9314048k66159j65116k5932J54204J40099J19370N79393L65448K63121L43695
3158E0822171M54060O93728N30555O49444P24899O44412O78237Q08896R71544
3149E6977946Q11290Q32312P83975O79549P04001P31209R83485Q07511O91693
3140F4002971O54323K94343m64285o19084m60690q28876p42437m31705o42824
3131F0761736l91339l44432n09314n87047n08860n33461n06014l83303k35511
3122E6762455k38795l17912k89727M0637P7105l3616Q1885Q4437q7120J97040
3112E6276389j51705m29823j147505j128266n73073j032959p57204n34563n00875
3103E0020416q29611p57864n43534o19404q91558p21106q96726r21195r32605
$$ plain form
3094 42906813 41899192 40961092 40276515 39478902 38833898 37957428 37415685 36883826 36395112
3085 36395112 35649728 35223227 34678075 34093633 33553385 32902789 32517099 32221499 32072256
3076 32072256 31689208 31263106 30610841 30379059 30212464 29741342 29428505 29343460 29204745 29044649
3066 29044649 28898078 28720485 28241627 28119563 27963647 27493024 27284958 26872764 26638863
3057 26638863 26511860 26397930 26058701 25741756 25634099 25503639 25377598 24924456 24623891
3048 24623891 24458561 24239355 23911780 23679439 23389590 23032393 22920246 22689404 22538981
3039 22538981 22294393 21989305 21880773 21377452 20859062 20575668 20369700 20224493 20193362 19916025
3029 19916025 19726772 19391439 19093380 19059815 18871784 18860190 18708489 18477366 18509485 18373512
$$ packed form
3094D2906813j007621r38100o84577p97613o45004q76470n41743n31859m88714
3085C6395112p45384m26501n45152n84442n40248o50596l85690k95600j49243
3076C2072256l83048m26102o52265k31782j66595m71122l12837q5045j38715j60096
3066B9044649j46571j77593m78858j22064j55916m70623k08066m12194k33901
3057B6638863j27003j13930l39229l16945j07657j30460j26041m53142l00565
3048B4623891j65330k19206l27575k32341k89849l57197j12147k30842j50423
3039B2538981k44588l05088j08532n03321n18390k83394k05968j45207l1131k77337
3029A9916025j89253l35333k98059l3565j88031j1594j51701k31123L2119j35973
$$ plain form
3019 18373512 18320720 18129516 18129313 17853227 17858269 17932453 18169316 18132775 18063403 18135426 18099990
3008 18099990 18127326 18137914 18155883 18186027 18215674 18211533 18433340 18255404 18261045 18362049 18368820
2997 18368820 18574371 18339420 18409774 18512789 18787917 18913126 18813462 18846257 18722713 18880051
2987 18880051 19126520 19087703 18908341 19119341 19235698 19464918 19522308 19691898 19515490 20098881
2977 20098881 20401658 20470133 20495903 20344947 20470454 20731715 20819496 21021275 21396484 21577098
2967 21577098 21912637 21986809 22260835 22608270 22842862 22948452 23146754 23620463 23743695 24024880
2957 24024880 24646398 24865444 25222426 25733953 26106254 26366492 26664077 27254512 27736626
2948 27736626 28147735 28699629 29132716 29824902 30260189 30714305 31216496 31704302 32129673
$$ packed form
3019A8373512n2792j91204k03k76086N042P4184K36863l6541o9372P2023l5436
3008A8099990K7336J0588J7969L0144K9647m141K21807j77936N641J01004O771
2997A8368820K05551k34951P0354J03015K75128J25209r9664L2795j23544J57338
2987A8880051K46469l8817j79362K11000J16357K29220N7390J69590j76408N83391
2977B0098881L02777O8475K5770j50956J25507K61261Q7781K01779L75209J80614
2967B1577098L35539P4172K74026L47435K34592J05590J98302M73709J23232K81185
2957B4024880O21518K19046L56982N11527L72301K60238K97585N90435M82114
2948B7736626M11109N51894M33087O92186M35287M54116N02191M87806M25371
$$ plain form
2939 32129673 32771406 33412047 34000599 34691807 35360554 35891202 36651536 37510703 38397646
2930 38397646 39071857 39815783 40800994 41826676 42749104 43993935 45169638 46191896 47245478
2921 47245478 48731235 50183608 51262847 53003733 54588363 56480437 58290188 60276102
2913 60276102 61948529 63901292 65743225 67626342 69493991 71432093 73258212 75136211
2905 75136211 77094324 78892144 80477413 82111005 83899892 85968251 88033684 90194197
2897 90194197 92706650 95559071 98507760 101392038 104346205 107456460 111129938 114790785
2889 114790785 118481756 122093374 125763078 129445405 133146049 136576284 140108220 143718041
2881 143718041 147723716 151773958 156027059 160210438 164518702 168757812 173058725 176932905
$$ packed form
2939C2129673O41733O40641N88552O91208O68747N30648P60334Q59167Q86943
2930C8397646O74211P43926R85211J025682R22428J244831J175703J022258J053582
2921D7245478J485757J452373J079239J740886J584630J892074J809751J985914
2913F0276102J672427J952763J841933J883117J867649J938102J826119J877999
2905G5136211J958113J797820J585269J633592J788887K068359K065433K160513
2897I0194197K512453K852421K948689K884278K954167L110255L673478L660847
2889A14790785L690971L611618L669704L682327L700644L430235L531936L609821
2881A43718041M005675M050242M253101M183379M308264M239110M300913L874180
$$ plain form
2873 176932905 180595707 183820872 186309847 188141309 189283201 189583236 189243409 188000668
2865 188000668 185832911 183308847 181039217 179268758 177785433 176774208 176654694 177178818
2857 177178818 177876697 179332604 181203863 183316803 185365269 187305572 188653968 188885475
2849 188885475 187935784 185354493 180807100 174889956 167730668 160332287 152653139 145275614
2841 145275614 138203001 131682477 125451453 120050214 115174186 110491215 106292362 102513753
2833 102513753 99227586 96225406 93615792 91068742 88763800 86553525 84613244 82619505
2825 82619505 80770767 79173289 77924884 76306509 74660749 73048216 71218133 69609862
2817 69609862 68101794 66386172 64857775 63742806 62529049 61461681 60200073 59200704
$$ packed form
2873A76932905L662802L225165K488975J831462J141892L00035l39827j242741
2865A88000668k167757k524064k269630j770459j483325j011225j19514N24124
2857A77178818O97879J455907J871259K112940K048466J940303J348396K31507
2849A88885475r49691k581291m547393n917144p159288p398381p679148p377525
2841A45275614p072613o520524o231024n401239m876028m682971m198853l778609
2833A02513753l286167l002180k609614k547050k304942k210275j940281j993739
2825H2619505j848738j597478j248405j618375j645760j612533j830083j608271
2817F9609862j508068j715622j528397j114969j213757j067368j261608r99369
$$ plain form
2809 59200704 58310960 56960316 55760477 54451058 53226508 52073478 50945707 49835545
2801 49835545 48909159 48029130 47187345 46290261 45562961 45035711 44208684 43368910 42689336
2792 42689336 41992194 40910573 39791101 38422535 36781415 35166946 33540504 31863103
2784 31863103 30529322 29270766 27919430 26849664 25805058 24841280 24047919 23348184 22641010
2775 22641010 21640731 21013535 20643894 20227500 19824902 19326052 18865903 18226577 17777449
2766 17777449 17318635 16805307 16686861 16261724 15901129 15685115 15218944 14784297 14596366
2757 14596366 14144578 13797896 13566162 13322221 13114069 12760520 12524606 12422770 12437543 12273301
2747 12273301 11972919 11466828 11265234 11192878 10968518 10691926 10535656 10415246 10269742 10013575
$$ packed form
2809E9200704q89744j350644j199839j309419j224550j153030j127771j110162
2801D9835545r26386q80029q41785q97084p27300n27250q27027q39774o79574
2792D2689336o97142j081621j119472j368566j641120j614469j626442j677401
2784C1863103j333781j258556j351336j069766j044606r63778p93361o99735p07174
2775B2641010j000279o27196l69641m16394m02598m98850m60149o39326m49128
2766A7777449m58814n13328j18446m25137l60595k16014m66171m34647j87931
2757A4596366m51788l46682k31734k43941k08152l53549k35914j01836J4773j64242
2747A2273301l00382n06091k01594p2356k24360k76592j56270j20410j45504k56167
$$ plain form
2737 10013575 9900962 9823922 9658681 9476169 9533052 9437226 9443980 9206670 8876118 8679039
2727 8679039 8583603 8486869 8550245 8512503 8255676 8298329 8228065 8002577 7976507 7871453 7759598
2716 7759598 7634187 7376182 7436551 7086243 7008999 7220090 7302182 7028866 7008012 6901909
2706 6901909 6712514 6620940 6553977 6612924 6587149 6429358 6308430 6212238 6118197 6071591 5992383
2695 5992383 6027879 5897952 5580186 5310169 5303387 5302202 5357958 5264984 5094718 5051786 5125479
2684 5125479 5016471 4833264 4957377 4798617 4778526 4747313 4756595 4591308 4533202 4567741 4482457
2673 4482457 4497864 4254209 4191785 4270796 4353867 3908766 3742919 3733695 3876929 3766008 3648402
2662 3648402 3600092 3597558 3314663 3281526 3461772 3445863 3537407 3414845 3332516 3153993 3150516
$$ packed form
2737A0013575j12613p7040j65241j82512N6883r5826O754k37310l30552j97079
2727H679039r5436r6734O3376l7742k56827M2653p0264k25488k6070j05054j11855
2716G759598j25411k58005O0369l50308p7244K11091Q2092k73316k0854j06103
2706F901909j89395r1574o6963N8947k5775j57791j20928r6192r4041m6606p9208
2695E992383L5496j29927l17766k70017o782j185N5756r2974j70266m2932P3693
2684E125479j09008j83207J24113j58760k0091l1213R282j65287n8106L4539q5284
2673D482457J5407k43655o2424P9011Q3071m45101j65847r224J43234j10921j17606
2662C648402m8310k534k82895l3137J80246j5909R1544j22562q2329j78523l477
$$ plain form
2651 3150516 3311163 3345418 3305334 3346468 3127336 3171550 3082285 2942353 3036601 2948134 2770885
2640 2770885 2908566 2880536 2657965 2725363 2767686 2676105 2821118 2792826 2535019 2471247 2697386
2629 2697386 2664279 2582202 2629953 2751931 2674006 2602310 2676777 2431435 2612980 2571568 2431429
2618 2431429 2425762 2260582 2278669 2184305 2272524 2384949 2336174 2332794 2436061 2439614 2343272
2607 2343272 2294438 2417467 2572377 2317157 2155863 2258258 2265231 2221710 2051613 1887372
2597 1887372 1986299 2304076 2355600 2193709 2157751 2395902 2389422 2542906 2399982 2264236
2587 2264236 2170563 2095366 2108334 2339812 2456063 2370497 2332364 2066556 2051190 2119137 2036987
2576 2036987 2011838 1975024 1978247 2001017 2028590 1814304 1725557 1983556 2107268 2051381 1839395
$$ packed form
2651C150516J60647L4255m0084M1134k19132M4214q9265j39932R4248q8467j77249
2640B770885J37681k8030k22571O7398M2323r1581J45013k8292k57807o3772K26139
2629B697386l3107q2077M7751J21978p7925p1696P4467k45342J81545m1412j40139
2618B431429n667j65180J8087r4364Q8219J12425m8775l380J03267L553r6342
2607B343272m8834J23029J54910k55220j61294J02395O973m3521j70097j64241
2597A887372R8927L17777N1524j61891l5958K38151o480J53484j42924j35746
2587B264236r3673p5197J2968K31478J16251q5566l8133k65808j5366O7947q2150
2576B036987k5149l6814L223K2770K7573k14286q8747K57999J23712n5887k11986
$$ plain form
2565 1839395 2199976 2192767 2139473 2035049 2017144 1988401 1894467 1809600 1653437 1684875 1558165
2554 1558165 1697332 1623046 1532051 1533677 1421081 1424965 1461269 1451609 1215573 1293371 1287858 1419686
2542 1419686 1248319 1106306 1178909 1303698 1197216 1180451 1091646 1130784 1194761 1279914 1087042
2531 1087042 1216067 1188088 1106299 1230890 1028486 1037204 906323 1046457 1156410 951255
2521 951255 939953 743732 893009 972182 956718 945326 894766 806576 876033 910862 1017597
2510 1017597 1095140 858093 851674 718014 673934 697560 793810 635269 504658 454831 587735
2499 587735 591551 606583 436787 465693 564798 659452 739928 693769 565687 552039 536487
2488 536487 758559 426575 458622 529643 409083 287956 371255 402633 277429 552766
$$ packed form
2565A839395L60581p209n3294j04424j7905k8743r3934q4867j56163L1438j26710
2554A558165J39167p4286r0995J626j12596L884L6304r660k36036P7798n513J31828
2542A419686j71367j42013P2603J24789j06482j6765q8805L9138O3977Q5153j92872
2531A087042J29025k7979q1789J24591k02404Q718j30881J40134J09953k05155
2521I51255j1302j96221J49277P9173j5464j1392n0560q8190O9457L4829J06735
2510A017597P7543k37047o419j33660m4080K3626R6250j58541j30611m9827J32904
2499E87735L816J5032j69796K8906R9105R4654Q0476m6159j28082j3648j5552
2488E36487K22072l31984L2047P1021j20560j21127Q3299L1378j25204K75337
$$ plain form
2478 552766 635976 560741 547307 469958 452325 515264 377762 398633 299173 82719 43770
2467 43770 205675 426794 253318 220483 399274 349785 309782 495656 450527 329624 203607
2456 203607 356027 470563 385134 269456 269092 205586 376271 393309 229067 306329 442796
2445 442796 484322 468759 438209 127365 310204 154986 187395 190472 233562 406061 298118
2434 298118 148828 306424 427183 431606 464601 341179 155970 283287 399546 246311
2424 246311 102423 97113 306147 257584 337348 286205 120649 304247 224698 231247 204300
2413 204300 201761 224931 394088 249574 72102 46535 -56109 110933 152980 -21645 151032
2402 151032 71035 -19936 258488 149194 248882 340337 229017 211266 108690 195143 269369
$$ packed form
2478E52766Q3210p5235j3434p7349j7633O2939j37502K0871r9460k16454l8949
2467D3770J61905K21119j73476l2835J78791m9489m0003J85874m5129j20903j26017
2456B03607J52420J14536q5429j15678l64o3506J70685J7038j64242P7262J36467
2445D42796M1526j5563l0550l10844J82839j55218L2409L077M3090J72499j07943
2434B98118j49290J57596J20759M423L2995j23422j85209J27317J16259j53235
2424B46311j43888n310K09034m8563P9764n1143j65556J83598p9549O549k6947
2413B04300k539K3170J69157j44514j77472k5567j02644J67042M2047j74625J72677
2402A51032p9997r0971K78424j09294R9688R1455j11320j7751j02576Q6453P4226
$$ plain form
2391 269369 230232 -70393 65549 310482 248055 63301 155041 262282 98343 -28030
2381 -28030 -124622 171216 162709 269462 146697 153366 151378 3327 168843 356827 208833
2370 208833 154624 -27076 -117199 -92755 8364 117673 283321 222659 145563 239472 231022
2359 231022 188020 222934 73308 46207 168562 128080 136082 195721 377049 176087 -55139
2348 -55139 -81697 168308 104454 60601 -68937 128272 214403 218632 423061 437119 279517
2337 279517 -90906 -66063 -92927 -31534 -59030 -93403 117837 125630 -129 167674 158237
2326 158237 61095 94378 73417 60526 33667 120725 -53887 -257083 -213206 -254551 -272495
2315 -272495 -135020 -196567 -214297 -258874 -89469 -86868 -187799 -304432 -27294 -24819 -40329
$$ packed form
2391B69369l9137l00625J35942K44933o2427j84754R1740J07241j63939j26373
2381b8030r6592K95838q507J06753j22765O669j988j48051J65516J87984j47994
2370B08833n4209j81700r0123K4444J01119J09309J65648o0662p7096R3909q450
2359B31022m3002L4914j49626k7101J22355m0482Q002N9639J81328k00962k31226
2348e5139k6558K50005o3854m3853j29538J97209Q6131M229K04429J4058j57602
2337B79517l70423K4843k6864O1393k7496l4373K11240P793j25759J67803r437
2326A58237r7142L3283k0961j2891k6859Q7058j74612k03196M3877m1345j7944
2315b72495J37475o1547j7730m4577J69405K601j00931j16633K77138K475j5510
$$ plain form
2304 -40329 9331 106197 68730 81596 85777 26994 8489 61299 111017 -33247 68114 -35691
2292 -35691 -141214 -244066 -117782 -21423 -38528 -145909 -208336 -122884 -96713 -116158 139837
2281 139837 91400 -319523 -345837 -250212 -234373 -76621 -23056 -46738 6184 -24802 48431
2270 48431 81966 -133216 -114409 62509 -9812 -31284 -55088 -179727 -49377 67784 21300
2259 21300 -35071 -22003 27098 57379 -114447 2211 -329807 -191920 -155631 -378987 -427795
2248 -427795 -174373 95332 177016 53343 -169928 -151302 -206179 -153727 -151123 -102007 -76638
2237 -76638 -70040 -34840 51555 100262 29728 -22301 58824 -39095 -86090 -5925 25870 66663
2225 66663 5625 -35565 98948 126084 285939 -47190 -155963 -2454 -107033 -43488 48299
$$ packed form
2304d0329M9660R6866l7467J2866M181n8783j8505N2810M9718j44264J01361j03805
2292c5691j05523j02852J26284R6359j7105j07381o2427Q5452K6171j9445K55995
2281A39837m8437m10923k6314R5625J5839J57752N3565k3682N2922l0986P3233
2270D8431L3535k15182J8807J76918p2321k1472k3804j24639J30350J17161m6484
2259B1300n6371J3068M9101L0281j71826J16658l32018J37887L6289k23356m8808
2248d27795K53422K69705Q1684j23673k23271J8626n4877N2452K604M9116K5369
2237g6638O598L5200Q6395M8707p0534n2029Q1125r7919m6995Q0165L1795M0793
2225F6663o1038m1190J34513K7136J59855l33129j08773J53509j04579O3545R1787
$$ plain form
2214 48299 176942 98757 61230 54163 233272 274671 243900 164315 46392 38929 50664 59441
2202 59441 208311 307351 78396 -27192 155727 202690 179949 135128 -39709 30618 -63099
2191 -63099 34734 -44868 821 100018 135190 208120 195859 230620 396304 294698 204676
2180 204676 227543 192616 266094 328613 376680 345806 305963 237452 550704 350421 244062
2169 244062 221382 285171 373733 131624 60446 268461 365376 279642 233594 377688 447263
2158 447263 387841 279906 292752 296553 353596 329573 408742 438247 501310 712190 658404
2147 658404 662321 544369 490832 433983 581339 607532 621069 590769 692584 661248 568905
2136 568905 614885 592080 460791 751543 957605 794887 688469 778565 1023827 987617
$$ packed form
2214D8299J28643p8185l7527p067J79109M1399l0771p9585j17923p463J1735Q777
2202E9441J48870R9040k28955j05588J82919M6963k2741m4821j74837P0327r3717
2191f3099R7833p9602M5689R9197L5172P2930j2261L4761J65684j01606r0022
2180B04676K2867l4927P3478O2519M8067l0874l9843o8511L13252k00283j06359
2169B44062k2680O3789Q8562k42109p1178K08015R6915q5734m6048J44094O9575
2158D47263n9422j07935J2846L801N7043k4023P9169K9505O3063K10880n3786
2147F58404L917j17952n3537n6849J47356K6193J3537l0300J01815l1336r2343
2136E68905M5980k2805j31289K90752K06062j62718j06418R0096K45262l6210
$$ plain form
2126 987617 943938 1037338 1185672 1407995 1305161 1363326 1406874 1536649 1638729 1706429 1804311
2115 1804311 1860428 1992597 2149404 2219496 2213597 2086425 2313319 2235723 2237915 2334230 2265977
2104 2265977 2193530 2523507 2980847 3098237 3140117 3405081 3778724 4151859 4232919 4358686
2094 4358686 4651182 5107040 5523268 5867079 6541891 7075627 7679649 8475001 9451837 10184575
2084 10184575 11310163 12812147 14963809 17356239 18922396 20324237 22703087 26250285
2076 26250285 30429857 33569408 34145243 28375713 20221516 14549314 11080128 8986444
2068 8986444 7504478 6563333 5657581 4925116 4667785 4388907 4155391 4084824 3897788 3739027
2058 3739027 3558361 2960745 2597565 2304588 2075423 1865734 1860714 1866550 1743228 1518062
$$ packed form
2126I87617m3679R3400J48334K22323j02834N8165M3548J29775J02080O7700R7882
2115A804311N6117J32169J56807P0092n899j27172K26894p7596K192R6315o8253
2104B265977p2447L29977M57340J17390M1880K64964L73643L73135Q1060J25767
2094D358686K92496M55858M16228L43811O74812N33736O04022P95352R76836P32738
2084A0184575J125588J501984K151662K392430J566157J401841K378850L547198
2076B6250285M179572L139551N75835n769530q154197n672202l469186k093684
2068H986444j481966r41145r05752p32465k57331k78878k33516p0567j87036j58761
2058C739027j80666n97616l63180k92977k29165k09689n020N836j23322k25166
$$ plain form
2048 1518062 1233837 1377700 1371491 1289370 1365133 1186393 1054920 1103900 999165 856455
2038 856455 829331 824266 869699 784961 761481 723022 455086 573897 468404 547417 616096
2027 616096 504201 396566 482092 351265 359578 554036 506590 587071 343264 75908 217623
2016 217623 205568 123621 108083 119824 225521 207979 368749 311751 -18068 -115735 -70033
2005 -70033 -180233 -217635 -162242 -152705 -189765 -109324 47271 -55941 -7112 163403 213871
1994 213871 -82889 -90569 -96703 -25902 102105 126616 -121506 -182200 59448 18072 87150
1983 87150 101821 183559 11436 -23472 -33739 30227 182495 -111903 -87373 -38412 -177382
1972 -177382 -154265 -46125 131842 85054 -120048 -311485 -104805 56221 -145734 -91922
$$ packed form
2048A518062k84225J43863o209q2121P5763j78740j31473M8980j04735j42710
2038H56455k7124n065M5433q4738k3480l8459k67936J18811j05493P9013O8679
2027F16096j11895j07635Q5526j30827Q313J94458m7446Q0481k43807k67356J41715
2016B17623j2055q1947j5538J1741J05697j7542J60770n6998l29819r7667M5702
2005g0033j10200l7402N5393R537l7060Q0441J56595j03212M8829J70515N0468
1994B13871k96760p680o134P0801J28007K4511k48122o0694K41648m1376O9078
1983H7150J4671Q1738j72123l4908j0267O3966J52268k94398K4530M8961j38970
1972a77382K3117J08140J77967m6788k05102j91437K06680J61026k01955N3812
$$ plain form
1962 -91922 -62000 27491 31984 84020 -14041 -82329 117107 3613 -58941 -94577 -168331 74313
1950 74313 69668 4837 -112149 -190397 -233521 -182015 -104850 -41170 61617 -65496 -112896
1939 -112896 -91058 -122164 -109045 -54533 -59507 9454 13875 -176165 -209196 -116902 -88628 -20602
1927 -20602 -221298 -366786 -147040 -228533 -250113 -145265 -33877 -141293 -138610 -160666 -248961
1916 -248961 -61162 -26927 -81980 -254623 -201292 40614 -137907 -344319 -375866 -326412 -286050
1905 -286050 -335698 -185271 -33323 32369 71873 173951 82827 -37181 -145462 -241118 -225847
1894 -225847 -213742 -51334 -227029 -215534 -351440 -418193 -171290 -228795 -195739 -260513 -212409
1883 -212409 -244924 -122428 -166958 -223284 -187913 -148200 -360808 -368693 -284458 -296091 -221575
$$ packed form
1962i1922K9922Q9491M493N2036r8061o8288J99436j13494o2554l5636p3754K42644
1950G4313m645o4831j16986p8248m3124N1506P7165O3680J02787j27113m7400
1939a12896K1838l1106J3119N4512m974O8961M421j90040l3031R2294K8274O8026
1927b0602k00696j45488K19746q1493k1580J04848J11388j07416K683k2056q8295
1916b48961J87799L4235n5053j72643N3331K41906j78521k06412l1547M9454M0362
1905b86050m9648J50427J51948O5692L9504J02078r1124j20008j08281r5656J5271
1894b25847J2105J62408j75695J1495j35906o6753K46903n7505L3056o4774M8104
1883b12409l2515J22496m4530n6326L5371L9713k12608p885Q4235j1633P4516
$$ plain form
1872 -221575 -213824 -159009 -316968 -281171 -127540 -148292 -242927 -430774 -371270 -316235 -200368
1861 -200368 -62931 175664 223158 23402 -269916 -371531 -410804 -485397 -398086 -312957 -310803
1850 -310803 -187801 -160075 -78382 -107214 -253756 -406490 -305004 -334220 -359284 -433200 -490457
1839 -490457 -328206 -290958 -127145 -161800 -101769 -142904 -122386 -117704 -198354 -153332 -233023
1828 -233023 -238253 -243680 -249326 -104551 -232178 -225504 -366482 -232702 -117098 -50984 -59873 -172715
1816 -172715 -155297 -65122 -23139 33297 -101137 -134092 70496 90935 108670 174474 31366
1805 31366 64247 -77333 -260886 -191921 -128083 -109416 -181433 -75925 69369 -101118 -97781
1794 -97781 -25423 34832 54627 39363 -106284 -99023 -29249 -116898 -73890 -221434 -267656 -192428
$$ packed form
1872b21575P751N4815j57959L5797J53631k0752r4635j87847N9504N5035J15867
1861b00368J37437K38595M7494j99756k93318j01615l9273p4593Q7311Q5129K154
1850c10803J23002K7726Q1693k8832j46542j52734J01486k9216k5064p3916n7257
1839d90457J62251L7248J63813l4655O0031m1135K0518M682q0650M5022p9691
1828b33023n230n427n646J44775j27627O674j40978J33780J15604O6114q889j12842
1816a72715J7418R0175M1983N6436j34434l2955K04588K0439J7735O5804j43108
1805C1366L2881j41580j83553O8965O3838J8667p2017J05508J45294j70487L337
1794i7781P2358O0255J9795j5264j45647P261O9774q7649M3008j47544m6222P5228
$$ plain form
1782 -192428 -146475 -202573 -130191 -27681 -5840 77702 56808 15498 -191183 -173500 175390
1771 175390 73494 82716 17150 7582 -12761 -69763 36415 65631 -70189 -188576 -184486
1760 -184486 76679 138918 -110197 -132779 -129633 -151712 109082 225042 -156105 -171791 -160377
1749 -160377 -115466 93389 22557 -127466 -152079 -224186 -116888 58793 -142186 -123710 -185480
1738 -185480 -96157 -131147 -285625 -162854 -10783 -119083 -86835 64598 -113397 -157564
1728 -157564 -230662 -265913 -74854 -163654 -145079 7186 231905 102562 -52371 10001 -6784
1717 -6784 88463 61296 69652 64201 -12744 49094 -46199 -280112 -306848 -336041 -111485 -37021
1705 -37021 -28743 112276 43209 -4058 -2760 69320 48432 42757 -22394 -130307 -280719 -109442
$$ packed form
1782a92428M5953n6098P2382J02510K1841Q3542k0894m1310k06681J7683L48890
1771A75390j01896R222o5566r568k0343n7002J06178K9216j35820j18387M090
1760a84486K61165O2239k49115k2582L146k2079K60794J15960l81147j5686J1414
1749a60377M4911K08855p0832j50023k4613p2107J07298J75681k00979J8476o1770
1738a85480Q9323l4990j54478J22771J52071j08300L2248J51433j77995m4167
1728a57564p3098l5251J91059q8800J8575J52265K24719j29343j54933O2372j6785
1717f784R5247k7167Q356n451p6945O1838r5293k33913k6736k9193K24556P4464
1705c7021Q278J41019o9067m7267J298P2080k0888n675o5151j07913j50412J71277
$$ plain form
1693 -109442 -106289 -100180 -154171 21708 296058 205338 76321 -68226 -95929 -222998 -230795
1682 -230795 -224208 -174965 -48251 21156 -104371 -141689 -179042 -150692 -503641 -442509 -225522
1671 -225522 -247182 -133761 -20155 -74600 -172766 -259649 -237253 -251014 -268806 -276716 -543407
1660 -543407 -478348 -204522 -136304 -25650 -222850 -207514 -182714 -338332 -368693 -279013 -322711
1649 -322711 -407651 -251634 -105430 -233683 -342872 -462743 -394932 -351521 -346207 -268262 -318133
1638 -318133 -431043 -259199 -162170 -193209 -208231 -137038 -149883 -229564 -200854 -466340 -470524
1627 -470524 -447134 -232181 -298712 -490962 -190272 -395048 -666808 -527265 -324284 -608751
1617 -608751 -527294 -324812 -365405 -214656 -203508 -363348 -588954 -521923 -414235 -349783 -387890
$$ packed form
1693a09442L153O109n3991J75879K74350r0720j29017j44547k7703j27069p797
1682b30795O587M9243J26714O9407j25527l7318l7353K8350l52949O1132K16987
1671b25522k1660J13421J13606n4445r8166q6883K2396j3761j7792p910k66691
1660e43407O5059K73826O8218J10654j97200J5336K4800j55618l0361Q9680m3698
1649c22711q4940J56017J46204j28253j09189j19871O7811M3411N314P7945m9871
1638c18133j12910J71844R7029l1039j5022P1193j2845p9681K8710k65486m184
1627d70524K3390K14953o6531j92250L00690k04776k71760J39543K02981k84467
1617f08751Q1457K02482m0593J50749J1148j59840k25606O7031J07688O4452l8107
$$ plain form
1606 -387890 -308682 -240413 -387840 -447153 -324354 -408516 -532935 -407843 -343542 -255111 -150507
1595 -150507 -258345 -427554 -605395 -574673 -528235 -365500 -253583 -325256 -456392 -388426
1585 -388426 -259543 -228367 -120376 7279 -246404 -355951 -320229 -465613 -471903 -354665
1575 -354665 -197589 -36714 -101084 -163830 -399197 -272814 -117507 -227481 -121707 -14634
1565 -14634 -103416 -183071 -264091 -172076 -47460 93990 25715 -110927 -155969 -7059 -113476
1554 -113476 -193877 -308063 -152736 -309115 -224031 51329 -16808 -133860 99864 137561
1544 137561 121488 -85020 -78761 -120406 -157839 -151792 -165887 -138995 -321551 -256147 -270564 -163434
1532 -163434 -214304 -125047 -280121 -236925 -13450 90611 -4772 -290124 -309773 -259180 -179344
$$ packed form
1606c87890P9208O8269j47427n9313J22799q4162j24419J25092O4301Q8431J04604
1595a50507j07838j69209j77841L0722M6438J62735J11917p1673j31136O7966
1585c88426J28883L1176J07991J27655k53683j09547L5722j45384o290J17238
1575c54665J57076J60875o4370o2746k35367J26383J55307j09974J05774J07073
1565a4634q8782p9655q1020R2015J24616J41450o8275j36642m5042J48910j06417
1554a13476q0401j14186J55327j56379Q5084K75360o8137j17052K33724L7697
1544A37561j6073k06508O259m1645l7433O047j4095K6892j82556O5404j4417J07130
1532a63434n0870Q9257j55074M3196K23475J04061r5383k85352j9649N0593P9836
$$ plain form
1521 -179344 -1659 -32588 59151 62576 -43799 -96802 50950 -67873 51958 -12957 -286
1510 -286 -82475 -135524 -45196 -36395 -130791 -241801 -152898 -110277 -114117 -111955 -246002 -97310
1498 -97310 -17950 15277 -3213 154641 -76965 -46612 -44741 -64858 -137001 -221816 -136084 -30383
1486 -30383 -275604 -270959 -57430 -206886 -309525 -159824 -101772 -20106 70188 53789 -165643
1475 -165643 -201091 20445 273098 79511 -33368 -129752 -190820 -43991 -144967 -122901
1465 -122901 -104089 -187459 -85939 -52326 25985 82639 7126 -89855 -302670 -164184 -140722
1454 -140722 -124518 -179188 33588 -80743 13730 121889 130785 -11841 99033 54679 206014
1443 206014 162026 60032 -24959 -98772 2516 -8625 -58038 -101623 -80267 -39023 95811
$$ packed form
1521a79344J77685l0929R1739L425j06375n3003J47752j18823J19831o4915J2671
1510b86q2189n3049R0328Q801r4396j11010Q8903M2621l840K162j34047J48692
1498i7310P9360L3227j8490J57854k31606L0353J871k0117p2143q4815Q5732J05701
1486c0383k45221M645K13529j49456j02639J49701N8052Q1666R0294j6399k19432
1475a65643l5448K21536K52653j93587j12879r6384o1068J46829j00976K2066
1465a22901J8812q3370J01520L3613P8311N6654p5513r6981k12815J38486K3462
1454a40722J6204n4670K12776j14331R4473J08159Q896j42626J10874m4354J51335
1443B06014m3988j01994q4991p3813J01288j1141m9413m3585K1356M1244J34834
$$ plain form
1432 95811 71975 -49606 10714 47526 -64504 27011 53241 -25580 -134643 -179582 -97808
1421 -97808 -86264 110818 101864 103405 156309 35551 -256284 -173688 -40815 -146559 -78660
1410 -78660 -94308 -1027 -97241 31739 -6538 -81508 -255202 -275144 -199962 -306765 -203184
1399 -203184 -143449 -182458 -34043 4092 -215284 -90071 -137327 -1398 31480 -62588 7792
1388 7792 130406 202788 -16212 34116 32459 -109705 -176490 -150057 -164263 -187676 -211724 -207679
1376 -207679 -2752 -25221 12310 -118430 -13553 59426 -102098 41775 214467 1085
1366 1085 -245132 -61792 101725 -96964 -29710 25227 -144426 -34473 -7167 33231 105772
1355 105772 -230509 -125489 -12801 42687 -8830 -255299 -209108 109844 -13376 -151455
$$ packed form
1432I5811k3836j21581O0320L6812j12030R1515K6230p8821j09063m4939Q1774
1421i7808J1544J97082q954J541N2904j20758k91835Q2596J32873j05744O7899
1410g8660j5648R3281r6214J28980l8277p4970j73694j9942P5182j06803J03581
1399b03184N9735l9009J48415L8135k19376J25213m7256J35929L2878r4068P0380
1388G792J22614P2382k19000N0328j657j42164o6785K6433j4206k3413k4048M045
1376b07679K04927k2469L7531j30740J04877P2979j61524J43873J72692k13382
1366A085k46217J83340J63517j98689O7254N4937j69653J09953K7306M0398P2541
1355A05772l36281J05020J12688N5488n1517k46469M6191L18952j23220j38079
$$ plain form
1345 -151455 -104667 8335 41486 -149133 -25118 -355262 -429868 -281945 -207830 -174651 -14462
1334 -14462 -118549 -179337 -165033 -103745 -90571 -62711 -82343 -107710 -244895 -359120 -330086
1323 -330086 -262796 -231300 -247286 -62277 -123771 42151 141455 -86642 -314096 -290082 -304147
1312 -304147 -364235 -387360 -318390 -146619 -365407 -476040 -296001 -348808 -102852 -120847 -71320
1301 -71320 46594 19402 77341 30799 -34617 24072 162541 -20005 -215816 -132960 43103
1290 43103 -43218 -53484 -275283 -87769 -27605 97567 32837 -133776 -39633 -49591 -191837
1279 -191837 -88943 144677 197449 135496 -188315 -82474 76986 98842 47645 -140285
1269 -140285 -208988 -83216 90678 125957 31977 273673 162698 6487 41118 -18176 125131
$$ packed form
1345a51455M6788J13002L3151j90619J24015l30144p4606J47923P4115L3179J60189
1334a4462j04087o0788J4304O1288J3174K7860j9632k5367j37185j14225K9034
1323c30086O7290L1496j5986J85009o1494J65922R9304k28097k27454K4014j4065
1312c04147o0088k3125O8970J71771k18788j10633J80039n2807K45956j7995M9527
1301g1320J17914k7192N7939m6542o5416N8689J38469j82546j95811Q2856J76063
1290D3103q6321j0266k21799J87514O0164J25172o4730j66613R4143r958j42246
1279a91837J02894K33620N2772o1953l23811J05841J59460K1856n1197j87930
1269a40285o8703J25772J73894L5279r3980K41696j10975j56211L4631n9294J43307
$$ plain form
1258 125131 -77816 -94254 -276498 88764 26400 -77790 -31886 130475 131742 110121 247178
$$ packed form
1258A25131k02947j6438j82244L65262o2364j04190M5904J62361J267k1621J37057
$$ [...]
##END NTUPLES=NMR SPECTRUM
##END=
