##TITLE=1H_TG-2306
 CDCl3, 8 sc, 
 27.10.2020
##JCAMPDX= 6.0         $$ Bruker NMR JCAMP-DX V2.0
##DATA TYPE= NMR FID
##DATA CLASS= NTUPLES
##ORIGIN= UXNMR, Bruker Analytische Messtechnik GmbH
##OWNER= root
$$ XWIN-NMR		Version 3.5
$$ Tue Oct 27 10:42:00 2020 Russian Standard Time (UT+4h)  she@DPX200
##.OBSERVE FREQUENCY= 200.1315066352
##.OBSERVE NUCLEUS= ^1H
##.DELAY= (6, 6)
##.ACQUISITION MODE= SIMULTANEOUS
##.ACQUISITION SCHEME= undefined
##.AVERAGES= 8
##.DIGITISER RES= 18
##SPECTROMETER/DATA SYSTEM= spect
##.PULSE SEQUENCE= zg30
##.SOLVENT NAME= D2O
##.SHIFT REFERENCE= (INTERNAL, D2O, 0, 15.7039)
##AUDIT TRAIL= $$ (NUMBER, WHEN, WHO, WHERE, WHAT)
$$ ##TITLE= Audit trail, XWIN-NMR		Version 3.5
$$ ##JCAMPDX= 5.01
$$ ##ORIGIN= Bruker BioSpin GmbH
$$ ##OWNER= she
$$ F:/spectra/data/she/nmr/H-F/1/audita.txt
$$ ##AUDIT TRAIL=  $$ (NUMBER, WHEN, WHO, WHERE, WHAT)
(   1,<2020-10-27 10:40:48.56 +0400>,<she>,<DPX200>,
      <created by zg, POWCHK disabled, PULCHK disabled
       configuration hash MD5:
       00 E9 B6 7A A2 85 ED C7 34 08 36 98 17 FE 4E 26
       data hash MD5: 16K
       77 57 EA 30 44 7E 50 A2 54 93 90 3A 2A 83 70 FD>)
$$ ##END=
$$ 
$$ hash MD5
$$ 35 67 55 02 6F BA 01 D6 37 17 E0 93 27 07 38 E2
##$RELAX= 
##$RELAX= 
##$RELAX= 
##$RELAX= 
##$RELAX= 
##$RELAX= 
$$ Bruker specific parameters
$$ --------------------------
##$DU= <F:/spectra>
##$EXPNO= 1
##$NAME= <H-F>
##$PROCNO= 1
##$TYPE= <nmr>
##$USER= <she>
##$AMP= (0..31)
100 100 100 100 100 100 100 100 100 100 100 100 100 100 100 100 100 100 
100 100 100 100 100 100 100 100 100 100 100 100 100 100 
##$AQSEQ= 0
##$AQ_mod= 1
##$AUNM= <au_zg>
##$AUTOPOS= <>
##$BF1= 200.13
##$BF2= 200.13
##$BF3= 200.13
##$BF4= 200.13
##$BF5= 200.13
##$BF6= 200.13
##$BF7= 200.13
##$BF8= 200.13
##$BYTORDA= 1
##$CFDGTYP= 0
##$CFRGTYP= 5
##$CHEMSTR= <none>
##$CNST= (0..31)
1 1 145 1 1 1 1 1 1 1 1 1 1 1 1 1 1 1 1 1 1 1 1 1 1 1 1 1 1 1 1 1 
##$CPDPRG= <>
##$CPDPRG1= <>
##$CPDPRG2= <>
##$CPDPRG3= <>
##$CPDPRG4= <mlev>
##$CPDPRG5= <mlev>
##$CPDPRG6= <mlev>
##$CPDPRG7= <mlev>
##$CPDPRG8= <mlev>
##$CPDPRGB= <>
##$CPDPRGT= <>
##$D= (0..31)
0 1.2 0 0 0 0 0 0 0 0.06 0 0.03 0 0 0 0 0.0002 0 0 0 0 0 0 0 0 0 0 0 0 
0 0 0 
##$DATE= 1603780847
##$DBL= (0..7)
120 120 120 120 120 120 120 120 
##$DBP= (0..7)
150 150 150 150 150 150 150 150 
##$DBP07= 0
##$DBPNAM0= <>
##$DBPNAM1= <>
##$DBPNAM2= <>
##$DBPNAM3= <>
##$DBPNAM4= <>
##$DBPNAM5= <>
##$DBPNAM6= <>
##$DBPNAM7= <>
##$DBPOAL= (0..7)
0.5 0.5 0.5 0.5 0.5 0.5 0.5 0.5 
##$DBPOFFS= (0..7)
0 0 0 0 0 0 0 0 
##$DE= 6
##$DECBNUC= <off>
##$DECIM= 32
##$DECNUC= <off>
##$DECSTAT= 4
##$DIGMOD= 1
##$DIGTYP= 9
##$DL= (0..7)
0 120 120 120 120 120 120 120 
##$DP= (0..7)
150 150 150 150 150 150 150 150 
##$DP07= 0
##$DPNAME0= <>
##$DPNAME1= <>
##$DPNAME2= <>
##$DPNAME3= <>
##$DPNAME4= <>
##$DPNAME5= <>
##$DPNAME6= <>
##$DPNAME7= <>
##$DPOAL= (0..7)
0.5 0.5 0.5 0.5 0.5 0.5 0.5 0.5 
##$DPOFFS= (0..7)
0 0 0 0 0 0 0 0 
##$DQDMODE= 0
##$DR= 18
##$DS= 0
##$DSLIST= <SSSSSSSSSSSSSSS>
$$ [...]
##$SUBNAM2= <"">
##$SUBNAM3= <"">
##$SUBNAM4= <"">
##$SUBNAM5= <"">
##$SUBNAM6= <"">
##$SUBNAM7= <"">
##$SUBNAM8= <"">
##$SUBNAM9= <"">
##$SW= 16.880792210976
##$SWIBOX= (0..15)
0 0 2 0 0 0 0 0 0 0 0 0 0 0 0 0 
##$SW_h= 3378.37837837838
##$TD= 16384
##$TD0= 1
##$TE= 0
##$TE2= 300
##$TE3= 300
##$TEG= 300
##$TL= (0..7)
0 120 120 120 120 120 120 120 
##$TP= (0..7)
150 150 150 150 150 150 150 150 
##$TP07= 0
##$TPNAME0= <>
##$TPNAME1= <>
##$TPNAME2= <>
##$TPNAME3= <>
##$TPNAME4= <>
##$TPNAME5= <>
##$TPNAME6= <>
##$TPNAME7= <>
##$TPOAL= (0..7)
0.5 0.5 0.5 0.5 0.5 0.5 0.5 0.5 
##$TPOFFS= (0..7)
0 0 0 0 0 0 0 0 
##$TUNHIN= 0
##$TUNHOUT= 0
##$TUNXOUT= 0
##$USERA1= <user>
##$USERA2= <user>
##$USERA3= <user>
##$USERA4= <user>
##$USERA5= <user>
##$V9= 5
##$VALIST= <valist>
##$VCLIST= <CCCCCCCCCCCCCCC>
##$VD= 0
##$VDLIST= <DDDDDDDDDDDDDDD>
##$VPLIST= <PPPPPPPPPPPPPPP>
##$VTLIST= <TTTTTTTTTTTTTTT>
##$WBST= 1024
##$WBSW= 4
##$XGAIN= (0..3)
0 0 0 0 
##$XL= 0
##$YL= 0
##$YMAX_a= 186891
##$YMIN_a= -165502
##$ZGOPTNS= <>
##$ZL1= 120
##$ZL2= 120
##$ZL3= 120
##$ZL4= 120
##$ABSF1= 10
##$ABSF2= 0
##$ABSG= 5
##$ABSL= 3
##$ALPHA= 0
##$AQORDER= 0
##$ASSFAC= 0
##$ASSFACI= 0
##$ASSFACX= 0
##$ASSWID= 0
##$AUNMP= <proc_1d>
##$AZFE= 0.1
##$AZFW= 0.1
##$BCFW= 1
##$BC_mod= 2
##$BYTORDP= 1
##$COROFFS= 0
##$CY= 11.3945322036743
##$DATMOD= 1
##$DC= 2
##$DFILT= <>
##$DTYPP= 0
##$F1P= 15.9154993809931
##$F2P= -4.1035820241983
##$FCOR= 0.5
##$FTSIZE= 0
##$FT_mod= 4
##$GAMMA= 1
##$GB= 0.15
##$INTBC= 1
##$INTSCL= 1
##$ISEN= 128
##$LB= 0.24
##$LEV0= 0
##$LPBIN= 0
##$MAXI= 10000
##$MC2= 0
##$MEAN= 0
##$ME_mod= 0
##$MI= 1.114404
##$NCOEF= 0
##$NC_proc= 0
##$NLEV= 6
##$NOISF1= 3.799351
##$NOISF2= 2.8
##$NSP= 1
##$NTH_PI= 0
##$NZP= 0
##$OFFSET= 15.70392
##$PC= 1
##$PHC0= -10704.5
##$PHC1= 27.20088
##$PH_mod= 1
##$PKNL= yes
##$PPARMOD= 0
##$PSCAL= 0
##$PSIGN= 0
##$REVERSE= no
##$SF= 200.130013532006
##$SI= 16384
##$SIGF1= 3
##$SIGF2= 2
##$SINO= 400
##$SIOLD= 16384
##$SREGLST= <1H.CDCl3>
##$SSB= 0
##$STSI= 0
##$STSR= 0
##$SW_p= 3612.71676300578
##$SYMM= 0
##$S_DEV= 0
##$TDeff= 0
##$TDoff= 0
##$TI= <>
##$TILT= no
##$TM1= 0
##$TM2= 0
##$TOPLEV= 0
##$USERP1= <user>
##$USERP2= <user>
##$USERP3= <user>
##$USERP4= <user>
##$USERP5= <user>
##$WDW= 1
##$XDIM= 8192
##$YMAX_p= 0
##$YMIN_p= 0
$$ End of Bruker specific parameters
$$ ---------------------------------
##NTUPLES= NMR FID
##VAR_NAME=  TIME,          FID/REAL,        FID/IMAG
##SYMBOL=    X,             R,               I
##VAR_TYPE=  INDEPENDENT,   DEPENDENT,       DEPENDENT
##VAR_FORM=  AFFN,          ASDF,            ASDF
##VAR_DIM=   8192,          8192,            8192
##UNITS=     SECONDS,       ARBITRARY UNITS, ARBITRARY UNITS
##FACTOR=    0.000296,      1,               1
##FIRST=     0,             0,               0
##LAST=      2.424536,      0,               0
##MIN=       0,             -165502,         0
##MAX=       2.424536,      186891,          0
$$ Real data points
##PAGE= N=1
##DATA TABLE= (X++(R..R)), XYDATA
0 0 0 0 0 0 0 0 0 0 0 0 0 0 0 0 8 -8 8 -8 11 -16 16 -24 24 -32 38 -44 50 -60 70 -81 93 -107 122 -141 159 -181
36 -181 203 -228 256 -288 324 -357 398 -443 491 -545 602 -665 733 -808 890 -981 1079 -1189
54 -1189 1310 -1444 1596 -1766 1956 -2180 2436 -2737 3098 -3537 4089 -4801 5757 -7107 9123
69 9123 -22147 186891 -14970 -111126 873 27681 48732 -95037 -26635 97307 -31337
80 -31337 -72126 61640 -8513 24810 -45976 -6836 64509 -17475 -22918 -1401 54402 -8614
92 -8614 -13023 -4911 43765 12855 -53386 49217 18388 2108 -10663 7949 22714 8780 -24067
105 -24067 31716 15820 -39781 61150 -35159 3667 32311 -19210 2649 -19134 42791 6410
117 6410 -51159 5383 66850 -50255 -29960 38704 9226 -12121 -42430 55168 -1416 -39249
129 -39249 -3789 30395 7856 -37680 7392 5320 28270 -35090 -10513 26309 6184 -15512
141 -15512 -19034 34093 8145 -17184 -28666 53115 -3596 -38227 22029 15852 15693 -45468 22110
154 22110 31621 -18935 -19066 25271 17236 -16731 9671 -4850 22654 -10296 11021 -2455 -647
167 -647 28978 -15645 5188 7052 24181 -25845 2082 30868 49 -12387 -2083 37941 -16358
180 -16358 -6060 2424 22326 -7667 -12416 16971 -1938 10165 -25212 14837 3181 -1969 -8926
193 -8926 -6841 21058 -11481 -7912 -13116 23405 -12939 -17797 3090 13102 -5470 -32925 25507
206 25507 -3545 -12909 -16430 20456 463 -29264 15328 446 -4723 -17159 16482 -8802 -5168
219 -5168 6322 -3293 -1134 -7446 20057 -23179 3821 9520 2539 -8689 -1733 21115 -14564
232 -14564 4564 -3708 14614 -5922 -280 7978 743 9756 -12748 12566 -881 12015 -10548
245 -10548 5718 15409 -5840 3193 -7280 24327 -9936 -5003 7234 17557 -6652 -17405 23730
258 23730 2033 -4595 -16797 26529 -505 -17456 8723 6897 -1857 -19916 18727 -6086 -1934
271 -1934 -5404 2583 1517 -11123 7454 -14592 5757 -6253 932 -9167 2663 1069 -15534
284 -15534 6477 -10194 7946 -13770 2321 -1630 -4218 1693 -9444 2265 -9203 11523 -14432
297 -14432 3652 1698 -1568 -1769 -11002 18307 -8644 -5341 -1973 20441 -9448 -11629 14889 2334
311 2334 -697 -15427 26514 -619 -9474 2454 13102 4514 -13636 10449 1333 13220 -11738
324 -11738 7572 8069 -1311 1684 -6157 18715 -5726 -1011 -1491 15849 -4636 -8349 8847 -1513
338 -1513 7371 -15212 12856 857 -3953 -4710 2820 6119 -12987 4361 -4207 8937 -12712 3669
352 3669 176 -9211 5339 -7109 3985 -9878 8965 -8010 -2880 616 -612 -2543 -11764 14509
366 14509 -9729 1038 -4932 2451 -1716 -5545 3804 -6394 8856 -10370 4236 -2185 6217
379 6217 -5572 -8972 13582 -3106 1640 -8559 12915 -2147 -2373 58 3134 8419 -10840 9164
393 9164 432 10764 -10976 1144 12777 -2922 -628 -2345 17003 -8215 1625 174 7702
406 7702 -1397 -6807 9513 -2754 8563 -12344 5208 3242 -843 -6723 -1786 12254 -12057
419 -12057 629 -3692 9853 -10987 -5760 5367 -3011 1190 -11769 7230 -4549 276 -10490
432 -10490 3297 3501 -11759 2576 -3537 8397 -13859 189 1766 -368 -2994 -4913 6475
445 6475 -5980 5539 -11319 5837 -310 -3267 -371 -2087 9651 -10164 2861 -2370 6731
458 6731 -6851 -1341 6259 -2917 4433 -8673 9622 -3358 1355 -3809 4259 4927 -5667 5635
472 5635 -5393 10907 -7045 1276 1532 2533 2875 -7024 7810 -716 3035 -11124 10617 388
486 388 -5715 2631 -1943 7797 -10986 3551 -2775 2292 -4123 -1215 759 -4314 6057 -13898
500 -13898 5965 -2100 -2639 -5823 -172 4807 -8276 -1381 -5280 10087 -13470 -701 2334 -1362
514 -1362 1269 -12046 8333 -1540 -3271 -6707 8843 -2011 -2470 686 -3576 11757 -12036 4329
528 4329 187 4402 932 -5982 7450 5783 -1807 -10947 19134 -1825 -3596 2430 6989 7448 -12579
543 -12579 8745 4752 2709 -5091 9489 852 2317 5012 -7732 14437 -3176 2701 -834 4520
557 4520 6207 -3500 530 5213 5757 -11881 11207 -1994 3953 -251 -6229 11757 -6710 -771
571 -771 -1271 5669 -4286 1195 -3533 428 3704 -10114 6633 -8946 5159 -2245 -6307 1470 2706
586 2706 -3807 -10742 9811 -5204 -61 -7906 6558 2413 -13760 5248 -1159 1451 -5362 3334
600 3334 -3084 5743 -3697 -4992 8344 -4280 6581 -10494 7773 6430 -5497 -835 5517 6529
614 6529 -9063 4450 3218 10260 -8886 1212 10144 -2729 1538 -3219 11842 -3013 1825
627 1825 -516 4677 2537 -3895 4950 -2964 9661 -7164 911 4716 4164 -5431 -5116 11180 -4316
642 -4316 -478 -4856 10526 -5023 -5435 3491 -2558 2969 -7557 5019 -4677 1289 -3411 -2378
656 -2378 1169 -3360 167 -7461 6329 -5677 629 -6148 1188 3798 -11089 2299 -1270 5439
670 5439 -9126 -47 2712 -834 -4704 -986 7996 -8893 5078 -3915 3115 -165 -930 2050 -2661
685 -2661 7973 -4307 2001 -812 8990 -5637 -2245 10030 -3941 2565 -895 8289 -4139 1450
699 1450 2217 3189 -645 -1122 9313 -7858 8057 -2768 815 1953 -841 4083 -3755 2423 -512
714 -512 5365 -8454 3669 -464 -1353 1748 -6537 8211 -6400 -87 -1639 1376 -4391 -1501 2077
729 2077 -4828 3866 -9177 4345 -3173 -699 -2950 -3374 4947 -4858 -1733 -3212 7152 -10759
743 -10759 639 3365 -3597 202 -4131 8632 -7800 -115 1842 2207 -5274 1696 5794 -5821
757 -5821 4238 -4017 7524 -4157 292 4534 51 2363 -2905 7364 -3355 3784 -2407 5020
771 5020 1329 -2224 5936 -2274 5707 -3976 4165 -362 3245 -1227 -728 7113 -4560 2760 -3799
786 -3799 6938 -3341 -1060 3260 -896 925 -3622 5353 -6872 3423 -2197 -475 -94 -2162
800 -2162 2304 -7063 4121 -4850 790 -4817 1593 -134 -5972 1984 -4405 3211 -7738 1818 -1124
815 -1124 33 -2925 -2847 5302 -7339 1966 -4363 4161 -3483 -540 2509 -2927 2934 -3708 3933
830 3933 -3989 5444 -2825 935 3955 -2729 3357 -2523 6330 -4320 3886 2008 1415 658 274 5607
846 5607 -5563 7332 -1465 2297 -776 4095 2996 -4791 4584 -1081 5319 -5306 4229 973
860 973 713 394 -3505 6840 -4777 754 -2528 6223 -3799 -3743 3460 -1269 -70 -7921 7058
875 7058 -3482 -1774 -3384 1185 2471 -7854 222 -2115 4410 -9448 152 2146 -1965 -4871
889 -4871 -3189 7216 -8797 -13 -972 2825 -5044 -2310 3651 -4421 528 -4182 5754 -4132 941
904 941 -421 776 2093 -5299 5396 -2030 2856 -3278 5214 -151 -2505 3813 -235 3702 -5643
919 -5643 8198 -4 -64 -303 2921 3911 -5124 4218 189 6005 -6461 3326 3889 -1837 -90 -2009
935 -2009 8446 -5905 469 1318 4084 -4882 -2587 5583 -2781 1052 -5604 6719 -2948 -2722 -1526
950 -1526 747 1934 -7045 3360 -1992 2402 -7042 1916 1435 -5099 437 -1942 3865 -6650 2199
965 2199 -1739 1315 -2653 -2375 3955 -4242 3535 -4319 3859 -2293 -177 765 -636 1757 -3358 6277
981 6277 -4462 3283 -727 1985 458 -1312 5086 -2110 3823 -2488 5280 -1581 1993 1304 -146
996 -146 6059 -4395 4475 714 3633 -4046 3140 3432 -1897 1542 -839 7124 -6882 2800 1760
1011 1760 -49 -383 -1691 3858 -1769 2133 -5596 4530 -2060 -577 -120 -1985 4336 -6743 2448
1026 2448 -1358 613 -4651 1198 11 -2809 1861 -5723 5546 -4915 -661 -898 288 206 -3655
1041 -3655 2130 -1773 1821 -6387 5596 -3170 -1567 3393 -3114 2900 -3604 3675 -2166 1062 -612
1056 -612 1939 -594 -614 5688 -5045 4946 -3010 2643 1791 -192 1671 311 3420 -3313 4288 -1701
1072 -1701 5089 -2909 346 6711 -3266 1578 -1557 5572 -2567 -39 -609 4809 256 -5448 6058
1087 6058 -2142 2530 -5560 3324 2763 -3850 -672 981 2655 -6742 2743 -1811 3524 -4249 -2927
1102 -2927 4388 -2579 -14 -5824 4088 -2699 -1787 -2653 2471 437 -7102 3471 -2437 1678 -5108
1117 -5108 1327 834 -1557 -512 -2854 4347 -4658 2713 -2112 2057 -1237 -1356 3226 -3104 2711
1132 2711 -2264 3689 -2916 3324 1031 -1405 3152 -974 2904 -4083 5294 -322 2067 -1008 -47
1147 -47 4394 -2193 3562 -3727 5577 289 -1104 31 3052 1176 -5123 5800 -1379 1863 -4923
1162 -4923 4028 3681 -5048 -198 -790 4659 -4606 -73 -533 4421 -4742 -4261 6683 -3407 -859
1177 -859 -4492 5383 -1862 -4151 -317 1987 -686 -6197 3693 -3350 3479 -5113 -1573 3369 -3352
1192 -3352 -1550 -2120 3967 -3813 261 -1724 3667 -3532 -3402 6856 -4028 1445 -2714 2703 140
1207 140 -185 69 824 1029 -2903 5646 -3969 3316 -915 1149 2376 -3206 3655 420 1595 -1855
1223 -1855 5444 -2396 621 1468 -455 3825 -4976 5003 -545 255 -1214 1496 1396 -735 -124 -2485
1239 -2485 7023 -5306 683 -23 316 84 -3952 4279 -1772 -1233 -3281 4896 -3656 -2194 474 -1060
1255 -1060 2719 -6438 3598 -1613 -708 -2380 747 -36 -3374 1856 -2622 3402 -4700 1764 -1271
1270 -1271 -1045 1420 -2456 2115 -2029 2353 -3617 2792 -565 -500 1118 -920 3438 -3617 4420 -1027
1286 -1027 -215 -257 2946 822 -2924 4900 -921 2299 -2704 4003 -569 -1352 3215 176 2615 -3501
1302 -3501 4232 -876 1413 -636 391 2103 -1710 2818 -2603 3223 -2365 1572 -895 -439 2539
1317 2539 -3247 1190 -1868 2760 -4561 -33 1172 -1042 -2275 -1632 4431 -6546 672 -596 500
1332 500 -3070 -899 1658 -3748 1350 -2513 1199 -4209 1874 -1312 -2655 2834 -2409 350 -2574
1347 -2574 3394 -2607 -115 373 488 595 -2613 4365 -3627 2084 -704 1884 -10 -380 3600 -1453
1363 -1453 1527 -1373 5109 -2862 1106 3042 46 712 -1045 5823 -3327 835 1701 3174 -2083
1378 -2083 200 4874 -2459 1814 -1269 3714 -1732 530 1271 -471 1833 -2209 2000 -1772 2835
1393 2835 -3171 446 2335 -1876 -610 -2242 4527 -4772 -920 442 1962 -3468 -2949 4506 -3022
1408 -3022 -1779 -3053 4763 -3414 -3407 2099 226 -1866 -4463 4950 -2613 -1448 -1028 2567 -882 -3181
1424 -3181 2754 -2019 2077 -2994 2063 -677 971 244 -1591 3716 -1386 1011 -1713 4513 -1584
1439 -1584 -1072 3043 594 641 -2469 5774 -1707 283 903 3321 -783 -2166 5072 -1223 1362 -1327
1455 -1327 4420 -1489 -1209 3118 427 -258 -3008 5614 -1997 -456 238 2382 -997 -3045 4089 -1937
1471 -1937 382 -2133 2127 -1529 -516 288 -3022 2012 -2205 315 -3226 2695 -2069 -3186 1636
1486 1636 -71 -1053 -4866 5103 -1915 -2358 -899 1635 -362 -3967 2859 -1067 665 -3257 2716
1501 2716 -830 -1307 1365 -1460 2110 -2193 3161 -1515 1127 684 698 64 -462 4530 -3155 1819
1517 1819 519 2795 -1344 -253 3895 -1154 839 166 4068 -3169 2169 1074 -487 2141 -1259
1532 -1259 2181 -1905 3442 -860 -439 336 1708 -541 -2447 4895 -2791 271 -1423 2258 -1040
1547 -1040 -3051 2187 -680 -827 -3214 3443 -3630 -880 -274 -586 177 -3646 2875 -2741 -618 -1043
1563 -1043 1166 -2794 -922 1990 -2852 1336 -3008 2566 -2512 -620 948 -1341 185 -860 1780
1578 1780 -2416 2807 -2264 666 1100 -328 920 -1797 4569 -1800 -51 1040 2895 -1821 -668
1593 -668 4806 -967 363 -1775 5103 -1277 -1275 2330 1214 377 -2028 4438 -1534 160 -1270 2512
1609 2512 35 -2049 2954 -1681 1482 -1822 1885 -2165 605 637 -2495 582 -893 1855 -4482
1624 -4482 1816 -341 -1585 -1091 -117 925 -4422 1955 -2238 -587 -1743 520 -751 -2002 1782
1639 1782 -2715 183 -2582 2276 -2608 -912 1860 -1903 -30 -1594 2784 -2712 417 -154 2154
1654 2154 -911 -2006 4171 -2071 1132 -1252 2419 -472 -28 2116 179 656 -1057 4227 -2748
1669 -2748 2440 1088 -252 1092 84 2567 -2318 2342 435 1433 -2252 2719 1968 -2587 3046
1684 3046 -1826 1779 -1050 941 -215 129 591 -818 168 -1540 3314 -4183 1570 945 -1616 -447
1700 -447 -1468 2697 -2407 -1150 -749 2594 -3418 -923 2018 -2207 255 -3560 3230 -1789 -2183 272
1716 272 625 -1117 -1763 1469 -2547 2493 -3030 1235 64 -1191 1311 -2070 2117 -1197 150 -883
1732 -883 2996 -1468 50 2288 -1280 2240 -2441 3159 -13 22 914 645 567 -568 2716 -1728 2351
1749 2351 -1459 2570 -25 -1545 2530 -1072 970 -1165 2590 -1996 643 670 130 -358 -2000 3619
1765 3619 -2493 1095 -435 791 -985 -663 1257 -1671 1183 -2418 1430 -1987 462 -1034 -1627
1780 -1627 1614 -2304 392 -1803 1900 -2394 -742 102 -1024 -221 -1766 2695 -2842 1054 -1240
1795 -1240 1418 -449 -2192 1683 -965 1257 -2736 1899 -411 72 -114 264 1658 -2672 3397 -1114
1811 -1114 1362 -772 1067 912 -241 1863 -1333 2328 -757 2228 -2027 1493 1678 -1605 1914
1826 1914 -546 2476 -1672 1793 -25 636 -181 142 1631 -2094 2706 -2528 1373 -83 -733 19
1842 19 -784 1421 -1718 1096 -2248 1717 -1913 -312 653 -1996 1130 -2645 1853 -1619 -409 -1224
1858 -1224 851 -821 -1923 1804 -2241 1534 -2702 1145 -882 -946 1055 -1385 235 -1368 1699
1873 1699 -2608 1817 -678 -117 701 -1073 2282 -2349 1394 -218 1470 -1342 249 1387 -350
1888 -350 1156 -1862 3504 -1662 649 559 693 1246 -1213 1877 -534 2306 -2311 1592 442 532 -11
1905 -11 -1530 3801 -2080 208 -475 2222 -1710 -1064 2145 -700 185 -2276 3332 -2106 -539 -536 488
1922 488 473 -2911 990 -1365 1135 -2896 1227 -31 -1165 -353 -1175 2034 -3204 793 -1035 858
1938 858 -1225 -1292 1389 -975 1003 -3097 2368 -1062 -328 -607 751 998 -3120 2257 -375 876
1954 876 -1910 2156 -208 -1426 1698 -245 1173 -2331 2771 -829 473 602 314 1052 -1330 2481
1970 2481 -1062 2274 -947 1607 580 -78 1195 -903 2702 -1917 1272 -478 1563 -698 -800
1985 -800 1918 -1402 811 -2277 2383 -861 -494 -414 451 568 -3445 2097 -676 362 -2825 1278
2001 1278 517 -2820 407 -919 1110 -3402 1525 -810 -316 -971 -726 994 -2369 1273 -2117 1119
2017 1119 -1241 -113 -268 -408 673 -2550 2072 -1314 963 -1815 891 806 -1622 1105 -555 2151
2033 2151 -2395 2201 31 384 -89 -274 2585 -2098 1880 -388 1385 -897 1411 1093 -871 1441
2049 1441 -642 2425 -1964 2194 105 -226 1164 -182 1179 -1545 1780 -1716 1680 -1077 185
2064 185 304 -1203 1740 -2195 1514 -1293 265 -1312 444 -144 -2064 1035 -2075 1408 -2616 928
2080 928 -671 -989 -415 -936 1301 -2693 994 -558 1022 -2465 -151 1461 -2213 662 -1074 1921
2096 1921 -2727 779 -57 -260 65 -759 1730 -1620 2248 -1395 1264 327 -159 448 -65 2417 -1831
2113 -1831 1860 -362 1633 -690 690 2037 -826 1836 -652 2450 -1440 1472 305 232 1189 -970
2129 -970 2107 -1266 1904 -815 1122 -426 254 1394 -1183 1757 -1698 1737 -1850 679 139 -1048
2145 -1048 -19 -754 1261 -2456 1679 -1515 90 -1042 -731 670 -2298 1333 -1858 -53 -1232
2160 -1232 747 -1706 -728 1105 -2291 1379 -1912 1331 -1472 -152 252 -618 -102 -977 1244 -1804
2176 -1804 1898 -1830 867 525 -1043 1424 -1369 1688 -733 664 -1146 2156 -384 -414 1530 -733
2192 -733 2274 -2518 2510 869 -317 83 1134 1270 -1322 1819 -474 2189 -2049 972 1437 -1115
2208 -1115 1347 -1126 1606 -1137 387 -735 1759 -949 -869 1388 -1600 1357 -2457 1638 42
2223 42 -1114 -686 23 827 -2287 793 -1508 1465 -2658 133 1191 -2258 -166 -1319 1385 -2205
2239 -2205 272 -109 588 -1724 -454 1731 -2878 1043 -928 1227 -909 -653 902 -163 255 -1378
2255 -1378 2649 -928 519 -662 1982 1071 -2376 2048 373 785 -1967 2440 624 -273 -202 885
2271 885 2294 -2496 1772 437 2062 -1683 -21 2720 -323 -327 -970 3527 -1833 -201 420 1709
2287 1709 -801 -1677 2592 -1296 429 -1761 1793 -602 -1323 18 -395 1130 -2492 786 -800 635
2303 635 -2244 -228 1182 -2414 295 -1334 1340 -2299 -182 -115 -225 -1016 -1408 1535 -2238 1035
2319 1035 -1305 922 -846 -974 1169 -578 -11 -1261 2080 -1560 248 26 944 391 -2018 2475
2335 2475 -445 418 -619 1750 104 -352 473 821 2081 -2724 2301 -6 1269 -568 -104 2676
2351 2676 -643 -75 -375 2770 -1751 376 -5 1055 272 -2380 2687 -635 -228 -1441 1517 251
2367 251 -1175 -456 27 1636 -3050 1181 -708 -192 -909 -1161 968 -1510 -132 -1504 823 -1600
2383 -1600 362 -1295 -750 920 -2263 1133 -1212 512 -1231 182 -266 -259 621 -1104 874 -1201
2399 -1201 1985 -1814 4 787 -463 243 -989 2170 -1061 538 -597 1795 -8 -983 1428 29
2415 29 1864 -2018 1738 1141 273 -630 771 2022 -1305 978 -295 2310 -1218 -27 1014 144
2431 144 922 -2120 1881 123 491 -1526 1339 1393 -1408 -47 -31 2019 -2635 183 583 452 -961
2448 -961 -1110 1586 -835 133 -2264 1250 -614 -790 -652 -40 1042 -2573 346 -305 757 -2441 -575
2465 -575 890 -453 -339 -1919 2077 -1474 -420 -779 918 408 -1794 1019 -240 944 -1743 1062
2481 1062 -287 516 141 -991 1862 -575 1016 -1201 1819 487 -136 275 495 2137 -1444 1438
2497 1438 -174 1644 -544 101 1097 41 942 -1445 2101 -67 743 -1516 834 2007 -1413 21
2513 21 -237 2255 -2223 -286 1098 808 -1188 -1717 2753 -864 -840 -1500 2227 -484 -1991 146 331
2530 331 962 -2784 868 -83 597 -1879 -562 1440 -1061 -689 -1274 2551 -1289 -797 -124 911 -274
2547 -274 -2439 1989 -382 309 -1623 1202 631 -615 35 -570 1516 -1376 1061 -631 1124 53
2563 53 -268 710 -315 1475 -1204 1447 -75 1239 -700 -156 1782 -611 465 -1004 1911 -807
2579 -807 325 492 471 359 -1066 1322 -830 1353 -1341 187 691 -20 -209 -1128 2257 -1593 -272
2596 -272 -359 1287 -1262 -1436 1464 -813 -296 -1668 1734 -963 -489 -166 -243 422 -1865 870 -1302
2613 -1302 549 -1211 -61 -133 -503 312 -1685 1074 -894 858 -1145 634 724 -748 5 -620 1607
2630 1607 -1705 994 64 691 -252 -199 1242 -900 1332 -781 942 208 536 -414 281 1888 -1302
2647 -1302 809 -93 1673 -1044 -272 1556 5 -629 -737 2579 -1341 349 -102 1341 -175 -1260
2663 -1260 1648 -546 506 -1143 1002 -578 258 -319 -716 1331 -1662 694 -1329 1036 -393 -1109
2679 -1109 213 170 -126 -1788 1374 -1334 99 -1244 240 155 -1750 1010 -1190 289 -628 715
2695 715 -1274 635 532 -857 487 -1004 1723 -1896 352 739 127 -715 6 1741 -1138 539
2711 539 -663 2130 -589 -219 1347 -558 1130 -582 1459 -185 922 -332 480 546 -291 1155
2727 1155 -1286 2181 -431 44 295 481 60 -1093 1327 -820 272 -1186 1705 -703 -364 902
2743 902 -1249 382 -663 1366 -1682 524 378 -581 -659 -296 1421 -2501 305 -360 515 -1343 -267
2760 -267 1237 -1316 -104 -835 1355 -1567 -259 -196 37 -231 -1643 1325 -841 777 -1608 560
2776 560 299 -463 -27 -268 1681 -1110 318 -381 1568 -780 -820 1523 -189 249 -920 1838 -562
2793 -562 100 632 358 34 -619 1997 -1404 1100 102 312 -371 166 1273 -1165 616 -58 1121 -1766
2811 -1766 896 667 -558 99 -885 1983 -1348 -295 -530 719 -684 -908 231 -512 1141 -2246
2827 -2246 1087 -138 -518 -673 -319 1274 -1891 -382 -93 1407 -2419 211 913 -530 -431 -1254 2220
2844 2220 -1505 -759 14 829 -948 -245 1251 -1046 879 -1238 1535 -750 103 745 -708 880
2860 880 -66 850 -941 1195 -278 663 -280 -239 1610 -1256 1170 -639 964 -139 162 36 460
2877 460 766 -1551 1652 -225 1164 -1855 593 1807 -1341 -479 504 1945 -2420 176 1099 635
2893 635 -1933 -579 2721 -1698 -608 -534 1571 -1176 -1031 309 43 -177 -1896 1156 -689 390
2909 390 -1476 119 824 -1286 148 -606 1434 -1291 50 43 666 -391 -962 1355 -1087 559 -785
2926 -785 982 -576 -309 864 -460 218 -449 1624 -1463 830 515 249 2 -158 1993 -1537 479
2943 479 549 1369 -1058 219 1432 -330 206 -512 1962 -1187 468 179 140 642 -977 943 -349
2960 -349 1096 -1254 738 81 -8 -519 -659 1799 -1568 387 -381 835 -816 -418 499 -745 205
2977 205 -1127 1054 -1733 64 -157 -682 103 -851 891 -1569 394 -168 250 -1279 319 869 -1596
2994 -1596 524 -333 1087 -1430 314 646 -252 -125 -934 1469 -793 690 -532 1177 64 -524
3010 -524 952 -38 1305 -1142 989 39 432 -522 368 1262 -1085 744 -626 1491 -862 489 775
3027 775 176 473 -481 1277 -1213 779 -160 431 -597 65 1083 -1821 740 -266 522 -1329 433
3044 433 488 -780 85 -718 1068 -1462 524 -568 358 -487 -640 649 -647 460 -1531 915 -570
3061 -570 -259 -601 -111 882 -1664 805 -390 749 -1206 311 594 -784 236 -748 1250 -1137 608
3078 608 -52 392 79 -490 1259 -656 883 -333 963 -449 458 565 -407 924 -330 1422 -974
3095 -974 939 -84 219 306 45 1073 -511 943 -837 1179 -470 -302 354 -151 402 -1176 1328
3112 1328 -631 115 -965 592 336 -1319 728 -298 735 -1678 572 48 -469 -540 -499 1051 -1682
3129 -1682 577 -867 903 -1286 -489 590 -771 139 -1021 1232 -904 131 -238 515 108 -1174
3145 -1174 1036 -546 662 -1399 940 131 -418 -144 -21 1259 -1390 1087 33 947 -668 341
3161 341 755 -250 597 -618 1466 -894 650 -24 339 679 -760 906 -368 763 -743 841
3177 841 7 358 239 -557 1154 -1200 857 -285 583 -85 -106 389 -531 616 -1015 460 -1268 507
3195 507 -326 -730 398 -765 577 -1523 522 -584 -68 -924 -174 412 -1028 663 -1232 1047 -919
3212 -919 -45 -116 34 141 -1371 619 -485 760 -1542 833 634 -728 -291 -525 1689 -1186 131
3229 131 -20 1212 -564 -469 1259 47 538 -1382 1871 388 -320 -164 594 913 -1199 838 100
3246 100 1485 -1302 359 994 319 242 -850 1752 -639 -358 -353 1295 -335 -995 933 -57 439 -1412
3264 -1412 1332 -489 -340 -89 -224 438 -1113 740 -930 501 -821 -152 -349 -392 556 -1263 714
3281 714 -1174 499 -981 -59 228 -582 264 -855 616 -851 718 -1395 44 85 -460 39 -902
3298 -902 1585 -989 -153 -202 972 -514 -781 1437 -149 400 -1256 1903 31 -378 423 464 583 -944
3316 -944 883 2 748 -1044 319 699 -409 444 -810 1662 -341 -260 -71 845 -93 -724 743 -190
3334 -190 370 -1273 1269 387 -518 248 -28 583 -1285 500 -195 251 -1176 495 13 -975 968 -1202
3352 -1202 120 -678 507 -506 -425 352 -136 -138 -1097 1340 -1093 16 -567 -207 754 -921 240 -486
3370 -486 812 -692 379 -231 719 -137 -892 1642 -593 23 -513 1084 201 -591 230 841 573 -1471
3388 -1471 1432 100 629 -636 462 1280 -982 359 283 872 -614 212 291 511 407 -784 1256
3405 1256 -464 573 -660 959 430 -513 1 107 859 -1432 590 -246 178 -606 90 628 -1165
3422 -1165 560 -663 136 -957 264 -107 -663 116 -623 408 -1558 862 -864 -186 -244 12 72 -1365
3440 -1365 515 -417 246 -846 399 69 -61 269 -529 1032 -660 624 -315 464 85 -536 402 39
3458 39 845 -1219 1215 -22 48 -257 225 1292 -1060 616 285 696 -529 568 387 -116 471 -444
3476 -444 1295 -850 301 -346 268 537 -349 235 -728 1028 -1028 563 -292 814 -310 -863 1049
3493 1049 -588 50 -774 597 -487 -258 -322 -195 197 -895 619 -1027 411 -360 -279 1 -305 94
3511 94 -1142 700 -765 301 -724 557 88 -935 802 -548 167 -731 872 -78 97 89 27 250
3529 250 -820 1352 -588 344 96 414 231 -493 874 -286 448 -780 1133 33 6 402 140 1213
3547 1213 -1000 933 28 845 -302 73 495 -223 33 -554 1281 -600 73 -165 748 -219 -1152 1084
3565 1084 -232 41 -931 1238 -57 -798 -17 -65 248 -1660 1039 -95 -440 -664 187 301 -932 138
3583 138 -627 319 -1416 189 85 -77 -204 -503 838 -1085 -30 -491 605 -631 -536 754 -121 449
3601 449 -883 1326 -448 -402 -115 721 291 -665 1183 109 162 -909 1126 319 -435 475 403 668 -710
3620 -710 987 -62 334 -207 322 822 -659 725 -379 689 -529 206 185 -294 72 -382 724 -518
3638 -518 115 -318 564 -409 -354 609 -694 262 -1001 869 -693 -366 -36 539 230 -1384 684 -345
3656 -345 -166 -991 486 -57 -799 184 -46 449 -1341 815 -127 -168 -300 -139 475 -711 368 -297 876
3675 876 -349 245 361 -58 428 -644 693 -272 248 -322 443 -50 -86 837 -522 840 -322 898
3693 898 -422 92 471 50 303 -591 989 -521 241 -179 941 361 -592 701 -77 321 -1016 800
3711 800 -180 -110 -377 -105 555 -933 685 -464 597 -675 -245 230 -233 39 -846 450 -369 -55
3729 -55 -694 461 108 -971 300 -257 476 -951 382 -76 -141 -177 -321 498 -731 511 -669 638
3747 638 -20 60 126 -447 798 -469 -3 -352 792 -421 -61 376 203 614 -617 1207 -224 220
3765 220 -237 426 552 -382 430 -158 869 -527 578 320 401 53 -491 1035 -651 122 -371 823
3783 823 30 -278 247 98 582 -906 835 -520 422 -430 -52 294 -637 39 -524 240 -760 336
3801 336 -610 -164 86 -665 247 -946 303 -663 93 -35 -84 -286 -537 406 -658 515 -650 653
3819 653 -24 -360 241 -320 677 -449 370 -283 913 -555 -212 657 -362 604 -767 1215 -385 -103
3837 -103 468 447 222 -455 618 -206 689 -569 557 28 7 583 -275 602 -361 382 -290 423 -226 -320
3857 -320 472 -638 651 -681 893 -147 -192 -112 -250 254 -837 325 -455 621 -827 138 136 -578
3875 -578 169 -546 506 -701 90 -544 144 -530 -354 359 -714 558 -1184 465 -217 -187 -162 -160 406
3894 406 -428 318 -605 565 -512 131 104 -391 633 -595 708 -543 185 -267 551 -47 37 372 -285
3913 -285 578 -373 728 -394 426 228 -221 664 17 534 -754 419 -9 201 211 -151 591 -497 801
3932 801 -572 446 77 107 183 -149 292 -567 500 -399 419 -699 -1 398 -387 68 -486 621 -816
3951 -816 -26 -529 163 -246 -407 439 -648 410 -1041 565 55 -374 -159 -185 457 -669 97 -367 620
3970 620 -568 158 569 -241 203 -666 807 -280 -147 -11 584 367 -465 726 -266 937 -740 374
3988 374 427 4 140 26 843 -667 552 -402 892 -540 -54 529 -172 644 -498 477 -240 300 -157
4007 -157 221 316 -173 208 -759 682 -630 199 55 -48 292 -630 225 -501 415 -857 270 -307 133
4026 133 179 -871 224 -509 134 -442 119 -75 -200 -244 -399 620 -765 225 -397 628 -500 -591 437
4045 437 -220 178 -706 870 -205 246 -504 685 577 -752 705 -215 521 -489 202 552 -99 -46
4063 -46 -238 1183 -632 388 -430 630 218 -714 458 -71 423 -488 814 -180 168 84 54 434 -547
4082 -547 948 -214 825 -505 157 -95 -280 376 -683 280 -532 508 -834 -77 -86 -416 -82 -574
4100 -574 594 -737 453 -773 205 -273 -540 -149 -546 551 -979 520 -400 410 -263 -405 545 -338
4118 -338 357 -622 685 -479 -235 -29 -100 467 -732 718 -367 419 -336 298 392 -104 156 -254 797
4137 797 -425 593 -174 57 408 -479 538 21 631 -919 719 206 265 -151 160 918 -715 494
4155 494 -38 832 -417 -115 509 -242 126 -714 712 -405 483 -162 220 150 -714 122 -410 485 -727
4174 -727 160 -491 -175 -124 -553 379 -692 467 -694 297 -443 112 116 -692 289 -359 183 -908 601
4193 601 -87 -228 -322 51 615 -720 278 97 339 -502 64 489 -224 161 -298 894 -541 4 134
4212 134 332 67 -526 798 87 583 -558 364 426 210 117 112 809 -896 837 -23 273 -277 -52 787
4232 787 -158 307 -353 740 -578 249 373 -100 -85 -28 436 -851 254 -640 324 -555 51 153 -539
4251 -539 17 -553 688 -600 -80 -111 106 -2 -970 531 -219 69 -911 380 346 -634 -203 10 670
4270 670 -1128 408 244 430 -791 -147 959 -530 78 -432 1185 -579 -139 337 185 57 -536 781
4288 781 -393 262 -193 471 410 -2 373 -19 709 -502 627 -181 550 -150 -81 198 -269 372 -352 368
4308 368 -393 319 -92 -221 347 -501 576 -1126 298 -185 -127 -393 64 598 -665 237 -292 641 -922
4327 -922 119 235 -483 -257 -358 713 -662 -37 -97 297 -477 -398 497 -706 618 -814 268 -255
4345 -255 -395 -67 -174 389 -253 328 -389 744 -326 38 391 -73 562 -415 701 -131 544 -260 302
4364 302 224 207 302 -437 954 -326 215 -291 382 181 -521 243 159 561 -970 570 -165 -298 -323 13
4384 13 951 -984 112 60 453 -457 143 219 -447 -120 -829 949 -813 1 -266 110 161 -700 431 -220
4404 -220 293 -868 322 -261 -127 -211 -183 428 -940 129 -97 314 -424 26 467 -247 227 -441 798
4423 798 -803 360 264 -155 37 -46 748 -645 556 -49 216 -644 395 531 -347 387 -238 737 -316
4442 -316 528 90 245 163 -209 704 -110 159 -536 833 129 -564 213 -4 325 -585 524 62 -132 -328
4462 -328 425 322 -645 143 -297 920 -971 -175 402 -124 -301 -430 481 -926 -6 -289 448 -440 -310
4481 -310 170 -435 148 -806 491 -519 -3 -272 -191 183 -392 484 -664 128 -419 205 245 -123 172 -267
4501 -267 96 -329 689 -255 414 23 214 431 -558 381 -146 255 -69 281 229 191 131 242 602 -577
4521 -577 581 23 394 -201 -123 570 -263 245 -330 567 -203 183 6 -10 279 -622 445 -207 358 -505
4541 -505 142 226 -259 -158 -577 501 -921 92 -215 239 -441 -464 481 -438 141 -514 521 -194 -35
4560 -35 -354 34 42 -676 348 -397 327 -282 100 265 -208 77 -222 764 -253 99 -179 606 172 -266
4580 -266 411 -458 362 -450 566 118 256 228 93 451 -356 358 -156 306 -85 291 290 -75 350 -134 389
4601 389 -609 294 -102 205 -134 -306 543 -466 287 -442 322 -440 -115 -12 -54 -6 -594 543 -423 120
4621 120 -210 -61 -37 -624 92 -264 231 -709 152 -16 -191 -49 -110 522 -782 436 42 251 -425 53
4641 53 719 -203 147 -412 561 -579 52 48 135 108 -387 652 -13 -73 -358 601 57 -501 29 232 660
4662 660 -552 651 -24 168 -7 233 467 -1 623 -112 583 -275 154 -108 49 293 -429 706 -345
4681 -345 168 -509 370 20 -384 102 -281 157 -617 439 -452 61 -427 -234 171 -502 288 -756 20
4700 20 -406 142 -187 -238 209 -483 383 -485 176 -344 126 -217 -317 40 -163 133 -597 605 -36 306
4720 306 74 -148 345 -390 342 -246 518 -193 138 43 137 116 -426 582 -104 381 -210 229 5 -209 84
4741 84 -292 641 -532 426 -336 89 -184 -95 294 -251 73 -197 414 -462 91 261 -96 -1 -290 577 -601
4762 -601 86 -225 305 110 -403 161 -323 415 -499 198 -161 -218 -364 -415 147 -677 184 -263 159 -306 215
4783 215 305 -411 -22 -417 246 -672 174 -50 95 49 -158 351 -455 378 -387 175 -46 302 23 -271 564
4804 564 4 416 -541 259 142 20 170 -135 446 -509 259 -214 513 -170 263 243 -82 403 -502 482
4824 482 -330 448 -262 -22 504 -279 8 -278 201 -526 352 -208 -113 36 -255 337 -610 201 -65 366
4844 366 -226 -30 75 -436 196 -415 321 -361 491 -169 -87 298 -360 144 -233 253 -378 162 -432 -81
4864 -81 73 -441 -40 -409 590 -439 132 122 11 -117 -473 254 -462 331 -327 276 373 -230 234 -278 386
4885 386 -415 437 21 486 -67 -22 483 -332 158 -115 609 -514 174 127 23 61 -68 585 -358 597 -279
4906 -279 201 141 -10 184 -214 288 -346 106 -510 221 -280 -267 224 -456 456 -551 445 -268 -114 -109 -364
4927 -364 105 -31 209 -412 390 -397 164 -216 -51 78 -647 348 -336 289 -175 98 -42 -180 149 -331
4947 -331 435 -512 288 -185 348 76 -369 436 -277 187 -90 624 -297 139 106 -269 466 -288 269 -116
4967 -116 356 -167 259 -51 254 142 -415 454 -366 465 -393 121 -12 -37 331 -441 203 -308 155 -572
4987 -572 229 126 -407 445 -586 506 -559 91 36 -174 -242 -455 117 -638 278 -450 412 -270 -280 -96
5007 -96 -98 272 -222 233 -458 284 -278 172 157 -258 147 -400 588 -194 120 -247 108 9 -135 549 -322 375
5029 375 -477 627 196 156 575 140 95 -358 354 -48 574 -242 127 140 -36 288 -447 822 -302 155
5049 155 -233 4 94 17 269 -184 307 -212 520 -66 162 -77 -153 339 -497 181 -274 246 -418 70 -100
5070 -100 -326 289 -414 314 -497 201 -106 -289 -33 -393 33 -582 53 -237 201 -366 -243 292 -271 169
5090 169 -548 532 -289 -111 -122 269 -47 -301 336 -192 454 -495 414 37 62 42 -266 526 -175 188 21
5111 21 562 -293 -103 450 -72 232 -303 637 -103 178 136 179 273 -386 396 28 191 -279 582 162 -26
5132 -26 446 -103 196 -440 153 -70 363 -473 232 382 -593 153 -519 351 -313 81 99 -28 4 -649 442
5153 442 -653 134 -378 65 -130 -328 119 -227 161 -182 195 -250 232 15 -204 93 -164 484 -271 227
5173 227 -185 88 159 -332 151 -29 368 -414 593 -294 207 -170 -95 664 -28 394 -12 375 30 155
5193 155 174 53 172 -150 482 -147 429 -25 73 80 -222 112 -53 195 -396 211 -190 110 17 -200 34 -437
5215 -437 480 -398 187 -217 -165 75 -118 21 -362 292 -294 244 -125 14 61 -504 46 -369 237 -393 247
5236 247 -205 5 231 -173 382 -240 475 -415 175 19 154 98 -276 343 -91 359 -465 316 -152 -42
5256 -42 195 25 406 -399 592 -137 95 41 116 87 -15 530 -201 548 -15 66 -31 67 314 -421 200 -98
5278 -98 370 -388 388 -155 -185 -127 -69 348 -311 408 -123 144 -146 34 58 -40 92 -300 332 -306 103 -287
5300 -287 58 214 -435 276 -277 294 -411 124 -141 16 248 -259 96 -334 375 -455 108 -173 -45 62
5320 62 -295 296 -179 415 -319 58 -116 -62 268 -35 470 -313 484 -73 300 137 -275 170 -106 231 -145
5341 -145 535 6 106 -78 2 -46 -281 438 -183 353 -368 185 46 -73 141 -279 152 -505 116 -48 39
5362 39 62 -164 309 -357 117 -617 430 -381 -201 76 -15 258 -442 436 -252 153 -431 182 89 -141 -111
5383 -111 -168 411 -724 109 -275 -91 -133 -120 161 -273 235 -525 360 -159 -17 0 -334 183 -330 385 -235
5404 -235 298 -210 227 374 149 289 -55 658 -70 218 -64 137 -8 103 473 -139 319 -171 210 -135
5424 -135 258 199 -156 209 -307 275 -134 262 -100 -49 42 -202 162 -402 312 -102 116 -291 -170 -159 20
5445 20 169 -302 64 -377 132 -96 -316 -5 -268 32 -333 465 -458 26 109 -87 305 -89 236 -186 218
5466 218 -304 361 -43 -31 53 57 316 -465 195 -21 74 89 92 200 -152 143 -245 482 -495 236 -88 10 38
5489 38 -129 67 -217 362 -108 260 -103 275 71 -135 459 -276 380 -84 368 -219 -291 -16 -253 -33 -399
5510 -399 425 -296 124 -77 -36 -47 -454 347 -188 -167 -326 316 -203 -244 164 -305 121 -427 273 -220 -224 107
5532 107 4 -30 -362 397 -171 158 -341 -46 24 43 110 105 216 -16 255 141 507 -82 100 335 -273 382
5554 382 -327 576 -102 35 355 82 217 28 717 -23 114 -304 261 -61 46 334 -116 410 -56 424
5574 424 -98 124 -122 270 276 -261 71 -394 272 -544 -37 178 -61 -77 -14 404 -261 88 -431 303 -140
5595 -140 -67 228 -143 316 -361 396 -37 -130 -27 75 0 -429 232 -179 192 -408 160 39 -170 112 -239
5616 -239 163 -170 113 -118 -117 55 12 194 -287 453 -121 237 -25 73 119 -26 220 100 379 -134 431 -5
5638 -5 101 -99 -212 458 -169 6 8 336 -104 -4 52 259 61 -128 430 -118 41 -192 273 424 -425 -69
5660 -69 -134 -25 -204 245 -86 225 -355 -314 385 -279 12 -257 87 -258 -130 -85 73 120 -236 21 -78 325
5682 325 -227 -109 64 -243 118 -278 36 -186 58 -151 75 96 -472 298 -195 575 -368 -104 32 -5 -42
5703 -42 -227 646 -66 -91 -298 506 -90 -347 142 95 381 -232 482 56 149 -301 177 313 -402 201 -180
5724 -180 449 -32 146 166 373 -11 -414 382 7 329 -501 243 -22 -64 33 -86 184 -366 -41 -355 369
5745 369 -201 52 -168 -205 93 -272 297 -328 -20 -172 -60 -98 -105 -163 -493 463 -202 -141 -315 94 -88 -341
5767 -341 104 -203 251 -517 439 193 -37 147 38 624 -463 148 56 437 -169 -87 242 140 70 -142 584
5788 584 154 -35 -39 491 240 -99 431 -47 136 -368 267 277 -209 -120 -228 444 -362 171 -316 182 -166
5809 -166 -300 87 -441 -158 -457 294 -145 305 -164 -1 255 -284 259 -456 25 -271 -129 -12 -292 -30
5829 -30 -341 157 -382 261 -354 -133 -128 -230 -85 -442 575 -201 18 -95 110 179 -227 235 -184 10 -405
5850 -405 234 -91 170 -22 69 344 -263 326 -76 445 -271 126 133 51 425 -261 304 -26 302 49 15 -78
5872 -78 33 -39 -235 234 -48 124 -112 60 54 -155 -72 -79 174 -354 215 -125 -159 -141 -412 256 -318 77 -473
5895 -473 266 -81 -265 -202 113 29 -547 199 -28 146 -398 -55 -3 -179 124 -130 366 -325 136 35 126
5916 126 -58 -220 222 16 146 -323 229 -144 23 7 -373 243 -243 419 90 276 -128 58 41 -58 183
5937 183 -296 207 -275 256 -289 26 354 -99 245 -92 470 -163 69 -49 148 23 -320 470 -253 257
5957 257 -268 178 -74 -160 -101 55 238 -152 209 -189 142 -40 -118 113 -48 147 -400 208 -331 158 -291
5978 -291 -117 190 -333 91 -171 222 -192 50 89 236 -46 -365 270 -301 308 -224 172 -152 4 75 -99
5999 -99 294 -289 111 -122 175 -160 -70 398 -93 203 -523 504 -15 233 -107 235 201 -347 261 -209 423
6020 423 -101 -75 -129 -186 346 -68 273 -276 212 -221 50 277 -72 140 -76 47 -435 182 -70 168 -80
6041 -80 -188 -40 -122 245 -428 303 -18 -152 -178 64 277 -398 460 -384 302 -72 -48 264 45 -262 -244 107
6063 107 -425 55 -324 -87 165 -138 227 110 254 -307 267 -86 -27 19 56 400 -63 497 -180 376 -31
6084 -31 -47 177 17 137 -73 196 -140 259 -121 111 153 -68 166 -181 2 -123 23 -85 143 62 -77
6105 -77 196 -285 299 -332 158 109 -39 34 -189 277 100 -3 -578 310 -116 28 181 179 336 -187 -6 -136
6127 -136 94 -341 196 -18 -173 52 -353 382 -313 105 78 152 25 -296 153 7 249 27 231 -83 -111
6148 -111 65 -143 437 -242 79 -49 -30 27 -86 -64 -85 199 -16 441 -94 172 -190 279 106 -155 248
6169 248 -165 302 47 7 -202 335 7 -300 367 151 38 -252 97 94 -6 -72 -37 244 -143 346 -155 234
6191 234 34 -174 -145 -454 196 -298 300 -24 -45 -165 -13 -2 -238 150 -508 183 -336 -31 -211 110 -78
6212 -78 -329 134 -277 194 -181 203 60 -225 -20 -250 331 -129 -1 35 198 -232 -233 284 -298 229 -208
6233 -208 312 -206 74 -119 363 137 -242 105 -250 259 -39 97 63 181 80 -84 92 -63 233 -178
6253 -178 110 429 -104 -90 -187 120 -281 333 -35 131 121 -80 125 -99 231 -288 396 44 -78 -294 -122
6274 -122 362 -433 55 -219 225 -235 302 95 -18 40 -49 119 -360 254 -241 -64 -85 3 142 -160 344
6295 344 -220 233 273 397 -84 1 418 -301 321 -244 206 -478 -114 41 5 -103 -426 165 -8 235 -80
6316 -80 38 119 -119 202 -194 174 20 321 -279 235 -139 -164 82 -348 139 -451 -4 144 -167 -16 -84
6337 -84 59 -403 93 -241 88 -456 31 213 -102 104 -96 63 -278 46 14 -244 -51 -376 118 -330 158
6358 158 -360 -35 -208 3 81 -65 138 -304 258 -259 274 -15 111 -140 -110 501 -113 106 -429 235 355
6379 355 -89 35 -273 163 -330 398 -87 148 124 142 139 -361 -58 -131 196 -170 17 -65 -61 40 -166 372 -87
6402 -87 212 229 283 14 -96 -172 -132 0 -205 -45 -348 -119 -254 64 311 -216 97 -83 255 -487 88 -152
6424 -152 -175 -98 -529 180 -557 177 -23 158 -187 136 43 -312 -50 -285 166 -174 83 -28 61 103 -131 425
6446 425 -198 350 -448 5 39 -141 418 -297 309 -172 -4 -96 325 40 -52 396 46 289 74 222 42
6467 42 -111 186 -59 55 -47 473 -211 2 48 100 -77 -246 -6 -311 30 -338 31 -70 139 37 34 159
6489 159 -242 22 -145 237 -161 -133 42 -58 -32 -325 238 -328 73 -242 110 -89 -58 101 -376 178 5
6510 5 152 -152 152 244 -75 194 36 260 12 134 -59 64 -110 -20 322 30 111 -61 127 -286 -114 283
6532 283 125 -148 -215 325 -121 131 -50 223 454 -38 308 73 168 -16 354 116 82 -200 92 252 -53
6553 -53 19 7 288 175 -54 -36 -174 267 -231 177 -146 114 -143 -37 18 -119 134 -324 77 -234 85 -163
6575 -163 -13 124 -152 38 -102 33 10 155 -77 161 47 14 147 -116 155 8 98 -47 -315 137 -38
6596 -38 0 -89 148 -140 166 -95 201 423 -202 416 -236 414 10 208 283 68 -99 -72 240 -182 120 -122
6618 -122 366 71 51 213 -76 124 -352 172 -163 -22 -142 216 25 -90 -143 -5 -86 32 4 -13 -102 -105 -75
6641 -75 9 -21 353 -275 174 -237 38 155 -305 262 -177 167 -57 -5 123 -126 27 -193 181 -125 118
6662 118 -35 150 -160 46 169 -322 256 -144 162 -296 532 179 89 219 -123 159 111 51 49 91 -215 94
6684 94 129 -8 444 -49 381 58 -51 47 -63 -2 -88 106 -181 247 23 32 113 75 244 -140 155 -368 60
6707 60 42 -85 -27 -10 247 -301 51 -355 92 -47 150 -57 133 95 -208 12 -215 -71 20 118 -64 -175
6729 -175 -164 -254 81 -246 192 88 99 -173 -241 175 -375 347 -183 406 -29 -138 186 17 -41 -99 -21 -174
6751 -174 -81 62 59 -54 -171 228 -12 366 -194 232 166 -79 128 80 196 -193 63 -159 77 108 -254 -218
6773 -218 -129 523 -135 -67 -131 22 17 -65 -49 131 53 -96 165 -278 164 -173 -19 -31 12 20 -243 42 -166 66
6797 66 -83 28 2 -95 322 -185 229 -275 -22 -269 164 43 -112 176 -143 -14 -155 -28 -34 -64 139 -42
6819 -42 209 -136 337 57 96 -51 -5 105 -179 24 -158 79 -116 138 -294 31 133 134 260 -67 440 -136
6841 -136 154 -56 -30 51 41 131 -87 358 4 293 39 205 40 21 200 -170 144 19 87 -167 -58 -244
6863 -244 -219 179 -295 350 -217 -56 46 -210 -10 41 -40 4 -42 -273 -282 -129 -26 97 -24 406 -210 136
6885 136 11 249 -23 -31 -20 -402 253 -75 -60 -244 59 -34 -155 -40 -301 276 -116 110 -253 -76 154 -48
6907 -48 -131 48 265 -123 22 -221 -79 113 -66 58 -55 38 -154 438 225 -24 -223 139 94 -141 -11
6928 -11 -170 70 -149 90 41 -206 124 -207 84 -33 1 69 165 137 -55 377 -255 15 -343 338 -265 -12
6950 -12 103 -403 -88 -349 -15 -224 210 -120 -116 246 -75 32 1 248 -83 218 -112 -21 2 110 65 -416
6972 -416 211 31 234 -169 135 -53 -236 -186 -171 124 -241 -138 241 166 68 105 8 -172 188 -45 77 -56
6994 -56 127 234 -8 223 -164 39 84 -39 -99 6 -43 -138 -162 -76 -109 -152 32 99 -88 137 -162 16 -398
7017 -398 270 -189 -28 -91 -58 44 -259 -97 -234 -17 -96 96 -150 90 189 -82 290 -314 214 11 -26 -208
7039 -208 108 -146 -199 26 -221 64 -177 96 -95 -266 -110 -77 322 -92 3 -256 283 -11 -246 13 -56
7060 -56 153 -286 86 -148 20 -162 -132 201 -195 210 -175 -54 -187 92 160 57 55 -94 19 -157 212 -9
7082 -9 -38 -51 -20 -185 -219 213 232 221 -258 153 -127 49 -185 -189 300 -325 86 -167 22 -115 -34 162 -155 238
7106 238 -120 170 -80 91 -6 177 205 -140 -11 106 29 -36 190 118 -199 130 -131 336 -110 -34 -91 207
7128 207 -57 -96 274 49 115 -255 257 -40 55 -95 106 -54 -338 358 -275 75 86 -85 124 195 46 -359
7150 -359 61 -253 264 -175 66 -23 -102 -204 -106 -53 -121 37 -247 -3 -150 -316 234 -237 -137 -42 4 -75 -251
7173 -251 -11 -120 37 -329 7 -193 -38 -97 114 50 -160 137 -269 -42 42 242 -244 -52 133 -102 39
7194 39 -176 197 -110 172 -121 -19 291 344 -120 -251 83 -127 158 70 -117 0 -195 56 -149 97 -138
7215 -138 56 4 69 -173 116 182 -22 193 -33 42 -314 211 15 -187 -105 -185 120 -88 67 105 240 -25
7237 -25 -88 402 -359 -141 -49 118 -137 -103 -187 90 -184 -330 140 -177 -213 -6 110 168 -88 3 -106 65 -116
7260 -116 -96 -25 -70 39 -161 175 -419 42 -458 -230 52 -6 165 -4 15 37 16 -73 25 334 -193 104 -419
7283 -419 232 -249 -77 -179 205 -211 -142 309 -254 188 -63 349 -6 -161 -94 151 -159 -65 -71 -174 60 -203
7305 -203 14 -172 -44 -59 -202 -23 -306 74 -329 -200 136 11 -82 -239 32 -16 178 -87 -232 -120 152
7326 152 142 -7 122 -10 315 -141 253 -217 -274 20 -203 -103 -104 -73 -23 112 62 55 12 86 211 -77 229 62
7350 62 102 54 -312 67 223 197 -165 231 114 263 34 -78 40 -51 74 52 74 -68 -38 238 212 154 -221
7373 -221 2 -54 108 30 42 -11 -21 15 95 79 -43 -22 -156 -104 -136 -59 -73 9 -7 -10 26 -69 -212 -11 -177 15
7399 15 -231 -21 -35 143 -350 151 57 -165 -75 -333 14 111 -96 -62 173 -96 -52 33 118 201 -29 366 225
7422 225 36 -54 -114 104 -170 -140 98 161 -76 16 33 70 98 -8 402 -148 235 92 152 56 148 51 -115 -83
7446 -83 98 -108 216 97 -74 -31 75 -73 62 -175 317 -69 43 -60 163 -27 -288 -163 -41 382 -165
7467 -165 0 19 -40 397 -108 48 -264 -64 -15 202 89 -190 187 -189 -166 -190 -189 133 105 9 -27 170 -337
7490 -337 95 97 19 0 77 -83 -66 19 -116 269 47 305 62 215 -1 111 56 -197 131 -137 119 68 207
7513 207 177 -80 131 -253 137 -24 8 -169 -52 -124 23 235 -9 164 -361 -99 103 -217 -214 -109 134 -184
7535 -184 -109 146 39 -209 -229 -157 3 271 165 83 -119 -137 -37 -23 -96 56 77 -378 471 -116 -163 87 59
7558 59 230 -32 5 -186 174 64 315 -178 -196 110 -100 371 18 -50 39 -15 -45 253 -34 -43 409 -116 -217
7581 -217 -179 77 82 -99 127 -176 -29 -166 208 -115 83 115 36 93 -66 -72 -112 26 72 342 286 43 -10 -298
7605 -298 121 -47 -34 -87 -266 185 -63 46 35 45 -99 -99 118 -76 -144 -131 420 -103 41 -171 -51 62 -17
7628 -17 -63 48 -104 -105 306 -55 -33 -342 36 33 14 146 15 -35 -123 47 -283 102 128 -232 167 64 -85 -215
7652 -215 71 56 43 78 256 68 -232 -110 -51 -16 179 -46 -50 -192 228 365 -40 -150 -85 -206 118 -65 -92
7675 -92 74 -128 442 -122 -18 -213 16 347 -52 107 -106 36 54 161 114 44 -112 -95 186 -35 156 -102
7697 -102 21 36 2 -109 -95 39 -270 70 -103 12 130 -177 145 -272 164 -145 97 -336 121 82 127 12
7719 12 148 -208 -52 -28 214 91 -303 171 -22 2 101 93 38 105 23 293 32 281 -200 302 182 43 -254
7742 -254 -17 19 29 -118 -255 237 -159 21 -230 -87 76 -50 164 34 105 -131 122 -33 66 -273 -110
7763 -110 53 72 134 -196 133 -125 141 123 -97 191 35 203 -32 157 -82 -119 -74 0 268 -62 -29 -155
7785 -155 11 -93 45 185 -41 -184 -182 278 -47 128 -93 65 166 -79 63 -25 185 -175 187 -133 -140 190
7807 190 44 77 -369 209 -126 99 297 -131 67 -66 32 -113 168 -125 284 233 64 33 1 60 -198 80
7829 80 -73 6 -268 24 126 11 31 -255 -125 150 248 -174 185 240 188 143 -14 95 157 202 -195 -165 -187 -28
7853 -28 205 199 68 -72 109 171 -141 -11 -70 6 147 418 -129 164 10 139 -252 -74 76 58 50 92 257
7876 257 -75 117 -96 181 156 -65 283 -27 162 12 167 191 -157 58 372 286 -253 265 91 -89 100
7897 100 31 277 -44 126 -238 36 -106 12 -228 -64 99 -240 -137 -246 9 -336 -45 50 86 146 -160
7918 -160 33 232 153 -134 -80 -88 38 -142 45 85 -241 163 -12 70 -64 -274 378 -97 -59 -18 72 -5 -108
7941 -108 -228 -93 72 -171 4 42 47 -130 70 202 -231 203 -135 401 150 217 87 -116 79 -133 132
7962 132 57 126 68 107 -54 -168 -7 -40 11 13 -62 29 -25 -186 -20 280 89 -22 -117 -13 -76 322 -160 55
7986 55 -133 -151 57 -125 209 -49 -135 59 123 -31 58 -43 70 -100 -40 -108 -233 -208 25 -170 -35 -231 34
8009 34 246 94 25 -112 250 -88 120 -236 97 -144 233 101 -150 151 -53 -256 -60 210 -31 83 77
8030 77 159 167 44 93 -73 -46 -219 -157 -28 125 211 -35 21 -118 134 91 80 -105 -54 71 -265 75 -12 -190
8054 -190 -115 126 -68 -250 210 -2 -23 64 -54 -102 -175 42 -114 73 -189 -58 -56 -144 -221 -22 -148 109 -21
8077 -21 -142 124 -307 75 169 78 97 -53 105 1 -58 -94 79 -68 136 70 -118 35 -235 75 -82 346
8099 346 -129 -354 -203 82 -170 -263 -43 -25 302 -176 210 59 -9 198 31 147 -207 184 -7 22 76 7
8121 7 77 -109 330 -245 -50 -60 -217 -182 -157 31 -91 -22 -37 -249 73 -169 -120 -64 201 -93 8 -23 101 234
8145 234 -133 111 -40 114 -98 103 -229 103 110 79 -268 -81 90 180 241 -6 22 -45 62 73 -54 -35 -195
8168 -195 -158 38 100 118 53 254 -57 271 -163 57 -113 276 -67 -209 222 -88 127 70 281 -70 49 -6
8190fk1
8191b7
$$ Imaginary data points
##PAGE= N=2
##DATA TABLE= (X++(I..I)), XYDATA
0 0 0 0 0 0 0 0 0 0 0 0 -8 8 -8 8 -11 16 -16 24 -27 32 -40 48 -56 65 -80 91 -105 123 -140 162 -185 212 -238
33 -238 269 -308 343 -387 432 -481 537 -598 664 -735 814 -900 992 -1095 1207 -1328 1463
50 1463 -1612 1775 -1954 2158 -2385 2637 -2929 3262 -3650 4110 -4662 5337 -6188 7297 -8807
65 -8807 10992 -14438 20696 -35636 142418 95213 -165502 64982 52751 62088 -52917 -20136
77 -20136 108442 21203 -88075 77867 30927 -8796 1363 -24085 78063 -9778 -31957
88 -31957 11330 41624 2886 -37089 13453 16911 25683 -61475 28103 34561 -27416 -9191 -3754
101 -3754 19340 -3656 -20075 756 31223 -52520 28274 1830 -44868 48470 -32512 -5832
113 -5832 -8758 16013 11951 -53454 -5447 55728 -28907 -60921 54326 3507 -17724 -33896
125 -33896 30713 23543 -57846 8014 24655 14770 -41839 7316 18706 11840 -13285 -24009 43570
138 43570 3458 -8420 -13436 34911 15679 -17891 -12085 37076 28178 -50597 32278 23898 8696
151 8696 -24783 5421 51362 -21789 -13488 22172 29571 -23366 6171 5465 10116 3111 -9748
164 -9748 15127 -14820 26520 -13715 -8515 9946 6750 -13302 -19597 35131 -11147 -16958 -9921
177 -9921 26012 -12444 -27276 9631 4373 -1591 -29679 16148 -6879 -3598 -17838 -4707 14725
190 14725 -20756 -2144 -15168 17005 -11650 -16447 -6167 9450 361 -29979 11553 4459 -227
203 -227 -32368 16612 11726 -23829 -3157 8472 15919 -33652 13529 10608 -8773 -8142 9612
216 9612 9779 -15495 16639 -4422 4644 -5240 16407 -5161 -8221 25412 -4273 1290 -6290 24177
230 24177 -8035 -3245 8918 4650 7129 -10759 16281 -4588 8398 -9062 4926 7363 -1506
243 -1506 1068 -9231 20733 -13071 -537 -5388 11344 -857 -19100 12493 3782 -2328 -26332
256 -26332 18573 3738 -15115 -11194 10051 10698 -31552 8616 3310 -3497 -19664 9642 5631
269 5631 -16543 3565 -6074 7554 -14898 5970 -6227 -1817 4984 -6829 2337 -5886 10974
282 10974 -15886 7648 -305 1704 1142 -5786 12604 -8393 8734 -6789 6003 -1035 7979
295 7979 1378 -5152 15801 -7094 7122 -8192 16262 1763 -9480 7756 12031 3208 -20432
308 -20432 20358 2906 -1676 -9528 15123 11189 -21509 7959 6241 6715 -17826 6815 5276
321 5276 1759 -5432 -7600 14606 -11849 1777 -8760 10083 -2096 -12512 2472 2940 854
334 854 -20555 10311 -3972 635 -10676 -851 8769 -15532 -240 -4406 8036 -14622 -16
347 -16 1079 425 -3758 -9168 10441 -14147 7103 -3792 1034 -2415 1499 3890 -9922 9601
361 9601 -3375 4893 -9017 13237 1827 -6268 7752 -1911 8875 -6974 10177 -1845 7842
374 7842 22 -953 9310 -763 5992 -10867 17001 1353 -1748 -975 5653 7616 -10295 7364
388 7364 -1594 9509 -9842 3471 5377 -455 -2619 -9989 17069 -7925 -3291 -3665 9735 -4427
402 -4427 -10512 5882 -2987 2638 -14257 8295 -3538 -643 -6974 -6359 8857 -9881 -2468 -7531
416 -7531 11160 -10878 -6928 1565 52 -2890 -14653 10905 -5671 -78 -9138 1842 1936 -7487
430 -7487 -1445 -4696 10904 -13060 2710 785 2851 -4952 -6798 11509 -4287 2827 -5151 9420
444 9420 -1741 2440 -801 -548 11226 -7341 7152 -1322 10890 -3694 -183 7341 2280 3606
458 3606 -5733 14133 -2696 5150 -3070 5051 5580 -4791 5192 -1112 10412 -8037 5106 -1273
472 -1273 3834 914 -7288 8690 -3524 5261 -8328 5182 734 -1758 -4898 1094 9172 -13255
486 -13255 5540 -3206 4768 -7155 -3332 4818 -4013 2148 -6316 5650 -6511 4966 -7417
499 -7417 -861 7226 -7893 1451 -3336 8584 -8068 -787 -1028 5779 -3002 -8054 12621 -4981
513 -4981 4703 -8545 5699 5632 -5519 103 5498 6628 -8260 7465 -3388 10508 -3823 -2423
527 -2423 10706 -1855 6658 -6783 8529 5598 -545 -8327 12778 8147 -12323 8552 2513
540 2513 8163 -11425 3696 9880 -2473 -2312 2421 6830 -7402 7347 -8973 7147 2119 -7666
554 -7666 4119 -2509 6373 -7439 -868 985 4497 -11081 2565 5949 -8178 5020 -11093
567 -11093 8976 -3649 -6673 2536 1481 -576 -5499 2469 -5185 6901 -9486 2795 -482 -2910
581 -2910 5448 -10171 5126 928 162 -9789 8530 1947 -5574 1285 -204 9875 -14514 4896
595 4896 5190 -906 -1380 665 3073 -716 3975 -8908 10914 -1821 1573 -2049 -557 12657 -9479
610 -9479 368 3222 7068 -8602 924 6366 2765 -3368 -7932 13579 -6007 -1288 -2464 5899
624 5899 113 -7577 3157 -2673 4226 -8919 3327 -3047 2327 -2684 -7923 7134 -3113 -2884
638 -2884 -9462 10025 -3305 -6398 -1333 2335 1019 -13179 7162 -3329 1795 -4986 579 1380
652 1380 -4406 2636 -5530 4997 -3992 2189 -3817 4342 1336 -4354 2875 -2954 9602 -9075
666 -9075 2574 4586 2314 -1813 -3686 9204 -2261 508 -1876 10703 -4532 537 4843 -1871
680 -1871 6127 -4391 5861 -2682 6533 -888 -1381 3016 2285 1093 -8498 12540 -3823 -1176 931
695 931 3324 -694 -5386 5340 -2296 1646 -6119 7312 -6140 -1514 3344 -7767 4980 -5518
709 -5518 2698 -4711 -484 -829 590 -4889 -4174 5527 -7691 3679 -7276 3901 -1920 -6101 2670
724 2670 -2599 -24 -5216 5717 -5401 2509 -4127 -917 3897 -5649 3411 -4777 6975 -2818
738 -2818 -1586 121 4929 -2299 -4715 11245 -5264 3074 -1853 6678 -787 -4095 7738 500
752 500 192 -1873 10198 -5219 2558 1162 2350 3186 -5544 8890 -2042 2543 -2739 4558 -56
767 -56 -1642 2324 -1409 5438 -6844 5348 -2803 821 -1383 -2153 3279 -3395 1854 -5907 6283
782 6283 -5319 -2025 -898 124 1096 -7968 5237 -4036 435 -4808 2682 -3167 -3004 3404 -5468
797 -5468 3262 -5188 3054 -5161 1395 351 -3272 1857 -2370 5267 -7252 3855 -1359 1767 -1600
812 -1600 -1730 5917 -3079 2352 -4011 7293 -3421 171 2412 605 3316 -4500 6955 -3189
826 -3189 3490 -1326 2116 785 434 3420 -4267 7453 -4164 2813 -862 2778 79 -1992 5661
841 5661 -3440 2482 -3542 5090 -4662 1467 2700 -4517 2509 -2385 4213 -7789 2209 -355 -23
856 -23 -2365 -2745 4164 -5980 1692 -6036 4584 -2878 -3966 685 7 701 -8793 5325 -2553 -425
872 -425 -5707 3382 2336 -6800 1903 -2261 5411 -7343 872 1834 2510 -2829 -3298 8156 -3740
887 -3740 -392 -3007 8897 -3298 -2635 5765 485 1228 -4339 8391 -2109 1454 97 3591 1796
902 1796 -3273 5313 -2003 5297 -4210 4666 1697 -349 1502 -98 4611 -6218 5319 -650 2403
917 2403 -3227 2267 4179 -5949 2389 -1437 4641 -6343 1928 1428 413 -2804 -3983 7226 -6303
932 -6303 45 -3109 4734 -3360 -4904 3614 -1107 -1751 -6990 6910 -3405 -1287 -3105 1391 1935
947 1935 -7362 2416 -1668 3754 -6436 1748 1967 -880 -1060 -2320 7099 -6045 2590 348 3771
962 3771 -2215 -618 4726 -1600 3119 -3364 7340 -1712 2643 673 690 4011 -3422 5251 -1297
977 -1297 4083 -2074 5348 40 -1396 4184 -1876 4221 -3745 5653 -1551 1125 -94 558 2186
992 2186 -3740 4488 -3448 4941 -3872 -471 2331 -1694 -1456 -2936 5817 -5905 764 -2218 3077
1007 3077 -4182 -4338 5276 -4853 480 -4072 2975 -2421 -928 -3213 -867 2149 -6120 2513 -4138
1022 -4138 3920 -4664 -1404 2244 -2657 -645 -2204 4114 -5096 3225 -3768 2381 469 -4417 4512
1037 4512 -1811 3146 -3899 3360 -48 1493 -1628 1990 4284 -5491 7357 -2636 2478 -362 1637
1052 1637 2063 -1596 3354 -625 3334 -3311 6279 -3172 1027 2421 -2399 5147 -3329 2686 -1139
1067 -1139 2977 -3059 768 961 -806 1232 -5452 7481 -4704 -1468 -496 1277 -575 -4489 1427
1082 1427 -534 1962 -8267 4068 -756 -2760 -1523 -2018 5758 -6839 -501 -351 2227 -5832 -243
1097 -243 1911 -1500 371 -6503 6436 -2553 -754 -2487 1786 2422 -4271 1895 -356 3912 -6765
1112 -6765 3436 1570 -784 151 -1398 5677 -3189 2048 -2047 4795 -1038 119 2786 -888 3320
1127 3320 -3636 5432 -1887 1664 372 983 1552 -1267 4522 -4335 3320 -965 1769 -1858 1293
1142 1293 2925 -3375 2003 -3933 4722 -3432 430 -1490 426 2737 -5875 1254 -589 1777 -6647
1157 -6647 3281 361 -3173 -1288 -1719 5730 -7741 -802 -178 2601 -3325 -3419 2539 -19 -853 -7785
1173 -7785 7326 -2089 -3359 -1140 2016 2531 -6422 2372 1129 1490 -6132 3807 1390 -200 1012
1188 1012 -4479 7117 -2683 -487 69 4243 -140 -1360 2694 805 2252 -5228 8695 -991 -980
1203 -980 1964 296 3718 -2307 2413 -502 3187 -2419 4468 -666 -1363 3535 -3008 4382 -3686
1218 -3686 2300 764 -575 -1241 1287 720 -4329 3772 -3229 2962 -4073 472 1980 -4103 435
1233 435 -1926 2213 -3539 205 -3146 4096 -2611 -5032 3555 -3232 1323 -4634 2961 -279 -3230
1248 -3230 -1586 1991 293 -6166 3679 -2114 2481 -4023 373 2914 -3285 1252 -781 3034 -3566
1263 -3566 2698 -702 1653 -236 -1294 4066 -3210 4182 -1567 2385 154 1420 133 188 3718
1278 3718 -2834 3743 -1285 3371 -1495 1330 2796 -3081 2490 452 2935 -4233 3963 595 -848
1293 -848 105 -61 2834 -4683 3728 -981 968 -2605 606 1496 -3106 1467 -2865 2685 -3432 1076
1309 1076 -2042 -165 88 -2776 1660 -3593 3180 -3774 164 -935 144 -1302 -3251 3837 -2832
1324 -2832 59 -2353 4297 -3396 -2267 3348 -1671 357 -2606 4079 -3036 988 399 32 -305 -575
1340 -575 3497 -4149 4137 -912 216 71 1569 1310 -2563 3892 -861 2582 -2393 3983 97 -735
1356 -735 3125 -688 2713 -2314 4090 -954 396 6 2188 279 -2757 5151 -2253 636 -1899
1371 -1899 3512 -1288 -2899 3218 -248 -520 -3768 5011 -3014 -1078 -331 382 305 -3690 2907 -2791
1387 -2791 1249 -2727 172 -514 -503 -340 -3598 4166 -3275 -319 -1917 2741 -1604 -3667 3404 214
1403 214 -720 -4522 5299 -1183 -2307 -257 3148 819 -5588 4713 438 -132 -3129 4271 1501
1418 1501 -3294 2080 1184 2340 -3972 4026 -42 704 182 46 2944 -1525 2682 -2488 3559 -256
1434 -256 -246 275 1835 1521 -4266 4525 -590 299 -1887 3286 446 -3606 2892 -131 469 -4491 3869
1451 3869 -920 -1901 -329 560 770 -5154 3242 -1109 -1080 -3249 2603 -53 -4582 1536 -504 51
1467 51 -5105 3142 -751 -2561 -412 -625 795 -3555 2169 -3347 1718 -550 -823 -295 374 1961
1483 1961 -4485 3617 436 190 -2994 3747 2260 -4164 2100 1006 2267 -3892 3505 1440 -381
1498 -381 -176 821 3214 -2980 3346 -824 2122 -232 1018 1447 -1554 2789 -1045 1748 -1798 3683
1514 3683 -1654 -858 2750 -563 485 -2558 4094 -1792 -621 -179 1651 -1438 -2308 3099 -3443 1323
1530 1323 -2305 619 -1443 -609 306 -3563 689 -1033 360 -4338 3109 -1394 -3388 785 -802
1545 -802 751 -4686 2355 -284 -1229 -2237 1708 -30 -3490 2751 -1863 1620 -3066 1989 64
1560 64 -2129 1665 -49 413 -2295 4302 -2211 876 -31 744 1266 -2257 3920 -1227 1432 -141
1576 -141 2033 -409 1060 1344 -1804 3884 -1684 1780 -1429 2750 358 -2300 2551 968 298 -3493
1592 -3493 4798 -1145 -1390 -1105 1815 1177 -4984 3049 -312 -92 -3078 2518 -442 -2845 677 -492
1608 -492 1706 -4447 2125 -1356 -787 -731 -1046 -109 -2169 2322 -3478 778 -892 491 -2127 -683
1624 -683 2390 -3328 796 -931 2122 -3173 1057 1309 -1882 992 -350 2124 -2714 3146 -1015
1639 -1015 129 748 1027 1322 -2584 4273 -1330 618 193 2239 118 -912 2704 324 1953 -2718
1655 -2718 4498 -152 -454 1340 329 1978 -2107 2775 -749 828 -1383 2775 -516 -1384 3290
1670 3290 -3078 1244 -1052 1416 -1821 -520 1364 -960 -997 -1045 3122 -4768 1599 -1048 -1048 328 -1829
1687 -1829 945 -2125 995 -2295 44 -1817 1615 -1730 -2440 3449 -3506 102 -1429 2411 -1082
1702 -1082 -2298 927 1253 -694 -3082 4576 -2235 194 -1019 1884 1790 -3340 2342 678 1018 -1992
1718 -1992 3103 -515 1194 627 -1110 3264 -1925 2493 -754 1679 687 -381 732 1257 1486 -2480
1734 -2480 3759 -1586 1052 -705 366 2135 -2219 1536 -695 1064 -1760 2172 -1199 -465 688
1749 688 -1122 1914 -3775 2168 -1262 -590 -880 391 -253 -2617 1977 -2337 250 -2921 2099 -1362
1765 -1362 -2272 1346 -1961 -2 -2605 1808 -2177 332 -1129 -344 545 -1974 1352 -2692 2551 -1585
1781 -1585 402 15 809 521 -1489 2481 -1535 1266 -1217 2518 -84 -764 1930 -364 2160 -2661
1797 -2661 3160 464 921 -487 858 2517 -1397 1801 -538 2727 -2008 2086 1030 -817 1650
1812 1650 -944 2286 -1624 1781 -1202 873 404 -261 29 -1319 3398 -3218 1358 -293 273 -728
1828 -728 -1130 1039 -1770 748 -2058 1685 -2512 618 -638 -1748 1675 -2738 857 -1803 1064
1843 1064 -1855 -202 -717 -618 351 -2745 2473 -2456 936 -1344 520 324 -1967 1016 -274 1582
1859 1582 -2558 2539 -961 587 483 -884 2002 -1780 2490 -811 929 227 1442 -367 121 2274
1875 2274 -1675 2542 -1402 2418 -1061 -190 2159 -135 1014 -1573 2714 -1012 1301 -1373 1639
1890 1639 634 -2131 2168 -1342 1661 -2148 1058 -380 257 -570 -1391 1890 -2063 816 -2512 2218
1906 2218 -1186 -2167 702 -24 -184 -3345 2679 -1685 -787 -1902 1006 43 -3049 1128 -1198 1002
1922 1002 -3064 754 -153 -281 -764 -840 2183 -2583 1080 -1330 2043 -1622 -916 1538 -547 1258
1938 1258 -2248 2609 -795 1092 -977 1252 1828 -1576 1676 -186 2627 -2720 1934 1564 -472
1953 -472 164 466 2603 -2839 2373 -113 887 -980 1193 1381 -1735 2198 -1179 1386 -2082 1175
1969 1175 45 -285 372 -1332 1897 -1948 1144 -1803 1095 -1021 -994 1011 -1175 533 -2743 2275
1985 2275 -1557 -191 -1217 -287 888 -2818 1009 -1336 1028 -3352 1234 492 -1390 -589 -763 2650
2001 2650 -3692 484 -226 984 -1771 -142 1732 -1972 1020 -1363 2107 -1384 716 443 -133 1390
2017 1390 -1561 1864 -906 2242 -1744 1604 996 -426 1111 -623 2949 -2003 1797 249 1488
2032 1488 -462 66 2555 -1376 1420 -1170 3034 -1368 351 1023 -507 654 -927 2311 -2279
2047 -2279 1072 -740 855 -807 -773 1711 -2380 1524 -1521 964 -1335 589 -226 -810 754 -2269
2063 -2269 1668 -2205 1302 -1374 -138 212 -1522 609 -961 1525 -2506 1477 -910 324 -519
2078 -519 -1257 1895 -2400 1140 -932 1659 -1869 49 1129 -319 177 -1547 3314 -1763 778 596
2094 596 845 -491 -675 2622 -1243 1593 -767 2118 -527 945 999 -914 1993 -1269 1627 -873
2110 -873 2068 -1138 -66 1382 -322 884 -1397 2720 -1620 681 21 550 -232 -1189 1636 -2065
2126 -2065 1242 -1897 991 -776 -595 260 -1044 510 -2047 1793 -2131 494 -863 -234 -22 -1752
2142 -1752 1447 -2208 512 -1138 835 -1818 -17 541 -1722 1377 -1960 1760 -1752 1009 -261
2157 -261 -748 663 -359 778 -1795 2686 -1855 736 7 -21 1284 -1467 2120 -836 1263 -646
2173 -646 1818 -674 872 995 -1146 2692 -1682 1817 -713 870 544 -104 790 121 1528 -1958
2189 -1958 2339 -1070 1134 -1031 -237 2154 -2590 331 91 1286 -2167 637 -31 -276 -465 -1927
2205 -1927 2516 -2809 224 -889 474 -204 -1564 296 -135 519 -2913 2016 -1547 149 -753 -451
2221 -451 1679 -2652 422 -587 1114 -1676 272 -125 295 -169 -1472 3486 -2311 49 160 954
2237 954 -590 -487 1885 -309 703 -1121 3188 -1589 616 1407 193 1040 -1464 2367 -530 1160
2253 1160 -952 1961 495 -1046 1090 71 2450 -2959 1704 1151 -11 -822 390 2056 -2099
2268 -2099 652 -317 2141 -2126 35 1411 -485 -426 -2035 2806 -1484 -1113 -1320 1568 -618 -2757
2284 -2757 1596 -253 -204 -3095 2156 -692 -1425 -281 -9 1046 -2890 900 -845 651 -1978 -110
2300 -110 792 -593 -357 -1660 2344 -1775 256 10 764 -405 -1000 1886 -917 783 -1228 2072
2316 2072 -748 -55 938 -324 1137 -1682 2282 -567 206 -150 1459 124 -888 1816 -353 1710
2332 1710 -2139 2089 885 -821 400 107 1561 -1835 1051 -207 1474 -2123 415 1943 -1374
2347 -1374 318 -1885 2699 -980 -1027 -470 1239 -586 -2397 1412 -1209 673 -2908 1620 364 -2083
2363 -2083 -468 -33 1009 -2681 175 -538 1253 -2022 -648 1556 -1618 686 -1466 1475 -958
2378 -958 -11 -99 658 434 -798 1266 -1219 2042 -1513 672 790 -213 586 -762 1437 -557 1362
2395 1362 -670 1344 -93 789 723 -1262 2676 -749 775 -580 1505 274 -495 803 253 1586
2411 1586 -1789 1662 -261 908 -1009 -132 2187 -1606 22 -761 2333 -1716 -339 62 362 -385
2427 -385 -1867 1783 -719 497 -1907 437 781 -1413 -1199 -321 1920 -2961 -262 -312 1215 -1810
2443 -1810 -1351 2030 -1028 61 -1812 1699 -687 -302 -788 112 983 -1992 927 -460 1928 -2045
2459 -2045 -241 1681 314 37 -1178 2486 -551 135 -902 1937 487 -1323 1160 399 1752 -1744
2475 -1744 1454 634 660 -377 71 1722 -690 1265 -1097 1768 -311 -102 -105 143 1593 -1708 1080
2492 1080 -304 1603 -1384 49 845 -442 285 -1642 1700 -839 453 -1379 378 633 -1386 -369
2508 -369 -976 1957 -2342 -587 -306 983 -1244 -1921 1850 -308 -454 -2239 2095 -54 -1793 -521
2524 -521 892 1045 -2914 967 25 904 -2083 -198 1317 -475 -230 -1346 2491 -749 -324 -576 1960
2541 1960 553 -1944 1560 437 1107 -1953 1809 904 -215 15 396 1917 -1621 897 -343 1545
2557 1545 -690 35 1198 -382 1164 -1226 1346 -763 783 -520 -175 1032 -358 362 -1794 1920
2573 1920 -1023 -116 -255 447 161 -1543 954 -920 418 -1527 501 -359 -156 -309 -1630 1295 -1040
2590 -1040 -205 -1405 1565 -730 -1770 868 -149 -42 -2629 1764 -600 -903 -924 473 582 -1841
2606 -1841 879 -477 1019 -1188 665 42 -542 648 -647 1316 -988 1365 -879 1079 544 -147
2622 -147 516 -333 1906 -1110 886 -88 1679 -455 -343 1360 -732 1189 -908 1229 -432 722
2638 722 186 -102 992 -443 740 -962 2004 -1457 -340 583 195 -127 -1893 1905 -799 -440 -1080
2655 -1080 1604 -829 -1303 678 -346 696 -2229 1098 -566 -611 -486 -265 525 -1094 451 -1472
2671 -1472 1254 -962 -112 -148 -307 894 -1751 793 -166 472 -1270 939 328 -851 450 -695 1739
2688 1739 -1660 1198 -29 -144 710 352 157 -481 1690 -1075 941 -138 1420 -84 -1053 2265
2704 2265 -663 145 -140 1911 -640 -80 232 688 659 -1873 1920 -732 193 -509 223 512 -821 42
2722 42 -839 1005 -1266 591 -947 481 105 -1606 843 -525 367 -1736 1024 -583 -672 -353 14
2739 14 355 -2473 1218 -1363 -67 -253 121 -530 -665 1141 -1241 -130 -793 1677 -1498 -555 1224
2756 1224 -469 52 -1062 2077 -936 -273 204 1199 162 -869 1620 80 819 -1417 1523 568
2772 568 -281 125 -222 1666 -798 710 -430 1441 -388 -400 865 590 525 -1922 2200 -435 -110
2789 -110 -175 897 353 -1349 1145 -153 324 -1095 1217 -1115 -375 1107 -1181 305 -1063 1058
2805 1058 -1527 -241 153 -15 -1144 -904 1860 -1740 122 -1205 1051 -692 -1474 652 -496 211
2821 211 -1584 770 -697 733 -1297 -76 1377 -1548 413 -756 1464 -1211 -749 791 1237 -969
2837 -969 -1213 2552 -1152 460 -409 1888 -40 -1372 1946 239 252 -890 2042 -628 620 4
2853 4 596 982 -1106 1797 -982 653 184 599 -207 185 1020 -622 885 -1117 1543 -787 149 399
2871 399 -412 788 -1182 805 -290 578 -1606 267 680 -759 -713 -1073 2560 -1998 -942 206 1234
2888 1234 -1490 -1479 2047 -644 -1197 -1361 2917 -1280 -1541 434 519 93 -1853 1117 -45 198 -1190
2905 -1190 667 485 -531 231 -787 1928 -1447 237 222 891 -195 -839 1205 -352 550 -1041 1577
2922 1577 -140 -32 614 207 1137 -1082 1505 -487 697 -323 734 -146 -330 1760 -672 726
2938 726 -515 1765 -1016 -499 1370 -161 -116 -1130 1945 -1168 -138 -350 731 -302 -1182 1114
2954 1114 -1086 626 -1475 530 -383 -55 -601 -463 833 -1200 286 -1337 971 -1000 -677 719
2970 719 -374 234 -1132 1076 -777 334 -782 510 10 -947 1447 -1022 627 -542 1098 -767
2986 -767 252 950 -193 270 -301 2275 -1333 395 511 473 252 -803 1798 -450 486 -507 1468
3003 1468 -568 -63 130 -145 1081 -1298 1266 -249 584 -433 59 600 -393 358 -783 1299 -1256
3020 -1256 142 -71 195 14 -1220 1283 -884 29 -1069 861 -619 -355 464 -751 398 -1072
3036 -1072 1278 -1565 118 345 -396 -427 -838 1146 -1635 351 -616 720 -770 -692 972 -890 581
3053 581 -1126 1147 -245 284 -373 193 1042 -867 735 -407 1364 -974 442 593 -67 -13 -428
3070 -428 1593 -617 726 -324 1164 -194 -434 1112 -193 815 -947 1301 -365 222 672 -28
3086 -28 347 -629 1377 -1266 708 -320 638 -343 -588 870 -798 235 -857 987 -866 -114 -106 77
3104 77 238 -1596 1096 -610 450 -1561 352 200 -1086 -186 -464 996 -2063 486 39 321 -695
3121 -695 -373 1218 -1166 149 -1022 930 -1145 -472 416 -183 -4 -1427 1198 -872 119 -367 738
3138 738 -68 -628 846 -593 1274 -1264 1240 250 373 -155 124 1382 -1307 919 -323 1321 -850
3155 -850 426 1023 -56 526 -890 1416 -727 502 -242 480 171 -519 1027 -718 918 -1131 667
3172 667 -245 -109 141 -503 670 -718 569 -1067 722 -684 -137 108 -546 665 -1330 767 -916
3189 -916 173 -530 154 -255 -565 860 -1222 811 -655 338 -567 -275 519 -907 55 -624 1082 -1139
3207 -1139 462 -355 205 341 -906 1032 -551 687 -836 600 543 29 -458 -123 1728 -1175 693
3224 693 -228 1163 -448 -891 989 368 229 -1221 1623 -102 302 -626 889 1178 -1587 440 86
3241 86 1100 -1361 18 468 420 -442 -843 1375 -923 66 -1388 1071 -40 -1466 87 60 170 -1844
3259 -1844 928 -18 -70 -1024 -116 632 -1368 271 -475 937 -1251 372 -271 -372 380 -1044 831
3276 831 -569 872 -909 450 -57 -23 552 -740 1410 -675 758 -359 378 439 -147 426 -571 1547
3294 1547 -769 545 -375 1226 270 -993 963 443 218 -1033 1521 61 -35 -265 587 1206 -1600
3311 -1600 582 200 741 -836 194 640 -99 -224 -890 1397 -1027 176 -856 613 55 -1430 497
3328 497 -83 361 -1639 682 -122 -358 -878 -79 1007 -1587 654 -477 484 -1138 -228 241 -610 -170
3346 -170 -549 901 -1682 728 -183 -690 135 -354 394 -707 991 -194 555 -855 699 204 -245
3363 -245 970 -634 1308 -568 503 19 307 325 -317 525 -163 787 -1159 1586 -139 -626 189 344
3381 344 1043 -1184 588 317 387 -1090 640 718 -854 293 -499 1516 -1180 45 96 200 -190 -657
3399 -657 712 -632 452 -866 704 -388 -383 -65 -612 852 -1232 244 -551 401 -1071 -162 348
3416 348 -706 -213 -858 1049 -1275 -10 50 -469 -76 -240 603 -1169 406 -550 238 -532 114 674
3434 674 -1093 911 -433 957 -940 394 451 62 5 -25 937 -947 775 -493 1014 7 -230
3451 -230 536 -46 818 -829 795 225 889 -721 440 859 -1006 294 -120 1249 -848 -139 674
3468 674 146 -101 -518 1155 -862 310 -783 640 -466 -346 517 -835 458 -619 159 -556 345
3485 345 -516 -373 214 -584 302 -1474 811 -279 -768 -61 55 140 -1158 470 -573 656 -901 216
3503 216 -219 -535 461 -1058 686 -467 427 -887 343 52 -377 458 -10 886 -1177 1122 239 65
3521 65 -61 438 905 -816 868 -282 651 -717 791 230 -515 662 -356 910 -969 565 -61
3538 -61 24 -153 285 688 -850 487 -598 708 -834 -90 120 -512 107 -873 837 -402 40 -511
3556 -511 444 -157 -775 564 -127 287 -1698 906 -58 -771 -539 510 385 -1584 388 -247 277 -952
3574 -952 324 867 -600 -34 -23 852 -809 398 275 401 -524 -264 1177 -522 249 -423 965 -156
3592 -156 -81 399 135 343 -672 1390 2 168 -350 843 572 -1040 782 130 731 -1278 613 319
3610 319 -74 -511 245 1133 -1025 600 77 441 -807 -184 577 -601 320 -429 880 -940 202 -341
3628 -341 -49 -230 -675 697 -1157 267 -568 721 -538 -113 169 -296 343 -956 784 -315 8
3645 8 -348 512 242 -834 583 -288 472 -1172 547 484 -694 -240 54 873 -1266 519 -34 528 -598
3664 -598 130 791 -641 216 -318 997 -273 297 192 315 197 -613 879 -258 768 -596 792
3681 792 236 -129 420 -148 602 -1040 935 -196 264 65 149 437 -678 808 -275 369 -740 359
3699 359 -101 -594 -180 -11 458 -1385 658 -300 -110 -496 43 568 -1012 18 -562 559 -892 -51
3717 -51 112 -224 72 -775 836 -615 135 -652 438 63 -605 174 -167 725 -1008 684 54 69 78 93
3737 93 968 -457 732 -345 840 -406 175 235 -118 633 -181 890 -628 1100 -235 -195 428 338
3755 338 533 -742 620 -26 383 -648 385 511 -596 238 -483 893 -956 194 47 157 -199
3772 -199 -408 694 -583 217 -1278 576 -491 -445 -230 23 304 -786 412 -412 273 -941 202
3789 202 -92 -606 355 -714 407 -663 266 -167 53 -125 -307 213 -407 925 -537 581 -93 246
3807 246 213 -360 424 -262 247 -456 595 6 65 133 -126 988 -590 623 -51 435 -158 -124 231 314
3827 314 79 -658 1378 -143 362 -380 291 571 -651 579 159 522 -834 596 -325 -53 -193 -452
3845 -452 747 -999 383 -442 281 -536 -395 328 -461 93 -969 582 -587 153 -373 -236 146 -770
3863 -770 240 -331 312 -967 141 -314 -89 -306 -542 639 -1067 480 -525 248 -291 -328 165 -101
3881 -101 352 -544 433 -160 438 -63 297 809 -539 554 -201 835 -424 325 105 340 216 -456 926
3900 926 -474 518 -313 509 238 -16 408 -172 846 -336 677 -277 479 150 -232 354 -324 490 -561
3919 -561 311 -197 68 -386 171 379 -356 621 -893 339 -637 -86 -157 -534 203 -781 279 -497 547
3938 547 -866 165 -3 -60 -121 -567 711 -829 276 -131 287 -222 -412 304 -24 140 -668 853 111
3957 111 41 3 -100 827 -339 432 41 582 -365 149 115 322 128 -523 1336 -465 273 14 380 365
3977 365 -472 188 184 739 -579 586 -214 428 21 -377 842 -405 155 -420 601 -358 -146 -48 285
3996 285 296 -836 619 -471 461 -680 32 -9 -580 -226 -466 587 -836 308 -568 241 84 -827
4014 -827 307 -784 358 -446 -38 -465 122 185 -558 422 -591 747 -979 451 -96 -83 -109 -161 764
4033 764 -536 27 -257 876 -379 -285 419 66 347 -684 764 -121 -93 -417 692 650 -466 566
4051 566 -161 890 -888 610 133 218 94 -544 863 -342 -15 -412 686 -140 -299 417 9 600
4069 600 -925 718 -463 30 -310 -211 333 -413 117 -643 608 -857 88 -251 -144 62 -645 485
4087 485 -684 481 -582 213 -409 -50 55 -482 590 -634 505 -499 551 -164 -188 315 -304 640
4105 640 -522 562 -448 454 -287 -317 627 -265 369 -545 963 -29 210 44 450 581 -404 627 -185
4124 -185 735 -314 477 171 -23 144 -209 765 -418 543 -137 419 30 -416 352 -233 697 -884 498
4143 498 -41 238 -769 -369 696 -670 100 -534 859 -808 -312 -43 -218 39 -826 770 -633 75
4161 75 -480 193 -42 -406 55 -675 447 -784 326 -584 253 -87 -155 514 -703 452 -700 408
4179 408 -261 222 214 -251 233 -359 673 -748 367 169 266 -106 146 722 -400 -121 -187 1029 -710
4198 -710 51 781 79 -231 -90 1143 -377 80 -313 766 -211 -549 724 45 543 -721 546 409
4216 409 -123 -302 -300 706 -814 175 -229 836 -364 -366 302 -121 -131 -619 893 -713 -154 -65 194 -308
4236 -308 -764 650 -595 158 -540 584 -650 126 598 -485 -127 -430 931 -552 80 -221 232 -165
4254 -165 -645 624 -407 416 -813 716 239 -203 -126 -33 931 -870 121 86 750 -822 -28 817 -11
4273 -11 -195 -517 1214 -391 -281 276 624 -82 -405 890 -157 240 -586 718 188 -272 49 -12 437
4292 437 -581 310 -216 333 -311 -146 91 -313 318 -716 225 -302 -370 -298 -463 -178 -367 95 -797 215
4312 215 -530 -100 -647 -218 512 -563 0 -516 429 -787 -44 109 56 -79 -571 1030 -437 64 -159
4331 -159 502 39 -294 211 133 500 -538 1062 -225 142 31 71 400 -333 610 -346 581 -247 85 100
4351 100 192 420 -579 661 -354 597 -345 420 229 -149 243 -82 442 -332 181 -368 336 199 -443 422
4371 422 -415 463 -601 297 238 148 -791 -40 804 -822 -53 -780 796 -786 -326 306 -293 -431 -512 671
4391 671 -469 -104 -433 412 168 -615 396 -291 528 -665 403 -129 36 -74 -114 765 -628 187 -168
4410 -168 597 -317 176 310 -42 292 -231 740 -344 506 -85 399 50 -177 891 -336 415 -296 529
4429 529 -181 180 521 -180 -75 -174 775 -690 291 -130 318 -147 -583 593 -308 229 -317 206 -312 -126
4449 -126 -27 -155 340 -1028 630 -375 -66 -688 -132 338 -755 77 -428 480 -701 93 33 -2 -284
4468 -284 -558 790 -454 -123 -455 594 -404 -110 -85 23 360 -836 898 -515 36 -115 196 91
4486 91 -347 81 -197 539 -684 556 -395 245 253 -303 466 -462 267 -73 188 -176 44 210 -94 354
4506 354 -367 712 -563 241 168 37 26 -379 527 -413 310 -413 551 -368 -216 659 -465 216 -587 446
4526 446 -262 -432 11 144 227 -502 232 -314 311 -823 -51 0 -552 183 -200 466 -842 76 -172 479
4546 479 -403 -157 151 -54 330 -687 741 -186 -175 -35 154 232 -316 397 -177 254 -513 452 457 -141 394
4567 394 -208 663 -228 298 -143 388 -53 -111 351 -212 603 -385 588 -12 50 180 33 414 -492 401 -95
4588 -95 392 -621 235 91 -300 171 -437 491 -563 130 -365 81 -97 -216 276 -460 406 -474 375 -269
4608 -269 -262 159 -347 26 -454 416 -309 51 -310 48 -37 -534 164 -379 372 -800 461 -59 -154 11 -202
4629 -202 302 -189 498 -204 655 -503 200 598 85 351 -44 701 -20 254 -104 280 21 -85 481 58
4649 58 550 -519 517 272 -43 221 -4 303 -471 659 -152 526 -57 96 610 -380 -56 -477 452
4668 452 -594 149 -308 -46 -265 -601 133 -513 -1 -509 294 -81 25 -88 -251 173 -701 231 -583 -48
4688 -48 -221 -37 249 -385 216 -415 197 -488 203 -238 -61 357 -41 359 -80 642 -460 262 -30 -16
4708 -16 186 -370 403 -517 276 -147 174 -168 199 230 39 139 -429 420 -209 238 38 -25 157 -215 420
4729 420 -317 520 -383 368 14 -308 239 -14 609 -610 335 -238 193 -51 -31 338 -450 84 -383 556
4749 556 -619 -103 242 -189 -173 -402 544 -329 18 -311 160 -186 -168 234 -174 225 -584 225 -121 45
4769 45 -202 -155 173 -393 383 -256 342 -176 292 122 -173 200 -420 655 -391 284 -191 496 25 -90
4789 -90 377 -193 221 -345 648 -255 313 330 -87 175 -168 438 -120 342 -97 366 -120 -28 326 -289 308
4810 308 -331 514 -108 44 253 65 381 -189 260 -381 274 -529 187 266 -272 -33 -383 666 -484 104
4830 104 -295 232 -287 -195 275 -236 14 -339 261 -451 -122 69 -90 -194 -451 449 -439 269 -220 -119
4850 -119 26 -363 456 -280 235 -338 392 -15 345 60 -272 247 -225 705 -368 446 -151 292 240 -150
4870 -150 395 5 594 -202 537 120 -54 75 -160 614 -505 299 -79 393 -270 -26 456 -16 245 -262
4890 -262 840 -482 163 25 -103 96 -389 134 -400 183 -495 160 -233 112 -10 -391 288 -760 402
4909 402 -493 174 -200 -265 28 -392 115 -549 257 -186 47 -412 -75 -69 -406 399 -467 458 -255 88 -118
4930 -118 -32 28 -543 482 -507 584 -311 32 287 -303 218 -184 571 53 395 -238 574 -63 -102 329
4950 329 -274 493 -353 448 -193 281 -434 264 165 -400 447 -148 607 -481 87 -63 15 107 -285 87 -443
4971 -443 303 -475 383 -154 -225 310 -625 9 -381 -29 -230 20 -146 -42 -118 -314 337 -825 176 -406
4991 -406 57 -46 -350 173 -296 320 -182 233 -275 72 -97 273 107 -454 558 -390 57 -216 51 48
5011 48 65 -29 -465 545 -308 646 83 194 224 -300 357 16 320 -365 423 -316 179 -320 17 391 -741
5032 -741 581 -246 640 -456 152 40 79 160 -226 625 -405 267 -212 307 -111 -156 117 -229 189 -587
5052 -587 250 -260 -28 -125 -152 53 -702 336 -406 232 -447 -91 -122 -206 -103 -174 242 -462 320 -393 135
5073 135 -322 -263 479 -366 161 -456 234 -329 -80 8 208 234 -370 616 -224 326 -360 255 217 -311 384
5094 384 -160 465 -561 415 322 73 -144 92 776 -436 324 -130 194 -297 -128 425 -138 -14 -273 651
5114 651 -432 61 -319 67 75 -305 50 -167 51 -402 255 -155 -179 -45 -181 587 -606 330 -170 68
5134 68 -402 -168 -60 -211 72 -347 322 -366 336 -208 67 -71 -528 296 -103 424 -170 208 -306 9
5154 9 334 -292 580 -562 483 -294 90 30 -23 160 -483 235 79 376 -122 489 -26 204 308 -384 291
5175 291 -192 503 -131 336 114 114 300 -242 216 -506 390 -343 -135 -16 -65 111 -163 355 -214 440 -513
5196 -513 347 -145 -285 -49 -319 335 -554 395 -544 90 89 -425 -8 -347 203 -532 166 -229 296 -282 -211
5217 -211 229 -349 164 -391 269 -161 72 20 -137 70 -320 292 -133 417 -77 55 106 -36 283 -211 325
5238 325 -405 505 -74 178 64 -223 455 -305 408 -213 404 -259 60 48 21 299 -144 418 -114 388 -208
5259 -208 205 44 4 299 -249 533 -327 105 57 22 -138 -432 430 -322 314 -548 217 -189 -113 -387 -424 214
5281 214 -397 27 -425 259 -382 -221 128 -111 -14 -428 132 -309 53 -186 41 -1 -251 185 -204 161 -289
5302 -289 165 105 56 2 -79 466 -82 214 -515 122 -235 49 -16 -189 358 -308 645 -98 37 74 32 342
5324 342 50 428 41 301 -224 543 -234 134 455 -19 -36 -216 507 -340 224 -47 -124 92 -284 148 -164
5345 -164 233 -288 21 185 118 -97 -162 393 -398 63 -416 198 -157 -175 145 -197 229 -371 65 11 -262
5366 -262 13 -112 55 -327 6 13 344 -274 226 155 -185 106 -288 676 -250 33 -77 381 14 107 397
5387 397 -67 335 -326 319 15 160 -77 273 236 -127 303 -268 318 -76 74 253 -229 171 -231 582
5407 582 -374 257 -160 272 100 -195 29 -536 332 -264 256 -298 -40 -167 -216 -129 -515 68 -247 250 -206
5428 -206 -75 -358 -164 163 -370 118 -335 23 -223 -48 -176 -70 377 -342 298 -254 308 -197 -89 24
5448 24 -71 -2 65 169 -66 318 -105 46 -300 -114 458 -100 530 -158 252 162 23 384 100 466 -140 250
5470 250 -85 810 -255 -71 161 -177 280 -242 500 -8 71 -234 319 108 -272 294 -499 224 -184 176
5490 176 -178 71 -84 -152 139 -329 67 -429 341 -162 -21 11 -155 77 -259 220 -210 222 -178 -132 -259
5511 -259 -295 251 -341 172 -495 221 -155 -23 -230 -168 -21 -374 -20 -264 221 -360 -65 145 -258 336 -119
5532 -119 197 -74 174 -167 56 142 178 335 -440 416 -272 202 94 -37 297 -259 297 -46 468 -101 25
5553 25 -142 230 179 -372 364 -258 33 -45 175 -66 -49 -41 -102 81 -534 441 -50 -103 -158 -226 442 -376 51
5576 51 46 118 -344 106 -172 -18 -209 -459 620 -377 312 -15 47 -152 -131 100 -163 -27 -126 491 -178 135
5598 135 -18 -57 181 -153 105 -47 182 -148 210 67 272 -88 -90 263 -136 253 -190 260 -204 -86 380
5619 380 -107 137 -295 604 -320 284 -108 -161 171 -80 267 -66 130 85 127 -78 -78 189 51 187 -198 361
5641 361 -197 -238 58 188 259 -458 87 -153 174 -334 166 -43 -431 -28 -204 183 -667 147 52 136 -68
5662 -68 -76 295 -297 207 -287 294 -77 -103 222 265 -15 -295 371 320 265 -263 -20 379 81 30 -173 661 -206
5685 -206 135 -84 404 100 68 197 -297 232 -374 501 -114 319 70 -183 420 -149 280 -240 386 127
5705 127 -134 59 367 212 -262 206 -26 10 -393 180 113 -354 2 55 660 -136 -77 -185 125 36 -226 161
5727 161 -80 206 54 124 -211 -144 -122 -184 124 -433 24 -306 -42 -257 -7 6 -238 201 -18 429 -161 511
5749 511 -173 -130 306 -157 222 -125 231 -164 179 7 218 163 -49 330 -17 260 -431 160 304 -28 -165
5770 -165 4 317 -444 436 -121 409 -129 135 287 128 438 -268 337 99 -156 190 -36 18 -211 213
5790 213 81 271 -233 339 359 -175 -142 -195 272 -87 2 24 293 -280 -158 136 -274 36 -506 86 -440 114
5812 114 -393 42 38 -315 -93 -310 111 -256 111 -274 56 145 -98 -8 -106 279 -362 123 370 135 -52 -173
5834 -173 605 132 293 -273 192 90 -213 23 170 305 -61 323 -1 151 10 27 53 -200 206 -54 290
5855 290 -155 22 21 109 283 -163 256 -163 374 -60 42 173 145 73 -98 368 -212 -27 -63 -40 123 -418
5877 -418 -73 -226 188 -411 39 -439 -158 -219 -163 274 35 139 -585 409 -285 88 -46 32 17 -313 264
5898 264 -133 19 -415 163 58 -230 179 -149 285 -283 171 175 358 183 -192 546 -124 320 -296 105 24
5919 24 -153 246 183 289 -117 294 -218 461 -113 -9 144 6 397 -199 305 -124 143 15 200 128 191
5940 191 81 -416 333 -404 -17 -95 248 -219 -212 168 32 317 -239 194 -181 -160 -159 33 172 -19 65 -167
5962 -167 492 -409 10 -87 -76 147 -478 289 -409 -45 -268 85 152 6 398 -137 310 -406 162 -87 431
5983 431 67 -136 319 -230 392 -132 109 -80 223 92 -116 402 -410 346 -173 253 -60 60 194 -133
6003 -133 314 -186 250 -372 119 -80 -102 164 -173 106 -313 149 -222 64 -3 187 -195 -295 136 -296 382
6024 382 -387 523 -136 -230 130 -111 258 -190 106 -75 94 -464 -178 247 -368 268 -229 482 -276 -127
6044 -127 -255 243 -59 -38 4 -257 418 -175 224 -30 51 196 -132 192 -332 375 -244 304 99 -277 212
6065 212 -222 321 -486 76 31 307 -101 62 346 200 -9 -181 329 -370 -46 -141 204 162 -235 284 -230
6086 -230 122 -103 212 60 -31 51 -154 374 -399 244 -282 -18 -3 -54 -102 -325 213 -446 301 -172 -6 52
6108 52 -315 1 -192 80 -79 264 -139 130 -265 96 172 -381 278 -119 68 -310 219 -52 -110 -49 -179
6129 -179 -24 -419 113 -241 199 112 100 143 -34 279 -66 70 -52 -54 168 252 343 -256 -104 -165 389 -245 41
6152 41 85 -112 304 -9 79 -201 -294 -186 50 124 -60 326 -63 365 -200 67 -189 104 -82 -42 154 -166
6174 -166 257 -436 6 -82 -105 -90 -127 283 -149 -23 -18 335 -300 -131 -84 -287 254 -369 269 -58 111 101 13
6197 13 191 159 192 -244 98 -182 151 -52 -49 -12 -354 329 -114 120 -237 435 -13 106 127 -5 463 -286
6219 -286 201 -285 418 74 -34 120 15 35 -41 254 50 201 18 -61 84 -250 293 -53 346 -59 333
6240 333 -259 131 223 -303 55 -145 462 -261 54 -205 -333 -80 -232 241 -153 344 -318 341 -141 -116 125
6261 125 -109 119 -161 433 -136 -38 86 -140 51 90 336 -184 180 -239 127 -9 53 350 -235 497 70
6282 70 197 -41 114 71 -179 545 -68 304 -413 322 -130 -101 41 -70 115 -110 185 -365 34 -225 155
6303 155 -44 -131 309 -246 411 -253 237 -216 388 166 97 8 -162 161 -304 79 -111 -19 89 -186 -57
6324 -57 -157 160 -337 255 100 39 -30 -37 225 -335 70 -310 191 -170 92 362 54 -282 -306 405 -266 433
6346 433 -70 70 -6 5 316 -93 98 -59 136 -27 193 -91 11 -3 -222 400 -284 292 -41 215 225
6367 225 -25 -28 -178 144 -238 -6 -121 -133 4 144 98 -289 116 -95 264 -296 63 341 -131 -19 -51 522
6389 522 -700 -100 141 -280 154 -49 25 -262 114 -387 414 -154 -149 -78 -84 253 -485 133 -66 203 -255 -93
6411 -93 101 -193 -35 -556 334 -184 -179 -72 134 -287 -44 366 -126 -18 57 391 -1 24 100 52 122 109 172
6434 172 -270 298 -11 -2 -141 -223 493 -334 73 -16 231 -186 -25 82 43 164 -2 81 -60 225 -181 125
6456 125 -103 -284 150 -218 251 -249 -72 -159 -246 76 -326 266 -234 -85 -247 94 -138 -88 152 -210 82
6477 82 -398 133 -287 -114 83 -10 26 -72 371 -34 282 -261 -42 133 -12 -31 -328 230 -323 40 -308 50
6499 50 91 -152 205 -21 124 -182 175 -135 220 305 -66 187 -36 188 -156 -20 -240 226 32 146 253
6520 253 -69 379 -268 350 -201 319 139 50 53 -118 395 -458 68 -164 258 -106 21 404 -142 132 -253
6541 -253 84 -73 305 -264 -291 211 -313 117 -380 215 -275 -19 18 -183 -68 -390 68 -188 67 -285 47
6562 47 11 -198 -36 -14 93 -264 163 -401 25 37 -10 141 -291 225 -58 49 -118 -24 199 27 193 -160
6584 -160 -99 -86 373 -324 11 109 -256 364 -291 123 206 217 -80 -48 43 -48 -47 -265 142 -149 142 53 103 86
6608 86 -75 254 -135 -38 -213 205 -59 -97 77 64 1 3 251 -57 120 -253 -190 -157 -56 -168 -369 90 -47
6631 -47 291 -136 -123 7 -304 311 -162 129 -131 184 28 279 217 -240 406 32 82 -315 177 -172 -12
6652 -12 0 241 105 -351 249 -183 255 -72 -46 207 -240 58 2 219 160 -34 -124 38 43 -117 157 83 110
6675 110 -92 296 105 62 -128 47 129 -244 275 1 213 95 12 202 -241 156 -76 318 -200 28 -74
6696 -74 -85 -65 -264 74 -237 39 -126 -119 -179 -237 80 -274 20 -204 305 -67 -159 -174 -195 8 -292 110 155 57
6720 57 212 83 196 -83 -211 -24 376 -134 165 77 184 -139 -86 256 -58 16 -102 270 -137 152 -13
6741 -13 -134 204 -196 -10 -137 173 -207 108 -44 44 67 -128 77 -247 172 -234 245 -52 -194 114 -308
6762 -308 89 -195 309 -49 60 -194 -219 73 99 149 -161 179 86 291 -262 -77 43 -112 -173 -234 89 -69
6784 -69 77 116 -131 16 -150 24 -54 170 -106 -71 7 -252 52 -175 229 -218 89 71 95 242 -80 295
6806 295 -31 145 -277 197 -151 -93 239 13 194 -187 153 -212 261 13 21 106 -84 -25 -214 203 -143 183
6828 183 44 156 -69 -167 67 -12 45 -138 135 -76 214 -268 -71 86 -363 457 42 46 119 -275 -74 -144
6850 -144 1 -172 -60 -175 -20 -77 31 52 -189 15 -110 386 -264 221 -65 -70 106 -38 118 109 106 -14 116
6873 116 -73 234 -138 -397 36 -36 173 -134 418 113 124 39 -130 252 -202 128 -143 220 -86 362 198
6894 198 -75 161 -306 301 -60 21 -31 175 -126 -16 345 -231 -79 -234 233 298 -231 137 -39 205 -388
6915 -388 122 50 181 36 133 44 -34 107 -237 325 -332 83 191 259 34 114 238 -463 54 2 169 36
6937 36 -77 180 -98 252 -151 8 15 -102 -141 -262 111 -193 71 -150 -134 -55 37 156 -62 254 -67 160
6959 160 76 -33 51 40 -31 81 215 27 144 -362 68 78 211 226 107 -4 -188 478 -119 386 71 144
6981 144 64 -99 126 -298 55 -118 266 -21 64 -36 -138 192 81 307 -166 155 38 83 -201 -328 -18
7002 -18 -34 -43 -266 -75 -227 109 -74 10 -41 -51 144 -322 -168 -122 -1 -170 221 176 -115 135 -243 -154 7
7025 7 50 -136 19 279 -206 162 -207 -1 -335 205 186 -52 -77 -295 295 18 22 79 125 -288 70 102 217
7048 217 169 -120 218 -42 2 -51 -140 49 -329 -85 -82 65 -15 -176 88 -89 280 -41 180 -136 -39 57 -152
7071 -152 -35 -152 170 -49 369 -405 128 -46 146 19 -34 -96 -330 171 170 45 -248 -166 -233 2 9 -102 167
7094 167 -285 321 -223 -148 68 -132 -91 -292 139 -11 62 329 62 154 -159 127 -20 221 -256 136 -79
7115 -79 43 149 -88 82 -224 102 -164 136 -170 19 52 -121 344 -18 425 -15 93 -21 2 -44 -272
7136 -272 95 -294 236 -194 -129 -12 -64 62 -61 160 -156 138 -26 276 -101 271 31 -92 331 -263 -74
7157 -74 -37 -109 16 -55 -168 116 209 61 262 -89 290 -16 -151 261 -18 12 -24 -46 -205 329 45 85 -180
7180 -180 16 141 119 43 -7 272 78 -152 79 -188 -5 -105 135 146 305 52 44 90 -225 169 -200 31
7202 31 -91 -60 -226 -138 128 -162 162 -126 221 -191 -31 -73 123 23 -379 144 64 252 -67 92 60 -68
7224 -68 -184 -217 288 -295 -110 77 159 -112 -155 200 54 -57 -226 311 -11 -125 170 120 68 -171 132 -134
7246 -134 248 -72 40 11 -141 -118 -112 408 -33 -91 99 67 -105 -201 378 -45 101 -183 364 26 -154 185
7268 185 -292 215 53 -40 -273 201 -80 123 -137 -242 86 -163 -125 -78 -18 -25 -268 123 -270 -12 -215 128
7290 128 -443 -366 -213 3 140 -401 57 -100 -24 -79 61 -102 -21 -244 -27 304 -286 130 -225 440 -35
7311 -35 -27 149 -112 -88 -259 -197 -39 -15 -186 -128 149 24 28 -115 64 -195 -13 -61 158 85 189 -11 -40 311
7335 311 -54 302 92 -259 86 -148 135 -179 217 -186 185 -26 94 322 5 -140 -139 51 -249 -189 125
7356 125 -90 -117 165 244 -306 197 -189 -329 -76 -100 126 -22 413 -264 66 -154 240 -144 -135 -115 32 97
7378 97 -71 -54 -171 -299 -217 121 -48 -81 -18 -123 57 -69 -91 -84 -71 -76 -187 45 67 98 -220 296 111 -190
7402 -190 -36 -114 224 -305 -47 -114 32 -183 -216 312 -12 -214 20 339 6 39 221 118 223 -526 108
7423 108 -133 -52 -149 79 101 22 116 -213 280 -165 109 -288 143 144 173 -158 75 98 -330 211 -119 6 -174
7446 -174 4 4 -131 18 -141 160 -91 51 119 56 125 -390 325 142 63 -57 -260 76 -17 -3 -168 132 -269
7469 -269 56 -219 129 49 -110 291 -48 346 -56 143 -33 61 187 -259 236 -171 105 -150 38 -48 44
7490 44 138 173 198 -192 149 -294 181 -46 103 43 95 262 55 54 12 -44 -72 292 194 -221 83 75 244 -42 170
7515 170 -102 -73 41 -175 -173 -63 -32 -377 112 -63 316 -163 -34 -93 -154 172 148 -126 -85 -168 105 70 -171
7538 -171 -430 37 -174 77 31 -95 -137 -18 409 -170 119 100 18 -117 69 -52 -43 138 -308 -59 -316 -7
7560 -7 -18 166 312 58 317 85 191 218 117 -16 5 268 59 -30 58 399 -59 -11 -145 -363 -74 -304 166
7583 166 -85 -2 -322 -171 -120 -161 -227 -94 79 -325 10 52 -37 -126 65 171 19 141 169 37 98 38 -80
7606 -80 87 45 -304 89 25 118 -157 206 -5 64 342 31 91 -293 130 -55 69 69 -212 136 -289 51 18
7629 18 205 -126 152 -7 32 -169 -110 280 -339 187 -28 154 151 103 178 -105 -209 -4 239 -140 97 -18
7651 -18 -38 82 -16 1 -27 90 -106 -30 -3 26 -185 -132 117 -222 -8 -3 26 -235 -70 -148 -270 -145 -128 -103 29
7676 29 71 70 195 95 -104 -82 -55 -140 -189 -179 14 12 -142 -97 17 61 346 -78 -142 -76 -246 113 29 -5 66 -57
7702 -57 -113 -69 -197 175 244 76 374 -213 4 25 59 -96 -106 -14 -194 132 -116 42 306 -97 -21 270 209
7725 209 69 46 -171 141 87 68 33 -245 105 -161 281 -186 -70 52 65 -187 31 145 -192 -47 -180 49
7747 49 -147 -100 -88 148 130 -182 27 -267 148 -95 401 13 -262 36 35 21 -160 227 97 85 283 -349 64
7770 64 88 -81 -110 35 -49 160 176 36 118 -26 93 -19 7 -126 227 264 -16 240 -185 296 -70 -74 260
7793 260 80 59 36 60 -220 58 -148 -28 -39 56 36 264 -22 -77 122 -128 -34 22 5 2 -96 240 -179 -112 -340
7818 -340 17 86 -143 -78 -142 -104 -100 -107 -118 145 6 -182 117 -38 62 -300 246 -53 -212 38 195 120 -32
7841 -32 74 -215 91 -193 -138 119 41 -20 -83 -166 8 184 -20 223 -24 -30 343 83 115 -206 -69 -155 213
7864 213 -249 57 338 -187 -99 39 289 -147 213 150 -28 121 -79 24 -170 -14 56 -133 123 -109 141
7885 141 -252 80 -101 189 253 -20 182 70 -4 -84 -14 -78 7 -366 -97 -95 -524 80 30 -37 -137 155 33
7908 33 72 -109 70 23 74 159 -161 179 -69 20 228 41 9 -63 136 -42 146 22 -85 -112 -521 103 -73
7931 -73 28 -203 30 -22 -37 36 -159 295 -151 -38 -52 88 39 130 244 -183 -11 56 -76 -128 -29 61 64 -47
7955 -47 -165 -179 121 219 -159 -230 -98 -274 66 167 174 -248 194 -51 69 223 107 72 -33 -200 -30 91
7977 91 144 -125 -62 18 -57 -83 172 -147 -167 -256 -45 -123 -38 269 -54 124 -175 16 -101 177 -117 70 48 55
8001 55 217 -30 28 51 83 13 -48 82 36 91 -125 154 103 59 -15 78 22 -42 177 21 155 55 135 286 157
8026 157 79 -261 76 -132 5 -109 4 -39 -188 124 -187 -45 -124 -154 -187 352 37 -60 -103 83 -14 -145 26
8049 26 62 40 237 -80 161 48 57 -146 44 -69 16 121 121 -54 -252 178 109 107 -104 -164 -122 129 94 -24 79
8074 79 56 192 2 98 78 -133 55 103 218 -151 276 17 85 -116 -137 154 -172 202 69 -3 -195 -88 108
8097 108 -222 -64 -35 192 -394 199 -16 -103 -160 103 203 -132 153 75 15 87 229 28 256 139 12 -24
8119 -24 -156 67 -28 -90 -61 -205 203 12 18 -195 24 84 -25 -83 172 -122 75 524 204 99 -59 150 176
8142 176 45 175 -258 -172 9 29 4 266 336 -21 -59 -54 -36 39 133 111 160 -203 73 289 -68 118 -94 347
8166 347 -17 67 -108 99 156 -19 386 -42 -92 -135 98 -22 56 126 37 275 -78 28 -282 72 -102 -184 21
8189 21 -213 5
8191E
##END NTUPLES=NMR FID
##END=
