##TITLE=1H_TG-2306-2
 CDCl3, 8 sc, 
 27.10.2020
##JCAMPDX= 6.0         $$ Bruker NMR JCAMP-DX V2.0
##DATA TYPE= NMR FID
##DATA CLASS= NTUPLES
##ORIGIN= UXNMR, Bruker Analytische Messtechnik GmbH
##OWNER= root
$$ XWIN-NMR		Version 3.5
$$ Tue Oct 27 11:17:12 2020 Russian Standard Time (UT+4h)  she@DPX200
##.OBSERVE FREQUENCY= 200.1315066352
##.OBSERVE NUCLEUS= ^1H
##.DELAY= (6, 6)
##.ACQUISITION MODE= SIMULTANEOUS
##.ACQUISITION SCHEME= undefined
##.AVERAGES= 8
##.DIGITISER RES= 18
##SPECTROMETER/DATA SYSTEM= spect
##.PULSE SEQUENCE= zg30
##.SOLVENT NAME= D2O
##.SHIFT REFERENCE= (INTERNAL, D2O, 0, 15.7039)
##AUDIT TRAIL= $$ (NUMBER, WHEN, WHO, WHERE, WHAT)
$$ ##TITLE= Audit trail, XWIN-NMR		Version 3.5
$$ ##JCAMPDX= 5.01
$$ ##ORIGIN= Bruker BioSpin GmbH
$$ ##OWNER= she
$$ F:/spectra/data/she/nmr/H-F/1/audita.txt
$$ ##AUDIT TRAIL=  $$ (NUMBER, WHEN, WHO, WHERE, WHAT)
(   1,<2020-10-27 11:16:01.18 +0400>,<she>,<DPX200>,
      <created by zg, POWCHK disabled, PULCHK disabled
       configuration hash MD5:
       00 E9 B6 7A A2 85 ED C7 34 08 36 98 17 FE 4E 26
       data hash MD5: 16K
       FC 3D CE A3 DB 0F DD BB DC 1E BC F1 CB 82 BA 5B>)
$$ ##END=
$$ 
$$ hash MD5
$$ 23 A3 B8 73 A4 2D 16 D6 BE 92 7E 37 AE E2 13 B1
##$RELAX= 
##$RELAX= 
##$RELAX= 
##$RELAX= 
##$RELAX= 
##$RELAX= 
$$ Bruker specific parameters
$$ --------------------------
##$DU= <F:/spectra>
##$EXPNO= 1
##$NAME= <H-F>
##$PROCNO= 1
##$TYPE= <nmr>
##$USER= <she>
##$AMP= (0..31)
100 100 100 100 100 100 100 100 100 100 100 100 100 100 100 100 100 100 
100 100 100 100 100 100 100 100 100 100 100 100 100 100 
##$AQSEQ= 0
##$AQ_mod= 1
##$AUNM= <au_zg>
##$AUTOPOS= <>
##$BF1= 200.13
##$BF2= 200.13
##$BF3= 200.13
##$BF4= 200.13
##$BF5= 200.13
##$BF6= 200.13
##$BF7= 200.13
##$BF8= 200.13
##$BYTORDA= 1
##$CFDGTYP= 0
##$CFRGTYP= 5
##$CHEMSTR= <none>
##$CNST= (0..31)
1 1 145 1 1 1 1 1 1 1 1 1 1 1 1 1 1 1 1 1 1 1 1 1 1 1 1 1 1 1 1 1 
##$CPDPRG= <>
##$CPDPRG1= <>
##$CPDPRG2= <>
##$CPDPRG3= <>
##$CPDPRG4= <mlev>
##$CPDPRG5= <mlev>
##$CPDPRG6= <mlev>
##$CPDPRG7= <mlev>
##$CPDPRG8= <mlev>
##$CPDPRGB= <>
##$CPDPRGT= <>
##$D= (0..31)
0 1.2 0 0 0 0 0 0 0 0.06 0 0.03 0 0 0 0 0.0002 0 0 0 0 0 0 0 0 0 0 0 0 
0 0 0 
##$DATE= 1603782960
##$DBL= (0..7)
120 120 120 120 120 120 120 120 
##$DBP= (0..7)
150 150 150 150 150 150 150 150 
##$DBP07= 0
##$DBPNAM0= <>
##$DBPNAM1= <>
##$DBPNAM2= <>
##$DBPNAM3= <>
##$DBPNAM4= <>
##$DBPNAM5= <>
##$DBPNAM6= <>
##$DBPNAM7= <>
##$DBPOAL= (0..7)
0.5 0.5 0.5 0.5 0.5 0.5 0.5 0.5 
##$DBPOFFS= (0..7)
0 0 0 0 0 0 0 0 
##$DE= 6
##$DECBNUC= <off>
##$DECIM= 32
##$DECNUC= <off>
##$DECSTAT= 4
##$DIGMOD= 1
##$DIGTYP= 9
##$DL= (0..7)
0 120 120 120 120 120 120 120 
##$DP= (0..7)
150 150 150 150 150 150 150 150 
##$DP07= 0
##$DPNAME0= <>
##$DPNAME1= <>
##$DPNAME2= <>
##$DPNAME3= <>
##$DPNAME4= <>
##$DPNAME5= <>
##$DPNAME6= <>
##$DPNAME7= <>
##$DPOAL= (0..7)
0.5 0.5 0.5 0.5 0.5 0.5 0.5 0.5 
##$DPOFFS= (0..7)
0 0 0 0 0 0 0 0 
##$DQDMODE= 0
##$DR= 18
##$DS= 0
##$DSLIST= <SSSSSSSSSSSSSSS>
$$ [...]
##$SUBNAM2= <"">
##$SUBNAM3= <"">
##$SUBNAM4= <"">
##$SUBNAM5= <"">
##$SUBNAM6= <"">
##$SUBNAM7= <"">
##$SUBNAM8= <"">
##$SUBNAM9= <"">
##$SW= 16.880792210976
##$SWIBOX= (0..15)
0 0 2 0 0 0 0 0 0 0 0 0 0 0 0 0 
##$SW_h= 3378.37837837838
##$TD= 16384
##$TD0= 1
##$TE= 0
##$TE2= 300
##$TE3= 300
##$TEG= 300
##$TL= (0..7)
0 120 120 120 120 120 120 120 
##$TP= (0..7)
150 150 150 150 150 150 150 150 
##$TP07= 0
##$TPNAME0= <>
##$TPNAME1= <>
##$TPNAME2= <>
##$TPNAME3= <>
##$TPNAME4= <>
##$TPNAME5= <>
##$TPNAME6= <>
##$TPNAME7= <>
##$TPOAL= (0..7)
0.5 0.5 0.5 0.5 0.5 0.5 0.5 0.5 
##$TPOFFS= (0..7)
0 0 0 0 0 0 0 0 
##$TUNHIN= 0
##$TUNHOUT= 0
##$TUNXOUT= 0
##$USERA1= <user>
##$USERA2= <user>
##$USERA3= <user>
##$USERA4= <user>
##$USERA5= <user>
##$V9= 5
##$VALIST= <valist>
##$VCLIST= <CCCCCCCCCCCCCCC>
##$VD= 0
##$VDLIST= <DDDDDDDDDDDDDDD>
##$VPLIST= <PPPPPPPPPPPPPPP>
##$VTLIST= <TTTTTTTTTTTTTTT>
##$WBST= 1024
##$WBSW= 4
##$XGAIN= (0..3)
0 0 0 0 
##$XL= 0
##$YL= 0
##$YMAX_a= 305321
##$YMIN_a= -390095
##$ZGOPTNS= <>
##$ZL1= 120
##$ZL2= 120
##$ZL3= 120
##$ZL4= 120
##$ABSF1= 10
##$ABSF2= 0
##$ABSG= 5
##$ABSL= 3
##$ALPHA= 0
##$AQORDER= 0
##$ASSFAC= 0
##$ASSFACI= 0
##$ASSFACX= 0
##$ASSWID= 0
##$AUNMP= <proc_1d>
##$AZFE= 0.1
##$AZFW= 0.1
##$BCFW= 1
##$BC_mod= 2
##$BYTORDP= 1
##$COROFFS= 0
##$CY= 11.3945322036743
##$DATMOD= 1
##$DC= 2
##$DFILT= <>
##$DTYPP= 0
##$F1P= 15.9154993809931
##$F2P= -4.1035820241983
##$FCOR= 0.5
##$FTSIZE= 0
##$FT_mod= 4
##$GAMMA= 1
##$GB= 0.15
##$INTBC= 1
##$INTSCL= 1
##$ISEN= 128
##$LB= 0.24
##$LEV0= 0
##$LPBIN= 0
##$MAXI= 10000
##$MC2= 0
##$MEAN= 0
##$ME_mod= 0
##$MI= 1.114404
##$NCOEF= 0
##$NC_proc= 0
##$NLEV= 6
##$NOISF1= 3.799351
##$NOISF2= 2.8
##$NSP= 1
##$NTH_PI= 0
##$NZP= 0
##$OFFSET= 15.70392
##$PC= 1
##$PHC0= -10848.44
##$PHC1= 13.00088
##$PH_mod= 1
##$PKNL= yes
##$PPARMOD= 0
##$PSCAL= 0
##$PSIGN= 0
##$REVERSE= no
##$SF= 200.130013532006
##$SI= 16384
##$SIGF1= 3
##$SIGF2= 2
##$SINO= 400
##$SIOLD= 16384
##$SREGLST= <1H.CDCl3>
##$SSB= 0
##$STSI= 0
##$STSR= 0
##$SW_p= 3612.71676300578
##$SYMM= 0
##$S_DEV= 0
##$TDeff= 0
##$TDoff= 0
##$TI= <>
##$TILT= no
##$TM1= 0
##$TM2= 0
##$TOPLEV= 0
##$USERP1= <user>
##$USERP2= <user>
##$USERP3= <user>
##$USERP4= <user>
##$USERP5= <user>
##$WDW= 1
##$XDIM= 8192
##$YMAX_p= 0
##$YMIN_p= 0
$$ End of Bruker specific parameters
$$ ---------------------------------
##NTUPLES= NMR FID
##VAR_NAME=  TIME,          FID/REAL,        FID/IMAG
##SYMBOL=    X,             R,               I
##VAR_TYPE=  INDEPENDENT,   DEPENDENT,       DEPENDENT
##VAR_FORM=  AFFN,          ASDF,            ASDF
##VAR_DIM=   8192,          8192,            8192
##UNITS=     SECONDS,       ARBITRARY UNITS, ARBITRARY UNITS
##FACTOR=    0.000296,      1,               1
##FIRST=     0,             0,               0
##LAST=      2.424536,      0,               0
##MIN=       0,             -390095,         0
##MAX=       2.424536,      305321,          0
$$ Real data points
##PAGE= N=1
##DATA TABLE= (X++(R..R)), XYDATA
$$ plain form
0 0 0 0 0 0 0 0 0 0 0 0 -8 8 -8 8 -16 16 -24 24 -32 40 -48 56 -71 80 -96 112 -132 152 -176 204 -231 264
32 264 -300 341 -387 435 -490 548 -612 685 -763 849 -943 1045 -1156 1278 -1410 1556 -1714
49 -1714 1889 -2079 2292 -2526 2785 -3074 3402 -3771 4194 -4682 5256 -5937 6767 -7800 9130
64 9130 -10912 13440 -17336 24210 -40061 160394 -18904 -37226 305321 93562 100425 204319
76 204319 46342 4357 246571 120940 -82315 27347 128429 -8016 73113 72452 -90378
87 -90378 -6692 62316 -58532 -60598 -2550 -59487 -21198 33815 -88069 -146252 -43132 13992
99 13992 -97141 -61174 -12319 -101582 -56949 20256 -123278 -133716 40916 -19687 -74506 -13577
111 -13577 -50387 -101013 -3287 25019 -109854 -46305 45363 -38627 -42323 -492 -105004 -50917
$$ packed form
0@%%%%%%%%%%qJ6j6J6k4L2m0M8n6P2q8J04j27J51j76K08k44K84l28L80m35M95
32B64n64O41p28Q22r25J038j160J297j448J612j792J988k201K434k688K966l270
49a714L603l968M371m818N311n859O476p173P965q876R938j1193J2704j4567J6930
64I130k0042K4352l0776M1546o4271K00455j79298j8322L42547k11759O863J03894
76B04319j57977m1985K42214j25631k03255J09662J01082j36445Q1129o61j62830
87i0378Q3686O9008j20848k066N8048n6937L8289N5013j21884n8183J03120N7124
99A3992j11133L5967M8855q9263M4633P7205j43534j0438J74632o0603n4819O0929
111a3577l6810n0626R7726K8306j34873O3549R1668q3990l696M1831j04512N4087
$$ plain form
123 -50917 72736 -38703 -80150 -12860 -7993 -43154 -34542 -52128 -58377 2149 5212 -43303
135 -43303 -70771 -29784 -27204 -30868 -25495 -35631 -21794 -8492 -7904 -41315 -35989 -14239 -14
148 -14 1035 19326 -7584 -44329 44156 27299 -42990 19984 53175 -4436 36467 56146 -36191
161 -36191 695 76826 34095 -16875 47477 43738 -5191 42723 21622 -24629 26000 62687
173 62687 1802 1243 13248 -8092 10501 11473 -4740 -17380 15419 13522 -20426 -20481 -9794 -25595
187 -25595 -6399 24639 -41078 -31032 12563 -20256 -37216 -6430 -15572 -35354 19528 1565
199 1565 -56340 -20338 18480 -39995 -12390 27766 -52190 -10727 38894 -38484 -45902 27149
211 27149 -10331 -26548 31480 -13878 -45495 13707 20819 -47232 -6471 24640 -24218 3226
$$ packed form
123e0917J23653j11439m1447O7290M867l5161Q612j7586o249O0526L063m8515
135d3303k7468M0987K580l664N373j0136J3837J3302N88l3411N326K1750J4225
148a4J049J8291k6910l6745Q8485j6857p0289O2974L3191n7611M0903J9679r2337
161c6191L6886P6131m2731n0970O4352l739m8929M7914k1101m6251N0629L6687
173F2687o0885n59J2005k1340J8593R72j6213j2640L2799j897l3948n5J0687j5801
187b5595J9196L1038o5717J0046M3595l2819j6960L0786r142j9782N4882j7963
199A565n7905L6002L8818n8475K7605M0156p9956M1463M9621p7378p418P3051
211B7149l7480j6217N8028m5358l1617N9202P112o8051M0761L1111m8858K7444
$$ plain form
223 3226 10151 -35671 -14146 26223 -19489 -10741 15436 -12104 -8185 3369 -4503 -20640 11046
236 11046 9713 -15839 6032 16977 -24039 -15587 34908 -5857 -15273 16850 10446 -10656 8378
249 8378 12055 -25459 12031 34256 -10561 -13578 28247 -3517 -7618 25529 -13196 63 29039
262 29039 519 -12200 18192 -928 -7668 25650 -264 -10550 17984 15041 -19656 11225
274 11225 15868 -16891 14969 16644 -12427 2082 20091 -11728 1399 14579 -2200 4051 2083
287 2083 5715 737 3016 -130 2115 2885 6044 4325 -9701 4864 7733 1825 -9805 4943
301 4943 6101 -4815 7307 -5703 -6074 9695 5964 -14844 4339 3751 -6576 8241 -5222
314 -5222 -4551 3003 3101 -7163 -561 51 -2196 2213 -4316 482 -5362 -1336 -3733 15 -3085 -4128
$$ packed form
223C226O925m5822K1525M0369m5712Q748K6177k7540L919J1554p872j6137L1686
236A1046j333k5552K1871J0945m1016Q452N0495m0765r416L2123o404k1102J9034
249H378L677l7514L7490K2225m4817l017M1825l1764m101L3147l8725J3259K8976
262B9039k8520j2719L0392j9120o740L3318k5914j0286K8534k943l4697L0881
274A1225M643l2759L1860J675k9071J4509J8009l1819J3127J3180j6779O251j968
287B083L632m978K279l146K245P70L159j719j4026J4565K869n908j1630J4748
301D943J158j0916J2122j3010l71J5769l731k0808J9183n88j0327J4817j3463
314e222O71P554R8j0264O602O12k247M409o529M798n844M026k397L748l100j043
$$ plain form
330 -4128 4595 -11536 -4134 4764 -8964 -13348 12329 -5287 -12515 11508 -14836 -11387 11242
343 11242 -2774 -16921 10115 2767 -12698 6664 -3666 -11311 6535 14354 -12832 4790 13106
356 13106 -11525 6930 10087 -6127 6609 22033 -3471 6112 12414 -4250 9149 13816 8159
369 8159 4513 15954 6701 4513 8979 3878 5576 11944 16521 2275 7338 3046 4580 7642 2763
384 2763 8299 5272 8813 7125 672 -6900 8255 4877 2047 13042 -3055 1528 6809 -1261
398 -1261 -6020 7739 3772 2833 12549 -4792 -6204 3167 3750 -7224 8954 4790 -8596 10681
412 10681 -2878 -17908 976 6091 -14730 9076 3066 -24584 284 -2172 -21644 -7610 4860
425 4860 -18992 -4935 2670 -28586 -21513 -180 -12721 -20511 4612 -17523 -21486 1216 -20775
$$ packed form
330d128Q723j6131P402Q898j3728m384K5677j7616p228K4023k6344L449K2629
343A1242j4016j4147K7036p348j5465J9362j0330p645J7846P819k7186J7622Q316
356A3106k4631J8455L157j6214J2736J5424k5504R583O302j6664J3399M667n657
369H159l646J1441r253k188M466n101J698O368M577j4246N063m292J534L062m879
384B763N536l027L541j688o453p572J5155l378k830J0995j6097M583N281q070
398a261m759J3759l967r39R716j7341j412R371N83j0974J6178m164j3386J9277
412A0681j3559j5030J8884N115k0821K3806o010k7650K4868k456j9472J4034J2470
425D860k3852J4057P605l1256P073K1333j2541p790K5123k2135l963K2702k1991
$$ plain form
438 -20775 -28186 -2099 -702 -18226 -2714 -9318 -18461 -9715 -5344 -11243 -9893 9961 -5146 -12938
452 -12938 -2068 -4306 -15885 1991 9902 -9548 2377 3693 -9459 -10640 6885 -6617 -9972
465 -9972 19897 512 -18790 2921 795 -22754 9614 6430 -19294 10986 6110 -22389 -8473
478 -8473 9100 -16200 -1445 17905 -9484 -10331 8444 -7151 -15541 16349 -354 -5101 19714
491 19714 2802 -12091 3935 9435 -2202 11591 11541 7556 8109 6612 560 -2033 16768 12517
505 12517 5408 9036 13353 818 -1832 7106 2785 7540 11365 7859 -5910 5715 1043 -13952
519 -13952 7052 9044 -5475 1449 7597 -14355 -5178 347 -11395 2198 8987 -4145 -11061
532 -11061 4242 -7441 -10792 1932 1451 1387 4083 904 -8634 571 -1680 1249 4056 4133 9851
$$ packed form
438b0775p411K6087J397j7524J5512o604r143Q746M371n899J350J9854j5107p792
452a2938J0870k238j1579J7876P911j9450J1925J316j3152j181J7525j3502l355
465i972K9869j9385j9302K1711k126k3549L2368l184k5724L0280m876k8499J3916
478h473J7573k5300J4755J9350k7389q47J8775j5595q390L1890j6703m747K4815
491A9714j6912j4893J6026N500j1637J3793n0l985N53j497o052k593J8801m251
505A2517p109L628M317j2535k650Q938m321M755L825l506j3769J1625m672j4995
519a3952K1004J992j4519O924O148k1952R177N525j1742J3593O789j3132o916
532a1061J5303j1683l351J2724m81o4K696l179r538R205k251K929K807P7N718
$$ plain form
547 9851 1419 -2222 2069 4234 -4588 12763 13784 -2528 7751 6033 -5169 2827 13410 -4854
561 -4854 8703 20469 -4551 -4833 9696 -45 -3902 19248 716 -3546 17929 1002 -13139
574 -13139 8305 9872 -7860 15944 11528 -8983 3512 10580 -6049 -1007 18609 948 2190
587 2190 14409 2000 -11375 9686 13247 -5312 11801 12340 -3064 1379 13258 -5904 -5278
600 -5278 20343 6819 -5004 10383 5442 -15961 11884 9947 -16098 11498 15390 -13142 -2875
613 -2875 12344 -18097 -3713 19453 -8959 -10482 13640 -6636 -21545 13711 -5029 -20788
625 -20788 13733 5563 -21971 -1652 3732 -21772 534 5864 -14358 -5628 8177 -10539 -18061
638 -18061 3846 -5687 -9284 3346 -199 -13292 -1206 279 -14637 -1611 3631 -3554 -6589
$$ packed form
547I851q432l641M291K165q822J7351J021j6312J0279j718j1202P996J0583j8264
561d854J3557J1766k5020k82J4529r741l857K3150j8532m262K1475j6927j4141
574a3139K1444J567j7732K3804m416k0511J2495P068j6629N042J9616j7661J242
587B190J2219j2409j3375K1061L561j8559J7113N39j5404M443J1879j9162O26
600e278K5621j3524j1823J5387m941k1403K7845j937k6045K7596L892k8532J0267
613b875J5219l0441J4384K3166k8412j523K4122k0276j4909L5256j8740j5759
625b0788L4521q170k7534K0319N384k5504K2306N330k0222Q730J3805j8716p522
638a8061K1907r533l597J2630l545j3093J2086J485j4916J3026N242p185l035
$$ plain form
651 -6589 6116 -3627 -13230 4657 891 -8005 5937 7366 -14464 4625 9128 -14471 -844
664 -844 13476 -2336 -5421 13436 -5532 -8041 12503 -1 -8810 11278 8211 -11818 7277
677 7277 4498 -8391 2828 7615 -1319 73 5090 -4520 1857 1981 -1264 -783 3959 4049 -2668 -847
693 -847 -1341 3383 -1584 529 2264 -404 1684 272 -2959 -1855 7317 -4459 -688 8048 -3002
708 -3002 -4859 4321 1545 -5998 7810 -43 -5815 6297 3905 -9230 -1156 10318 -3799 -771
722 -771 2929 -1271 -2088 4430 -73 -6505 5778 3358 -2374 -2586 3291 -2274 -1984 5477 -787 -3002
738 -3002 1387 3810 -6304 2101 1510 -6786 4656 4771 -7653 -4190 7821 -7258 -2947 6964
752 6964 -6480 -5810 7449 -2804 -13458 8469 -1696 -12354 6687 2820 -15543 -640 7808
$$ packed form
651f589J2705r743r603J7887l766q896J3942J429k1830J9089M503k3599J3627
664h44J4320j5812l085J8857j8968k509K0544j2504q809K0088l067k0029J9095
677G277k779j2889J1219M787q934J392N017r610O377J24l245M81M742R0o717J821
693h47m94M724m967K113J735k668K088j412l231J104R172j1776L771Q736j1050
708c002j857R180k776p543J3808p853n772J2112k392j3135Q074J1474j4117L028
722g71L700m200q17O518m503o432J2283k420n732k12N877n565K90P461o264k215
738c002M389K423j0114Q405n91q296J1442J15j2424L463J2011j5079M311R911
752F964j3444O70J3259j0253j0654K1927j0165j0658J9041l867j8363J4903Q448
$$ plain form
765 7808 -13781 -1044 4464 -9714 -3903 7704 -7758 -11777 7936 -1978 -6704 2274 -907 -8483
779 -8483 4227 2275 -10059 2721 3031 -2317 -1135 3361 -4057 -1596 7007 -1145 -2217 3902 3262
794 3262 -5492 5893 3599 -6170 4577 7819 -1958 -2779 8318 -2878 -1098 9720 53 -5326
808 -5326 8103 6075 -8711 6348 3867 -4175 6434 6593 -5659 890 8346 -4495 2985 4968
822 4968 -1420 2411 7232 -2741 -2583 8303 -2299 1742 7260 -672 -2414 6902 505 -4105 6451
837 6451 473 786 3510 2265 -2999 -257 2559 97 2238 -947 2481 -430 -770 -165 -715 -2064
853 -2064 1429 5606 -4232 -864 534 -1470 -915 1740 -828 30 5297 -2738 -703 -1240 144 2833
869 2833 2159 -264 2152 4446 -3604 1885 1337 692 3687 5144 373 254 4846 -2633 2008 3190
$$ packed form
765G808k1589J2737N508j4178N811J1607j5462m019J9713r914m726Q978l181p576
779h483J2710j952j2334J2780L10n348J182M496p418K461Q603q152j072O119o40
794C262q754J1385k294r769J0747L242r777q21J1097j1196J780J0818r667n379
808e326J3429k028j4786J5059k481q042J0609J59j2252O549P456j2841P480J983
822D968o388L831M821r973J58J0886j0602M041N518p932j742R316o397m610J0556
837F451n978L13K724j245n264K742K816k462K141l185L428k911l40O05n50j349
853b064L493M177r838L368J398k004N55K655k568Q58N267q035K035n37J384K689
869B833o74k423K416K294q050N489n48o45K995J457m771j19M592p479M641J182
$$ plain form
885 3190 2202 3664 3555 -1212 1114 3493 -4825 4410 4068 -1223 3181 3064 -6052 -977 6724 -5800
901 -5800 192 5526 -1316 -3259 2396 -4601 -5592 6526 -1779 -3412 1576 -141 -5319 -1197 -3059
916 -3059 -4112 4292 -1876 -3058 -2366 -1964 -4396 -2630 -2280 -2692 1813 -3123 -3841 -5258 -2356 -4084
932 -4084 -4008 -1672 -1743 -1495 -6569 -2874 -6085 -5230 -1463 -2197 -5041 -1648 -944 -10136 -2973 -2742 -5140
949 -5140 -1440 612 -4996 -4067 127 -7242 -2191 -1255 -1530 1285 913 -5445 -2284 2964 -5787 864
965 864 3474 -1258 764 4685 -5055 -3925 7919 -1836 -636 5744 2032 -2513 3218 -872 -3312
980 -3312 7024 1331 -314 3290 2700 -3644 880 1712 -2295 5018 2701 -1033 -527 3061 -3421 -1322
996 -1322 3893 208 1536 1199 1144 -3315 628 1118 -1384 1383 4352 876 -4045 3954 -1852 -2776
$$ packed form
885C190r88J462j09m767K326K379q318R235l42n291M404j17r116N075P701j2524
901e800N992N334o842j943N655o997r91J2118q305j633M988j717n178M122j862
916c059j053Q404o168j182O92M02k432J766L50m12M505m936p18j417K902j728
932d084P6K336p1K48n074L695l211Q55L767p34k844L393P04r192P163K31k398
949e140L700K052n608R29M194p369N051R36k75K815l72o358L161N248q751O651
965H64K610m732K022L921r740J130J1844r755J200O380l712m545N731m090k440
980c312J0336n693j645L604n90o344M524Q32m007P313k317l734N06L588o482K099
996a322N215l685J328l37n5m459L943M90k502K767K969l476m921P999n806r24
$$ plain form
1012 -2776 4388 2909 -2456 2953 4865 -6735 834 4268 -2321 536 7802 -2049 -3264 6842
1026 6842 -3855 -2248 5622 1063 -2030 6337 -111 -5763 5016 -189 -2439 3929 4560 -4188 2067
1041 2067 3534 -6073 881 4124 -253 -753 4998 -2021 -2673 1906 -452 31 -17 3597 -752 -529
1057 -529 -365 -1835 -1440 1389 2407 -2822 1483 -171 -1645 -1868 -216 -1601 273 4435 -4338 -2026
1073 -2026 1540 -1484 -4159 2173 448 -2142 3031 -2867 -2786 43 915 -2953 759 2012 -1422 259
1089 259 -2418 25 -36 720 -1082 1626 1435 -1277 166 -2872 2271 1743 -787 198 3301 -1216 -1324
1106 -1324 3614 -3541 856 5073 -34 -3254 4630 223 -4566 5450 650 -2527 3672 3874 -4798
1121 -4798 1564 2764 -3557 3815 2793 -2660 14 5735 -3685 -2328 4981 -659 -388 2718 303
$$ packed form
1012b776P164j479n365N409J912j1600P569L434o589K857P266r851j215J0106
1026F842j0697J607P870m559l093Q367o448n652J0779n205k250O368O31q748O255
1041B067J467r607O954L243m377n00N751p019o52M579k358M83m8L614m349K23
1057e29J64j470L95K829J018n229M305j654j474k23J652j385J874M162q773K312
1073b026L566l024k675O332j725k590N173n898Q1K829Q72l868L712J253l434J681
1089B59k677K443o1P56j802K708j91k712J443l038N143n28k530R85L103m517j08
1106a324M938p155M397M217n107l220P884m407m789J0016m800l177O199K02q672
1121d798O362J200o321P372j022n453K674N721r420J357P309n640K71L106k415
$$ plain form
1136 303 -3959 3686 334 -4236 1773 3828 -1591 -3943 3587 -1763 -2527 1256 -544 -2638 2510
1151 2510 1007 -7776 1747 2390 -4610 -1976 4175 -3626 -3080 4838 -6394 -3670 5951 -1124 -7221
1166 -7221 5532 701 -8231 4226 1008 -5707 2124 5395 -6317 300 5151 -5749 116 5733
1180 5733 -1922 -2646 7525 -1760 -3603 5532 89 -2193 4080 4296 -4067 3232 3685 -3066 760
1195 760 5591 470 -2385 6028 130 -1771 2579 1917 -1660 2869 4947 -4349 859 4104 -1331
1210 -1331 -2138 4916 -317 -2092 5849 -2408 -3702 3385 2030 -4789 2975 2734 -4922 1808 1270 -3853
1226 -3853 -1179 4277 -3562 -1041 3068 -3820 -1959 1023 -843 -3300 1935 -1245 -2168 -62 -1815
1241 -1815 -2306 -1669 1497 -2251 -1318 -1447 -626 -1591 -2557 306 -2288 -576 246 -1070 -4513 829 197
$$ packed form
1136C03m262P645l352m570O009K055n419k352P530n350p64L783j800k094N148
1151B510j503q783R523O43p000K634O151p801N46P918j1232K724R621p075o097
1166g221J2753m831q932J2457l218o715P831L271j1712O617M851j0900N865N617
1180E733p655p24J0171r285j843R135n443k282O273K16q363P299M53o751L826
1195G60M831n121k855Q413n898j901M350o62l577M529K078r296N208L245n435
1210a331q07P054n233j775P941q257j294P087j355o819P764k41p656O730n38n123
1226c853K674N456p839K521M109o888J861K982j866k457N235l180r23K106j753
1241a815m91O37L166l748R33j29Q21r65r66K863k594J712Q22j316l443N342o32
$$ plain form
1258 197 -3927 1031 -225 -2053 -944 1571 -3827 -983 2152 -2204 -362 1108 -942 -3123 2405
1273 2405 -911 -1993 1587 -144 -845 -278 1073 -2922 116 1534 29 -1164 406 982 -2888 1540
1289 1540 388 -1618 -109 3208 -1137 -2291 2763 -1627 -622 2893 874 -3774 3673 2268 -4512
1304 -4512 2154 1710 -1450 2037 3840 -4048 832 4950 -2729 -353 4115 604 -1466 5062 -1302
1319 -1302 -2170 4519 570 -1364 3025 3206 -3032 2198 2017 -1412 1080 2592 314 -215 3741 -1799
1335 -1799 -917 2343 1760 -609 1312 2465 -1343 1934 755 -845 27 4194 727 -1186 3166 -570
1351 -570 -159 2159 1441 -1957 3507 2822 -2520 1365 965 -669 772 3530 -2322 349 3149 -2454
1367 -2454 -1203 1177 -373 -1380 3015 -1974 -2150 1221 -1842 -2219 164 566 -3019 1101 -1270 -3085
$$ packed form
1258A97m124M958j256j828J109K515n398K844L135m356J842J470k050k181N528
1273B405l316j082L580j731p01N67J351l995L038J418j505j193J570N76l870M428
1289A540j152k006J509L317m345j154N054m390J005L515k019m648P447j405o780
1304d512O666m44l160L487J803p888M880M118p679K376M468l511k070O528o364
1319a302q68O689l949j934M389J81o238N230j81l429K492J512k278n29L956n540
1335a799Q82L260n83k369J921J153l808L277j179j600Q72M167l467j913M352l736
1351e70M11K318p18l398N464o85n342L885m00j634J441K758n852K671K800n603
1367b454J251K380j550j007M395m989j76L371l063l77K383M02l585M120k371j815
$$ plain form
1383 -3085 -480 -1065 -1941 -619 1212 -3056 -634 -788 -1656 -999 -392 -10 -961 1440 -1205 -1093 -858
1400 -858 1081 146 -414 1792 -218 546 46 608 -1284 1895 2213 -540 1282 490 173 -198 1995
1417 1995 -947 1027 2252 -736 207 366 -349 -929 2357 -910 -58 1548 -1303 -973 148 35 -1944
1434 -1944 1717 -210 -885 -66 -1187 -750 -662 605 -1167 754 -961 -248 -328 -1931 27 241 -175
1451 -175 -890 1293 -2256 -771 1133 -1743 -606 855 222 -2071 1370 -1474 -1762 902 -423 -928
1467 -928 256 388 -2850 746 -707 -1771 529 490 -803 -771 843 -2521 -69 565 -287 -687 974
1484 974 746 -2157 751 8 -360 -49 2359 -181 -1154 2189 -230 -484 1036 2128 -1257 2076 2473
1501 2473 -2143 915 2014 70 -97 3346 -660 369 2431 -973 -278 2116 1040 -1217 3143
$$ packed form
1383c085K605n85q76J322J831m268K422j54q68O57O07L82r51K401k645J12K35
1400h58J939r35n60K206k010P64n00N62j892L179L18k753J822p92l17l71K193
1417A995k942J974J225k988R43J59p15n80L286l267Q52J606k851L30J121j13j979
1434a944L661j927o75Q19j121M37Q8J267j772J921j715P13q0j603J958K14m16
1451a75p15K183l549J485J904k876J137J461o33k293L441k844k88K664j325n05
1467i28J184J32l238L596j453j064K300l9j293L2J614l364K452O34q52m00J661
1484I74k28k903K908p43l68L11K408k540r73L343k419k54J520J092l385L333L97
1501B473m616L058J099j944j67L443m006J029K062l404O95K394j076k257M360
$$ plain form
1516 3143 -217 -1410 1784 47 -1182 1380 1845 -2687 1434 889 -2106 -576 1419 -480 -1291 1691
1532 1691 -1986 -1110 151 -640 -1896 19 894 -2024 -547 -999 -909 -1589 197 -845 -1018 567 -1604
1549 -1604 -778 -631 -369 -1702 937 -21 -1665 674 -559 -1100 -211 1581 -2021 685 1945 -1931
1565 -1931 -468 1343 -21 -1328 2651 -374 -722 1550 -207 -882 744 1492 -1567 1524 671 -777
1581 -777 178 139 -599 442 1261 -1771 970 273 -1109 -622 379 -239 -709 1383 -1351 -542 53 -128
1599 -128 -1380 318 962 -1408 300 -407 -230 -1361 478 175 -699 417 -274 -330 -992 1069 -1090
1616 -1090 -75 1000 43 -334 -458 532 -1017 863 -188 77 397 -29 -217 -429 759 -868 1035
1633 1035 100 148 78 -116 -103 -446 1240 -299 711 282 788 -191 -344 1005 101 843 230 1491 -483
$$ packed form
1516C143l360j193L194j737j229K562M65m532M121n45k995J530J995j899q11K982
1532A691l677Q76J261p91j256J915Q75k918J477m52R0o80J786j042j73J585k171
1549a604Q26J47K62j333K639r58j644K339j233n41Q89J792l602K706J260l876
1565a931J463J811j364j307L979l025l48K272j757o75J626P48l059L091q53j448
1581g77R55l9p38J041Q19l032K741o97j382M87J001o18m70K092k734Q09N95j81
1599a28j252J698O44k370J708p07J77j131J839l03q74J116o91n6o62K061k159
1616a090J015J075r57l77j24R90j549J880j051K65L20m26j88k12J188j627J903
1633A035r35M8p0j94J3l43J686j539J010m29N06r79j53J349r04P42o13J261j974
$$ plain form
1652 -483 637 1163 -450 565 1668 1042 -871 2303 57 -521 1410 1301 -244 668 2502 -1369
1668 -1369 647 1311 -338 -85 1946 208 -1006 1795 -752 -349 554 636 -874 756 1124 -1756 466
1685 466 74 -730 -532 1787 -1156 -971 1675 -1205 -1198 498 1000 -2109 1137 1411 -2211 -77 1175
1702 1175 -984 -1174 2862 -1483 -1062 2029 -593 -1836 1113 1281 -2320 1796 586 -1864 425 1383
1718 1383 -1965 -473 2953 -2012 -218 1381 -1035 -1280 1597 -106 -1773 2253 -480 -1549 465
1733 465 1079 -2093 325 1895 -1717 221 726 -765 -1316 2019 -455 -1343 1752 127 -1248 -333
1749 -333 1559 -1824 489 1270 -1267 -299 705 -311 -1552 1708 -833 -761 975 -342 -1446 -63
1765 -63 833 -1890 746 -147 -1153 19 582 -1523 -1160 1591 -1148 -129 211 -113 -1070 406 136
$$ packed form
1652d83J120N26j613J015J103o26j913L174k246n78J931j09j545R12J834l871
1668a369K016O64j649K53K031j738j214K801k547M03R03Q2j510J630L68k880K222
1685D66l92q04J98K319k943J85K646k880PJ696N02l109L246K74l622K134J252
1702A175k159j90M036m345M21L091k622j243K949J68l601M116j210k450K289R58
1718A383l348J492L426m965J794J599k416k45K877j703j667M026k733j069K014
1733D65O14l172K418J570l612J938N05j491n51L335k474q88L095j625j375R15
1749c33J892l383K313P81k537R68J004j016j241L260k541P2J736j317j104J383
1765f3Q96k723K636q93j006J172N63k105L63K751k739J019L40l24r57J476k70
$$ plain form
1782 136 -1299 1255 -29 -75 -468 896 -439 -333 717 -65 669 -243 900 -640 453 172 -253
1799 -253 422 361 631 -1147 590 -370 -121 -62 2 -228 -413 826 -1358 34 -131 -195 -474 316 -100 -1100
1819 -1100 639 -665 -126 -236 761 -254 108 800 -885 529 622 799 -368 1532 587 -30 1047
1836 1047 657 634 350 2218 -359 874 1724 43 350 1544 1113 -408 2315 311 -89 1156 873
1853 873 -513 789 1892 -1308 924 826 -586 -192 1410 -333 -654 2062 -976 -592 475 324 -1176
1870 -1176 858 705 -1450 840 -39 -857 -678 1302 -1170 -478 1063 -1211 -760 -15 -4 -1851 853
1887 853 -87 -1740 100 -257 -1520 -1263 920 -2068 -654 292 -1573 -1454 -220 -749 -2430 850 -1007
1904 -1007 -1669 -394 -465 -1867 -666 517 -2283 205 94 -1137 -987 617 -852 -1120 1452 -989
$$ packed form
1782A36j435K554j284m6l93J364j335J06J050p82P34r12J143j540J093k81m25
1799b53O75o1K70j778J737r60K49N9O4k30j85J239k184J392j65o4k79P90m16j000
1819a100J739j304N39j10R97j015L62O92j685J414R3J77j167J900r45o17J077
1836A047l90k3k84J868k577J233Q50j681L07J194m31j521K723k004m00J245k83
1853H73j386J302J103l200K232r8j412L94J602j743l21K716l038L84J067j51j500
1870a176K034j53k155K290q79q18J79J980k472O92J541k274M51P45J1j847K704
1887H53r40j653J840l57j263K57K183k988J414R46j865J19J234n29j681L280j857
1904a007o62J275p1j402J201J183k800K488j11j231J50J604j469k68K572k441
$$ plain form
1920 -989 -239 568 288 -1292 624 695 -961 1014 370 -71 -229 1220 -635 4 1320 -114 176 166
1938 166 786 -746 1101 194 -401 855 385 138 -485 1253 -488 419 487 74 136 565 589 -837 1242
1957 1242 13 372 343 373 -167 60 827 -755 603 96 258 -250 246 -174 -544 575 -684 180 -473
1976 -473 93 -754 -540 -42 -536 -86 -891 337 -994 -208 -451 -489 -319 8 235 -1147 663 -405 -30
1995 -30 -15 246 47 333 940 -746 944 367 611 150 986 597 266 1351 -181 713 606 1115 59
2014 59 1024 973 -171 1038 188 353 -86 1231 -145 -169 681 -271 -150 -170 840 -949 638 142 -873
2033 -873 -14 334 -281 -936 1066 -794 -261 269 -425 -799 399 445 -1476 1026 -106 -773 -197 316
2051 316 -908 -126 1039 -1498 187 300 -544 -1087 556 -328 -1104 871 -801 -743 -337 296 -1502 -23
$$ packed form
1920i89P50Q07k80j580J916P1j656J975o44m41j58J449j855O39J316j434K90j0
1938A66O20j532J847r07n95J256m70k47o23J738j741R07O8m13O2M29K4j426K079
1957A242j229L59k9L0n40K27P67j582J358n07J62n08M96m20l70J119j259Q64o53
1976d73N66q47K14M98m94M50q05J228j331P86k43l8J70L27K27j382J810j068L75
1995c0J5K61j99K86O07j686J690n77K44m61Q36l89l31J085j532Q94j07N09j056
2014E9R65n1j144J209q50J65m39J317j376k4Q50r52J21k0J010j789J587m96j015
2033h73Q59L48o15o55K002j860N33N30o94l74J198M6j921K502j132o67N76N13
2051C16j224P82J165k537J685J13q44n43J643q84p76J975j672N8M06O33j798J479
$$ plain form
2069 -23 361 -1347 -51 -292 -439 -1097 747 -711 -579 540 -372 -693 -320 705 -1194 616 407 -448
2087 -448 158 450 -180 -632 1484 -662 157 821 223 -338 570 749 -1110 1236 257 -303 300 732 -592
2106 -592 -63 1001 -952 423 177 -16 -557 437 -125 -736 552 -483 -39 -492 183 -976 -31 109
2124 109 -693 272 -341 208 -819 323 -291 -150 197 -45 15 -503 918 -605 142 237 146 -20 267 337
2144 337 -749 885 -119 100 105 870 -179 -150 727 -681 509 274 172 -118 814 72 -341 642 -183
2163 -183 623 -86 682 -118 508 344 -176 520 156 930 -192 848 89 318 370 330 425 -303 1104 -277
2183 -277 138 83 338 -312 278 481 -986 670 -194 -527 -450 500 -732 -526 537 -1132 -146 -267 -415
2202 -415 -1146 292 -413 -1231 208 -856 -486 -569 76 -1229 173 168 -996 -67 -314 54 -778 597 -421
$$ packed form
2069b3L84j708J296k41j47o58J844j458J32J119r12l21L73J025j899J810k09q55
2087d48O06K92o30m52K116k146Q19O64n98n61R08J79j859K346r79n60O03M32j324
2106e92N29J064j953J375k46j93n41R94n62o11J288j035M44m53O75j159R45J40
2124A09q02R65o13N49j027J142o14J41L47k42O0n18J421j523P47R5r1j66K87P0
2144C37j086J634j004K19NP65j049K9Q77j408J190k35j02k90R32p42m13R83q25
2163a83Q06p09P68q00O26j64n20O96l64P74j122J040p59K29N2m0R5p28J407j381
2183b77M15n5K55o50N90K03j467J656q64l33P7R50j232K06J063j669R86j21j48
2202d15p31J438p05q18J439j064L70q3O45j305J402nj164R29k47L68q32J375j018
$$ plain form
2221 -421 -218 404 -80 -277 -172 993 -698 435 490 38 -122 484 491 -677 1380 207 -49 423 870
2240 870 -428 621 1308 -821 1023 681 -74 90 1342 -218 -33 1513 -297 347 785 661 -655
2257 -655 1273 532 -603 1210 206 81 170 959 -752 459 767 -403 100 -10 384 -683 502
2274 502 -282 -333 38 -95 -336 -816 482 -833 -304 -277 -119 -688 -233 13 -1170 359 -371 -463 -313 311
2294 311 -755 -286 585 -846 364 207 -43 -234 845 -238 -242 1046 -173 429 270 610 -124 863
2312 863 294 -2 868 192 811 132 589 9 723 141 114 790 -272 669 -8 182 -330 589 -136 -46
2332 -46 628 -611 273 -136 -22 -410 445 -286 -373 481 -566 -117 -212 91 -762 376 -278 -711 357 -571
2352 -571 -121 -538 67 -720 23 -452 -658 -244 -615 67 -831 -157 -475 -272 -605 -489 -139 -845 137 -560
$$ packed form
2221d21K03O22m84j97J05J165j691J133N5m52j60O06Pj168K057j173k56M72M47
2240H70j298J049O87k129J844l42p55J64J252j560J85J546j810O44M38j24j316
2257f55J928p41j135J813j004j25Q9P89j711J211L08j170N03j10L94j067J185
2274E02p84n1L71j33k41m80J298j315N29K7J58n69M55K46j183J529p30r2J50O24
2294C11j066M69Q71j431J210j57k50j91J079j083mJ288j219O02j59L40p34R87
2312H63n69k96Q70o76O19o79M57n80P14n82k7O76j062R41o77J90n12R19p25R0
2332d6O74j239Q84m09J14l88Q55p31q7Q54j047M49r5L03q53J138o54m33J068r28
2352e71M50m17O05p87P43m75k06M14l71O82q98O74l18K03l33J16L50p06R82o97
$$ plain form
2372 -560 -411 -452 92 -725 -311 444 -843 274 -245 -158 -416 550 -456 -177 901 -536 289 402 204
2391 204 -406 932 -9 -398 935 -78 -53 233 516 -611 537 192 -419 414 27 8 -368 496 -435
2410 -435 43 37 -205 11 -171 187 -473 273 -257 121 -169 -53 166 -416 603 -203 169 70 383 -354 240
2431 240 576 -517 656 254 167 -124 993 -365 -41 1100 -367 229 470 144 -588 945 -109 -496
2449 -496 905 -74 -160 112 405 -823 573 84 -625 538 -3 -178 -96 673 -739 331 342 -216 234
2468 234 46 198 -282 552 -333 246 136 118 239 -160 421 -141 417 -118 366 -148 30 458 -430 213
2488 213 -51 150 -453 424 -463 -494 462 -609 -208 -260 -4 -861 289 -566 -768 149 -540 -356 -346 28
2508 28 -1066 161 -361 -762 100 -327 -278 -349 287 -834 140 -25 -460 156 -162 65 -180 441 -515 370
$$ packed form
2372e60J49m1N44q17M14P55j287J117n19Q7k58R66j006K79J078j437Q25J13j98
2391B04o10J338r41l89J333j013K5K86K83j127J148l45o11Q33l87j9l76Q64r31
2410d35M78ok42K16j82L58o60P46n30L78k90J16K19n82J019q06L72r9L13p37N94
2431B40L36j093J173m02q7k91J117j358L24J141j467N96K41l26p32J533j054l87
2449d96J401r79q6K72K93j228J396m89p09J163n41j75Q2P69j412J070J1n58M50
2468B34j88J52m80Q34q85N79j10j8J21l99N81n62N58n35M84n14J78M28q88O43
2488B13k64K01o03Q77q87l1R56j071M01n2K56q57J150q55k02R17o89J84J0L74
2508B8j094J227n22m01Q62m27M9p1O36j121R74j65m35O16l18K27k45O21r56Q85
$$ plain form
2528 370 80 -145 354 -171 54 -9 441 -370 517 145 -194 542 -86 115 90 548 -353 456 158 -176 387
2549 387 23 81 -15 677 -478 452 129 -382 301 59 239 -195 462 -459 351 -14 -249 208 -173 191
2569 191 -238 298 -503 248 -228 -147 241 -317 -99 -217 164 -827 385 -281 -471 432 -367 -346 -170 161
2589 161 -839 440 -75 -633 502 -131 -343 -23 474 -813 475 339 -501 315 275 -204 -273 775 -549
2608 -549 273 511 -287 111 224 -19 -381 802 -364 138 269 -41 55 174 319 -282 505 -106 275 -58
2628 -58 52 335 -192 238 47 407 -301 452 -154 -174 572 -61 -62 37 463 -744 420 -25 -537 481 -48
2649 -48 -367 -135 511 -1100 235 194 -559 -103 94 -417 -578 613 -917 -138 191 -376 -292 -7 -16 -705
2669 -705 389 -531 -40 5 34 -2 -104 174 -228 523 -291 466 144 -113 319 172 34 190 634 -440
$$ packed form
2528C70k90k25M99n25K25o3M50q11Q87l72l39P36o28K01k5M58r01Q09k98l34N63
2549C87l64N8r6O92j155R30l23n11O83k42J80m34O57r21Q10l65k35M57l81L64
2569A91m29N36q01P51m76Q1L88n58K18j18L81r91J212o66j90R03p99K1J76L31
2589A61j000J279n15n58J135o33k12L20M97j287J288j36q40Q16m0m79o9J048j324
2608e49Q22K38p98L98J13k43l62J183j166N02J31l10R6J19J45o01P87o11L81l33
2628e8J10K83n27M30j91L60p08P53o06k0P46o33jR9M26j207J164m45n12J018n29
2649d8l19K32O46j611J335m1p53M56J97n11j61J191j530P79L29n67Q4K85ro89
2669g05J094r20M91M5K9l6j02K78m02P51q14P57l22k57M32j47j38J56M44j074
$$ plain form
2689 -440 621 129 -368 313 249 -22 -5 717 -619 432 284 -463 136 323 -114 -250 770 -681 27
2708 27 324 -205 -98 245 191 -477 617 -360 -41 155 47 78 -29 251 -85 541 -215 514 204 7 556
2729 556 201 167 140 693 -527 701 238 -323 373 321 -165 -198 809 -692 374 515 -342 -80 418 -26
2749 -26 -439 951 -545 6 467 -181 -258 381 369 -693 620 -26 29 221 273 -205 48 676 -333 494
2769 494 30 367 -65 202 385 -38 145 -72 380 -442 526 -152 -346 275 -54 -238 -288 416 -828 65
2789 65 -94 -764 -181 5 -665 -657 627 -1065 -363 253 -725 -650 205 -352 -980 576 -529 -456 107 -4
2809 -4 -674 67 285 -712 484 -226 -135 81 236 -123 101 392 -316 530 -143 291 30 11 130 124 341 -184
2831 -184 580 -401 335 46 -206 155 261 65 -304 814 -550 257 353 -81 -4 466 -16 -427 942 -271
$$ packed form
2689d40J061m92m97O81o4k71J7P22j336J051j48p47N99J87m37j36J020j451P08
2708B7K97n29J07L43n4o68J094r77L19J96j08L1j07K80l36O26p56P29l10j97N49
2729E56l55l4k7N53j220J228m63n61O96n2m86l3J007j501J066J41q57K62M98m44
2749b6m13J390j496N51M61o48p7O39j2j062J313o46N5J92N2m78K53O28j009Q27
2769D94m64L37m32K67J83m23J83k17M52q22R68o78j94O21l29j84n0P04j244Q93
2789F5j59o70N83J86o70QJ284j692P02O16r78P5Q55n57o28J556j105P3N63j11
2809do70P41K18r97J196p10R1K16J55l59K24K91p08Q46o73M34k61j9J19oK17n25
2831a84P64r81P36k89k52L61J06j96l69J118j364Q07R6m34P7M70m82m11J369j213
$$ plain form
2851 -271 -4 310 253 -154 309 422 -487 737 -49 14 159 183 -9 82 50 -386 454 -420 35 -35 -171 -228
2873 -228 -178 -276 -550 271 -769 -221 -152 -585 -391 31 -401 -836 541 -820 -417 284 -319 -587 327 -31
2893 -31 -837 544 -360 -279 109 172 -440 193 688 -541 420 119 161 57 528 159 184 648 -146 555 53
2914 53 540 148 268 441 157 192 151 689 -402 588 343 -82 67 447 -29 -359 979 -580 38 502
2934 502 -166 -421 394 18 -905 868 -340 -516 222 229 -687 -31 386 -1004 295 -31 -411 -352 357 -631
2954 -631 -339 336 -616 -15 -207 -62 -352 93 -93 -257 106 -171 119 -477 297 -72 -56 179 180 32 -300
2975 -300 707 -406 188 333 64 -90 433 248 -432 796 -234 74 389 382 -200 299 477 -488 521
2994 521 129 60 63 410 -105 95 398 -380 355 -131 128 -149 245 -103 -94 216 -243 406 -212 85 -4 90
$$ packed form
2851b71K67L14n7m07M63J13r09J224p86O3J45K4j92R1l2m36Q40q74M55p0j36n7
2873b28N0r8k74Q21j040N48O9m33J94M22m32m35J377j361M03P01o03k68R14l58
2893c1q06J381r04Q1L88O3o12O33M95j229R61l01M2j04M71l69K5M64p94P01n02
2914E3M87l92J20J73k84L5m1N38j091R90k45m25J49L80m76l30J338j559O18M64
2934E02o68k55Q15l76r23J773j208j76P38Pr16O56M17j390J299l26l80N9P09r88
2954f31K92O75r52O01j92J45k90M45j86j64L63k77K90n96P74l69J6K35Jj48l32
2975c00J007j113N94J45k69j54N23j85o80J228j030L08L15pn82M99J78r65J009
2994E21l92o9LL47n15K00L03p78P35m86K59k77L94l48RL10m59O49o18K97q9R4
$$ plain form
3016 90 -222 152 183 -523 439 -109 -208 -101 213 -514 73 455 -681 175 -73 -277 -376 195 -404 -324 334
3037 334 -494 9 -225 -125 -423 120 -135 -354 166 -504 137 -351 58 -208 93 -83 62 257 -240 479
3057 479 -310 132 256 286 -174 343 324 -423 774 66 -61 203 779 -309 195 756 -598 487 404 -117
3077 -117 -79 711 -256 -198 633 -615 23 80 -126 -543 266 -418 -412 293 -564 -110 -334 -97 -624 22 -369
3098 -369 -280 93 -591 55 -475 -204 -314 -114 -462 -32 180 -635 224 -124 -260 -284 362 -591 -165 451 -601
3119 -601 123 -86 -232 -498 343 -432 -384 309 -492 -42 -105 59 -322 315 -182 -255 218 -302 344 -53 219
3140 219 -110 493 -127 102 415 -153 594 137 278 180 598 -108 425 623 -305 745 541 126 39 887
3160 887 -281 22 877 -262 228 315 105 -439 603 -196 -333 489 -266 -120 -149 19 -578 116 -217 -385
$$ packed form
3016I0l12L74L1p06R62n48r9J07L14p27N87L82j136Q56k48k04r9N71n99Q0O58
3037C34q28N03k34J00k98N43k55k19N20o70O41m88M09k66L01j76J45J95m97P19
3057D79p89M42J24L0m60N17j9p47J197p08j27K64N76j088N04N61j354J085q3n21
3077a17L8P90r67N8Q31j248O38N7k06m17Q09o84OP05q57M54k24K37n27O46l91
3098c69Q9L73o84O46n30K71j10K00l48M30K12q15Q59l48j36k4O46r53M26O16j052
3119f01P24k09j46k66Q41p75M8O93q01M50o3J64l81O37m97p3M73n20O46l97K72
3140B19l29O03o20K29L13n68P47m57J41r8M18p06N33J98r28J050k04m15q7Q48
3160H87j168L03Q55j139M90Q7k10n44J042p99j37Q22p55J46k9J68n97O94l33j68
$$ plain form
3180 -385 55 -302 -43 -469 74 -429 137 -316 -194 112 -465 258 -288 -181 3 258 -411 184 430 -595
3200 -595 512 180 -145 -1 787 -269 64 762 -480 303 443 151 -276 883 -188 -321 772 -166
3218 -166 -44 142 301 -357 458 45 -236 378 -29 -67 -216 444 -395 186 -3 -130 247 -160 230 -142
3238 -142 199 -164 273 -261 134 206 -450 337 -2 -146 -232 500 -315 -126 537 -552 -147 310 -48 -751
3258 -751 479 -170 -448 356 -204 -306 -11 178 -673 188 -37 -318 72 9 -63 -469 380 -396 -78 -63 27
3279 27 92 -273 274 -177 76 -39 413 -365 89 598 -406 268 232 -43 -170 855 -328 -75 761 -273
3299 -273 -118 474 290 -676 812 144 -490 685 29 -444 223 528 -863 322 277 -454 -25 74 -69
3318 -69 -463 402 -494 -179 -63 -157 -345 -221 134 -536 8 -226 65 -457 24 111 -641 256 -69 -295 -158
$$ packed form
3180c85M40l57K59m26N43n03N66m53J22L06n77P23n46J07J84K55o69N95K46j025
3200e95J107l32l25J44P88j056L33O98j242P83J40k92m27J159j071j33J093r38
3218a66J22J86J59o58Q15m13k81O14m07l8j49O60q39N81j89j27L77m07L90l72
3238a42L41l63M37n34L95P2o56P87l39j44q6P32q15J89O63j089M05M57l58p03
3258g51J230o49k78Q04n60j02K95J89q51Q61k25k81L90o3p2m06Q49p76L18J5R0
3279B7O5l65N47m51K53j15M52p78M54N09j004O74l6k75j27J025j183K53Q36j034
3299b73J55N92j84r66J488o68o34J175o56m73O67L05j391J185m5p31M29R9j43
3318f9l94Q65q96L15J16r4j88J24L55o70N44k34K91n22M81Q7p52Q97l25k26J37
$$ plain form
3339 -158 376 -541 -155 611 -535 -62 309 55 -580 663 -26 -449 782 29 -312 487 486 -666 697
3358 697 364 -292 338 421 -32 -68 750 -290 289 260 -53 96 170 194 -171 512 -111 263 75 133 279 -220
3380 -220 169 -12 61 -227 356 -233 -19 331 -314 -143 88 153 -575 599 -248 -484 325 -96 -377 -6
3400 -6 237 -805 78 -3 -458 -55 12 -149 -436 294 -527 -226 -187 -202 -197 -232 59 -253 -24 -396 235 -418 -193
3423 -193 218 -275 -10 38 49 -439 495 -135 -217 506 -82 -177 274 395 -571 624 320 -424 616 366 -423
3444 -423 48 830 -578 357 645 -217 177 601 59 -302 739 -139 -67 413 246 -282 118 290 -362 246
3464 246 -27 180 -313 7 120 -370 114 31 -145 -456 454 -387 -345 349 -211 -225 203 106 -799 415 -93
3485 -93 -728 381 147 -522 83 485 -861 319 411 -646 -12 344 -189 -406 689 -413 -241 268 -80
$$ packed form
3339a58N34r17L86P66j146M73L71k54o35J243o89m23J231p53l41P99jj152J363
3358F97l33o56O30Q3m53l6Q18j040N79k9l13J49P4K4l65O83o23L74j88N8J46m99
3380b20L89j81P3k88N83n89K14L50o45J71K31O5p28J174q47k36Q09m21k81L71
3400fK43j042Q83q1m55M03O7j61k87P30q21L01L9j5Nl5K91l12K29l72O31o53K25
3423a93M11m93K65M8J1m88R34o30q2P23n88r5M51J21r66J195l04p44J040k50p89
3444d23M71P82j408R35K88q62L94M24n42l61J041q78P2M80j67n28M00J72o52O08
3464B46k73K07m93L20J13m90M84q3j76l11R10q41M2O94n60j4M28r7r05J214n08
3485i3o35J109k34o69O05M02j346J180R2j057O34L56n33k17J095j102J72N09l48
$$ plain form
3504 -80 -85 117 142 -513 314 -134 153 -81 12 182 -86 87 -146 169 -207 406 88 -98 307 -61 113 121
3526 121 363 -280 453 216 -278 351 175 -204 3 581 -611 308 330 -310 -72 282 -93 -404 469 -364
3546 -364 -146 -68 -62 -330 -67 57 -294 130 -451 31 -322 -280 66 -279 -219 -50 173 -578 327 -206 -427 106
3568 106 6 -275 -195 207 -615 236 189 -389 88 375 -189 -261 598 -426 -77 564 -138 -72 412 154 -475
3589 -475 532 -14 -48 214 361 -300 59 361 -251 19 -9 235 -189 96 142 -201 -121 -49 222 -405 406
3610 406 -104 -295 219 24 -154 -147 451 -490 263 175 -370 -46 249 -298 -283 626 -534 80 457 -300 -392
3631 -392 297 -32 -541 586 -184 -241 139 98 -307 -50 257 -336 242 -192 66 -163 48 86 -70 50 -195
3652 -195 341 -418 170 231 -145 165 388 -34 -68 581 -304 199 325 31 32 483 150 -306 767 -308 12
$$ packed form
3504h0nK02K5o55Q27m48K87k34R3J70k68J73k33L15l76O13l18j86M05l68J74Q
3526A21K42o43P33k37m94O29j76l79K07N78j192R19K2o40K38L54l75l11Q73q33
3546c64K18P8Ok68K63J24l51M24n81M82l53M2L46l45O0J69K23p51R05n33k21N33
3568A06j00k81Q0M02q22Q51m7n78M77K87n64p2Q59j024L49O41p02O6M84k58o29
3589d75J007n46l4K62J47o61L59L02o12K70k8K44m24K85M6l43Q0P2K71o27Q11
3610D06n10j91N14j95j78PN98r41P53q8n45L24K95n47J5R09j160O14L77p57r2
3631c92O89l29n09J127p70n7L80m1m05K57L07n93N78m34K58k29K11L8j56J20k45
3652a95N36p59N88O1l76L10K23m22l4O49q85N03J26k94JM51l33m56J073j075L20
$$ plain form
3673 12 417 -18 -258 400 170 -410 558 -58 13 154 306 -183 71 179 -326 285 -222 131 -124 -61 13
3694 13 -34 -222 -156 307 -622 106 111 -356 -149 90 -436 -442 439 -643 -159 163 -368 -480 265 -243 -601 580
3716 580 -527 -281 303 -35 -545 305 190 -685 413 -68 -292 121 292 -184 73 332 -159 242 44
3735 44 270 7 241 249 156 243 134 309 -218 466 99 50 263 271 -136 -16 637 -451 296 358 -135 -130 442
3758 442 -114 -305 700 -335 -85 210 -71 -431 314 100 -640 480 -134 -260 -24 79 -473 -71 49
3777 49 -451 68 -276 -86 -198 51 -221 -147 -117 -305 -62 -468 100 -99 -227 -174 -3 -143 -292 293 -378
3798 -378 73 109 -256 -166 278 -30 -404 480 -125 -80 183 298 -166 303 280 -390 352 75 -44 97 509
3819 509 -36 182 439 -121 271 55 323 75 275 216 219 118 18 291 -210 347 70 6 114 206 -198 -183
$$ packed form
3673A2M05m35k40O58k30n80R68o16P1J41J52m89K54J08n05O11n07L53k55O3P4
3694A3m7j88O6M63r29P28Nm67K07K39n26oQ81j082M84L22n31j12P45n08l58J181
3716E80j107K46N84l38n10Q50j15q75J098m81k24M13J71m76K57K59m91M01j98
3735D4K26k63K34Qr3Q7j09J75n27O84l67m9K13Qm07J20O53j088P47O2m93NN72
3758D42n56j91J005j035K50K95k81l60P45k14p40J120o14j26K36J03n52M02J20
3777D9n00N19l44J90j12K49k72P4L0j88K43m06N68j99j28N3J71j40j49N85o71
3798c78M51L6l65R0M44l08l74Q84o05M5K63J15m64M69k3o70P42k77j19J41M12
3819E09n45K18K57n60L92k16K68k48K00n9Lj01j00K73n01N57k77o4J08R2m04J5
$$ plain form
3841 -183 525 -492 -83 270 -122 -382 438 -177 -617 489 -252 -437 35 181 -708 22 313 -610 202
3860 202 174 -334 -203 439 -361 -251 426 -379 -127 64 80 -254 188 -13 -284 187 150 -58 -261 395 -209
3881 -209 -27 117 218 -120 -157 460 -404 167 288 -132 -139 558 17 -256 707 -58 -129 363 326 -412 422 412
3903 412 -545 333 281 -196 52 645 -295 108 470 -327 103 216 55 -214 379 29 -156 98 -157 59
3923 59 -96 74 -301 -53 -43 -207 -96 -321 151 -244 -82 -53 -103 -437 189 -64 -479 470 -146 -360 -15
3944 -15 257 -442 13 348 -452 172 282 -114 -234 448 -86 -96 473 -83 1 137 302 -264 212 0 172
3965 172 23 1 268 -192 181 98 146 83 361 38 -206 362 -201 -78 297 157 -351 327 153 -544 375
3986 375 87 -328 79 399 -606 -14 382 -605 -91 272 -218 -441 423 -338 -420 299 -293 -280 -99 78
$$ packed form
3841a83P08j017M09L53l92k60Q20o15m40J106p41j85M72J46q89P30K91r23Q12
3860B02k8n08J31O42q00J10O77q05K52J91J6l34M42k01k71M71l7k08k03O56o04
3881b09J82J44J01l38l7O17q64N71J21m20pO97n41k73R63p65p1M92l7p38Q34j0
3903D12r57Q78n2m77K48N93r40M03L62p97M30J13j61k69N93l50j85K54k55K16
3923E9j55J70l75K48J0j64J11k25M72l95J62K9n0l34O26k53m15R49o16k14L45
3944a5K72o99M55L35q00O24J10l96j20O82n34j0N69n56Q4J36J65n66M76k12J72
3965A72j49k2K67m60L73q3M8o3K78l23k44N68n63J23L75j40n08O78j74o97R19
3986C75k88m15M07L20j005N92L96r87N14L63m90k23Q64p61q2P19n92J3J81J77
$$ plain form
4006 78 -487 162 -55 -365 27 26 -127 -412 171 -442 -127 -65 -35 -277 -126 247 -427 -60 55 2 -390 262
4028 262 28 -443 386 -92 -210 177 371 -374 194 419 -420 175 245 -135 -116 619 -158 0 568 -160 -29
4049 -29 181 188 -239 460 96 -141 310 131 -75 21 376 -183 140 -10 32 103 -184 171 -98 50 -67 161
4071 161 -290 21 -63 -340 305 -101 -79 -143 265 -376 -121 248 -399 130 59 -43 -379 328 -299 -198 284
4092 284 -217 13 96 73 -385 249 -81 56 127 49 98 -87 206 -108 210 -154 111 -6 -120 356 -89 -33
4114 -33 25 254 -237 299 292 -285 251 257 -55 -37 580 -274 -13 474 -203 -72 211 94 -316 578 -50 -161
4136 -161 275 -1 -191 37 244 -417 250 122 -218 10 50 -52 -363 322 -204 -79 -127 64 -137 -341 255
4157 255 -277 -41 -17 137 -441 68 146 -440 175 25 -179 -253 438 -453 -34 290 -349 -139 255 26 -317
$$ packed form
4006G8n65O49k17l10L92jj53k85N83o13L15O2L0k42J51L73o74L67J15n3l92O52
4028B62k34m71Q29m78j18L87J94p45N68K25q39N95P0l80J9P35p77J58N68p28J31
4049b9K10Pm27O99l64k37M51j79k06R6L55n59L23j50M2P1k87L55k69J48j17K28
4071A61m51L11q4k77O45m06K2o4M08o41K55L69o47N29p1j02l36P07o27J01M82
4092B84n01K30Q3k3m58O34l30J37P1p8M9j85K93l14L18l64K65j17j14M76m45N6
4114c3N8K29m91N36pn77N36Ol12J8O17q54K61M87o77J31K83j17m10Q94o28j11
4136a61M36k76j90K28K07o61O67j28l40K28M0j02l11O85n26J25m8J91k01k04N96
4157B55n32K36K4J54n78N09P8n86O15j50k04p4O91q91M19L24o39K10L94k29l43
$$ plain form
4178 -317 525 -81 -333 413 -18 -31 175 328 -409 307 68 -210 42 173 77 -238 289 -142 99 -29 190
4199 190 -59 -95 297 -8 -48 -44 312 -278 169 146 -322 45 62 -120 -291 200 -181 -128 238 -129 -235 -32
4221 -32 117 -389 176 -96 -264 193 -174 -242 -144 139 -454 79 -47 -248 -111 -15 -136 -252 106 -153 -75 -179
4243 -179 103 -25 -255 204 -107 -183 -36 341 -387 -2 299 -280 151 270 168 -413 460 -13 -146 455
4263 455 107 -160 241 316 -330 454 93 -129 391 338 -147 141 487 -341 208 325 -69 -89 323 32 -143
4284 -143 349 -39 19 -128 159 -55 -151 168 -102 -68 -100 163 -391 100 203 -333 -126 117 -37 -376 362
4305 362 -240 -198 335 -127 -225 -7 221 -438 308 -138 -234 46 -2 -78 -70 202 -427 223 41 -190 24 242
4327 242 -70 -227 395 -122 20 124 163 29 87 188 -18 175 15 317 -218 234 367 -51 19 199 241
$$ packed form
4178c17Q42o06k52P46m31j3K06J53p37P16k39k78K52J31r6l15N27m31K41j28K19
4199A90k49l6L92l05m0ML56n90M47k3m68L67J7j82j71M91l81N3L66l67j06K03
4221c2J49n06N65k72j68M57l67o8R8K83n93N33j26k01J37R6j21j16L58k59P8j04
4243a79K82j28k30M59l11p6J47L77p28L85L01n79M31J19j02n81Q73m73j33O01
4263D55l48k67M01P5o46P84l61k22N20n3m85K88L46q28N49J17l94k0M12k91j75
4284a43M92l88N8j47K87k14r6L19k70L4l2K63n54M91J03n36K07K43j54l39P38
4305C62o02M2N33m62r8K18K28o59P46m46r6K80m8p6QK72o29O50j82k31K14K18
4327B42l12j57O22n17J42J04L9j34N8J01k06J93j60L02n35M52J33m18P0J80M2
$$ plain form
4348 241 -184 374 49 37 232 161 28 71 281 -324 315 33 -139 146 120 -83 -124 288 -280 68 76 -72
4370 -72 -145 82 49 -286 85 -234 -20 -314 -22 -76 -390 65 -178 -153 -213 203 -440 -132 172 -220 -54 113
4392 113 -10 -440 341 28 -306 151 269 -273 86 441 -436 326 126 -120 94 249 -16 -17 576 -121 49
4413 49 353 122 18 328 153 -140 552 115 93 264 230 -25 121 267 -23 7 65 222 -260 268 240 -136
4435 -136 107 132 53 -283 229 -45 -239 1 10 -242 -26 96 -600 140 3 -366 -88 -77 -341 -157 210 -535
4457 -535 -104 94 -333 -258 170 -93 -426 151 -290 -162 -68 -40 -229 119 58 -206 266 -162 130 -145 74
4478 74 42 25 184 56 106 -104 273 108 -30 124 169 23 77 419 -198 250 48 -70 126 310 98 -39
4500 -39 505 -96 283 150 143 28 316 91 -289 354 -52 2 -57 126 -116 -11 15 -159 83 -179 220 -318
$$ packed form
4348B41m25N58l25j2J95p1j33M3K10o05O39k82j72K85k6k03m1M12n68L48Qj48
4370g2p3K27l3l35L71l19K14k94K92n4l14M55k43K5o0M16o43L08L04l92J66J67
4392A13j23m30P81l13l34M57J18n42L59L55q77P62k00k46K14J55k65jN93o97J70
4413D9L04k31j04L10j75k93O92m37k2J71l4k55J46J46k90L0N8J57m82N28k8l76
4435a36K43K5p9l36N12k74j94K40Rk52K16J22o96P40j37l69K78J1k64J84L67p45
4457e35M31J98m27P5M28k63l33N77m41J28R4K8j89L48o1k64M72m28K92k75K19
4478G4l2j7J59j28N0k10L77j65j38J54M5j46N4L42o17M48k02j18J96J84k12j37
4500c9N44o01L79j33pj15K88k25l80O43m06N4n9J83k42J05K6j74K42k62L99n38
$$ plain form
4522 -318 -95 -78 -128 -145 -179 100 -529 -19 -106 -259 -174 70 -347 -390 288 -502 -26 42 -232 -257 38 -206 -367
4545 -367 283 -271 -140 53 14 -215 202 65 -315 219 26 0 -31 236 -14 -68 116 2 260 24 312
4566 312 -58 226 274 2 126 310 231 -132 400 113 91 223 318 -47 127 442 -278 248 397 -155 -2
4587 -2 353 10 -151 461 -206 81 92 41 -136 180 34 -342 323 21 -120 63 157 -253 2 69 -179 26
4609 26 -132 26 -146 -57 -68 -128 32 -144 15 -268 111 -50 -67 -156 51 -77 -107 214 -331 18 -57 -140 -80
4632 -80 86 -160 -204 182 -201 -49 -3 26 -141 131 59 -260 216 -70 18 -27 164 -78 74 -23 -6 230 -100
4655 -100 158 -19 47 148 66 0 -20 275 -132 155 152 78 -43 176 -47 -258 347 -239 -78 114 -44 -207
4677 -207 84 1 -342 303 -98 -116 -48 128 -348 69 17 -421 -38 -104 63 -209 129 -286 -120 24 -145 -66
$$ packed form
4522c18K23J7n0j7l4K79o29N10q7j53Q5K44m17m3O78p90M76O8k74k5K95k44j61
4545c67O50n54J31J93l9k29M17j37l80N34j93k6l1K67k50n4J84j14K58k36K88
4566C12l70K84M8k72J24J84p9l63N32k87k2J32R5l65J74L15p20N26J49n52J53
4587bL55l43j61O12o67K87J1n1j77L16j46l76O65l02j41J83R4m10K55O7k48K05
4609B6j58J58j72Q9j1o0J60j76J59k83L79j61j7q9K07j28l0L21n45L49p5q3O0
4632h0J66k46m4L86l83J52M6K9j67K72p2l19M76k86Q8m5J91k42J52r7J7K36l30
4655a00K58j77O6J01q2o6k0K95m07K87lp4j21K19k23k11O05n86J61J92j58j63
4677b07K91q3l43O45m01j8O8J76m76M17n2m38L83o6J67k72L38m15J66J44j69P9
$$ plain form
4699 -66 -69 59 -181 55 90 31 -118 2 220 -230 233 86 -56 -17 157 -55 -51 359 -150 102 222 -19 -159
4722 -159 358 12 -237 462 27 -58 165 281 -216 214 166 -226 135 9 -57 -62 256 -243 -33 158 -111 -5
4744 -5 -138 190 -176 171 -43 -134 -84 -184 159 -102 25 -115 -51 -44 53 -22 -99 178 -158 -14 41 49 -140 111
4768 111 -3 -245 210 -108 -18 -108 79 -219 95 143 -165 196 -36 -19 -60 193 -145 60 120 -145 149 8
4790 8 279 -68 112 65 115 63 44 372 -29 220 68 32 -67 295 27 -156 324 -28 81 104 198 -217 188
4813 188 133 -235 250 87 -44 -76 286 -218 43 240 -231 128 55 -56 -208 136 -113 -87 144 -193 -99 -30
4835 -30 155 -215 -6 -211 -79 -41 -19 41 -193 32 11 -102 -180 200 -128 -225 227 -131 45 81 1 -282 55
4858 55 63 -309 323 -42 -143 21 196 -228 93 147 -216 236 91 -3 -158 271 -116 5 127 -90 20 -92
$$ packed form
4699f6lJ28k40K36L5n9j49J20K18m50M63j47j42L9J74k12MM10n09K52J20k41j40
4722a59N17l46k49O99m35q5K23J16m97M30m8l92L61j26o6nL18m99K10J91k69J06
4744ej33L28l66L47k14r1N0j00L43k61J27j40O4PR7p5p7K77l36J44N5Qj89K51
4768A11j14k42M55l18R0r0J87k98L14M8l08L61k32J7m1K53l38K05O0k65K94j41
4790HK71l47J80m7N0n2j9L28m01K49j52l6r9L62k68j83M80l52J09K3R4m15M05
4813A88n5l68M85j63j31l2L62n04K61J97m71L59p3j11j52L44k49K6K31l37R4O9
4835c0J85l70K09k05J32L8K2O0k34K25k1j13p8L80l28r7M52l58J76L6q0k83L37
4858E5Ql72O32l65j01J64J75m24L21N4l63M52j45r4j55M29l87J21J22k17J10j12
$$ plain form
4880 -92 42 -73 166 -209 22 129 -79 47 -70 53 -126 -66 -238 79 -44 -270 133 -25 54 -9 134
4901 134 -211 75 45 -182 94 24 -21 -58 278 -113 89 118 -71 75 -47 67 20 116 -52 104 45 -35 76
4924 76 43 64 -76 159 -48 190 171 -38 199 -130 236 -104 -5 -203 197 108 -203 225 -74 1 87 233 -262
4947 -262 60 151 -283 57 136 51 -42 341 -103 16 249 -21 72 82 32 -157 155 -45 -4 121 -57 -42 -66
4970 -66 69 -200 35 34 -165 -153 4 -28 -194 -20 -126 -127 -185 16 -147 -246 153 -279 -73 -52 -118 -368 140 -12
4994 -12 -197 177 -86 -106 -82 266 -161 10 266 -189 -20 191 1 -111 366 -142 123 244 -50 -26 61 142
5016 142 -180 388 6 41 171 66 -52 1 124 -110 91 78 41 20 -103 125 -22 35 -51 17 -83 97 -1
5039 -1 -95 98 -97 54 -206 108 -146 -3 10 -117 17 24 17 -213 188 -199 -58 -52 -205 -121 -174 -34 -274 85
$$ packed form
4880i2J34j15K39l75K31J07k08J26j17J23j79O0j72L17j23k26M03j58P9o3J43
4901A34l45K86l0k27K76p0m5l7L36l91K02K9j89J46j22J14m7R6j68J56n9q0J11
4924G6l3K1j40K35k07K38j9k09K37l29L66l40R9j98M00q9l11M28k99P5Q6J46m95
4947b62L22R1m34L40P9q5r3L83m44J19K33k70R3J0n0j89L12k00M1J25j78J5k4
4970f6J35k69K35jj99J2J57l2j66J74j06jn8K01j63r9L99m32K06K1o6k50N08j52
4994a2j85L74k63k0K4L48m27J71K56m55J69K11j90j12M77n08K65J21k94K4Q7Q1
5016A42l22N68l82L5J30j05j18N3J23k34K01j3l7k1j23K28j47N7q6O8j00J80r8
5039ar4J93j95J51k60L14k54J43J3j27J34Ppk30M01l87J41Oj53Q4n3J40k40L59
$$ plain form
5063 85 -269 -122 -129 -108 15 -87 20 -192 70 -197 47 66 -171 65 54 -97 -44 202 -183 207 151 -86 251
5086 251 226 174 -83 450 77 53 302 56 126 189 108 -108 357 -10 47 194 51 148 54 204 -128 99 78
5109 78 48 -5 69 32 -194 178 -198 -16 -167 107 -167 -143 212 -165 -97 -113 128 -337 111 122 -423 35 -95
5132 -95 -243 -205 130 -249 -112 222 -302 -86 101 38 -282 208 -140 -45 70 -53 -136 -34 76 -262 100 -81
5154 -81 -86 -27 61 35 -8 167 -155 54 -39 64 -104 -26 116 -78 22 -8 175 -240 148 64 -144 174 46 102
5178 102 -61 290 -61 -39 72 -21 46 -17 77 -80 204 -124 -4 29 -77 42 3 -35 -126 8 -234 37 -22
5201 -22 -130 -52 -93 16 -192 85 -253 5 -55 -234 -6 -127 -100 -179 223 -269 -85 -19 -206 -122 15 55 -375
5224 -375 191 -35 -107 83 102 11 16 172 -171 168 75 78 61 94 160 -16 151 -93 253 33 212 4 209 175
$$ packed form
5063H5l54J47pK1J23j02J07k12K62k67K44J9k37K36j1j51N3K46l85L90n6k37L37
5086B51k5n2k57N33l73k4K49k46P0O3q1k16M65l67N7J47j43R7r4J50l32K27k1
5109G8l0n3P4l7k26L72l76J82j51K74k74K4L55l77O8j6K41m65M48J1n45M58j30
5132i5j48L8L35l79J37L34n24K16J87o3l20M90l48R5J15j23q3J02J10l38L62j81
5154h1nN9Q8k6m3J75l22K09r3J03j68P8J42j94J00l0J83m15L88q4k08L18j28N6
5178A02j63L51l51K2J11r3O7o3R4j57K84l28J20L3j06J19l9l8r1J34k42K71n9
5201b2j08P8m1J09k08K77l38K58o0j79K28j21K7p9M02m92J84O6j87Q4J37M0m30
5224c75N66k26p2J90J9r1NJ56l43L39r3Lj7L3O6j76J67k44L46k20J79k08K05l4
$$ plain form
5248 175 96 194 0 168 -112 98 90 -49 107 28 55 -123 201 -150 25 153 -118 66 136 19 -278 228
5270 228 -99 -54 98 -35 -157 -62 108 -231 138 -149 -177 -115 -97 -199 -214 7 -293 127 -156 -112 -141 -27 -3
5293 -3 -141 216 -276 45 -104 -4 20 48 53 -25 126 -173 169 -54 -20 -10 43 75 11 162 -119 290 -93 94
5317 94 74 62 192 70 117 -55 221 -52 70 96 64 57 -43 157 -185 255 35 65 123 114 8 -31 250 -97
5341 -97 226 -24 106 94 131 -41 -40 169 -232 78 15 -66 -60 -45 -146 -16 64 -186 64 -124 -88 -124 -107 -61 -131
5366 -131 106 -325 134 -127 -90 -181 44 -44 -147 117 -224 46 -121 34 -86 -24 -63 -36 139 -140 109 -3
5388 -3 101 93 -24 56 49 186 48 266 5 109 109 34 86 101 221 -227 189 -73 33 78 62 -28 -18 72 -200 115
5414 115 -68 -10 54 83 -107 -16 55 -113 106 -2 -99 -77 203 4 -212 -8 -171 165 -70 -12 -73 -9 -99 -142
$$ packed form
5248A75p9R8j94J68k80K10qj39J56p9K7j78L24l51J75J28k71J84P0j17k97N06
5270B28l27M5J52j33j22R5J70l39L69k87k8O2J8j02j5K21l00M20k83M4k9J14K4
5293cj38L57m92L21j49J00K4K8Np8J51k99L42k23L4J0N3L2o4J51k81M09l83J87
5317I4k0j2J30j22M7j72K76k73J22K6l2pj00K00l42M40k20L0N8rj06l9K81l47
5341i7L23k50J30j2L7j72JK09m01L10o3q1OJ5j01J30Q0k50K50j88L6l6J7M6p0
5366a31K37m31M59k61L7r1K25q8j03K64l41K70j67J55j20O2l9K7J75k79K49j12
5388cJ04qj17Q0pJ37j38K18k61J04%p5N2J5J20m48M16k62J06M5j6r0J0R0k72L15
5414A15j83N8O4K9j90R1P1j68K19j08r7K2K80j99k16K04j63L36k35N8o1O4r0m3
$$ plain form
5438 -142 128 -84 -33 -160 6 -121 -45 149 -81 89 -188 44 -142 -77 120 -7 74 -18 82 -147 160 -90
5460 -90 18 1 88 36 69 244 -92 179 -75 48 -3 176 8 -30 209 -113 211 8 8 59 109 36 90 279
5484 279 19 176 29 77 35 50 -66 3 279 -142 36 40 -101 -166 23 -155 0 142 -154 96 -181 14
5506 14 -74 87 -13 -108 122 -137 -21 -76 -16 -81 61 57 -103 122 -163 99 -60 137 44 60 42 37 152 9
5530 9 207 40 12 19 121 37 49 158 -73 208 75 -21 82 69 -52 3 257 -177 153 -66 -62 15 93 -19 -92
5555 -92 134 -18 125 -69 30 8 96 -67 -144 209 -40 35 48 99 -59 62 78 -88 -36 -18 -5 17 37 -159 -59
5580 -59 -52 -165 75 -188 5 -3 -10 -145 -56 -139 32 -14 -208 146 -165 -25 -51 -92 -33 -55 61 -152 105 -69 84
5605 84 -8 111 -73 -50 183 -33 109 11 74 38 137 49 -56 228 -77 114 81 40 -46 96 62 -46 318 -30
$$ packed form
5438a42K70k12N1j27J66j27P6J94k30J70k77K32j86O5J97j27Q1r2J00k29L07k50
5460i0J08j7Q7n2L3J75l36K71k54J23n1J79j68l8K39l22L24k03%N1N0p3N4J89
5484B79k60J57j47M8m2J5j16O9K76m21J78Mj41o5J89j78J55J42k96K50k77J95
5506A4q8J61j00r5K30k59J16n5O0o5J42mj60K25k85K62j59J97r3J6j8nJ15j43
5530IJ98j67k8PJ02q4J2J09k31K81j33r6J03j3j21N5K54m34L30k19MP7P8j12p3
5555i2K26j52J43j94R9k2Q8j63p7L53k49P5J3N1j58J21J6j66N2J8J3K2K0j96J00
5580e9Pj13K40k63J93qpj35Q9q3J71m6j94L54l11J40k6m1N9k2J16k13K57j74J53
5605H4r2J19j84K3K33k16J42r8O3l6R9q8j05K84l05J91l3m1q6J42l4j08L64l48
$$ plain form
5629 -30 44 103 106 -63 295 -5 -105 203 -100 107 -71 -36 -100 55 87 -126 88 -148 -50 -34 34 -214 -38 -5
5653 -5 -69 -13 -252 -58 -285 -70 -31 -45 -111 -200 -98 -197 -10 -176 -133 -128 -23 -50 -17 90 -62 27 -84 33 -46
5678 -46 95 -39 45 266 -186 38 63 66 16 178 29 -49 186 76 126 25 155 -65 232 107 -19 227 -69
5701 -69 61 47 85 -30 78 39 9 197 47 47 -62 79 -67 35 113 -129 130 71 108 -81 167 -28 21 -20
5725 -20 36 173 -153 47 -118 -86 -120 100 40 -50 19 -202 -54 -195 -31 -174 -15 -71 -206 -10 -183 27 -85
5748 -85 -8 -182 57 -140 -70 110 -85 -81 55 5 -51 109 63 -82 142 -3 147 -88 93 -131 219 97 -89
5771 -89 222 16 137 12 113 -70 157 126 97 97 11 103 -41 157 -99 -6 0 -68 103 -104 61 -60 69 -90
5795 -90 67 -98 -76 17 -43 5 -82 -72 -61 92 -159 -80 108 -134 133 -41 2 -39 50 26 -73 183 -103 -77 58
$$ packed form
5629c0P4N9Lj69L58l00j00L08l03K07j78L5o4J55L2k13K14k36R8J6O8k48J76L3
5653eo4N6k39J94k27K15L9j4o6q9J02r9J87j66M3NJ05k7L3J07j52Q9j11J17p9
5678d6J41j34Q4K21m52K24K5Ln0J62j49p8K35j10N0j01J30k20K97j25j26K46k96
5701f9J30j4L8j15J08l9l0J88j50%j09J41j46J02P8k42K59n9L7j89K48j95M9m1
5725b0N6J37l26K00j65L2l4K20o0r0O9k21J48j41J64j43J59n6j35J96j73K10j12
5748h5P7j74K39j97P0J80j95MJ36n0n6J60m6j45K24j45J50k35J81k24L50j22j86
5771h9L11k06J21j25J01j83K27l1k9%q6R2j44J98k56R3Oo8J71k07J65j21J29j59
5795i0J57j65K2R3o0M8q7J0J1J53k51P9J88k42K67j74M3m1Q9k4r9K56k86K6J35
$$ plain form
5820 58 8 -85 155 27 -98 153 -20 22 -79 131 -176 -11 152 -24 37 -100 0 -42 121 -79 41 105
5842 105 -111 122 -8 29 -93 227 -8 115 116 -16 75 78 46 -60 200 -8 81 37 -33 54 -58 15 -103 124
5866 124 -61 106 69 -155 84 -79 -90 -128 118 -180 -17 -161 -120 4 -144 -20 -143 -48 -283 -9 -122 -135
5888 -135 16 -72 -204 -150 -24 -287 -106 12 21 77 -86 -38 -3 119 -133 43 -64 -125 96 5 12 -66 149 -174
5912 -174 77 76 -13 104 -37 40 -62 173 -83 71 103 -67 66 -46 130 89 89 -37 238 42 116 204 55
5935 55 149 -43 221 -117 88 57 59 80 -62 91 -90 74 -91 88 79 13 67 -80 23 -79 31 -198 -39
5958 -39 -49 -170 130 -18 8 -70 73 -189 -30 71 -176 -47 14 -37 -147 185 -67 -110 7 -90 12 11 60 -37
5982 -37 186 -70 145 183 -42 -9 134 58 -38 182 71 143 63 76 50 -19 94 7 98 -34 122 118 -5 135 31
$$ packed form
5820E8n0r3K40j28j25K51j73M2j01K10l07J65J63j76O1j37J00m2J63k00J20O4
5842A05k16K33j30L7j22L20k35J23Jj32R1Ll2j06K60k08Q9m4p0Q7j12P3j18K27
5866A24j85J67l7k24K39j63j1l8K46k98J63j44M1J24j48J24j23R5k35K74j13j3
5888a35J51q8j32N4J26k63J81J18RN6j63M8L5J22k52J76j07o1K21r1Pp8K15l23
5912a74K51jq9J17j41P7j02K35k56J54L2j70J33j12J76m1%j26K75j96P4Q8j49
5935E5R4j92K64l38K05l1KK1j42J53j81J64j65J79ro6N4j47J03j02J10k29J59
5958c9j0j21L00j48K6p8J43k62J59J01k47J29O1n1j10L32k52m3J17r7J02jM9r7
5982c7K23k56K15L8k25L3J43p6r6K20j11P2q0J3k6o9J13q7R1j32J56mj23J40j04
$$ plain form
6007 31 0 -51 154 -55 102 -103 61 13 -55 90 -64 65 -184 20 -43 -33 -55 -58 -68 -171 188 -218 -10 24
6031 24 -147 -38 -50 -19 -165 50 -231 25 64 -91 -58 -85 20 -219 60 -52 -86 23 -41 -16 -1 61 -145 175
6055 175 -134 117 100 -59 44 9 76 8 146 -19 170 10 -59 39 -55 82 -20 150 -56 108 28 -7 10
6078 10 -6 87 -93 196 -127 125 41 26 75 -73 69 -88 147 -111 10 -74 -66 22 -41 101 -21 116 -165 57
6102 57 -63 -93 12 -40 22 -60 148 -115 -33 43 -3 -11 64 -57 -131 228 -169 32 121 -65 6 -39 4 -176 228
6127 228 -11 57 -18 33 16 -4 203 -107 115 17 54 48 166 -3 58 116 -73 201 -96 116 92 -25 134 66
6151 66 204 -25 184 -126 198 84 15 25 71 11 -73 92 -134 -52 -19 -102 -139 37 -53 -211 164 -189 -49 20
6175 20 31 -97 -34 -86 -189 -6 -177 -44 -132 -12 -252 -128 52 -229 67 -113 -10 -71 -42 -9 -217 39 -106
$$ packed form
6007C1l1n1K05k09J57k05J64m8o8J45j54J29k49K04o3J0k2lj0j03L59m06K08L4
6031B4j71J09j2L1j46K15k81K56L9j55L3k7J05k39K79j12l4J09o4K5J5O2k06L20
6055A75l09K51j7j59J03l5O7o8J38j65J89j60o9R8r4J37j02J70k06J64q0l5J7
6078A0j6R3j80K89l23K52q4j5M9j48J42j57K35k58J21q4QQ8o3J42j22J37k81K22
6102E7j20l0J05n2O2q2K08k63Q2P6m6qP5j21p4L59l97K01Q9j86P1m5M3j80M04
6127B28k39O8p5N1j7k0K07l10K22r8L7oJ18j69O1N8j89K74k97K12k4j17J59o8
6151F6J38k29K09l10L24j14o9J0M6o0q4J65k26Q2L3q3l7J76r0j58L75l53J40O9
6175B0J1j28O3n2j03J83j71J33q8J20k40J24J80k81K96j80J03o1K9L3k08K56j45
$$ plain form
6198 -106 69 -92 69 -13 1 0 -45 39 -31 175 -206 140 113 63 74 60 118 44 218 -39 108 53 7 -8 94
6223 94 105 50 156 44 108 54 102 -79 14 99 -70 98 -6 48 83 26 -7 29 46 -9 204 -146 160 121 -117
6248 -117 34 9 82 -115 162 -112 13 90 -30 -66 -40 40 -158 157 -146 -45 -82 -65 -153 -49 -4 -125 -5
6271 -5 -109 58 -94 -1 -4 -54 62 -19 -53 -152 29 -106 -33 -41 99 44 7 138 -177 88 -66 -108 -26 29 88 -63
6297 -63 178 -32 20 47 -31 115 94 81 -75 163 -34 -55 124 81 25 11 91 -218 159 -34 1 11 186 -64
6321 -64 -101 68 -189 76 -33 80 6 98 -57 -14 177 -98 61 -1 103 8 -83 -12 -80 35 -85 130 -119
6344 -119 -86 15 -187 16 -12 34 -140 160 -135 7 4 44 -5 -11 76 -194 133 -36 -33 43 85 -27 87 77 -78
6369 -78 51 -3 60 -23 46 30 -78 21 -79 129 -41 5 22 117 -62 -82 116 -146 31 -92 11 27 76 4 27
$$ packed form
6198a06J75j61J61q2J4jm5Q4p0K06l81L46k7n0J1j4N8p4J74k57J47n5m6j5J02
6223I4J1n5J06j12O4n4M8j81R3Q5j69J68j04N4L5n7l3L6J7n5K13l50L06l9k38
6248a17J51k5P3j97K77k74J25P7j20l6K6Q0j98L15l03J01l7J7q8J04M5j21J20
6271ej04J67j52R3ln0J16q1l4r9J81j35P3qJ40n5l7J31l15K65j54m2Q2N5N9j51
6297f3K41k10N2K7p8J46k1j3j56K38j97k1J79m3n6j4Q0l09L77j93L5J0J75k50
6321f4l7J69k57K65j09J13p4R2j55M3J91k75J59o2J04r5r1P1o8J15j20K15k49
6344a19L3J01k02K03k8M6j74L00k95J42lM0m9oQ7k70L27j69LP6M2j12J14j0j55
6369g8J29n4O3q3O9j6j08R9j00K08j70M6J7R5j79k0J98k62J77j23J03J6M9p2K3
$$ plain form
6394 27 57 -193 56 -10 19 -64 45 -28 -78 56 -95 71 -154 -50 -166 -75 103 -149 100 -171 -48 -174 0
6417 0 -77 18 -95 -56 14 -96 52 -128 121 -39 -31 34 -35 -2 -130 129 -50 -40 102 153 17 86 59 -92 141
6442 141 -55 56 23 86 -68 82 157 -31 122 91 103 95 130 -51 56 133 57 76 38 176 -51 58 43 -53 27
6467 27 -237 64 -44 68 2 79 4 -51 -88 -124 36 -177 37 -61 39 -150 5 7 -84 171 -49 -57 44 15 -142
6492 -142 -63 26 -70 -68 80 80 -128 2 25 -34 47 -26 69 -70 -9 -138 80 -4 14 67 -135 40 72 53 11 -18 -47
6519 -47 -13 149 -10 122 84 127 16 187 3 16 105 -104 205 81 149 -103 157 67 -8 99 3 10 119 102
6543 102 -43 77 21 -127 23 -91 -45 -95 -94 -89 -18 -52 -142 -55 -146 115 -75 58 -79 -49 3 -105 1 -125 77
6568 77 -93 20 115 -65 -51 52 114 -200 7 25 24 -66 169 -36 -23 127 -153 44 40 232 30 210 100 -63
$$ packed form
6394B7L0k50K49o6K9q3J09p3n0J34j51J66k25J04j16R1J78k52K49k71J23j26J74
6417@p7R5j13L9P0j10J48j80K49j60QO5o9L3j28K59j79J0J42N1j36O9k7j51K33
6442A41j96J11l3O3j54J50P5j88J53l1J2qL5j81J07P7p6J9l8J38k27J09j5r6Q0
6467B7k64L01j08J12o6P7p5n5l7l6J60k13K14r8J00j89J55Kr1K55k20qJ01k9j57
6492a42P9Q9r6KJ48%k08J30K3n9Q1p3R5j39O1j29K18q4J8N3k02J75L2j9m2k9k9
6519d7L4J62j59J32l8M3j11J71j84J3Q9k09L09j24O8k52K60r0p5J07r6PJ09j7
6543A02j45J20n6j48J50j14M6n0JNP1l4r0Q7r1K61j90J33j37L0N2j08J06j26K02
6568G7j70J13R5j80J4J03O2l14K07J8jr0K35k05J3J50k80J97mJ92k02J80j10j63
$$ plain form
6592 -63 42 -2 168 -40 26 57 159 32 31 60 9 71 -111 -1 -56 46 -76 27 69 -15 106 -94 32 -98
6616 -98 106 -145 12 20 -81 10 -107 -79 -49 100 -77 -6 25 -34 6 0 53 -140 19 -8 -115 23 -153 57 -76
6641 -76 -56 -109 -103 -102 -12 10 -149 70 -25 94 -30 0 -129 91 156 3 84 45 40 -28 137 21 69 125 -5 69 112
6668 112 95 -55 196 71 34 112 25 32 43 168 -63 94 119 -42 77 -43 70 -167 163 -32 -10 97 53
6691 53 17 -83 92 -51 86 0 21 -38 -25 32 -241 -74 -18 -66 -38 -73 -171 -102 146 -200 -52 -97 43 -136 78
6716 78 -57 -38 6 -170 -70 -23 -28 -269 29 105 -80 42 -30 24 -104 118 -66 34 5 -22 100 -16 199 -29
6740 -29 149 41 151 70 90 75 -58 135 -47 155 91 48 18 57 103 -84 60 -19 57 -80 96 25 50 144 33
6765 33 100 13 61 -161 45 -41 -97 84 -133 -86 -54 132 -87 64 0 -104 -47 -179 43 -93 -58 -105 17 -88
$$ packed form
6592f3J05m4J70k08O6L1J02j27jK9n1O2j82J10n5J02j22J03M2q4J21k00J26j30
6616i8K04k51J57Qj01R1j17K8L0J49j77P1L1n9M0oN3j93J59k7j07J38j76K10j33
6641g6K0n3OJR0K2j59K19r5J19j24L0j29K20O5j53Q1l9no8J65j16M8N6j30P4M3
6668A12j7j50K51j25l7P8q7PJ1J25k31J57K5j61J19j20J13k37L30j95K2J07m4
6691E3l6j00J75j43J37q6K1n9J3N7k73J67N6m8K8l5r8O9K48l46J48m5J40j79K14
6716G8j35J9M4j76J00M7nk41K98P6j85J22p2N4j28K22j84J00k9k7J22j16K15k28
6740b9J78j08J10q1K0j5j33J93j82K02o4m3l0L9M6j87J44p9P6j37J76p1K5R4j11
6765C3O7q7M8k22K06q6n6J81k17M7L2J86k19J51o4j04N7j32K22j36L5m7J22j05
$$ plain form
6789 -88 -60 -25 -110 -5 -77 31 -113 74 -53 -95 29 -142 -96 1 57 -75 85 -35 -122 70 -39 -33 -29 125 -109
6814 -109 111 -36 -155 58 130 -50 -54 30 -59 103 126 -40 -73 19 109 -32 17 -9 125 -42 -10 41 32 169 -21
6839 -21 -14 -126 120 -132 60 102 -95 -26 -79 -15 -49 132 68 45 68 -86 -117 31 95 -158 14 -66 -63 -21 -28 -70 -78
6866 -78 9 -136 -8 -66 -66 -55 -73 2 -63 4 -54 -17 1 -37 -19 -12 134 -23 40 -11 111 -16 70 174 -82 64 88
6893 88 46 -64 152 3 7 40 44 25 44 61 -96 162 98 -41 64 58 -33 -36 191 -103 146 -75 -22 -39 63 21
6919 21 -4 159 -58 -13 -103 42 -37 -65 5 -73 43 -148 -1 26 10 12 -1 -28 -95 58 -102 -77 -89 -96 38 -67
6945 -67 8 -97 100 -145 43 28 -39 40 -53 51 -19 116 -137 -51 -36 -29 63 -150 73 -47 104 -93 38 44 -5
6970 -5 35 -23 85 28 0 -182 -14 43 -35 59 15 40 96 107 -93 72 30 -81 61 13 -31 10 182 -110 33 -9
$$ packed form
6789h8K8L5q5J05p2J08j44J87j27m2J24j71M6R7N6j32J60j20q7J92j09OMJ54k34
6814a09K20j47j19K13P2j80mQ4q9J62K3j66l3R2R0j41M9k6J34j67L2N1rJ37j90
6839b1Pj12K46k52J92M2j97O9n3O4l4J81o4k3K3j54l1J48O4k53J72q0LM2pm2q
6866g8Q7j45J28n8%J1j8P5o5O7n8L7J8l8J8PJ46j57O3n1J22j27Q6J04k56J46K4
6893H8m2j10K16j49ML3Mj9J9J7j57K58o4j39J05or1lK27k94K49k21N3j7J02m2
6919B1k5J63k17M5r0J45p9k8P0p8J16j91J47K7j6Kj3k7o7J53j60K5j2pJ34j05
6945f7P5j05J97k45J88j5o7P9r3J04p0J35k53Q6J5PR2k13K23j20J51j97J31Om9
6970eM0n8J08n7k8j82J68N7p8R4m4K5N6J1k00J65m2j11J42m8m4M1J72k92J43m2
$$ plain form
6996 -9 -93 -27 -15 -53 -142 36 -105 -30 -56 -60 -85 19 56 -129 47 -38 6 15 -15 50 -80 15 37 -32 -11 29 -42 33 -19
7025 -19 -27 -30 -71 48 -150 122 -75 7 65 94 36 40 89 -69 138 70 101 40 1 110 26 182 -124 14 20 47 -37
7052 -37 8 112 -25 248 12 118 -51 52 -14 6 63 -11 86 -13 -23 -81 -48 90 12 99 -74 27 -78 29
7076 29 69 -85 51 -17 -3 -77 48 -33 -84 -70 -63 -107 -115 63 -90 -82 10 -22 -105 21 -95 25 105 -105 -51 -111 27
7103 27 -2 54 59 -49 39 19 37 -170 170 -105 -123 39 40 -51 71 146 -64 105 79 -85 17 142 77 -101 94
7128 94 -128 114 52 109 94 47 73 -85 149 -137 17 16 85 104 72 121 -78 15 -44 -16 -10 -54 29 -3 74 -103 -94 -66
7156 -66 -7 -33 61 63 -89 -138 -93 12 -138 146 -82 -38 13 -16 -38 -56 17 -98 -13 16 -21 -77 31 40 -76 138 27
7183 27 115 -61 38 -39 86 22 -9 77 -22 60 13 -30 71 61 -84 -33 90 -101 122 -67 -60 27 32 10 14 93 -72
$$ packed form
6996iq4O6J2l8q9J78j41P5k6mk5J04L7j85J76q5M4Rl0O5j30R5K2o9K1M0p1P5n2
7025a9qlm1J19j98K72j97Q2N8K9n8MM9j58K07o8L1o1l9J09q4J56l06J38OK7q4
7052c7M5J04j37K73k36J06j69J03o6K0N7p4R7r9j0n8L3J38p8Q7j73J01j05J07
7076B9M0j54J36o8J4p4J25q1n1J4Pm4qJ78j53QR2l2q3J26j16J20Q0k10N4o0J38
7103B7k9N6Nj08Q8k0J8k07L40k75j8J62Jr1J22P5k10J69k6j64J02J25o5j78J95
7128I4k22K42o2N7j5m7K6j58K34k86J54jO9J9l2M9j99R3n9K8Om4Q3l2P7j77RK8
7156f6N9k6R4Kj52m9M5J05j50K84k28M4N1k9k2j8P3j15Q5K9l7n6J08Rj16K14j11
7183B7Q8j76R9p7J25o4l1Q6r9Q2m7m3J01j0j45N1J23j91K23j89PQ7Nk2MP9j65
$$ plain form
7210 -72 -61 1 -31 -27 23 62 -41 83 -18 45 -50 -3 -54 -7 159 -184 63 -121 58 -5 66 55 -97 99 -89
7235 -89 5 -55 24 -21 -33 -90 -99 1 49 -6 -115 79 -111 -118 6 -87 -21 41 120 -105 108 15 29 -6 19 -125 -82
7262 -82 178 -97 10 59 67 28 36 8 -175 144 -28 -4 -26 114 -17 4 162 -66 21 83 -94 -42 29 18 -2 -2
7288 -2 -71 -59 -8 42 -119 -18 -80 -91 -57 37 15 -117 111 -55 -97 -102 60 -44 16 43 -213 -15 68 -84 -196 -100
7314 -100 29 19 97 -88 -141 -15 27 8 -30 41 -77 44 -27 -34 -71 -31 17 18 -35 -34 142 25 44 -2 -3 92 82 34
7342 34 60 165 -91 162 -6 52 27 160 130 -82 154 -158 -19 9 52 -51 73 8 -147 22 -35 -2 39 80
7366 80 0 -23 -31 -42 -22 -18 79 -57 11 47 27 70 29 -51 -106 57 -61 -49 -71 -37 -186 -25 124 -67 42 -57 -102
7393 -102 -142 5 -9 -85 93 -73 -20 3 -20 -57 45 13 -125 116 5 16 -96 64 -97 -3 9 -79 125 43
$$ packed form
7210g2J1O2l2MN0L9j03J24j01O3r5M7n1M7J66l43K47j84J79o3P1j1j52J96j88
7235h9R4o0P9m5j2n7rJ00M8n5j09J94j90pJ24r3O6O2P9k25K13r3J4l5K5j44M3
7262h2K60k75J07M9Ql9Qk8j83L19j72K4k2J40j31K1J58k28Q7O2j77N2P1j1k0%
7288bo9J2N1N0j61J01o2j1L4R4k2j32K28j66m2nJ62j04O0K7k56J98Q3j52j12R6
7314a00J29j0P8j85n3J26M2j9l8P1j18J21p1pl7M0M8Jn3JJ76j17J9m6jR5j0m8
7342C4K6J05k56K53j68N8k5J33l0k12K36l12J39K8M3j03J24o5j55J69n7L3M1M1
7366H0q0k3qj1K0MR7j36O8L6k0M3m1q0n5J63j18J2k2L4j49J61J49j91J09r9m5
7393a02m0J47j4p6J78j66N3K3k3l7J02l2j38K41j11J1j12J60j61R4J2q8K04q2
$$ plain form
7417 43 107 -79 94 -10 51 106 -64 -3 -69 66 9 14 56 -10 -1 51 87 -111 -13 -17 -52 10 44 -54 -94 38 -48 48
7445 48 -10 -13 -125 -22 33 -3 137 -94 -16 -91 56 -100 -46 50 -5 -34 -37 -46 -82 194 12 -75 -19 -27 -29 9 9 -9 61
7474 61 73 -4 -58 82 -52 -75 -20 -86 -12 10 44 15 -14 139 -20 -37 -71 -15 12 33 99 60 87 -29 8 -13 128
7501 128 -17 14 21 -62 -77 25 17 -6 104 29 -72 111 93 -26 4 190 -90 -28 -37 10 -103 -13 -26 -99 -79 -23 -77
7528 -77 -102 -27 -107 -200 150 -80 -57 69 -56 -140 34 -14 -69 78 28 25 -36 42 -13 -41 119 -134 35 -36 -12 -103
7554 -103 187 6 8 -11 -51 115 26 80 -60 91 -81 95 48 40 113 -39 69 17 -23 -7 116 164 67 67 49 33
7580 33 76 68 -40 93 7 -31 54 38 123 -19 54 -120 -16 56 -39 112 9 -21 -60 81 0 46 -39 27 -4 -103 36
7607 36 -125 26 -45 -17 -35 -134 36 -16 -46 -7 -126 -10 28 46 -31 89 -64 27 -58 80 -52 -66 -54 -32 86
$$ packed form
7417D3O4j86J73j04O1N5j70O1o6J35n7NM2o6RN2L6j98R8ml5O2L4r8m0J32q6R6
7445D8n8lj12J03N5l6J40k31P8p5J47j56N4R6n5k9lrl6K76j82q7N6qkL8%j8P0
7474F1J2p7n4J40j34k3N5o6P4K2L4k9k9J53j59j7l4N6K7K1O6l9K7j16L7k1J41
7501A28j45L1Pq3j5J02qk3J10p5j01J83j8j19L0J86k80O2rM7j13R0j3p3K0N6n4
7528g7k5P5q0r3L50k30K3J26j25q4J74m8n5J47n0lo1P8n5k8J60k53J69p1K4r1
7554a03K90j81Kj9m0J66q9N4j40J51j72J76m7qP3j52J08n2m0J6J23M8r7%j8j6
7580C3M3qj08J33q6l8Q5j6Q5j42P3j74J04P2r5J51j03l0l9J41q1M6q5O6l1r9J39
7607C6j61J51p1K8j8r9J70n2l0L9j19J16L8J8p7J20j53R1q5J38j32j4J2K2J18
$$ plain form
7632 86 69 74 -10 11 73 -18 63 -81 -40 -30 141 81 91 -49 -14 110 2 -23 -9 54 -63 128 48 54 -42 -17 78 -20
7660 -20 158 92 59 -87 46 134 18 54 -57 -78 -75 101 -109 -5 52 -26 -13 37 30 -106 -17 -70 -118 10 -89 -21
7686 -21 -46 -1 -139 -50 -51 -80 6 16 -116 -171 -56 -116 15 -31 -18 -42 -78 101 -55 51 -77 156 36 6 -28 -11
7712 -11 95 58 77 -6 192 -1 -73 111 81 -21 84 -15 -132 63 56 -45 94 -104 -38 -17 64 -162 109 5
7736 5 23 -36 -34 13 -69 37 4 12 -27 30 -10 62 29 61 -4 35 -9 -3 -38 -11 -135 40 4 57 -60 63 6 20 -44 29
7766 29 -63 -96 -64 15 114 -10 24 -29 -94 -182 -208 93 -91 -21 42 -19 -61 2 20 18 85 9 30 -40 71 20 87 85 -38
7795 -38 168 47 65 3 29 11 -65 54 -66 43 -58 66 -72 -21 75 -84 36 -53 41 -106 -17 -52 -112 -4
7819 -4 55 -8 -45 39 -158 87 86 -80 -65 -26 94 -36 88 -42 -5 -16 121 -6 41 47 -22 -34 64 101 -63 114
$$ packed form
7632H6j7Nq4K1O2r1Q1j44M1J0J71o0J0j40L5J24j08k5J4O3j17J91q0Or6K5R5r8
7660b0J78o6l3j46J33Q8j16L6j11k1LJ76k10J04N7p8J3N0pj36Q9n3m8J28r9O8
7686b1k5M5j38Q9jk9Q6J0j32n5J15o0J31m6J3k4l6J79j56J06j28K33j20l0l4J7
7712a1J06l7J9q3J98j93p2J84l0j02J05r9j17J95pj01J39j98O6K1Q1k26K71j04
7736EJ8n9KM7q2J06l3Ql9N7m0P2l3L2o5L9m4Ol5K7j24J75l6N3j17J23n7J4o4P3
7766B9r2l3L2P9R9j24L4n3o5q8k6L01j84P0O3o1m2O3J8kO7p6K1p0J11n1O7kj23
7795c8K06j21J8o2K6j8p6J19j20J09j01J24j38N1R6j59J20q9R4j47Q9l5o0J08
7819dN9o3l7Q4j97K45jj66J5L9J20j30J24j30L7j1J37j27M7Oo9j2R8L7j64J77
$$ plain form
7845 114 13 -62 -16 -86 -20 16 74 -102 39 37 10 14 -24 16 -32 32 79 32 89 92 -8 33 124 -78 24 41 9 -80
7873 -80 87 46 -34 57 1 91 110 85 12 40 28 -6 109 0 121 -70 79 39 -63 19 16 -94 -54 78 -49 -13
7899 -13 116 -64 -5 -39 -6 -15 38 -130 -65 43 -80 -67 -25 96 -78 -12 17 -18 35 -42 23 -33 5 -26 68 -22 -8
7926 -8 -31 -16 -15 -65 38 -2 0 -93 27 103 58 56 -38 28 -64 56 -65 -84 48 27 65 -6 141 14 -38 -81 22 -21
7954 -21 94 5 4 80 -70 127 2 74 3 -79 -25 -75 149 -9 9 76 19 -96 -35 149 -125 -28 -129 18 -60
7979 -60 16 -90 -102 -96 44 -90 18 39 -59 41 -17 -61 -8 -22 136 -40 178 -19 -84 9 8 -64 -50 151 -85 -11
8005 -11 -90 39 -4 59 20 -20 116 -207 -44 24 47 -18 67 126 -55 82 -6 -86 -9 33 -20 43 31 -49 -39 -8 100
8032 100 22 112 17 -10 71 104 20 -18 86 -11 -21 -24 -28 -84 -12 18 -149 27 2 -59 -31 -37 -1 -57 63 59 39 -95 -7
$$ packed form
7845A14j01p5M6p0O6L6N8j76J41kk7Ml8M0m8O4M7m7N7Lj00M1R1k02J02J7l2q9
7873h0J67m1q0R1n6R0J9k5p3K8j2l4J15j09J21j91J49m0j02Q2lj10M0J32j27L6
7899a3J29j80N9l4L3rN3j68O5J08j23J3M2J21j74O6K9l5N3p7O5n6L8l1R4r0J4
7926hk3J5Jn0J03m0Kr3J20P6m5kr4O6r2J20j21j9J32k1L8p1J47j27n2m3J03m3
7954b1J15q9jP6j50J97j25P2p1q2N4n0K24j58J8O7n7j15O1J84k74R7j01J47p8
7979f0P6j06j2OJ40j34J08K1r8J00n8m4N3j4J58j76K18j97o5R3jp2J4K01k36P4
8005a1p9J29m3O3l9m0J36l23J63O8K3o5Q5N9j81J37q8q0P7M2n3O3j2q0J0L1J08
8032A00p8R0r5k7Q1L3q4l8J04r7j0lmn6P2L0j67J76k5o1K8oL6n6J20mk0j34Q8
$$ plain form
8061 -7 -29 -62 66 -61 -31 -82 3 -11 120 45 47 5 -107 20 -142 130 -68 0 19 -27 -99 59 75 -121 97 7
8087 7 63 82 -63 -31 -21 11 -83 12 82 69 -90 33 116 -20 69 -39 28 38 -12 -34 17 49 -122 14 -65 50 24
8114 24 42 40 49 25 -59 84 -79 157 -92 -47 74 5 -38 -66 82 -215 30 -38 -14 50 41 9 -78 39 -73 -8 32
8141 32 36 -11 28 46 -155 54 -46 25 29 44 26 -38 46 -28 82 70 10 -39 56 -25 30 8 -27 -32 53 -14 0 72 50 133
8171 133 54 -22 5 -42 63 121 9 -48 53 156 -31 138 -54 72 109 -33 72 41 14 -72
$$ packed form
8061gk2l3J28j27L0n1Q5j4J31p5Km2j12J27j62K72j98O8J9m6p2J58J6j96K18r0
8087GN6J9j45L2J0L2r4R5P0j3j59J23Q3j36Q9j08O7J0n0k2N1L2j71J36p9J15k6
8114B4J8kRk4q4J43j63K36k49M5J21o9m3k8J48k97K45o8K4O4rl2q7J17j12O5M0
8141C2Mm7L9J8k01K09j00P1MJ5j8o4Q4p4J10j2o0m9R5q1N5k2l5nQ5o7J4P2k2Q3
8171A33p9p6K7m7J05N8j12n7J01J03j87J69j92J26L7j42J05l1k7q6
8191g2
$$ Imaginary data points
##PAGE= N=2
##DATA TABLE= (X++(I..I)), XYDATA
$$ plain form
0 0 0 0 0 0 0 0 0 0 0 0 8 -8 8 -8 16 -16 20 -24 32 -32 40 -48 56 -71 80 -95 109 -126 144 -165 189 -213 243
33 243 -275 309 -348 391 -437 487 -543 605 -670 742 -823 907 -1002 1106 -1218 1342 -1478
50 -1478 1627 -1794 1977 -2184 2413 -2675 2973 -3319 3720 -4200 4781 -5499 6414 -7627 9312
65 9312 -11813 15906 -23734 43961 -203556 -390095 87425 -83647 -209039 -62899 -138497
76 -138497 -234248 -3628 -63817 -282449 -161469 13339 -118027 -121596 -41030 -182120 -127821
87 -127821 3257 -107128 -130534 -31998 -55466 -69972 -630 -94014 -139326 -23694 48450
98 48450 -58371 -71273 20734 -50149 -50108 41796 -49520 -96998 84168 55778 -66372 6030
110 6030 7200 -40373 28110 81801 -40454 -19424 105478 22729 -25876 45291 -3814 -645
$$ packed form
0@%%%%%%%%%%Qj6J6j6K4l2L6m4N6o4P2q8J04j27J51j75K04k35K70l09L54m02M56
33B43n18N84o57P39q28R24j030J148j275J412j565J730j909K108k324K560k820
50a478L105l421L771m161M597n088N648o292P039p920Q981j0280J1913j4041J6939
65I312k1125K7719l9640O7695k47517j86539M77520j71072j25392J46140p5598
76a38497r5751K30620o0189k18632J20980J74808j31366l569Q0566j41090N4299
87a27821J31078j10385k3406R8536k3468j4506O9342r3384m5312J15632P2144
98D8450j06821j2902R2007p0883M1R1904r1316m7478J81166k8390j22150P2402
110F030J170m7573O8483N3691j22255K1030J24902q2749m8605P1167m9105L169
$$ plain form
122 -645 134813 38981 -43746 52331 68485 21118 22723 37512 25469 72855 71307 14176 -4363
135 -4363 39958 59347 32378 40672 29257 35697 42095 33838 7688 8639 40016 42362 33833 26456
149 26456 18054 -20746 40246 54821 -33850 12471 64512 210 -1317 43308 -33341 -20081
161 -20081 68546 25587 -38618 11953 40446 -27763 5236 17587 -32061 7785 50128 -10349
173 -10349 -33411 8492 -10839 -247 8310 -8934 -16022 5656 12886 -26781 -23576 -2807 -5798
186 -5798 -6808 22576 -24768 -39699 22333 -5742 -31835 -813 7875 -21474 13326 14498 -46406
199 -46406 -16631 35254 -9969 -21197 40397 -22781 -21853 50630 -15948 -42316 37728 24603
211 24603 -26573 29156 8771 -37243 18092 38486 -26200 -11368 46298 -9072 -7150 20782
$$ packed form
122f45J35458r5832q2727R6077J6154m7367J605J4789j2043M7386j548n7131j8539
135d363M4321J9389k6969Q294j1415O440O398q257k6150R51L1377K346q529p377
149B6456q402l8800O0992J4575q8671M6321N2041o4302j527M4625p6649J3260
161b0081Q8627m2959o4205N0571K8493o8209L2999J2351m9648L9846M2343o0477
173a0349k3062M1903j9331J0592Q557j7244p088K1678P230l9667L205K0769k991
186e798j010K9384m7344j4931O2032k8075k6093L1022Q688k9349L4800J172o0904
199d6406K9775N1885m5223j1228O1594o3178R28P2483o6578k6368Q0044j3125
211B4603n1176N5729k0385m6014N5335K0394o4686J4832N7666n5370J922K7932
$$ plain form
223 20782 -19796 -11760 35402 -762 -20242 22068 -5505 -12267 5002 -388 -14254 4689 15486
236 15486 -18766 -5020 11015 -18342 -23585 28600 1360 -30938 10510 6820 -16563 -7521 10262
249 10262 -21385 -2526 30073 -14405 -27077 17400 4895 -24077 18038 -5157 -14630 23430
261 23430 -1794 -22181 7566 7132 -16606 16359 2995 -19373 8851 12214 -20187 -4985 20875
274 20875 -18443 261 16551 -16507 -9481 15238 -9157 -13113 14718 -7134 -5543 -1088 -2342
287 -2342 -3144 -5471 -2648 -4825 -26 -3675 -1188 -13437 -3130 4686 -6530 -12170 -4842 6123
301 6123 -12268 -2481 -5609 -12082 3296 1561 -17271 -6630 7631 -12955 562 -4171 -10702
314 -10702 1551 18 -7272 -5452 3509 -4415 1879 -3157 -798 -536 -1091 3228 832 4635 -2070
$$ packed form
223B0782m0578Q036M7162l6164j9480M2310k7573o762J7269n390j3866J8943J0797
236A5486l4252J3746J6035k9357n243N2185k7240l2298M1448l690k3383R042J7783
249A0262l1647J8859L2599m4478j2672M4477j2505k8972M2115k3195r473L8060
261B3430k5224k0387K9747m34k3738L2965j3364k2368K8224L363l2401J5202K5860
274B0875l9318J8704J6290l3058P026K4719k4395l956K7831k1852J591M455j254
287b342q02k327K823k177M799l649K487j2249J0307P816j1216n640P328J0965
301F123j8391R787l128o473J5378j735j8832J0641J4261k0586J3517m733o531
314a0702J2253j533p290J820Q961p924O294n036K359K62n55M319k396L803o705
$$ plain form
329 -2070 8140 -1591 -1690 12212 1541 -4908 14719 10949 -11771 15343 1921 -8317 19131
342 19131 8539 -9839 10037 15719 -11287 6611 6755 -6436 8043 16133 -7400 -5617 17089
355 17089 -10334 -1746 12069 -6245 -1395 15622 -5281 -10634 9932 -8550 -295 9032 -436
368 -436 -4923 2894 827 -8691 1825 -2457 -520 3107 5747 -6719 -6998 -395 -5280 2945 -3862
383 -3862 87 -981 -2468 -2596 -8055 -10752 -350 5115 -8640 2728 -7784 -11038 658 -6804
397 -6804 -10125 523 3570 -7802 2620 -8870 -13303 1329 3389 -5608 1207 8811 -11348 4285
411 4285 3470 -13653 4767 17423 -3322 5423 16826 -15443 5306 17666 -4769 5374 22754
424 22754 2975 1278 20632 -6728 -4086 22656 14082 -2605 17491 9963 -9768 17741 4842
$$ packed form
329b070J0210r731r9J3902j0671o449J9627l770k2720K7114j3422j0238K7448
342A9131j0592j8378J9876N682k7006J7898J44j3191J4479Q090k3533J783K2706
355A7089k7423Q588J3815j8314M850J7017k0903n353K0566j8482Q255R327r468
368d36m487P817k067r518J0516m282J937L627K640j2466k79O603m885Q225o807
383c862L949j068j487j28n459k697J0402N465j3755J1368j0512l254J1696p462
397f804l321J0648L047j1372J0422j1490m433J4632K060q997O815P604k0159J5633
411D285q15j7123J8420J2656k0745Q745J1403l2269K0749J2360k2435J0143J7380
424B2754j9779j697J9354k7360K642K6742q574j6687K0096p528j9731K7509j2899
$$ plain form
437 4842 -8727 16030 21194 -3745 3416 8532 -7373 4212 8354 4060 80 14312 4562 -11915
451 -11915 2666 4415 -4711 4080 17442 -5647 -2564 7047 -6848 -6473 8271 5841 -8760 16393
465 16393 5881 -20836 434 10583 -13271 4593 18804 -17406 3224 11521 -19767 -9358
477 -9358 15538 -4001 -7117 18723 -7588 -17002 5826 -346 -15580 11648 8257 -14541 10702
490 10702 379 -18853 -1407 10779 -3715 2258 8403 -3542 -941 -2773 -2773 -4424 10888 10090
504 10090 -4172 255 3675 -2927 -8605 5851 3325 2944 5757 558 -9236 -4045 4242 -12753
518 -12753 3716 11438 -7886 -6645 3705 -12372 -11885 5944 -8008 -691 6653 -7151 -15775
531 -15775 -1047 -2357 -13055 3497 2720 -2308 -2198 -3119 -10684 -2987 2485 -1501 4733 132 3444
$$ packed form
437D842j3569K4757N164k4939P161N116j5905J1585M142m294l980J4232r750j6477
451a1915J4581J749r126Q791J3362k3089L083R611j3895L75J4744k430j4601K5153
465A6393j0512k6717K1270J0149k3854J7864J4211l6210K0630Q297l1288J0409
477i358K4896j9539l116K5840k6311r414K2828o172j5234K7228l391k2798K5243
490A0702j0323j9232J7446J2186j4494N973O145j1945K601j832%j651J5312p98
504A0090j4262M427L420o602n678J4456k526l81K813n199r794N191Q287j6995
518a2753J6469P722j9324J241J0350j6077M87J7829j3952P317P344j3804q624
531a5775J4728j310j0698J6552p77n028J10r21p565P697N472l986O234m601L312
$$ plain form
546 3444 -2741 -6978 -460 4125 -1630 5145 12918 -8736 -2130 3912 -6500 -1644 10899 -2419
560 -2419 -3170 14242 -9638 -14669 5166 1685 -9111 9273 1777 -16142 7258 -2088 -19316
573 -19316 460 10917 -11013 1233 8755 -17287 -5826 7183 -5438 -7318 14150 1216
585 1216 -8650 7708 -686 -11863 4607 16980 -5851 2996 12208 -5766 -2936 10438 592
598 592 -7031 18992 9500 -10086 3719 7703 -12320 4096 17880 -14555 3052 16926 -13499
611 -13499 -11084 12629 -8962 -10490 20435 -5241 -17440 8544 -426 -22652 8222 7487 -21976
624 -21976 9134 10732 -21488 -6960 12235 -13270 -2556 15077 -9453 -5276 10451 -1931
636 -1931 -14611 9238 7969 -5131 7862 6371 -6158 454 10598 -5305 3165 13036 2301
$$ packed form
546C444o185m237O518M585n755O775P773k1654O606O042j0412M856J2543j3318
560b419p51J7412k3880n031J9835l481j0796J8384p496j7919K3400r346j7228
573a9316J9776J0457k1930J2246P522k6042J1461J3009j2621j880K1468j2934
585A216r866J6358q394j1177J6470J2373k2831Q847R212j7974K830J3374r846
598E92p623K6023r492j9586J3805L984k0023J6416J3784l2435J7607J3874l0425
611a3499K415K3713k1591j528L0925k5676j2199K5984q970k2226L0874p35k9463
624b1976L1110J598l2220J4528J9195k5505J0714J7633k4530M177J5727j2382
636a931j2680K3849j269j3100J2993j491j2529O612J0144j5903Q470R871j0735
$$ plain form
649 2301 -1599 6681 5306 -8779 8103 10296 -3389 4940 11057 -8787 -1010 15331 -9877 -2749
663 -2749 15886 975 -9396 8875 552 -12542 10868 3988 -10374 5589 9653 -13548 -1030
676 -1030 8491 -10080 129 7509 -1925 -5109 3306 -3899 -2512 3289 -2845 -479 1460 3034 -4900
691 -4900 -2641 -248 1841 415 -2387 2984 -1655 -38 -767 -2012 -1821 5640 -718 -5193 7584
706 7584 -2354 -6311 3187 4074 -5872 3401 3998 -8194 4084 3984 -7648 -3499 10759 -2109 -6279
721 -6279 3544 -1990 -2628 1386 1225 -7312 2898 3844 -5634 -3977 688 -395 -4923 3719 -1541 -5442
737 -5442 -862 2112 -5360 -3283 3973 -7073 1050 4158 -7535 -6660 7072 -2573 -7771 7832
751 7832 -3555 -7207 5588 1351 -12667 5041 6374 -12692 4646 6583 -12140 -3525 12450
$$ packed form
649B301l900Q280j375j4085J6882K193j3685Q329O117j9844P777J6341k5208P128
663b749J8635j4911j0371J8271q323j3094K3410o880j4362J5963M064k3201J2518
676a030R521j8571J0209P380r434l184Q415p205J387N801o134K366J939J574p934
691d900K259K393K089j426k802N371m639J617p29j245J91P461o358m475J2777
706G584r938l957R498Q87r946R273N97j2192J2278j00j1632M149J4258j2868m170
721f279R823n534o38M014j61q537J0210R46r478J657M665j083m528Q642n260l901
737e442M580K974p472K077P256j1046Q123L108j1693Q75J3732r645n198J5603
751G832j1387l652J2795m237j4018J7708J333j9066J7338J937j8723Q615J5975
$$ plain form
764 12450 -8408 -5449 9585 -6470 -4698 7352 -2315 -12257 7999 3819 -9131 1702 1366
777 1366 -6456 800 5634 -9584 139 5843 -3798 -2636 1560 -1276 -3898 6604 -477 -4499 2316
792 2316 3232 -4629 1035 6337 -6837 2212 7468 -2151 -5307 6273 1236 -4811 8626 929 -6547
807 -6547 4079 7327 -9109 707 7828 -6186 2427 5155 -6090 -4130 7957 -3762 -3296 5258
821 5258 -3673 -1396 3142 -2815 -7083 6169 -574 -4184 5368 -2316 -4930 3103 2186 -6545 4604
836 4604 2766 -2394 2941 846 -1883 -881 5248 1247 2442 1020 1946 2316 -474 2738 1292 2192
852 2192 2382 6590 -1571 -2174 4296 261 1255 2610 2076 -864 4586 -1523 -3188 1438 -24 2977
868 2977 502 -1028 -1339 2317 -4400 -2140 2303 -1760 1534 998 -1946 -4432 2149 -2798 -2072 3291
$$ packed form
764A2450k0858K959J5034j6055J772J2050r667r942K0256m180j2950J0833l36
777A366p822P256M834j5218R723N704r641J162M196k836k622J0502p081m022O815
792B316R16p861N664N302j3174R049N256r619l156J1580n037o047J3437p697p476
807f547J0626L248j6436R816P121j4014Q613K728j1245J960J2087j1719M66Q554
821E258q931K277M538n957m268J3252o743l610R552p684k614Q033r17q731J1149
836D604j838n160N335k095k729J002O129m001J195j422R26L70k790L212j446R00
852B192J90M208q161o03O470m035R94J355n34k940N450o109j665M626j462L001
868B977k475j530l11L656o717K260M443m063L294n36k944k486O581m947P26N363
$$ plain form
884 3291 -850 415 -298 -2533 -2919 2914 -3762 312 5274 -3797 -236 1188 -4902 -3644 7024
899 7024 -3216 -3834 5797 -2504 -5385 -18 -1238 -6414 5599 705 -6904 353 -896 -5358 -2985
914 -2985 473 -4269 3065 -797 -5847 -1958 -1956 -2177 -2345 1093 -1648 1961 -1504 -3867 -1413 -84
930 -84 1503 -907 2942 1035 1453 -2207 23 1838 -327 5105 3206 833 1305 4564 -3236 856
946 856 6552 616 3771 4601 570 -1833 4864 -623 428 5432 1473 3188 1922 -2080 -2090 5935
962 5935 -1328 -245 6318 -915 -805 2476 -2404 -5449 7789 1205 -4215 4585 636 -4344 -291
977 -291 1442 -4489 5081 2579 -4028 968 622 -3642 -2033 3624 -2364 2405 2365 -3701 -2334 1172
993 1172 -1454 -3456 4696 -240 -1089 -397 -1173 -2917 -1522 2395 -1937 398 1780 -302 -5821 832
$$ packed form
884C291m141J265p13k235l86N833o676M074M962r071L561J424o090J258J0668
899G024j0240o18R631q301k881N367j220n176J2013m894p609P257j249m462K373
914b985L458m742P334l862n050L889Kk21j68L438k741L609l465k363K454J329
930h4J587k410L849j907M18l660K230J815k165N432j899k373M72L259p800M092
946H56N696n936L155Q30m031k403O697n487J051N004l959J715j266m002j0Q025
962E935p263J083O563p233J10L281m880l045J3238o584n420Q800l949m980M053
977b91J733n931R570k502o607M996l46m264J609N657n988M769m0o066J367L506
993A172k626k002Q152m936q49O92p76j744J395L917m332K335J382k082n519O653
$$ plain form
1009 832 724 -4612 3726 2158 -3331 -1228 3833 -6185 -2634 6018 -1932 -1334 4796 -842 -7250
1024 -7250 5082 -834 -4818 5815 1680 -3601 2258 1496 -7603 3279 2853 -3694 2588 3335 -4030
1039 -4030 -2421 4546 -5462 -1052 5253 -796 -2768 2031 -1046 -5654 2242 -273 -815 -537 1112
1054 1112 -1087 -3668 -313 -2278 -671 412 1973 -3410 -1306 436 -3045 -1207 -372 422 -927
1069 -927 3285 -3277 -4105 2813 -459 -2728 1467 3258 -2998 2034 -674 -3053 1978 1905 -546 83
1085 83 3976 -1514 -62 -378 539 2245 1041 846 631 2699 -1733 520 -478 1828 3543 -1012 224
1102 224 2168 271 -2841 3763 -1076 -1174 5221 -547 -3993 1919 2528 -5733 3369 2670 -4425 1666
1118 1666 2986 -4680 -2163 4468 -3770 879 2963 -3624 -1881 3655 -1963 -5248 5124 26 -2564
$$ packed form
1009H32j08n336Q338j568n489K103N061j0018L551Q652p950N98O130n638o408
1024g250J2332n916l984J0633m135n281N859p62r099J0882m26o547O282P47p365
1039d030J609O967j0008M410O305o049j972M799l077m608P896k515n42K78J649
1054A112k199k581L355j965J607J083J561n383K104J742l481J838Q35P94j349
1069i27M212o562q28O918l272k269M195J791o256N032k708k379N031p3k451O29
1085H3L893n490J452l16R17J706j204j95k15K068m432K253r98K306J715m555J236
1102B24J944j897l112O604m839r8O395n768l446N912O09q261R102o99p095O091
1118A666J320p666K517O631q238M649K084o587J743N536n618l285J0372n098k590
$$ plain form
1133 -2564 1346 222 -3691 1325 2611 -4697 1555 3720 -1028 -4331 2956 1374 -3328 2625 1034
1148 1034 -1102 1215 2925 -5484 892 6185 -2977 -1156 4985 450 -3961 5824 -1180 -3659 7691
1163 7691 2121 -5685 4122 5932 -7175 3715 5950 -4041 2210 7081 -2807 -1923 8299 -2533
1177 -2533 -751 7691 787 -3062 6598 2196 -5246 6312 2823 -2089 3374 4675 -3103 55 5452
1192 5452 -3037 -255 4871 979 -4170 3385 1420 -4640 1538 1149 -2097 -672 3350 -5280 -3276
1207 -3276 3406 -2857 -4467 1434 79 -6185 2165 -2386 -6958 1425 939 -5709 -1647 2878 -6697
1222 -6697 -1690 1450 -4361 -2592 3065 -1920 -4521 3348 -3108 -2931 1834 217 -2547 1198 1245 -2876
1238 -2876 1276 -425 -510 94 2523 28 -1338 996 -22 724 -1224 1925 281 14 1576 -190
$$ packed form
1133b564L910j124l913N016J286p308O252K165m748l303P287j582m702N953j591
1148A034k136K317J710q409O376N293r162J821O141m535m411R785p004k479J1350
1163G691n570p806R807J810j3107J0890K235r991O251M871r888Q84J0222j0832
1177b533J782Q442o904l849R660m402p442J1558l489m912N463J301p778L158N397
1192E452q489K782N126l892n149P555j965o060O178l89l246J425M022q630K004
1207c276O682o263j610N901j355o264Q350m551m572Q383m86o648M062M525r575
1222f697N007L140n811J769N657m985k601P869o456J77M765j617k764L745M7m121
1238b876M152j701q5O04K429k495j366K334j018P46j948L149j644k67J562j766
$$ plain form
1254 -190 -2087 564 3474 -2968 1169 1817 -1658 -474 1707 -1191 -1886 3865 -1167 -842 1491 -43
1270 -43 -2370 1710 1865 -2542 2399 745 -577 -157 1494 -1023 -264 3154 -101 -493 -102 1897 -1861
1287 -1861 666 2089 -1665 255 1968 -138 -3909 2210 -294 -2164 1917 111 -4022 132 2819
1302 2819 -6069 -598 2075 -2959 -982 1558 -4298 -3491 4238 -3608 -3448 2383 -406 -4104 1382
1317 1382 -542 -5365 3105 517 -3189 780 2272 -3673 -831 2974 -2454 294 1989 314 -1559
1332 -1559 2311 -684 -2392 3054 1407 -559 -290 2276 -1547 -32 1376 -1272 195 2348 1030
1347 1030 -3473 1676 -209 -1958 1327 733 -2123 419 2764 -4148 -745 1092 -1299 -400 2003
1362 2003 -1580 -2405 3315 -2322 -2079 1731 632 -1339 1980 232 -3127 2563 -91 -1007 1376 2294
$$ packed form
1254a90j897K651K910o442M137O48l475J184K181k898o95N751n032L25K333j534
1270d3k327M080J55m407M941j654j322M20J651k517P59L418l255l92L91J999l758
1287a861K527J423l754J920J713k106l771O119k504j870M081j806m133M154K687
1302B819q888N471K673n034J977K540n856Q07P729p846J60N831k789l698N486
1317A382j924m823Q470k588l706L969J492n945K842L805n428K748J695j675j873
1332a559L870k995j708N446j647j966K69K566l823J515J408k648J467K153j318
1347A030m503N149j885j749L285n94k856K542K345o912L403J837k391Q99K403
1362B003l583q25N720n637K43L810j099j971L319j748l359N690k654r16K383R18
$$ plain form
1378 2294 -1174 735 1847 -2173 1482 1341 573 875 2744 -718 -400 2297 -344 1236 1052 1831
1394 1831 61 1611 436 -895 1086 1372 1752 -554 1877 304 -146 637 540 83 771 2841 -1205
1411 -1205 348 476 -196 -161 1163 199 -566 2609 -1331 -619 371 -33 -607 1471 409 -1830 1787
1428 1787 -1271 -1136 327 740 -1225 724 1012 -2178 438 -835 -257 -280 880 -535 -230 49 -1247
1445 -1247 476 -1599 421 768 -65 -733 599 -636 -1679 2207 -849 -379 1251 630 -1696 545
1461 545 576 -2084 1888 415 -559 147 1001 -1862 68 1324 -1742 1299 912 -399 -958 1099 -1004
1478 -1004 -603 1987 -350 -220 324 1125 -2025 89 1138 -680 260 1137 408 -2410 1645 258 -1283
1495 -1283 580 1438 -969 -544 2220 -2923 -636 1682 -434 -1520 1501 -520 -2487 1689 -1636
$$ packed form
1378B294l468J909J112m020L655j41p68L02J869l462L18K697k641J580j84P79
1394A831j770J550j175j331J981K86L80k306K431j573m50P83r7m57O88K070m046
1411a205J553J28o72L5J324r64p65L175l940P12R90m04n74K078j062k239L617
1428A787l058J35J463M13j965J949K88l190K616j273N78k3J160j415L05K79j296
1445a247J723k075K020L47q33o68J332j235j043L886l056M70J630o21k326K241
1461E45L1k660L972j473r74P06Q54k863J930J256l066L041l87j311n59K057k103
1478a004M01K590k337J30N44Q01l150K114J049j818R40Q77p29k818M055j387j541
1495a283J863Q58k407M25K764n143K287K318k116j086L021k021j967M176l325
$$ plain form
1510 -1636 -1593 883 425 -2507 347 47 -3663 799 -278 -1902 -253 1066 -3058 -1172 1284 -3033
1526 -3033 -954 879 -135 -2281 968 -1000 -2157 865 -480 -929 -349 1793 -1531 -539 242 -335
1542 -335 33 433 985 -1010 1467 -352 -348 803 511 57 842 1705 -1508 980 565 -397 513 1822
1560 1822 -334 -362 2972 -1495 -727 1722 823 -1097 1846 940 -1854 1657 -98 -787 347 1779
1576 1779 -1092 135 1468 -1635 195 288 38 -80 1272 -1238 -294 1154 -1535 -77 292 548 -992
1593 -992 918 -482 -1339 822 -248 -480 -213 1515 -1313 -178 330 -479 -327 8 1109 -1006 404
1610 404 -147 -222 -470 737 207 -739 1587 -278 -171 -381 858 -123 337 873 -408 865 -344 237
1628 237 -407 929 -88 350 1000 -716 516 -387 367 -356 966 10 -177 418 -325 69 -1038 875
$$ packed form
1510a636M3K476m58k932K854l00l710M462j077j624J649J319m124J886K456m317
1526c033K079J833j014k146L249j968j157L022j345m49N80K142l324R92P81n77
1542c35L68M00N52j995K477j819MJ151k92m54P85Q63l213K488m15r62R10J309
1560A822k156k8L334m467P68K449q99j920K943r06k794L511j755o89J134J432
1576A779k871J227J333l103J830R3k50j18J352k510R44J448k689J458L69K56j540
1593i92J910j400q57K161j070k32K67J728k828J135N08q09J52L35J101k115J410
1610D04n51p5k48J207n30r46K326j865J07k10J239r81M60N36j281J273j209N81
1628B37o44J336j017M38O50j716J232r03P54p23J322r56j87N95p43L94j107J913
$$ plain form
1646 875 -252 246 -210 259 -408 -955 1145 -1001 9 772 532 -1515 584 684 -1720 1165 761
1663 761 -432 -551 1918 -960 -793 1872 -411 86 1310 1047 -1390 1439 272 -803 1359 745
1679 745 -36 217 1939 -1208 231 1399 -227 190 1507 465 -1527 2097 -61 -945 1228 1524
1695 1524 -918 32 2413 -1874 -259 1817 -30 -1194 2502 378 -2043 2537 161 -1400 1037
1710 1037 2380 -1645 528 2164 -1942 573 1757 -597 -1056 3030 -937 -1587 2112 -751 -1194 849
1726 849 865 -2362 1274 148 -2500 110 764 -1621 -1314 1878 -2142 -1496 516 -1346 -1880 540 1
1743 1 -2892 748 -257 -2132 -997 726 -1282 -1270 1558 -1802 -914 372 -309 -1698 947 231 -1654
1760 -1654 1158 -240 -1088 -348 1414 -1153 104 1200 -1360 248 505 -530 -1244 1966 -198 -986
$$ packed form
1646H75j127M98m56M69o67n47K100k146J010P63k40k047K099J00k404K885m04
1663G61j193j19K469k878J67K665k283M97J224k63k437K829j167j075K162o14
1679G45p81K53J722l147J439J168j626M17J317j042j992L624k158q84K173K96
1695A524k442R50K381m287J615K076j847j164L696k124k421M580k376j561K437
1710A037J343m025K173J636m106K515J184k354m59M086l967o50L699k863m43K043
1726H49J6l227L636j126k648K610O54k385L07L192m020O46K012j862n34K420n39
1743Ak893L640j005j875J135J723k008J2K828l360Q88J286o81j389K645p16j885
1760a654K812j398q48P40J762k567J257J096k560J608K57j035p14L210k164p88
$$ plain form
1776 -986 741 -263 -544 -342 773 -1299 578 207 -892 -453 -138 -74 -1231 648 -507 -100 -683
1793 -683 -270 -417 -587 535 -918 274 -164 193 -1052 -158 298 -716 454 -241 223 -713 818 -682
1811 -682 -429 768 -212 202 -147 538 -1014 742 248 -199 329 523 385 -589 1115 -627 339 813
1829 813 559 -122 614 1288 -740 1006 617 565 202 1551 136 -333 1935 -218 218 1164 1328 -663
1847 -663 1110 918 -955 1229 598 -110 5 1905 -1059 -412 1315 -908 -280 664 164 -1530 1355
1864 1355 -546 -1635 451 -95 -1021 -534 879 -2043 -225 254 -1311 -806 645 -419 -1764 1249
1880 1249 -1120 -1048 178 22 -1180 51 998 -2021 177 176 -832 -1011 1161 -546 -1321 1271 -992
1897 -992 -833 98 396 -1712 636 502 -1823 364 28 -870 -819 1282 -1316 -407 1076 -1154 -508 477
$$ packed form
1776i86J727j004k81K02J115k072J877l71j099M39L15O4j157J879j155M07n83
1793f83M13j47j70J122j453J192m38L57j245Q94M56j014J170o95M64r36J531j500
1811f82K53J197r80M14l49O85j552J756m94m47N28J94j38r74J704j742R66M74
1829H13k54o81P36O74k028J746l89n2l63J349j415m69K268k153M36R46J64j991
1847f63J773j92j873K184o31p08J15J900k964O47J727k223O28R44n00j694K885
1864A355j901j089K086n46r26M87J413k922J818M79j565N05J451j064j345L013
1880A249k369P2J226j56j202J231R47l019K198jj008j79K172j707p75K592k263
1897i92J59R31K98k108K348j34k325K187l36q98N1K101k598R09J483k230O46R85
$$ plain form
1915 477 424 -1240 1584 40 -772 1011 260 -246 221 1789 -815 894 1003 -179 389 1077 542 -442
1933 -442 1959 169 17 540 791 -117 302 1035 -809 705 151 -294 -905 462 -187 -802 424 -1040
1951 -1040 -458 -553 -37 -1546 -86 -151 -1167 -191 -902 -421 -1039 173 -1199 -416 84 -863 -370 -590 165
1970 165 -796 516 -479 -150 142 -123 178 -565 874 -165 535 -197 480 182 -184 616 -296 809 310
1989 310 578 -499 580 652 -296 507 158 671 -98 967 -428 288 893 6 548 368 915 -218 1115
2008 1115 55 333 979 736 573 394 1459 -328 1101 676 483 630 950 804 -377 1313 264
2025 264 288 332 1012 -126 -11 1061 -890 344 266 125 -869 795 61 -1100 521 -621 -524 -93 634
2044 634 -1473 93 419 -1393 -133 26 -419 -784 1122 -1116 -545 832 -695 -630 226 634 -1288
$$ packed form
1915D77n3j664K824j544q12J783p51n06M67J568k604J709J09j182N68O88n35r84
1933d42K401j790j52N23K51r08M19P33j844J514n54m45o11J367o49o15J226j464
1951a040N82r5N16j509J460o5j016R76p11M81o18J212j372P83N00r47M93k20P55
1970A65r61J312r95L29K92k65L01p43J439j039P00p32O77k98l66Q00r12J105m99
1989C10K68j077J079P2r48Q03l49N13p69J065j395P16O05q87N42j80N47j133J333
2008A115j060K78O46k43j63j79J065j787J429m25j93J47L20j46j181J690j049
2025B64K4M4O80j138J15J072j951J234p8j41r94J664p34j161J621j142R7M31P27
2044F34k107J566L26j812J260J59m45l65J906k238N71J377j527O5Q56M08j922
$$ plain form
2061 -1288 919 75 -845 297 455 -515 -483 1236 -1140 -18 256 -349 -669 301 165 -1110 665 -460
2079 -460 -658 -596 461 -873 -425 664 -1171 -232 -166 -243 -1002 701 -182 -1046 723 -339 -595 -287 765
2098 765 -1138 364 674 -1092 226 325 -86 -614 1414 -583 -190 681 -257 -199 -3 535 -834 797
2116 797 -68 -358 -17 -38 -136 -425 568 -651 153 -272 -64 -304 -248 438 -665 391 -246 134 -508 529
2136 529 -101 -354 796 -56 331 -144 748 -493 590 705 -213 448 470 443 -483 1115 -94 356 765
2155 765 -41 352 176 560 -574 832 -7 253 172 98 100 -264 653 -592 389 29 322 -273 -363 293 -518
2176 -518 280 -337 368 -629 384 -112 -574 324 -256 -8 -249 876 -759 227 523 -784 179 383 245
2195 245 -679 1042 -351 -169 545 -194 -254 267 889 -1002 759 208 -196 290 480 -44 2 1263 -748
$$ packed form
2061a288K207q44r20J142J58r70L2J719k376J122K74o05l20R70j36j275J775j125
2079d60j98O2J057j334M48J089j835R39O6p7p59J703q83q64J769j062k56L08J052
2098G65j903J502L10j766J318R9m11n28K028j997L93Q71r38N8J96N38j369J631
2116G97q65k90L41k1r8k89R93j219Q04m25K08k40N6O86j103J056o37L80o42J037
2136E29o30k53J150q52L87m75Q92j241J083J15r18O61K2k7r26J598j209M50M09
2155G65q06L93j76L84j134J406q39K60q1p4Kl64R17j245R81l60K93n95r0O56q11
2176e18P98o17P05r97J013m96m62Q98n80K48k41J125j635R86K96j307R63K04j38
2195B45r24J721j393J82P14p39o0N21O22j891J761n51m04M86J90n24M6J261k011
$$ plain form
2214 -748 376 346 407 -14 517 702 -345 808 136 146 78 1186 -63 13 1160 -89 242 239 746 -584
2234 -584 807 690 -547 450 472 -291 -340 1268 -1006 -40 801 -728 -448 315 -127 -1305 1009 -598
2252 -598 -903 222 -337 -964 -278 500 -1722 232 -150 -841 -404 112 -578 -621 626 -901 -174 -229 140
2271 140 -614 -104 328 -601 394 -283 17 -588 516 -113 -438 439 -122 -26 -414 739 -610 301 469
2290 469 -434 283 295 -26 -538 1106 -472 82 767 -110 -23 441 450 -670 1286 130 -112 566 254 112
2310 112 141 723 -342 833 53 224 186 -31 115 92 439 -491 635 -317 -42 133 -380 -223 -128 35
2330 35 -789 394 -810 -471 -81 -464 -493 -386 -63 -992 314 -736 -691 -3 -40 -478 -314 359 -962 490
2350 490 -125 -215 8 302 -1 -133 565 -463 456 -83 558 102 130 451 -98 219 -228 570 -408 283
$$ packed form
2214g48J124l0O1m21N31J85j047J153o72J0o8J108j249P6J147j249L31lN07j330
2234e84J391j17j237R97K2p63m9J608k274R66Q41j529K80P63m42j178K314j607
2252e98l05J125n59o27O86P78k222J954l82o91M37N16o90m3J247j527P27n5L69
2271A40p54N10M32r29R95o77L00o05J104o29l25Q77n61R6l88J153j349R11J68
2290D69r03P17J2l21n12J644j578N54O85q77Q7M64Rj120J956j156k42O78l12j42
2310A12K9N82j065J175p80J71l8k17J46k3L47r30J126r52K75J75n13J57R5J63
2330C5q24J183j204L39L90l83k9J07L23r29J306j050M5O88l7m38J64O73j321J452
2350D90o15r0K23K94l03j32O98j028R19n39O41m56K8L21n49L17m47P98r78O91
$$ plain form
2370 283 91 -291 -12 -54 -8 -720 631 -952 -301 38 -718 -595 -382 -370 -1211 288 -998 -835 -161 -554
2390 -554 -923 -326 -66 -1470 245 -490 -816 -227 -51 -741 -501 356 -1051 18 -160 -313 -487 136 -169
2409 -169 -549 353 -619 99 -274 110 -390 -204 131 -295 64 -491 188 -515 206 -12 -311 92 47 91 -271
2430 -271 737 -528 282 474 23 194 579 337 -378 1345 -31 212 893 480 66 843 1010 -510
2448 -510 1244 595 90 544 700 14 446 1163 -460 749 356 79 -15 678 111 -117 853 -486 172
2467 172 -9 103 -374 144 -19 -433 395 -475 145 -415 94 -141 -49 42 -248 106 -563 471 -470 -11
2487 -11 190 -21 -225 91 283 -598 720 -126 51 208 159 -222 71 510 -640 646 98 -30 85 355
2507 355 -247 104 741 -533 564 252 101 22 428 -40 32 957 -253 538 272 286 256 503 104 140 802
$$ packed form
2370B83j92l82K79m2M6p12J351j583O51L39p56J23K13J2q41J499j286J63O74l93
2390e54l69N97K60j404J715p35l26N89J76o90K40Q57j407J069j78j53j74O23l05
2409a69l80R02r72P18l73L84n00J86L35m26L59n55O79p03P21k18k99M03m5M4l62
2430b71J008j265Q10J92m51J71L85k42p15J723j376K43O81m13m14P77J67j520
2448e10J754o49n05M54J56o86M32P17j623J209l93k77r4O93n67k28R70j339O58
2467A72j81J12m77N18j63m14Q28q70O20n60N09k35R2R1k90L54o69J034r41M59
2487a1K01k11k04L16J92q81J318q46J77J57m9l81K93M39j150J286n48j28J15K70
2507C55o02L51O37j274J097l12j51p9M06m68P2R25j210P91k66J4l0K47l99L6O62
$$ plain form
2528 802 -219 720 166 349 314 633 59 162 709 -360 631 35 51 139 389 -80 -198 500 -734 279
2548 279 -188 -277 -403 92 -485 -559 209 -979 -64 -425 -397 -596 -156 -511 -524 -35 -837 -188 -617 -292 -508
2569 -508 -357 -462 -475 -7 -727 178 -374 -280 -253 -114 -475 -244 151 -685 478 -199 -341 43 240 -412 59
2590 59 714 -674 471 124 -317 -83 521 -236 -49 782 -675 227 233 1 -285 728 -84 -289 897
2609 897 -530 100 157 279 -311 526 -11 -291 575 -325 135 -102 273 -389 36 44 -298 89 -390 245 -503
2630 -503 20 -97 -7 -365 -258 55 -806 483 -240 -396 -55 187 -545 -132 489 -843 411 165 -204
2649 -204 -121 517 -376 -252 875 -541 233 466 -6 -484 727 -129 -367 1016 -302 -22 120 355 -466
2668 -466 426 220 -180 535 -168 264 -106 496 -178 344 185 50 400 -388 452 180 180 146 597 -61 179
$$ packed form
2528H02j021R39n54J83l5L19n74J03N47j069R91n96J6Q8K50m69j18O98j234J013
2548B79m67q9j26M95n77p4P68j188R15l61K8j99M40l55j3M89q02O49m29L25k16
2569e08J51j05j3M68p20R05n52R4K7J39l61K31L95q36J163o77j42L84J97o52M71
2590E9O55j388J145l47m41K34O04p57J87Q31j457R02Ok32k86J013q12k05J186
2609H97j427O30N7J22n90Q37n37k80Q66r00M60k37L75o62M25Ql42L87m79O35p48
2630e03N23j17R0l58J07L13q61J289p23j56L41K42p32M13O21j332J254k46l69
2649b04Q3O38q93J24J127j416P74K33m72m78J211q56k38J383j318K80J42K35q21
2668d66Q92k06m00P15p03M32l70O02o74N22j59j35L50p88Q40k72%l4M51o58K40
$$ plain form
2689 179 678 -486 427 318 91 -173 728 -191 -202 782 -686 206 259 -52 -352 593 -295 -665 418 -399
2709 -399 -213 -89 104 -679 23 -137 -624 172 -351 19 -506 60 -357 -11 -222 -182 334 -602 335 -35
2729 -35 10 -80 492 -189 117 919 -313 454 520 394 37 1044 278 66 1301 -33 255 646 619 -195
2749 -195 1099 242 -246 992 58 33 238 654 -445 520 415 -398 418 62 71 -228 506 -192 158 226
2769 226 -161 128 -160 500 -140 85 -34 386 -124 171 409 -416 510 113 -6 -285 461 -256 -155 635
2789 635 -609 53 214 -167 -656 617 -399 -756 598 -526 -547 52 33 -1043 338 -295 -988 262
$$ packed form
2689A79M99j164R13j09k27k64R01r19j1R84j468Q92N3l11l00R45q88l70J083q17
2709c99J86J24J93p83P02j60m87P96n23L70n25N66m17L46k11M0N16r36R37l70
2729c5M5r0N72o81L06Q02j232P67O6j26l57J007p66k12J235j334K88L91k7q14
2749a95J294q57m88J238r34k5K05M16j099R65j05q13Q16l56Rk99P34o98L50O8
2769B26l87K89k88O60o40K25j19M20n10K95K38q25R26l97j19k79P46p17J01P90
2789F35j244O62J61l81m89J273j016l57J354j124k1N99j9j076J381o33o93J250
$$ [...]
8191c6
##END NTUPLES=NMR FID
##END=
