##TITLE=1H_TG-2306-1
 CDCl3, 8 sc, 
 27.10.2020
##JCAMPDX= 6.0         $$ Bruker NMR JCAMP-DX V2.0
##DATA TYPE= NMR FID
##DATA CLASS= NTUPLES
##ORIGIN= UXNMR, Bruker Analytische Messtechnik GmbH
##OWNER= root
$$ XWIN-NMR		Version 3.5
$$ Tue Oct 27 10:48:14 2020 Russian Standard Time (UT+4h)  she@DPX200
##.OBSERVE FREQUENCY= 200.1315066352
##.OBSERVE NUCLEUS= ^1H
##.DELAY= (6, 6)
##.ACQUISITION MODE= SIMULTANEOUS
##.ACQUISITION SCHEME= undefined
##.AVERAGES= 8
##.DIGITISER RES= 18
##SPECTROMETER/DATA SYSTEM= spect
##.PULSE SEQUENCE= zg30
##.SOLVENT NAME= D2O
##.SHIFT REFERENCE= (INTERNAL, D2O, 0, 15.7039)
##AUDIT TRAIL= $$ (NUMBER, WHEN, WHO, WHERE, WHAT)
$$ ##TITLE= Audit trail, XWIN-NMR		Version 3.5
$$ ##JCAMPDX= 5.01
$$ ##ORIGIN= Bruker BioSpin GmbH
$$ ##OWNER= she
$$ F:/spectra/data/she/nmr/H-F/1/audita.txt
$$ ##AUDIT TRAIL=  $$ (NUMBER, WHEN, WHO, WHERE, WHAT)
(   1,<2020-10-27 10:47:05.43 +0400>,<she>,<DPX200>,
      <created by zg, POWCHK disabled, PULCHK disabled
       configuration hash MD5:
       00 E9 B6 7A A2 85 ED C7 34 08 36 98 17 FE 4E 26
       data hash MD5: 16K
       3D D4 3A 0A CE D6 D1 59 48 48 67 80 F8 01 3B 6A>)
$$ ##END=
$$ 
$$ hash MD5
$$ BE 77 51 2F A0 6B B5 18 D3 90 96 40 25 44 48 15
##$RELAX= 
##$RELAX= 
##$RELAX= 
##$RELAX= 
##$RELAX= 
##$RELAX= 
$$ Bruker specific parameters
$$ --------------------------
##$DU= <F:/spectra>
##$EXPNO= 1
##$NAME= <H-F>
##$PROCNO= 1
##$TYPE= <nmr>
##$USER= <she>
##$AMP= (0..31)
100 100 100 100 100 100 100 100 100 100 100 100 100 100 100 100 100 100 
100 100 100 100 100 100 100 100 100 100 100 100 100 100 
##$AQSEQ= 0
##$AQ_mod= 1
##$AUNM= <au_zg>
##$AUTOPOS= <>
##$BF1= 200.13
##$BF2= 200.13
##$BF3= 200.13
##$BF4= 200.13
##$BF5= 200.13
##$BF6= 200.13
##$BF7= 200.13
##$BF8= 200.13
##$BYTORDA= 1
##$CFDGTYP= 0
##$CFRGTYP= 5
##$CHEMSTR= <none>
##$CNST= (0..31)
1 1 145 1 1 1 1 1 1 1 1 1 1 1 1 1 1 1 1 1 1 1 1 1 1 1 1 1 1 1 1 1 
##$CPDPRG= <>
##$CPDPRG1= <>
##$CPDPRG2= <>
##$CPDPRG3= <>
##$CPDPRG4= <mlev>
##$CPDPRG5= <mlev>
##$CPDPRG6= <mlev>
##$CPDPRG7= <mlev>
##$CPDPRG8= <mlev>
##$CPDPRGB= <>
##$CPDPRGT= <>
##$D= (0..31)
0 1.2 0 0 0 0 0 0 0 0.06 0 0.03 0 0 0 0 0.0002 0 0 0 0 0 0 0 0 0 0 0 0 
0 0 0 
##$DATE= 1603781224
##$DBL= (0..7)
120 120 120 120 120 120 120 120 
##$DBP= (0..7)
150 150 150 150 150 150 150 150 
##$DBP07= 0
##$DBPNAM0= <>
##$DBPNAM1= <>
##$DBPNAM2= <>
##$DBPNAM3= <>
##$DBPNAM4= <>
##$DBPNAM5= <>
##$DBPNAM6= <>
##$DBPNAM7= <>
##$DBPOAL= (0..7)
0.5 0.5 0.5 0.5 0.5 0.5 0.5 0.5 
##$DBPOFFS= (0..7)
0 0 0 0 0 0 0 0 
##$DE= 6
##$DECBNUC= <off>
##$DECIM= 32
##$DECNUC= <off>
##$DECSTAT= 4
##$DIGMOD= 1
##$DIGTYP= 9
##$DL= (0..7)
0 120 120 120 120 120 120 120 
##$DP= (0..7)
150 150 150 150 150 150 150 150 
##$DP07= 0
##$DPNAME0= <>
##$DPNAME1= <>
##$DPNAME2= <>
##$DPNAME3= <>
##$DPNAME4= <>
##$DPNAME5= <>
##$DPNAME6= <>
##$DPNAME7= <>
##$DPOAL= (0..7)
0.5 0.5 0.5 0.5 0.5 0.5 0.5 0.5 
##$DPOFFS= (0..7)
0 0 0 0 0 0 0 0 
##$DQDMODE= 0
##$DR= 18
##$DS= 0
##$DSLIST= <SSSSSSSSSSSSSSS>
$$ [...]
##$SUBNAM2= <"">
##$SUBNAM3= <"">
##$SUBNAM4= <"">
##$SUBNAM5= <"">
##$SUBNAM6= <"">
##$SUBNAM7= <"">
##$SUBNAM8= <"">
##$SUBNAM9= <"">
##$SW= 16.880792210976
##$SWIBOX= (0..15)
0 0 2 0 0 0 0 0 0 0 0 0 0 0 0 0 
##$SW_h= 3378.37837837838
##$TD= 16384
##$TD0= 1
##$TE= 0
##$TE2= 300
##$TE3= 300
##$TEG= 300
##$TL= (0..7)
0 120 120 120 120 120 120 120 
##$TP= (0..7)
150 150 150 150 150 150 150 150 
##$TP07= 0
##$TPNAME0= <>
##$TPNAME1= <>
##$TPNAME2= <>
##$TPNAME3= <>
##$TPNAME4= <>
##$TPNAME5= <>
##$TPNAME6= <>
##$TPNAME7= <>
##$TPOAL= (0..7)
0.5 0.5 0.5 0.5 0.5 0.5 0.5 0.5 
##$TPOFFS= (0..7)
0 0 0 0 0 0 0 0 
##$TUNHIN= 0
##$TUNHOUT= 0
##$TUNXOUT= 0
##$USERA1= <user>
##$USERA2= <user>
##$USERA3= <user>
##$USERA4= <user>
##$USERA5= <user>
##$V9= 5
##$VALIST= <valist>
##$VCLIST= <CCCCCCCCCCCCCCC>
##$VD= 0
##$VDLIST= <DDDDDDDDDDDDDDD>
##$VPLIST= <PPPPPPPPPPPPPPP>
##$VTLIST= <TTTTTTTTTTTTTTT>
##$WBST= 1024
##$WBSW= 4
##$XGAIN= (0..3)
0 0 0 0 
##$XL= 0
##$YL= 0
##$YMAX_a= 217211
##$YMIN_a= -145512
##$ZGOPTNS= <>
##$ZL1= 120
##$ZL2= 120
##$ZL3= 120
##$ZL4= 120
##$ABSF1= 10
##$ABSF2= 0
##$ABSG= 5
##$ABSL= 3
##$ALPHA= 0
##$AQORDER= 0
##$ASSFAC= 0
##$ASSFACI= 0
##$ASSFACX= 0
##$ASSWID= 0
##$AUNMP= <proc_1d>
##$AZFE= 0.1
##$AZFW= 0.1
##$BCFW= 1
##$BC_mod= 2
##$BYTORDP= 1
##$COROFFS= 0
##$CY= 11.3945322036743
##$DATMOD= 1
##$DC= 2
##$DFILT= <>
##$DTYPP= 0
##$F1P= 15.9154993809931
##$F2P= -4.1035820241983
##$FCOR= 0.5
##$FTSIZE= 0
##$FT_mod= 4
##$GAMMA= 1
##$GB= 0.15
##$INTBC= 1
##$INTSCL= 1
##$ISEN= 128
##$LB= 0.24
##$LEV0= 0
##$LPBIN= 0
##$MAXI= 10000
##$MC2= 0
##$MEAN= 0
##$ME_mod= 0
##$MI= 1.114404
##$NCOEF= 0
##$NC_proc= 0
##$NLEV= 6
##$NOISF1= 3.799351
##$NOISF2= 2.8
##$NSP= 1
##$NTH_PI= 0
##$NZP= 0
##$OFFSET= 15.70392
##$PC= 1
##$PHC0= -10689.53
##$PHC1= 11.00088
##$PH_mod= 1
##$PKNL= yes
##$PPARMOD= 0
##$PSCAL= 0
##$PSIGN= 0
##$REVERSE= no
##$SF= 200.130013532006
##$SI= 16384
##$SIGF1= 3
##$SIGF2= 2
##$SINO= 400
##$SIOLD= 16384
##$SREGLST= <1H.CDCl3>
##$SSB= 0
##$STSI= 0
##$STSR= 0
##$SW_p= 3612.71676300578
##$SYMM= 0
##$S_DEV= 0
##$TDeff= 0
##$TDoff= 0
##$TI= <>
##$TILT= no
##$TM1= 0
##$TM2= 0
##$TOPLEV= 0
##$USERP1= <user>
##$USERP2= <user>
##$USERP3= <user>
##$USERP4= <user>
##$USERP5= <user>
##$WDW= 1
##$XDIM= 8192
##$YMAX_p= 0
##$YMIN_p= 0
$$ End of Bruker specific parameters
$$ ---------------------------------
##NTUPLES= NMR FID
##VAR_NAME=  TIME,          FID/REAL,        FID/IMAG
##SYMBOL=    X,             R,               I
##VAR_TYPE=  INDEPENDENT,   DEPENDENT,       DEPENDENT
##VAR_FORM=  AFFN,          ASDF,            ASDF
##VAR_DIM=   8192,          8192,            8192
##UNITS=     SECONDS,       ARBITRARY UNITS, ARBITRARY UNITS
##FACTOR=    0.000296,      1,               1
##FIRST=     0,             0,               0
##LAST=      2.424536,      0,               0
##MIN=       0,             -145512,         0
##MAX=       2.424536,      217211,          0
$$ Real data points
##PAGE= N=1
##DATA TABLE= (X++(R..R)), XYDATA
$$ [...]
2573B526k784J07O9J968k668M19K617l149K045j055J740k856K587j312q05K650
2589B099j931K72q29L028m459J832J479j812K87L53J383l855L853j723l28M68
2605A17R32q99j608L906m208J467J69J086k029J105R37k741K812k147R90r90J968
2622H67j536o75L306l975J444N00J348m167L253N81k879K295k56j28k527M476
2638A927k497m33K055j045l78m36K590m109K967l56p53P25K54k62k116M129l342
2655a080J050N27k16j027P20K048m256L064p01N69j733K412j200k073L373k038
2671e61R41j313K215k838J554J391l195J603k79J004k475L489j652j479K203p66
2687a58L17k093L317l314K097J92o41k85J36P11k532M318l292N11J160M33j133
$$ plain form
2573 2526 -258 -151 -82 1886 -782 -363 2254 -895 1150 95 1835 -1021 1566 254 -551 2099
2589 2099 168 440 -389 2639 -1820 12 1491 -321 -34 319 1702 -2153 1700 -23 -351 117
2605 117 1049 150 -1458 2448 -1760 -293 -124 962 -1067 38 975 -1766 1046 -1101 -111 -1101 867
2622 867 -669 -1344 1962 -2013 -569 -69 1279 -2888 365 946 -1933 362 106 -22 -2549 1927
2638 1927 -570 -1003 1052 7 -371 -807 1783 -2326 641 285 -468 257 511 249 -1867 2262 -1080
2655 -1080 -30 497 281 -746 -26 2022 -2234 830 129 698 -1035 1377 177 -1896 1477 -561
2671 -561 380 -933 1282 -1556 -2 1389 -1806 -203 -482 522 -1953 1536 -116 -1595 608 -158
2687 -158 159 -1934 1383 -1931 166 358 -283 -568 -432 279 -2253 2065 -1227 -716 444 877 -256
2704b56k56K239m025L242K45j74k548K420P31l788L911j237j83j127K915j882
2720B27n40J883k156J431p40K035k977K381q50j087K199j573or35L834l806J186
2737E06J455k310j51J176K062n014L683m26n63k36Q73r44k106M630l195R62l68
2754C4O20j603J287J000l525K851q75R24j817K167j750q73L175k487P53n60K024
2771A345l320K077M93k323J812p68J137k556L623k535n32K099r68Jm72K972m765
2788b680K826P68j476r82J298J663l254L084j875L7k12J750j347q30K724l105
2804a611K914j469M38j807K339l65j718L063k644J040n58K472l576J138K453k869
2820g60Q62M04J468l907K955m83j137J253j95L86k613M056l056J054j80k92m79
$$ plain form
2704 -256 -512 1727 -2298 944 1189 1015 -1533 887 1618 -2170 1741 504 321 -806 2109 227
2720 227 -313 1570 -586 845 105 2140 -837 1544 694 -393 1806 233 227 -708 3126 -680 506
2737 506 1961 -349 -500 676 2738 -2276 1407 981 418 182 1055 111 -1995 2635 -560 402 34
2754 34 654 -949 338 1338 -2187 664 -211 713 -1104 1063 -687 -1560 1615 -872 -119 -679 1345
2771 1345 -1975 102 595 -1728 84 -684 453 -2103 1520 -1015 -1547 552 -416 -415 -887 2085 -2680
2788 -2680 146 914 -562 -1544 -246 1417 -1837 1247 -628 -591 -803 947 -400 -1230 1494 -1611
2804 -1611 1303 -166 272 -1535 804 439 -1279 1784 -860 180 -378 2094 -1482 -344 2109 -760
2820 -760 102 506 1974 -1933 1022 539 -598 655 460 846 -1767 2289 -767 287 107 -185 -664
2837f64P30J787l925L241j569M71k85M04r61o12L308l773J636l72O65j711J766
2854A36L33l021L261j072R9j573K843k159j50K593k497Q28o85K387l530K274L50
2871D17j621J324l61P32k124K942k587P06P76n81J49m20K269l975L334r63o82
2888f65K93J214j74k433L789k763N63N9J604k320M61K393l653K445o49N26k353
2905a663L105p55j813K735j785N74j183K770k974J311R23j840J459r47Q64k395
2921a614L688j968m87J257l20k87j004L232m121K257N44o62p32O52J076l032L128
2938A607j379%o77K284j215j455K774k890J607p62J255k049J711K85k129K284
2954A251j429P77j545K732k699K33J919k273Q10m75J865k941K955r37j239J005
$$ plain form
2837 -664 66 1853 -2072 1169 -400 71 -214 190 -771 -1383 1925 -1848 -212 -584 81 -1630 136
2854 136 469 -2552 709 -363 -264 -1837 1006 -1153 -1303 1290 -1207 -379 -1064 1323 -2207 67 417
2871 417 -1204 120 -241 491 -1633 1309 -1278 -572 204 -377 -228 -648 1621 -2354 980 17 -665
2888 -665 -372 842 668 -1765 2024 -739 -176 -117 1487 -833 -372 2021 -1632 813 164 690 -1663
2905 -1663 1442 687 -1126 1609 -176 398 -785 1985 -989 322 1245 -595 864 -83 781 -1614
2921 -1614 2074 106 -381 876 556 269 -735 2497 -1624 633 1177 515 -217 435 1511 -1521 1607
2938 1607 228 228 -449 1835 620 -835 1939 -951 656 -106 1149 -900 811 1096 -1033 1251
2954 1251 -178 599 -946 1786 -913 -680 1239 -1034 -224 -699 1166 -1775 1180 243 -996 9
2970Ik1J47k357L665k543P64L99m3r76P8K470l690K153q77J082q14O65m18j509
2989a816L323k688J247p91J413j847J375Q58k988K704q61R47k505L054j543p53
3005h71K073j780P62n50K149l262J944M47j568J258n18Q35k743L942k185k50N66
3022B49j83K49j081K754l782K567p5j32j369J089O40k178K870k425J094n82J660
3039A365k073m6K154k987K574p24M05k607L377p47k093K149j002O15j273K792
3055A879k975J032P89j203N15l49J874l063K905j454n78J018LL8j766L146k526
3072g15J278l62j88n70Q68J304l588L218j246M12j208J888r78j179K992k311Q58
3089D73j148J752j762J019K52j683K062j202Q92k146K924j919k21J503j258N57
$$ plain form
2970 9 -12 135 -2222 1443 -1100 -336 63 20 -956 -878 1592 -2098 55 -822 260 -554 111 -307 -1816
2989 -1816 1507 -1181 66 -725 688 -1159 216 1074 -1914 790 -71 876 -1629 1425 -118 -871
3005 -871 1202 -578 184 -366 1783 -1479 465 912 -656 602 84 919 -1824 2118 -67 -317 249
3022 249 66 315 -766 1988 -1794 773 698 566 -803 286 926 -1252 1618 -807 287 -295 1365
3039 1365 -708 -754 1400 -1587 987 263 668 -1939 1438 691 -1402 747 -255 360 -913 1879
3055 1879 -1096 -64 725 -478 37 -312 1562 -1501 1404 -50 -628 390 393 431 -1335 1811 -715
3072 -715 563 201 13 -557 311 1615 -1973 1245 -1 411 -797 1091 113 -1066 1926 -385 473
3089 473 -675 1077 -685 334 586 -1097 965 -237 655 -1491 1433 -486 -707 796 -462 95
3105I5r88K654l607K054j01p08N65j12Q16k305L066k151K02K02M04p09j89K016
3123A204l155K387m50K88j102J478k19j763K862k143R93j155J846j620K87J436
3139A174k110J852j264J225k162K477q69q97J901j681R11j146K344k640J120M35
3155F70p53K83p9J495l101K901j486r4N48L60n08j340L183l094J586o62M96q30
3173d25O84P18k516L064k210J205j058J448j494o1J528k227J330r79J571k104
3189a526J750K01j850J529r05R95j938K484j908M85P72q17N32j074K153l050K312
3206A45o80m05L26J90L76j844L000k492Q87K51N26j233K83J987l152K158m59O41
3224E05j417J951p55j144K324k199J226j009J859k045J198P37j928J307p66J284
$$ plain form
3105 95 -893 1761 -1846 208 107 -601 -36 -148 668 -1637 1429 -722 -520 -318 86 -623 -812 1204
3123 1204 -1951 436 -14 274 -828 650 431 -1332 1530 -613 380 -775 1071 -549 -262 1174
3139 1174 -936 916 -348 877 -1285 1192 323 -574 1327 -354 557 -589 1755 -885 235 670
3155 670 -83 200 121 1616 -1485 1416 -70 -164 384 744 236 -1104 2079 -1015 571 -91 405 -425
3173 -425 259 977 -1539 1525 -685 520 -538 910 -584 -645 883 -1344 -14 -993 578 -1526
3189 -1526 224 425 -1425 104 -801 194 -1744 740 -1168 -683 89 -728 -196 -1270 883 -2167 145
3206 145 -535 -940 -614 -424 -48 -1892 1108 -1384 -497 -246 280 -953 -670 1317 -1835 323 -136 505
3224 505 -912 1039 284 -860 1464 -735 491 -518 1341 -704 494 1231 -697 610 -156 1128
3240A128j965K385j621j22J138j207P66j201K577k724J448j16m90q8K58J065k851
3257a620K888j588O04n30P39n50q90J969k136J504q53M67j036J308N4k221K610
3274G19j592O21q73J639j419j28J586j687J090j217K057k040J515q25m97J356
3290C05j069J040j496K159k195J205O60j235O90n14J627k815K622p31j41n02O97
3307C07K50j831L003k297J106n05Q33q41J5Q07j644K396j522N55j135J847j081
3324B63n83J905k094J242n88J140k170J468M80j712J676q79J013k203K252j470
3340b60L25L71m34N64j323K245k237J299p08N9K38k20P68j696K533k046P14l82
3358a90N99r58r8K178k346J035o33J173j617J392l73r94J819j549J210j237J082
$$ plain form
3240 1128 -837 1548 -73 -195 943 -264 502 -699 1878 -846 602 486 -4 -92 166 1231 -1620
3257 -1620 1268 -320 284 -246 493 -57 -947 1022 -1114 390 -463 4 -1032 276 330 -1891 719
3274 719 -873 -252 -1125 514 -905 -1033 553 -1134 -44 -1261 796 -1244 271 -554 -1051 305
3290 305 -764 276 -1220 939 -1256 -51 609 -626 64 -450 1177 -1638 984 253 112 -390 307
3307 307 557 -1274 1729 -568 538 33 866 25 40 847 -797 1599 77 632 -503 1344 263
3324 263 -320 1585 -509 733 145 1285 -885 583 1063 -649 1027 148 1161 -1042 1210 -260
3340 -260 65 436 2 566 -757 1488 -749 550 -158 -99 139 -81 687 -1009 1524 -522 192 -190
3358 -190 409 -549 -647 1531 -815 220 -413 760 -857 535 162 -832 987 -562 648 -589 493
3375D93j059P56O29j669J266o12J180k300K447j125p70J350o21M45j495K822k282
3392e45P20k99O40m29p04J546j986J912j290N76m23L94L21r99J677k167J372k89
3410B7M17j137O41O94j931J838p92M12j391J973q52l95R82j210J337j563J645
3427F95j878J229M62q52N71l96O35j785K583j845L57O49j90J8q22J737k242J531
3445D57m06K85l90M62M55j414J739j512J210j066O80k12n2J028j914J659r95P87
3463H01j174J237J5j554J774o74O18j611K119j994P13N35q79R32j295J689k098
3480h46J699q27K8N21o59N85j098J798k340J824n55l11j17L94P18k312K144j028
3498c82M65j023J511n31j335J691j430J007j257J501j210R96k06r28J477j236
$$ plain form
3375 493 -566 190 819 -850 416 -196 984 -1316 1131 6 -764 586 -35 410 -1085 1737 -545
3392 -545 175 -124 516 87 -617 929 -1057 855 -435 141 -282 112 433 -566 1111 -1056 316 27
3410 27 444 -693 -52 642 -1289 549 -243 169 -1222 751 -101 -496 486 -724 613 -950 695
3427 695 -1183 46 508 -344 227 -169 466 -1319 1264 -581 -224 425 235 253 -569 1168 -1074 457
3445 457 51 336 -54 408 863 -551 1188 -324 886 -180 500 288 236 1264 -650 1009 14 801
3463 801 -373 864 879 -675 1099 425 1043 -568 1551 -443 270 805 -74 858 -437 1252 -846
3480 -846 853 26 54 575 -84 501 -597 1201 -1139 685 130 -181 -298 96 814 -1498 646 -382
3498 -382 83 -940 571 40 -1295 396 -1034 -27 -1284 217 -993 3 -203 -1131 346 -890
3514h90J251j492J806j560O15P82j365Q32p59J461j892J776m35n98M24l93R87
3531E50j764K159j377O96k56K08j21n24J038j804K007p42N30q60Q02j22q55J706
3549A271j817J193q43J333j230k69J003j171J944j825J184j516J358m86k69N75
3565D35j291J530j274J312j815R63K29p69N47l35J260k060J688q32J32j07K52
3582a35Rj003J840j664R64q65P84n80p3R36j149J326j342J394q38K44m71J34J377
3601H88j736J186j206J634j597J011R6q01P08n90J507j877J321q37M18Q8l47N90
3619D56p29J112j501J524j003L21O5m31J107j335J584j407N44l63O84n63j13O81
3637F33j601K034j176O69j028N62j86l68J095j768J481p60J464j443J39M88r43
$$ plain form
3514 -890 361 -1131 675 -885 -270 512 -853 -21 -780 681 -1211 565 130 -468 -44 -437 550
3531 550 -1214 945 -432 264 8 216 95 -429 609 -1195 812 70 600 -260 542 420 -435 1271
3549 1271 -546 647 -196 1137 -93 -362 641 -530 1414 -411 773 -743 615 129 -140 435
3565 435 -856 674 -600 712 -1103 -140 89 -680 -133 -468 792 -1268 420 -412 -280 -387 -135
3582 -135 -126 -1129 711 -953 11 -854 -70 -650 -723 213 -936 390 -952 442 -396 -152 -623 -489 888
3601 888 -848 338 -868 766 -831 180 276 -525 183 -407 1100 -777 544 -293 125 213 -134 456
3619 456 -273 839 -662 862 -141 180 245 -186 921 -414 1170 -237 307 -56 628 65 -48 633
3637 633 -968 1066 -110 559 -469 93 -93 -461 634 -1134 347 -413 1051 -392 -253 235 -708
3654g08J129j132J129j462J553p42R2K5l51J013j108J223j448R27l36R7L67q54
3672e86J215j486J821j656J122l31N7j25m78J523j918J422q45P03q42P73L77j276
3690e30J296j102J360j526J226j098J33R93j094O14j015J727j502J195n94n85
3706e02Q23n21J048j593J464j493J140j12m16J07m02J253j936J962j109j06lL93
3724cL86j150J594j608R98o43J008p83m43J003j248J501j294J218j434J043L8
3741A83m74N86q33J180p48P95j458J134J5o93J035j074J185j527J339n49K19O0
3759C75m49P21j113J600j705J480q27M44n56K29R51j729J441j005J153j247O67
3776D30Q5n93J159j622J463j335J209j019N68K04r76R15p61R56j624J681n92j14
$$ plain form
3654 -708 421 -711 418 -1044 509 -233 -141 -116 -467 546 -562 661 -787 140 -196 -99 268 -586
3672 -586 629 -857 964 -692 430 99 156 31 -447 1076 -842 580 -265 438 -404 369 746 -530
3690 -530 766 -336 1024 -502 724 -374 -241 752 -342 272 -743 984 -518 677 83 -502
3706 -502 321 -200 848 -745 719 -774 366 254 -162 -55 -457 796 -1140 822 -287 -393 -396 -3
3724 -3 383 -767 827 -781 217 -426 582 -201 -644 359 -889 612 -682 536 -898 145 183
3741 183 -291 295 -538 642 -106 689 -769 365 380 -313 722 -352 833 -694 645 96 315 375
3759 375 -74 647 -466 1134 -571 909 82 526 -30 199 1150 -579 862 -143 1010 -237 430
3776 430 515 -78 1081 -541 922 -413 796 -223 345 549 -427 488 -273 683 -941 740 148 34
3794C4L37r63J111j006J031j510J328n05l56L86j44O98j388J783j658R66n16L57
3812a5j51m53J080j347J339j127Q86o53L52K02j003J578j398J304j383J138q51
3829e02L35O34j225J362j169J169j046R21o21j28O25n27P92j286J413j327J023
3846D43k16j85K25l53Q78j556J509j061M57j08k13O42j102J521j558J431q27K73
3864B00m42p6R76j590J803j470R83p66R90p73l20Q83j025J044j248J390j539J045
3882F5R7p67Q91r30P61j016J738j361J68J98k57N80p86J289j901J518o55K82N8
3901b8k00K96j056J964j632N53m63Q63k77n12J063j493J645j090R10q11N66k41
3919E7n04J321j351J073j116J228p20P0K72n95J004j152J203j245J285j043J8
$$ plain form
3794 34 371 -592 519 -487 544 -966 362 -143 -499 -113 -257 441 -947 836 -822 144 -372 -15
3812 -15 -166 -619 461 -886 453 -674 212 -441 -89 113 -890 688 -710 594 -789 349 -502
3829 -502 -167 467 -758 604 -565 604 -442 479 -142 -270 355 -172 620 -666 747 -580 443
3846 443 227 42 267 -86 792 -764 745 -316 141 33 -180 462 -640 881 -677 754 -73 200
3864 200 -242 -318 658 -932 871 -599 384 -382 608 -165 -485 398 -627 417 -831 559 -980 65
3882 65 162 -605 286 -644 117 -899 839 -522 -354 -156 -413 167 -619 670 -1231 287 -368 -86 -28
3901 -28 -228 68 -988 976 -656 -103 -566 297 20 -492 571 -922 723 -367 543 -268 298 57
3919 57 -447 874 -477 596 -520 708 -12 58 330 -265 739 -413 790 -455 830 -213 -195
3936a95P06o55Q11j542J752j407R90m75n5m6l48J243j536J700j550Q72k26K35
3954B74O1p78J102j327J476j561R19n65N89K84j160J236j123R13r26J073q42o9
3972d24P71j138J523j301J402j579J321o92m54P89n81O67j253J918j393P01n77
3989c00K35N85q02P28j099J346q69M46j47n1R9r21J704j338R02r24Q99m44k53
4008b04O22r80J450j279J001j290J086k05p36J084r42J023j384J284q45L85j82
4025a12m86R09r72J069j360J359q21L95M4l40K82o10J322j615J280o34M0%l2Q74
4045E92j390J450j142Q24p31P09l3p57P08j042J290j067J190j073R24k61p01J170
4063F60j102J058j065J402j047J28L92o44P15r78J602j926J717r75L7M75o23Q09
$$ plain form
3936 -195 511 -144 667 -875 877 -530 460 -15 -70 -116 -464 779 -757 943 -607 265 39 274
3954 274 335 -443 659 -668 808 -753 166 -399 190 474 -686 550 -573 340 -586 487 -355 -424
3972 -424 347 -791 732 -569 833 -746 575 -117 -571 218 -363 304 -949 969 -424 277 -300
3989 -300 -65 520 -282 446 -653 693 -176 270 123 72 171 -750 954 -384 518 -406 493 49 -204
4008 -204 418 -562 888 -391 610 -680 406 201 -535 549 -393 630 -754 530 -315 70 -112
4025 -112 -598 311 -661 408 -952 407 -414 -19 25 -315 -33 -643 679 -936 344 -290 -250 -250 -282 592
4045 592 -798 652 -490 334 -397 312 279 -478 230 -812 478 -589 601 -472 452 191 -510 660
4063 660 -442 616 -449 953 -94 34 426 -218 497 -481 1121 -805 912 -63 -26 449 -174 635
4081F35j500J559j018R16p02K86L9l88P50j570J595q94N81p89O46K51j408J246
4099B35j069J421j439R05m26J63K29r25J479j457J195j017R48m79J51N44r90R51
4117D19j078J177j242J001J7q35N97l18Q25j540J603p38M17m97J03N88p68Q53
4135E84j221J371o76J6J54j34M85j023J478j349Q88o35N14m05K20N06j228J368
4153I13j081J104j314P47J35o24P80j060R40j239J260j053Q70oo35M64o01Q67
4171D67j458J574r26J66l8L03O3j124J560j147O92m65M28l75k23P75j060J209
4189D21r00Q81p51M39N2l60P88j336J483j094Q97j209R20K04r21P53n66J288j853
4208h64J666q68J50K38m58R97j408J250j104J055p37K59K10m06O17j086J407j343
$$ plain form
4081 635 -865 694 -324 592 -110 176 215 -173 577 -993 602 -292 289 -500 146 397 -1011 235
4099 235 -834 587 -852 53 -373 -210 19 -906 573 -884 311 -706 242 -237 -86 458 -532 419
4117 419 -659 518 -724 277 294 -541 56 -262 563 -977 626 -112 305 -192 -89 499 -269 584
4135 584 -637 734 58 74 228 94 579 -444 1034 -315 573 -62 452 47 267 773 -455 913
4153 913 -168 936 -378 369 504 -120 660 -400 540 -699 561 -492 378 372 -263 201 -400 467
4171 467 -991 583 -343 -177 -215 88 151 -973 587 -560 132 -333 95 -280 -503 272 -788 421
4189 421 -479 402 -349 90 142 -218 570 -766 717 -377 520 -689 231 435 -486 267 -299 989 -864
4208 -864 802 -66 84 322 -136 861 -547 703 -401 654 -83 176 386 -20 597 -489 918 -425
4226d25O59j68N9j74j30J144j541R28o90Q39j062K79L53n48J024j216R92q43Q34
4245C14n40K48J45j017J258r55R41j119J081k91m91O08p43Q98j036J045j354J041
4263C3k42k01L73m24R49j310J264j138Q80k21k97L86o46R86j317J618j070N85
4281B08m49QN61j104J485j181Q04r57Q08j48j88O10q16R88j184R64q33N07k50
4300a67j26P35j159J105r48J226j284O77j6m29M13n05J120j615J429p24M02k69
4318a35k19Q39j038J131j069J042j060N33m75K62M88j030J411j235P55o27N09
4335H2k39o7N64p87R66j161J282j011L72K73o48R71j185J384j271R37o22O15J07
4354E62q51R05r17J148j181P47k75R3J2m03R91j294J432j034O75p26M85M1m53
$$ plain form
4226 -425 234 66 125 -49 -179 965 -576 352 -338 501 -561 -282 71 -477 547 -669 323 -520 314
4245 314 -226 22 167 -850 408 -547 394 -725 356 65 -426 182 -561 337 -699 346 -1008 33
4263 33 -209 -410 -37 -461 488 -822 442 -696 184 -37 -334 52 -594 392 -925 693 -377 208
4281 208 -241 -233 328 -776 709 -472 332 -625 183 35 -153 457 -359 629 -555 409 -424 83 -167
4300 -167 -293 442 -717 388 -560 666 -618 59 43 -386 27 -478 642 -973 456 -268 134 -135
4318 -135 -354 485 -553 578 -491 551 -509 24 -451 -189 299 -731 680 -555 200 -427 82
4335 82 -157 -224 340 -447 519 -642 640 -371 1 274 -374 597 -588 796 -475 462 -160 455 562
4354 562 -289 616 -301 847 -334 413 138 231 243 -160 831 -463 969 -65 610 -116 369 410 -43
4373d3Q64j156R34q80J022q31L33M03j082Q77j099J518j203P46m71J4N68q90P61
4392C85j006J303j347P37k8m77O01o54P82j052J114q53P13n45k28Q32o78P32r03
4411e72J235o64J0j64j87M87r43J106q03R47q25M28l1j13L76p25N21o20R66q51
4431d22N83j43k13O48q17N97n64R72q06N43l68m98P74m85R26j169J017r35N49
4450A89J3k92O43j148R65p46O81o49M25l9l10M67o12J034r32N46m30K63l3j40
4470a05N92j074J030j027R37o53K97r9j20O14q30R27j057Q40o47L90j73M5M80
4489C67j059J126j017R14q77N74Jl32Q47j309J226r45P93o21K34L6l50R63q85
4508c14O28p51O68l35m0K63l19Q60r78Q41o72O56o59J65K09m96P24q33P98p13
$$ plain form
4373 -43 821 -335 599 -281 741 -90 243 646 -436 441 -658 860 -343 403 -68 -54 514 -376 385
4392 385 -621 682 -665 72 44 -433 168 -486 296 -756 358 -495 218 -327 -555 277 -401 331 -572
4411 -572 663 -1 9 -155 -342 145 -798 308 -495 452 -373 55 24 -89 287 -438 83 -537 429 -422
4431 -422 161 18 -195 453 -364 233 -331 641 -165 378 10 -488 286 -199 727 -442 575 -360 189
4450 189 202 -90 553 -595 370 -376 305 -344 81 42 -268 199 -413 621 -311 235 -195 68 35 -105
4470 -105 487 -587 443 -584 353 -300 -3 -102 -222 392 -438 489 -568 272 -375 15 -158 -113 367
4489 367 -692 434 -583 331 -546 28 29 -303 544 -765 461 -484 309 -312 -78 -42 -392 571 -314
4508 -314 314 -437 231 -104 -144 119 -200 660 -318 523 -149 507 -152 13 222 -274 450 -383 415 -298
4528b98M36l58O02J1o42M47l75O24o75N59l79J05L51o12N97p73R29q50O04n56
4548b53K16N12q36R67j124J098p89P88p10p1L47m85P14j050J192r27N22k72n5
4567b16M87o94O82p57Q39m86L08j76k87O17n74J014j195P73p32M41L46n32P58
4586F16j012R64r79R47j103Q40k20k0P06j302J408j351Q42n70L97j37J2K82o93
4605c73R45j022J178j219P75l14k65M81n43Q88r29N85n06K85l1j34L87o51O63
4624B00o62Q26p11K14K95p34O33o63J006j048R43q17L86L68n32P65q74P37j042
4643g10J243o70o4L19n60P90r38J011j016R69o19L08l5m34N91o27R51p99O05o74
4663c59J74K40j26M84q19P62n01M58j94j97L64m78P10r70J127j046O69m89R8L56
$$ plain form
4528 -298 138 -220 382 393 -249 198 -177 447 -228 331 -48 57 408 -204 393 -380 549 -301 303 -253
4548 -253 -37 475 -361 606 -518 580 -209 579 -131 -202 145 -340 374 -676 516 -411 111 -161 -216
4567 -216 271 -423 259 -498 341 -145 163 -13 -300 317 -257 757 -438 335 -397 44 390 -142 616
4586 616 -396 568 -411 536 -567 273 53 33 739 -563 845 -506 336 -234 163 26 38 320 -373
4605 -373 572 -450 728 -491 284 -30 -295 186 -357 531 -398 187 -319 -34 -65 -199 188 -463 200
4624 200 -462 364 -347 -133 162 -572 61 -602 404 -644 299 -518 -132 236 -296 469 -405 332 -710
4643 -710 533 -137 -201 118 -442 348 -590 421 -595 374 -245 63 28 -406 185 -442 509 -290 315 -359
4663 -359 -185 55 -71 413 -406 356 -145 313 119 -78 286 -192 518 -452 675 -371 298 -191 -93 263
4683B63n15O89q20Q73q69P67l68l4N0k55N71j022J186j135J007l14m99Q15j086
4702f96O40o77J092q17N48k04k02M89q15O97q43J259r86L90p1o1N66q00O61o94
4722e24Q40n57M06m17K40L66r20Q16m50P56q01M14om58L40n03Q00o42Q35p22J15
4743g2L95m75O16o83Q56r62P65m46Q6J39k34M89q77R46q81R24o83M16m18j94R98
4764G05r64P42q56O72m56L90R1l62M46r24J150j052N78k30L11j59n85R12r40R32
4784D01q57R61p42L12L9l24N92n34O82n91L40o93O62r0m15O13m40R07j343R79
4804D59m13k25K72R8M42j241P29o9K08l52K95Lp23R13r02R57r64P61n49L85K51
4825C35n99P24r11Q71q38P43o10M3L98l61K25m60P83r99P61p0k86J24l70Q07q79
$$ plain form
4683 263 -252 437 -383 490 -379 388 20 -14 36 -219 352 -670 516 -619 388 74 -425 390 -696
4702 -696 -56 -733 359 -458 90 -114 -316 173 -642 55 -788 471 -515 -125 -196 -257 309 -491 170 -524
4722 -524 316 -241 165 -252 -12 354 -566 250 -200 556 -245 169 163 -295 45 -458 342 -300 535 -187 -72
4743 -72 323 -152 464 -219 637 -325 440 -6 80 219 -15 474 -403 543 -338 586 -97 319 -99 -293 705
4764 705 -259 483 -373 299 -157 233 324 -38 408 -516 634 -418 160 -70 241 82 -503 409 -531 401
4784 401 -456 505 -237 75 114 -210 382 -152 530 -61 279 -414 248 158 -257 356 -84 823 -520 459
4804 459 46 -179 93 191 633 -608 121 52 260 -92 203 206 -517 396 -506 451 -513 248 -301 84 335
4825 335 -264 460 -451 420 -418 325 -285 -242 156 -205 20 -440 343 -656 105 35 -251 -127 -497 310 -569
4846e69J079j185P92k70j20L51m93P40j088R35n82L39k29j0O89r53R18q51R48
4865D41r36P54l62r4P09j184J174r71J069p93L29q1k97P61o55N54m96L96q27J014
4885E05j33m28L27n03R98j113R29n95J20J10k87O22q91Q60j022Q29n21L45Q2l36
4905a02P07q83Q36q79M12l04M16l53N3O38r95O32n01P67r69M23L56p08N87m27
4925b94P48j103R18n50K86K68n57O51p80Q74j059Q44l58J08J75j91O7o46J252
4944F53r85O94l33L89k62o88J030q30M59m55O13l31P8pn09J177j180J071n96K58
4964B46n56N93M4o33P92o60O02q98Q14k53m20N66m67O16q43Q58o53L73j44J00
4984G7J77n12O87r64J178j122P69k75k13L29n51R38q93O64o71N21l75M7M13n83
$$ plain form
4846 -569 510 -675 117 -153 -273 78 -415 325 -763 172 -410 -71 -300 -310 379 -574 344 -507 441
4865 441 -495 259 -103 -197 512 -672 502 -469 600 -193 136 55 -242 519 -136 418 -78 318 -509 505
4885 505 372 -56 271 -232 766 -347 582 -13 107 217 -70 552 -339 521 -501 328 -193 152 234 -102
4905 -102 605 -278 558 -321 91 -213 203 -150 -97 541 -454 178 -323 444 -525 -102 254 -454 133 -294
4925 -294 454 -649 269 -281 5 273 -284 367 -413 461 -598 246 -112 -4 171 -20 47 -599 653
4944 653 -332 362 29 418 156 -532 498 -332 127 -328 285 -46 32 25 -484 693 -487 584 -12 246
4964 246 -310 283 327 -306 486 -174 428 -470 344 91 -329 237 -230 386 -457 401 -252 121 -23 77
4984 77 254 -258 429 -535 643 -479 290 15 -198 131 -420 518 -375 289 -382 139 -236 -189 224 -359
5004c59O09k89L72o03K93p2L0K99o23N79n35N29m63J39j13p9P89p91P91j026Q15
5025B92n41J29L79o58P30p04R32j156J136m14p3j81o2P14j010J081r62R93r23
5044b98M76j21l18N72p06O25o16O66n28M06l4p73R85n98M16p72P36m78L14N5n03
5065d94O56r93R50q49Q05m82kL33n47N63n64J014j028P55q0j92j42K2O38j037
5085f74Q77l27J99k56K43j38k32M63p13J000o80O01n60J62L86p10R80j098P73
5104B96n15N86n11K78L07q53N81n66J009j152R58L0m56L03n69Q06j062R60q15
5123c85M47R1j51K92l14N08j054P47l99K82j01q5M53r89J004r84P72m59M38l92
5143b79j00O74p36O82o13O33q41O13k65p7N69q77P91o35P15p83N85K19o14O93
$$ plain form
5004 -359 250 -39 333 -270 23 -49 -19 280 -343 236 -299 230 -233 -94 -207 -286 503 -288 503 -523 292
5025 292 -249 -120 259 -399 331 -373 559 -597 539 125 52 -129 -191 523 -487 594 -368 625 -298
5044 -298 178 57 -261 311 -395 230 -386 280 -248 158 124 -649 336 -262 154 -618 118 -360 -46 9 -494
5065 -494 162 -831 119 -730 75 -407 -409 -76 -623 -60 -624 390 -638 117 37 -155 -297 -275 363 -674
5085 -674 203 -124 75 -181 62 -76 -308 155 -558 442 -238 363 -197 -35 351 -359 621 -477 296
5104 296 -219 367 -144 134 441 -412 169 -397 612 -540 418 448 -8 295 -274 532 -530 430 -385
5123 -385 62 153 2 294 -20 488 -566 181 -218 64 -37 -122 331 -658 346 -638 134 -325 113 -279
5143 -279 -379 295 -441 241 -372 261 -580 33 -232 -309 260 -617 174 -461 254 -529 56 275 -339 354
5163C54o10O32q22Q11n12M15k77Q9L73n86P82j030O58k66L41l39J84L67p88J009
5183G85j010P76m24J08M3j55N17r21R06q21Q09o74K48K21n04Q04j099J007r44
5202c28J223q78K33N7n79M34l14O23r70J066p63J88M77o31N19j111J215p93K95
5221c7k09K60k0o25R38j008Q72n35O30p11K65K65o83R12j162Q14n57O36l59J90
5241a24J32o43R09j089J022q22O79k14J55L34p45O00p22R35j030Q38l79J88J12
5260A36k93N82j034J202o24M00l63K61r0m06P34r37N53l28N13j71j82L50n14N75
5280C64o36O21k84L20l00j93O69p69N07n07O34r04L97K79l25K22m94Q14j204J348
5300E59p91R2J94l94M46n73P84o97P92n44J56p6KK05n32N33n32O19l24M6J42l80
$$ plain form
5163 354 -256 376 -446 365 -147 268 -9 80 453 -133 649 -381 277 11 352 13 197 564 -224 785
5183 785 -225 551 127 235 278 123 640 -281 625 -196 613 -61 187 408 -96 708 -391 616 -328
5202 -328 895 17 250 307 -272 162 -152 471 -499 567 -196 -8 469 -162 357 -754 461 -332 -37
5221 -37 -246 14 -6 -631 307 -701 171 -364 266 -445 -180 85 -598 314 -848 -34 -591 45 -314 -124
5241 -124 8 -635 274 -815 207 -615 64 -150 5 339 -406 194 -528 407 -623 215 -164 24 136
5260 136 -157 425 -609 593 -31 369 6 267 177 -229 505 -432 121 -207 306 135 -47 303 -211 364
5280 364 -272 349 65 385 85 -108 561 -208 299 -208 426 -478 -81 198 -127 95 -399 415 -789 559
5300 559 -232 -140 54 -340 106 -467 317 -380 412 -132 24 -52 -50 155 -377 156 -376 243 -81 -35 107 -273
5322b73N64n47O21n73N30k91L39k46j81N60o78Q66j007O99l58M74m52j80L82k63
5342a4M83o63N25m05L09O2m72L58l62P58q79O82n61K78j79k41O65p02O97q29O29
5363A39l55O9L08o96O09o40P74n59N37p69N44J35o76P11o02O30p57R82p09P1L70
5384A16n19O19n96N46n83N60m19J40L33m77M39o27N61m89N88j27O2J59l86N08
5404D08n58Q01p28L37j42J89K77n88N54q10Q47o47O18l89l6L95m63N99o26P19
5424G57q35N66r9n52Q80p38L52n80P06o66M35J12k49J68n99Q24j078R79k85r1
5444GJ3k80L99m89O94p59O09m42L20l59J52J03o29Q47n82M64l90J73j03j61N73
5465A60n56O48o51O79p39M57j0k80N95j009R59n70M92o29L76K40m71M68n23P74
$$ plain form
5322 -273 291 -256 365 -208 322 31 370 124 -57 503 -175 691 -316 383 25 499 47 -133 249 -14
5342 -14 469 -194 331 -74 235 297 -175 183 -179 579 -300 382 -179 99 -80 -321 344 -358 339 -490 139
5363 139 -216 -147 161 -535 74 -566 208 -351 186 -583 -39 96 -580 131 -471 159 -598 384 -325 -254 116
5384 116 -403 216 -380 166 -417 143 -276 -136 197 -280 159 -468 93 -396 192 65 127 286 -100 408
5404 408 -150 651 -77 260 118 307 584 -4 550 -260 587 -60 558 169 133 528 65 664 38 757
5424 757 -78 488 389 -163 717 -21 331 -249 457 -209 226 338 89 257 -342 482 -596 383 98 7
5444 7 20 -260 139 -350 344 -415 194 -248 72 -287 -135 -32 -661 186 -396 68 -322 -149 -252 -413 160
5465 160 -396 252 -399 280 -459 -2 -12 -292 303 -706 253 -317 175 -454 -78 162 -309 159 -364 410
5485D10p64P61l48l5J92j78K92q15J184j284P70j04j2p0n0O73q46P85q25L62k64
5506a66M45k62k49P05r12O59l88N47m93Q1K26l27N04p41R00p14N39m66k17R08
5526E79q08M12o02O65p77P83m14j70K89k47O62r05J021q38L69M3o8L8m76O06p04
5547e42R28o19K60m76K88J62n21Q19o24O16m86L24m80L47K21o76O45p18O89n12
5567c55P23k22k69K75m97O52n62R76p70P4J37k10M53p25N38o80Q97n31J44J22
5587A70l39N85o19P74r66N87r1n9j90l1N16o71Q48o03J99m25L18j03M5K29k43
5608f9L47n12M35l75K45j22k86O70o18N83o71O67m86P6K22j78M39p38Q44o68K87
5629I2j80K47q3k48O08q64R11n66L41p8k20K04l04O25p97N60l06K09k11L85j84
$$ plain form
5485 410 -354 407 59 24 216 38 330 -485 699 -585 185 81 69 -1 -51 622 -224 561 -264 98 -166
5506 -166 279 17 -232 473 -439 220 -168 379 -114 -33 193 -134 370 -371 529 -185 354 -112 -329 579
5526 579 -229 183 -419 246 -531 252 -162 -332 -43 -290 372 -533 488 -350 19 62 -6 32 -444 162 -542
5547 -542 386 -233 27 -449 -161 1 -520 299 -325 291 -195 129 -351 -4 217 -459 186 -532 157 -355
5567 -355 368 146 -123 152 -345 307 -255 721 -49 25 162 -48 405 -320 218 -462 435 -96 48 170
5587 170 -169 416 -203 571 -395 192 101 42 -148 -179 337 -334 514 -89 110 -315 3 -100 -55 174 -69
5608 -69 278 -234 201 -174 71 -51 -337 333 -285 298 -373 294 -192 -116 106 -72 367 -371 473 -195 92
5629 92 -88 159 76 -172 436 -428 483 -83 258 180 -40 164 -140 485 -312 248 -58 151 -60 325 141
5650A41j78J99m29P03o58N38n51n8P11m51R0k22L11n16P94l45m03M47j48K37m73
5671b61P92j011P64l61j43K54j39J25o81Q17n04K41j33J77K35m44O79r37N29m45
5691d46K04M9P8M95p07P64o13L97m08K18q7J47M10p78O06m96L75j00q3Q9m42N30
5713B02jJ94l86M72o23K32L03n40O51o90N88o93N71k97J68j68K9L59o67R78q69
5734a87L75k94M41n45J41N32p81M44l15N09p46O62q9m26O26o23M47l43M12n07
5754b67J2O58p24N88m30L16o70J028q76J83L01o04N14n39P30o62Q21m60r1QO6
5775i8K71l84L75n08L70k18J53k8m8L57q72R13l69J8j27P15k90p39P32m81O62
5796D04p73O93l57mL18l05K64l06M91q06O71j14k11L57l30o5k46Q90q28L61K60
$$ plain form
5650 141 -37 162 -267 436 -222 316 -235 -293 418 -33 57 -165 146 -370 424 79 -324 123 -25 212 -261
5671 -261 531 -480 284 -77 -220 34 -105 20 -661 156 -348 -107 -240 -63 172 -272 407 -530 -1 -446
5691 -446 -242 -193 -115 380 -327 437 -176 221 -187 31 -56 91 501 -277 329 -167 208 108 25 114 -328 202
5713 202 201 395 9 481 -142 90 393 -147 504 -186 402 -291 280 -17 151 -17 12 371 -296 682 -187
5734 -187 188 -106 335 -210 -69 463 -318 126 -189 320 -426 236 147 -279 347 -276 171 -172 240 -267
5754 -267 -255 403 -321 267 -163 153 -517 511 -365 -182 119 -485 29 -510 220 -442 379 -81 -172 -164 -98
5775 -98 173 -211 164 -344 26 -192 -39 -67 -115 242 -630 283 -86 -68 -195 520 230 -509 223 -258 404
5796 404 -369 324 -33 -37 281 -24 240 -66 425 -381 290 176 -35 322 -8 -73 -319 571 -257 104 364
5817C64j72P6m14N15n36N13l16j1K44q0j06k62O79q75P69k01j14j63k4L74n32
5838b72O94n84K14k35K79m2l0K83m82N31m14N90r53M86K11l02L65n31N19q13P87
5859C01l39j16M45l14K16j55N08r95Q75j93k69j03R1L60j058J174n58K23j30M60
5879D23l56m29P25q22O99n10L74o14N30J01l83K52l70O61l80J33k02L8L29m18
5899b19P4J63K90q91Q63n32j3J25l45M19o04J027q56M90m8j27K30p5L39q01P26
5920B35m67J65j78M08K8j64L48n30L10l20K49k73K91J04o18Q10p14M36l08N25
5940C37k06m00N74l80L58n39N66n40M97j28o2N7j2J28m57O16n24L57j17k81J80
5961B4k84O94p34O36n00L91m29J21j0k87O20p56O08K5J54n08MM09m78N06m68M52
$$ plain form
5817 364 192 268 -146 369 -167 346 30 19 263 183 77 -185 494 -381 388 187 73 -90 -114 260 -272
5838 -272 422 -162 52 -183 96 54 24 307 -175 356 -58 532 -421 65 276 -26 339 -192 327 -486 301
5859 301 -38 -154 291 -23 193 38 546 -449 426 233 -36 -139 -48 312 -746 428 -130 93 -37 423
5879 423 67 -362 363 -459 240 -270 104 -510 20 121 -262 -10 -380 281 -99 34 -168 -130 199 -219
5899 -219 -145 18 308 -583 280 -252 -265 -140 -485 -66 -670 357 -499 -9 -57 -184 46 -29 310 -491 235
5920 235 -232 -67 -245 163 191 27 375 -155 155 -165 84 -189 102 206 -412 398 -316 120 -188 337
5940 337 131 -269 305 -75 283 -256 310 -230 267 139 77 134 122 250 -207 409 -115 242 125 -156 24
5961 24 -260 434 -300 336 -164 227 -202 -81 -91 -378 242 -514 94 119 273 -235 -231 178 -300 206 -262 190
5983A90n63L80k49L3K50n98N55m69J096r78L68Q0m0P5l57P39r00O72l71R2q9l0
6005a14L55k42M86p76N00k06J90k29J89K29n67O78o22L0j7O37m29j20M07q45Q93
6026D27n25L90l85K45K14l60K17l18L77m07M14k60J47Q6n55N77m73P02q26N60
6046B47l1j26j03j95L62o55J060r50M70r7K9j33l4O22r45Q55o99M31n47O85l49
6067a03l12N70n34P87n09L08m17J44J04k34O20m90K12m59Q38n45m4L02l00L02
6087B40m35O68o44M46k15lK25p3Jn41P90m98J60j88R8O2J57M40j077O14m10M35
6109B52l50Q4J38m60N67k61L68o88L34k4k06M82l61J37j88N27n69M03p1m84M84
6130A14k85M05p27P16n00J06R3jJ60n02Q44q56O91n67J40J87J11j51l33O64p01
$$ plain form
5983 190 -373 7 -242 -209 41 -557 -2 -471 625 -353 15 95 55 130 -227 512 -388 284 -87 5 -84 -114
6005 -114 241 -1 485 -291 209 3 193 -36 153 382 -185 493 -129 -99 -116 521 92 -28 379 -466 427
6026 427 -98 292 -93 152 366 6 223 -95 282 -125 289 29 176 262 -293 284 -189 513 -313 247
6046 247 216 90 -13 -208 154 -501 559 -391 79 -18 11 -122 -156 466 -479 376 -323 108 -439 246 -103
6067 -103 -415 155 -379 408 -101 207 -210 -66 38 -196 424 -66 146 -313 525 -20 -64 238 -62 240
6087 240 -195 473 -171 275 60 57 282 209 210 -331 459 -39 121 -67 31 93 250 690 -387 227 -183 252
6109 252 -98 -14 124 -336 231 -30 338 -350 -16 -40 -246 236 -125 12 -176 351 -218 185 114 -370 114
6130 114 -171 234 -493 223 -277 -171 -78 -79 81 -421 423 -433 258 -309 -169 18 129 -22 -355 309 -392
6151c92L51q4L41l11M2M37o46O49n21K82m40L74K1l29O97n74J45j75J54j88K97
6172A30L0m34P23q01P27m59N49o60K78K34m30L02k74N70p11M42k21j49J17k1L77
6193C19p04O39p20N09k58L11l46N9M26n69M25l45M35k37k74K57l62N68k58J2j33
6214b46O19n56R2L94m38L77m30P42q94O52m7n57N93n16M32n91Q65p29N76j07j97
6235C4J80k70N29p94N70o06L90N3L5R7j77M22p34K95j82M83l79J60K12p80N82
6256A20l53M71r1M79m98k92N18k84J82m92O51p13K08L80o89M42l58N70p94J065
6276E22p52L30J04l01J08j53Ln3L65k89K19j25L9J9n07N89l61L68l14L36k22k03
6298b78P66r31M97k72J59j26J23K19m50O99l72L8k88M07k35P4Q0m78N24l52O58
$$ plain form
6151 -392 -41 -125 216 -95 -53 384 -262 387 -134 148 -292 82 103 -226 471 -103 42 -133 21 -167 130
6172 130 160 -274 449 -352 375 -84 465 -195 83 317 -113 189 -85 485 -226 216 -5 -154 -37 -58 319
6193 319 -385 254 -466 43 -215 96 -250 -191 235 -334 91 -254 181 -56 -330 -73 -435 133 -125 -113 -246
6214 -246 373 -183 -91 303 -135 242 -188 554 -340 312 265 -292 301 -215 217 -374 491 -238 338 231 34
6235 34 214 -56 473 -321 249 -357 33 86 121 218 41 463 -271 24 -158 325 -54 106 318 -462 120
6256 120 -233 238 147 626 128 -164 354 70 252 -240 411 -302 -94 286 -403 39 -319 251 -543 522
6276 522 -230 100 204 -97 11 -142 -139 -192 173 -116 103 -22 17 36 -471 118 -243 125 -189 147 -75 -278
6298 -278 488 -443 54 -218 -59 -185 -62 157 -293 406 34 72 -216 191 -44 30 110 -368 156 -196 462
6319D62r88Q16n57K08j20P3K22l25N90q87N46M6l9Lk09M04o98Q53n67J53J08r5
6341aP0n59N90l54K01j8K15l98R3M45o76N82l60J84n02P45m88L01J41l80K92n30
6363d07P56n24L00j36J6J6j02K47o09O61o08M64N7j67J37k96O21p09N66l73K09
6384A19j84L66j18m80R07r88P02p23O36m26L74K97o84M77l00K56m08K80j26j54
6404a77N70n88M36m75K85n01L68J16q9J67k33L80l97L82m10J06K35k65Pm2N23
6425C98o54M22n84M37j7o7K02n16Q81o25K30n41L22J28j54L83m05M49l29J56l51
6446b35K77k22j01L22k59M01o59N82k99K78p1k72L34r0L43n67M31j84j20J88j68
6467i1M36n22M98m98L52M6k67J21kK54p70Q02m82Q2M4J08J34p05P15m97N30m64
$$ plain form
6319 462 -526 290 -267 -59 -179 -106 116 -209 381 -506 40 86 47 50 -159 245 -453 400 -167 -14 94 -1
6341 -1 69 -490 100 -254 -53 -71 144 -254 -161 284 -392 190 -170 14 -488 257 -231 70 211 -169 123 -407
6363 -407 349 -175 125 -11 5 21 -81 166 -443 218 -390 74 131 -36 101 -195 426 -283 283 -90 119
6384 119 -65 301 183 -297 610 -378 324 -399 237 -189 185 482 -202 275 -25 231 -177 103 -23 -177
6404 -177 393 -195 241 -234 51 -450 -82 34 -55 112 -121 259 -138 244 -166 -60 175 -90 -83 -125 398
6425 398 -256 166 -418 19 2 -65 137 -379 502 -123 107 -434 -112 16 -138 245 -160 289 -40 116 -235
6446 -235 42 -180 -281 41 -218 183 -476 106 -193 85 14 -258 76 -14 329 -238 193 9 -111 77 -91
6467 -91 345 -177 321 -177 175 221 -46 75 73 327 -443 359 -123 -41 3 111 245 -460 255 -242 288 -176
6489a76K72j60J28K19o87N28m60P34p62M80j31l40O24n09K58k45N64o80M79l6
6509A00j05qR5J76l87K47k12L13k11M7j4j71N51n47K54r0j38q2J67L17n62O36
6531C76o69N99p81N79k1J0K42n90N92m61L81l77M44m4k76K69m38K79k93M95n90
6552b74N61k80k29N38m59L35m48P26n42J70k28K63j22l41M27j75q2Q9L88o43L10
6573a6N0m67P19n84L50j32K60k63q6M47p06M54k62L98l45K8K27m04L01l08K54
6594h5j73M50m04O1J0q8J39j18M59p22P01k51l07L27J52l6n18R46p37L38j45j7
6616a8q5J6M10o68Q19o11L11n76N03P5l90L49k14L15m88L54j28j68O14o10K53
6637F3n5J67q9j66l7m6R7m8M33o20L01k35K30m5P1Rk76J67l55N07k87L05l03M09
$$ plain form
6489 -176 96 -64 64 283 -404 124 -336 398 -364 116 -15 -355 269 -240 18 -227 337 -343 136 100
6509 100 -5 -13 82 258 -129 118 -94 219 8 55 41 -130 421 -126 128 38 -100 -182 -15 302 -260 376
6531 376 -293 306 -475 104 83 93 335 -255 337 -124 257 -120 324 280 4 273 -165 114 -179 316 -274
6552 -274 287 7 -222 316 -143 192 -256 470 -72 98 -130 133 11 -330 97 -78 -160 -71 317 -326 -16
6573 -16 34 -433 286 -298 52 -80 180 -83 -169 278 -428 26 -236 162 -183 -155 72 -332 -31 -339 -85
6594 -85 -258 192 -212 -151 -141 -229 -90 -208 251 -471 230 -21 -328 -1 151 115 -403 543 -194 144 -1 -18
6616 -18 -103 -87 323 -345 474 -137 174 -402 101 176 -214 135 -79 236 -252 102 -26 -194 420 -190 63
6637 63 8 175 86 -80 -117 -163 -66 -114 319 -301 0 -235 -5 -50 21 30 -246 -79 -434 73 -214 91 -212 197
6661A97k16k76M90m36N33l57K30k12jm3j83O80m33J38l38J64r6j7L92n07K89k84
6683b86M14m15M66J0k39J50j97N64n87L92l45J71J4j85K72m98M61k28L16k41m4
6704c5J0J48J62n42O41p23O58l61k9R2k45P39j035P72o18M07l26N07k28k83K99
6725A0j88J21l50O23o84L01o1qK34j80M21m87K79k72L62l10J65J86o03O54o32
6746d19N19qj18mK28j08l53M76n29N51j42j4J2k70K76k91M27k16L19l51j09K74
6768A50m66N00l00K38l05O96m85O0K16n03M49k55M66o57J26Mm0K59l59L07j92
6789i1L76k81J55k43n1J98l5J68n06M65m43K63j85L61k63l52P93l86J00l88N62
6810B17m37L33M9k40R3O2J36j64J74j46k22K26j94L90m96L79k72M39k90j81K72
$$ plain form
6661 197 -19 -295 195 -241 292 -65 165 -47 -48 -91 -274 406 -27 111 -227 -63 -159 -176 216 -291 -2 -286
6683 -286 128 -287 179 189 -50 100 -97 467 -120 272 -73 98 112 -73 199 -299 162 -66 250 9 -35
6704 -35 -25 123 285 -257 384 -339 319 -42 -71 21 -224 515 -520 252 -366 41 -285 222 -6 -289 10
6725 10 -178 -57 -407 216 -468 -167 -228 -236 -2 -182 239 -248 31 -241 121 -189 -24 162 -441 213 -419
6746 -419 100 92 -26 -30 198 90 -263 213 -316 235 93 79 91 -179 97 -194 233 17 336 -15 -124 150
6768 150 -316 184 -116 122 -183 513 28 88 304 -199 250 -5 461 -196 -70 -66 -106 153 -206 101 -91
6789 -91 285 4 159 -84 -135 63 28 196 -310 155 -288 -25 -210 151 -112 -464 329 -57 43 -345 217
6810 217 -220 113 162 -78 15 77 213 49 223 77 -145 81 -113 277 -219 160 -112 327 37 -144 128
6831A28j77N64q21N84m15J88q2L00k35k16M26o26P29k43j47j11L15J49l84O59
6851E85n32N1j29K28k98j62N99p30M84k32K97m84M01J6j91L72l39M29p73P87n34
6872a55J38J66l40L57l57N30n21N87n33j42K94k22N01m61L93m64O3K35L5p9N9
6893H4M12q37N69j90K13m56K62K5j17K88m39N04n59N92l32J4P1k05N82n17O8o5
6915c3M98l81K0k74J72P8l05M41l04K60j13J1K30n36L75m72Q18n89J81q8J42j24
6937Gl79N59n31N80k26K7q2J8J51m83M54m53N17l70N47o27K03M87p87N38j78M9
6959B1n16N14N7l53J99lJ56m13J035j395N68J0R4j5j09K30k81M94n29L88l2k21
6981a01J81j55K50j76K93l81L73k17K9L0l30O58q35M27l67M71k04j26O48m51K06
$$ plain form
6831 128 -49 515 -306 278 -137 51 -31 269 34 -182 244 -382 347 104 -43 -154 161 310 -74 585
6851 585 53 104 -25 203 -95 -257 342 -388 96 -136 161 -323 78 94 -97 275 -64 365 -408 379 -155
6872 -155 -17 149 -191 166 -191 339 -182 405 -128 -270 24 -198 303 -158 235 -229 -166 69 104 25 84
6893 84 496 -341 228 38 251 -205 57 82 -35 253 -186 318 -241 351 19 33 104 -101 481 -36 32 -33
6915 -33 465 84 104 -170 2 80 -225 216 -88 172 59 70 300 -236 139 -333 485 -104 77 -11 131 7
6937 7 -372 187 -344 236 10 37 -45 -27 124 -359 95 -358 159 -211 336 -291 -88 399 -388 150 -28 21
6959 21 -495 19 76 -277 -78 -81 75 -338 697 -698 -130 -120 -26 -41 -150 80 -201 293 -236 152 120 -101
6981 -101 80 -75 175 -1 292 -89 284 67 96 126 -204 454 -381 46 -321 150 -54 -180 468 17 223
7002B23m43N02m72J97P9m86N57n17M52j26M41o51J26K19n7J1k90M88n48K47k48
7023b96M89l00j8L05o37L84k94M25j56L27l98l8N77r36P89l92K23j39K42o7m3
7044D7K17m24K83k65K32j43J25K74o09N04m76K51j28J59l16Q8M56m73l8N4N90
7065D08o10L05n3J39j83j13N31q56Q01m13K34m2r2J46j02J47j99m5NJ51k01j86
7087b28L00o06P76l37N2k88K72P8q6M13o32L68l66L97l91L12Q4k01L8J54M3l03
7109a51M73n97L64O7k60M22m62M13o76N18n9n4m4qJ79m26O22o26M56k26K80m33
7131b28p7N88o28O54l64J89p9L18m33o6K91k92M32k61K15j55k8j00k3J03j52K93
7153A97n87P26m77J22qj80L85k42L17o17L69QJ3k38J81K81p26L77N6o3o8K22l6
$$ plain form
7002 223 -220 282 -190 7 86 -400 157 -360 92 -34 407 -244 -118 101 44 55 -235 253 -295 -48 -296
7023 -296 193 -107 -125 180 -457 -73 -367 58 -98 229 -169 -207 370 -566 223 -169 54 -85 157 90 47
7044 47 264 -160 123 -142 90 -53 72 346 -263 241 -235 16 -112 47 -269 -181 275 -198 -236 -182 408
7065 408 -202 103 50 189 6 -107 424 -432 369 -44 190 148 56 202 100 247 48 3 8 159 -42 -228
7087 -228 72 -534 242 -95 -43 -331 -59 19 -67 346 -286 82 -284 113 -278 34 118 -83 -45 109 152 -151
7109 -151 322 -275 89 156 -104 318 -144 269 -407 111 52 -2 -46 -54 125 -301 321 -305 151 -75 205 -228
7131 -228 -305 283 -345 309 -55 134 55 373 -60 -126 165 -127 305 44 259 104 76 -24 -47 56 -96 197
7153 197 -390 336 -141 -19 -27 -207 178 -64 253 -364 5 13 26 -212 -31 250 -476 -99 -43 -106 -174 48 12
7176A2k24L27l90N42m48M31n83K76M4k86N57l87K68k67K79j25j45K01j10L79m36
7197h5M81l41K0j24R0L6n1J56l53J014j311M36q8K33O3k56M38o51N79k26kq5K04
7220A77l34n3P03o25M13k41n9o2O7K50l62J90j39M18l52L69m05J38L49n42K42
7241A42j19K81n47K95J25l34Po2J81k48N68o82L98J9Q1j68k72O04o33K83K08m9
7263G8J8l38L05k97L49m60M22k26J34J26q0K31p55O12k16M43n31K6K84j23R9j49
7285d8J88m48P10o52L58J93n40N54n51N32m14K82j29L8J63m81N54n46N24l83L90
7306B94m32J58n7P8J78n04M27L1N3l61K46j22j30M27m59J99k20L77l57L58p1m08
7328b95N26m05K83n05P49k33k69K60j00K63n09P5l33N12j32pj01N1j8l69P91m06
$$ plain form
7176 12 -212 115 -275 267 -181 250 -333 -57 -13 -299 258 -129 139 -128 151 26 -119 82 -28 351 -85
7197 -85 396 55 75 -49 41 77 26 182 -171 843 -468 -32 -120 113 176 -80 358 -293 286 60 58 -27 177
7220 177 -157 -210 493 -132 281 40 -19 -81 -14 236 -126 64 -75 343 -9 360 -45 93 442 -100 142
7241 142 23 304 -243 52 177 -157 -150 -212 -31 -279 289 -393 5 24 105 -63 -335 269 -364 -81 127 78
7263 78 96 -242 63 -234 115 -345 77 -149 -15 111 31 262 -493 119 -97 346 -185 -159 125 2 101 -48
7285 -48 140 -308 402 -250 108 301 -239 315 -236 296 -118 164 35 73 236 -245 309 -237 287 -96 294
7306 294 -138 20 -37 41 219 -285 142 173 226 -135 111 -11 -141 286 -173 26 -194 183 -174 184 113 -295
7328 -295 231 -174 109 -396 353 120 -149 111 11 274 -235 -160 -493 19 -113 -120 -221 -170 -188 -557 234 -172
7350a72J63k63M99J1l73N52p86N69n39O94l56Q4Jk95M97m64L81m02L41l34J29
7371f3L58l23K48k32K91m68L44k72J03O4j75L43k37K72n27M87k26P7J02j88M10
7392C88n38N42n62J35R3j48O1l12O60n20J56O6j38Q2k1P6k92K77l20N82l89J54
7414C2j09j37M07n24Q40n16K45k62N2o7N9K78m68O26l99J63k48j66K28l91N72
7435B15l12L95k96J73J58k90J37k01J18m25O59p63L63K47m08K04j87N09l52J19
7455F3r3J15j17L35j39k71L02l83K07k62K50l72N81J87n36K59j71N1j44M41n17
7476b14J92J34j17J88l74N06m21K69o1j9l47L30Om29O16l61k4O2J78j57p7L89
7498B69m19K94m58M50j76O7O5n29N52k91K23j22Q9j36N6L34n73J42q1N65m87K89
$$ plain form
7350 -172 -9 -272 227 238 -135 417 -369 200 -339 355 -1 83 84 -211 286 -178 203 -199 142 -192 -63
7371 -63 295 -28 220 -12 279 -189 155 -117 -14 50 -125 218 -19 253 -274 213 -13 64 166 -22 388
7392 388 -150 392 -170 -35 58 -90 -29 -341 319 -201 -45 21 -117 -35 -56 20 -272 5 -315 267 -122 32
7414 32 -77 -214 193 -331 509 -7 238 -24 28 -39 20 298 -170 456 57 220 -28 -194 34 -357 215
7435 215 -97 298 2 175 333 43 180 -21 97 -328 331 -432 -69 178 -230 -26 -213 296 -56 63
7455 63 -30 85 -32 303 164 -107 195 -188 19 -243 7 -365 216 403 -133 126 -45 6 -138 303 -214
7476 -214 -22 112 -5 183 -191 315 -106 163 102 83 -264 66 72 -357 259 -102 -126 -64 114 -43 -120 269
7498 269 -150 144 -314 136 -40 27 92 -437 115 -176 47 -75 14 -122 -66 268 -305 -163 -244 321 -166 123
7520A23J77l51L99m88K68l79L71k58K25k77J41K41l52K40n44O12l01Q7J57j11
7540b0K20j25K04m87K46j19P9J64l21K24k10M51n01J99j96L02j71j74M73l32L74
7561B80n61K97n7J21N8p5j44p1K86l32J51n2N5L3j11J76j76K73k63L71j8l47K57
7584A51k50K22l48O19n74L96k89M11k42j3J87q04N14R2K21k28L3J94m07K67j88
7605c6J26k95K12k17J83N9j69L35k08N7n06P31k44j67K64k36O0k12L70j40q0J87
7627G4l29J60k7J13k78O25m88L00j98j07J82m63O14n36P08l78o6k16J12L72l49
7648a75o0J45LJ7K83l16k71M15J53k12KK46j19J37j35j54J34J64j9m71M88k41
7670A4r4l0M13j68j04J96m58M54k90j5r4O3M78o43L79k6J89k24J65j39j06Q0l17
$$ plain form
7520 123 300 -51 348 -140 128 -251 120 -138 87 -190 -49 192 -160 80 -464 148 -153 -66 91 -20
7540 -20 200 75 279 -208 38 -81 -2 162 -159 65 -145 306 -195 4 -192 110 -61 -235 238 -94 280
7561 280 -281 16 -41 80 138 63 -81 -152 134 -198 -47 -99 -44 -11 -122 54 -122 151 -112 259 241 -106 151
7584 151 -99 123 -225 394 -180 216 -73 338 96 83 270 -534 -20 72 293 65 98 292 -115 152 -36
7605 -36 90 -205 7 -210 -27 32 -137 198 -10 47 -459 272 28 -139 125 -111 -51 -263 107 -33 -113 74
7627 74 -255 -95 -122 -9 -287 338 -150 150 -48 -155 27 -436 178 -358 350 -28 -94 -310 -198 174 -175
7648 -175 -235 -90 -87 -70 213 -103 -374 41 194 -18 -16 230 111 248 113 -41 93 257 238 -233 255 14
7670 14 -80 -110 303 135 31 227 -231 223 -67 -82 -176 -113 365 -278 101 75 264 40 205 66 -40 40 -277
7693b77J79M7J67l48M15l00J5Q9J3o1n0k4K34j86K47m65K95q1M32n64M62k58j28
7716a47l1J20K09l94O71m66K76j46j55l3k8L40m03N07l71K7OJ4M2k36N81q02M85
7739F6j02J59r2k53L32l56N21k01J05l66L96k10m8L6L7M8j58M32l56R0j21J05
7761F4J26m40L82k12K47j68k57N04l39j10J6L50l73L67m82K52j19m3K28l37N94
7782B50o60O34m25K93r8j03N7J11J81n62N22l33K46k03J13N4R4K4k5M1l35J17
7804gM9l7J50k22K36j23K37r9l22L10j51j58nM27k93K56m28K32L9lJ78l74L80
7827B72m13L26j86L0j39J25j16J66K60l93K46l46K32k3p9J49q4j7m15P48l33j49
7849a39J81l3ML5R4l91K43J34J50j43l43M03n57P09n05J92k31O2J29j98L76k18
$$ plain form
7693 -277 -98 -51 116 -232 183 -117 -102 -13 0 -61 -111 -135 99 -87 160 -305 -10 -91 341 -223 239 -19 -147
7716 -147 -178 -58 151 -243 428 -38 238 92 -63 -96 -124 216 -187 320 -51 -24 -18 -4 38 -198 383 -419 66
7739 66 -36 123 31 -222 110 -246 275 74 179 -187 209 -1 -49 -13 24 72 -86 346 -10 80 -41 64
7761 64 190 -250 132 -80 167 -1 -258 246 -93 -203 -187 163 -210 157 -325 -73 -192 -235 -7 -344 250
7782 250 -410 224 -201 92 -6 -109 -52 59 240 -322 200 -133 113 -90 23 77 171 195 170 211 -124 -7
7804 -7 42 5 155 -67 169 46 283 184 -138 172 21 -137 -142 285 -8 248 -180 52 91 88 266 -108 272
7827 272 -141 185 -1 29 -110 15 -101 65 325 -68 178 -168 64 41 -38 111 27 10 -405 343 10 -139
7849 -139 42 9 13 48 142 -249 -6 128 278 135 -208 195 -362 347 -158 34 -197 -135 -6 -204 172 -46
7871d6L37l92K93l30M44n25K21J65l92O13n02M21j79mrl2J62k94L19n15M74l29
7893a00J06J10j38K06k63N59o97L09j91K12j34l8K82k99L17j94K0J30k18j90L22
7914A11K46p07M09k64L61k42j65K76k18J54j43J40k78K45N8L7qk60K21k41J19
7935a49J31L3K76q37O09k69K50l01M65l25L22n13J32L05p8K29l78J58J80k51M6
7956C5p2J5l83N84l82K52J71j14J64m31M62n32L86j49K88m12K59k44J13O1k52
7977a81K59l36M45l12R3J32j95J87j35J38k43K05k7k8r7J40J46l81N12n91L91
7998A22Q6j45j1P3l21k34N30n77N27k76L90l78K43N3j11J28l00N7o2J66J6N3R1
8021A20k59K43k67J93k09K25K38l45pr9N01n24K21k13J97J23r6K02j27Q8m29M50
$$ plain form
7871 -46 291 -101 192 -138 306 -219 2 167 -225 388 -114 307 128 124 115 83 245 -49 270 -245 229 -100
7893 -100 6 116 -22 184 -79 480 -217 92 -99 113 -21 -59 223 -76 241 47 67 197 -21 -211 111
7914 111 357 -350 59 -205 156 -86 -251 25 -193 -39 -182 -42 -320 -75 -17 20 12 -248 -27 -268 -149
7935 -149 -18 15 291 -546 63 -206 44 -257 208 -117 205 -308 -176 129 51 280 -98 60 240 -11 35
7956 35 -37 -22 -405 179 -203 49 220 106 270 -161 301 -231 155 6 294 -118 141 -103 10 71 -181
7977 -181 78 -258 187 -125 -32 100 -95 92 -43 95 -148 57 30 2 -95 45 191 -190 322 -269 122
7998 122 208 63 52 125 -196 -430 100 -477 50 -226 164 -214 29 82 -29 99 -201 -144 -206 -40 -24 29 120
8021 120 -139 104 -163 30 -179 46 284 -61 -68 -167 334 -190 31 -182 15 138 42 244 117 205 -224 226
8043B26m8m0k01J06o3j26L18r3J62n28K59K95l60K92o21L93o1L68m35m6K69O0
8065A26p4j48p2K26n3Q5k05J17m8J04l73M94l89R9J70j63Q3N8k7j73L64k24j3
8088c6N1K52l71j59M66n04K02rK46k85J33m2j31M49m89M22k30Q4j65M5K81m09
8110a99M09l83M28n44L81l4k07M58P6k14l37N75m76J66K9k05J00l9O7k08M06l07
8132e8K1j44J03Q3j48L48k42K42k10j1N9j38L64m43K86j99j9q7J62J60p7J36m04
8155b16L41l02K79j55M8M8j77K24l37Q48o64k96L60l13L30l42J72N0K59k32K49
8176A74r3o1j95J82J04k66K61k8J42R2m49l3K30J12k97
$$ plain form
8043 226 178 138 -63 43 -20 -146 172 79 241 -287 -28 267 -93 199 -422 -29 -90 278 -157 -203 66 126
8065 126 52 -96 -168 58 5 90 -115 2 -46 58 -315 179 -210 -111 59 -104 -21 37 10 -163 201 -23 -36
8088 -36 15 267 -104 -263 203 -301 -99 -108 138 -147 -14 -56 -187 262 -227 195 -35 49 -116 -71 210 -199
8110 -199 210 -173 255 -289 92 58 -149 309 385 171 -166 409 -67 99 128 -77 23 -16 51 -157 249 -58
8132 -58 -37 -181 -78 5 -143 205 -37 205 -5 -16 43 -95 269 -174 112 -87 -106 -193 -31 129 52 188 -216
8155 -216 125 -177 102 -53 -5 43 -134 90 -247 601 -63 -359 1 -312 18 -324 -152 -102 157 -75 174
8176 174 81 20 -175 7 111 -155 106 78 220 312 -137 -170 60 172 -125
8191a25
$$ Imaginary data points
##PAGE= N=2
##DATA TABLE= (X++(I..I)), XYDATA
0@%%%%%%%%%%qJ6j6J6k4L2l3M1n6O4p2Q8j05J28j51J76k07K38k72L13l60M09m65
33b48N28n95O69p52Q42r43J054j170J300j444J599j769J953k154K375k617K883
50A511l174L495l851M247m691N189n752O398p147Q025r068J0337j1921J3959j6692
65i135K0570k6535L6982o0568K09224M6673k83796J61077L5774n2834j4272P2890
77A36050j05189M3964N7849k4090r4325M7580l129o1031J32853n8946p5258N4505
89E0833K5325p1163R308L1725q1923Q1231J7597m8494n4296Q4736k7091j02747
101h4959J07398K0631p8799Q966Q6174j09312N334O2617n9925J0459K1188J9991
113I763o2016O7646j8364q6664O1273O0599o6615k7327J04851p6616N023L7933
$$ plain form
0 0 0 0 0 0 0 0 0 0 0 0 -8 8 -8 8 -16 16 -17 24 -32 32 -40 48 -57 71 -80 96 -111 127 -145 168 -192 217 -248
33 -248 280 -315 354 -398 444 -499 555 -615 685 -759 840 -929 1024 -1130 1245 -1372 1511
50 1511 -1663 1832 -2019 2228 -2463 2726 -3026 3372 -3775 4250 -4818 5519 -6402 7557 -9135
65 -9135 11435 -15100 21882 -38686 170538 217211 -66585 94492 130266 77432 63160 136050
77 136050 30861 74825 132674 108584 14259 61839 58710 -2321 130532 71586 -3672 50833
89 50833 76158 4995 14303 46028 -35895 45336 62933 14439 -39857 44879 17788 -84959
101 -84959 22439 43070 -35729 -26763 59411 -49901 -44567 18050 -41875 -31416 -10228 9763
113 9763 -52253 15393 -2971 -89635 -28362 32237 -34378 -61705 43146 -33470 -28447 9486
125I486l4822k2757M3114L1527o4280O1289j6763l7857J5180N1117m3726k5530
137c4022Q1543n4214J2180K9544k4680n0812O8545R067p0528O6336O072m1731
149b700k5559Q7753m6206n9847P1772l864k4391J1104K8933p6818L8694K3890
161B2761m1041R552J1310j902k6281O0005n3874k0060M0305o772k5569K8761K6093
174B3288q9047O8144K2879p3965o951P5347k0810n7530P7427k3214l1486J0141
186b5777L5399n3119R868N8245n5386K0280J2952j7757l0667N3917j7153l2600
198d1798N1436q149q296q135K5469n5103L0653M1319n0750P192L8592m724o1977
211d4271O2866j5997l9164M1257K6575k9683j8042N2510n4997Q225L0256k0927
$$ plain form
125 9486 -25336 -48093 -4979 26548 -37732 23557 6794 -31063 -15883 35234 -8492 -34022
137 -34022 47521 -6693 5487 35031 10351 -40461 28084 37151 -33377 32959 39031 -2700
149 -2700 -28259 59494 13288 -46559 25213 21349 -3042 8062 36995 -39823 -1129 22761
161 22761 -18280 -8728 2582 680 -25601 34404 -19470 -39530 775 -5997 -31566 -2805 23288
174 23288 -65759 2385 25264 -48701 -55652 19695 -1115 -58645 18782 -4432 -35918 -25777
186 -25777 9622 -43497 -33629 24616 -30770 -10490 2462 -15295 -45962 7955 -9198 -41798
198 -41798 9638 1489 -6807 -14942 10527 -44576 -13923 27396 -23354 -16162 22430 17706 -44271
211 -44271 18595 2598 -36566 4691 31266 1583 -16459 36051 -18946 -10721 19535 -1392
223a392k1511N4207J3242p8749M9467L55l1036N184M5278l2180j6687N8815m2651
236B342j1510J0196Q046l2607M7498J0613n6440L2976M296j7658j8988M1938l4802
249a4100P674M9397m1549j9774J9878J5142n6742N2789J3813m9427J8037L8123
261C3261k7168n3155O2553j8560j2044K9561M624l5291Q085L3775n4872K5360
273c871R804j0356j185L1461k2480l2185N0011l0937p105K4736J6396m5481K7244
286F052K6421o2134K4385K1677j5039k6678N5953j5491l2918L3468j3100j6157
298a3561P098L9101m8238J6126K3329l0444M134J3561q430l2941N5997j4455k0881
311i604J6359K962k2242R12M0609n0840J2282K4265r708j8557K4172o585m0995
$$ plain form
223 -1392 -22903 31304 44546 -34203 15264 15619 -15417 -10233 35045 2865 -13822 44993 2342
236 2342 -9168 1028 9074 -23533 23965 34578 -21862 11114 15410 -2248 -21236 20702 -14100
249 -14100 -6426 42971 1422 -18352 1526 16668 -40074 12715 26528 -22899 -4862 33261
261 33261 6093 -47062 15491 -3069 -15113 14448 19072 -16219 -8134 25641 -29231 -3871
273 -3871 5933 -4423 -5608 25853 3373 -28812 21199 -9738 -16843 7893 24289 -21192 6052
286 6052 32473 -29661 -5276 16401 1362 -25316 30637 15146 -17772 15696 2596 -13561
298 -13561 -6463 32638 -15600 526 23855 -6589 -2455 11106 2676 -30265 25732 11277 -9604
311 -9604 6755 9717 -12525 -11613 28996 -21844 -9562 14703 4995 -13562 10610 4025 -36970
324c6970N0633q894j7562M859K3954l2669J063M0039m6624l23K4274R149l5647
337b4718L4552l567m0939L5730K731j6345j0005L8634l0315M512K6409k9597j0826
350b3744J6573J9724l8780L5646k549k6006J7263J1350k0117j5370M6474l0782
362a0318M207K2705q343k9021J5470K4574m3223L0627R024j6010q154L1616j9622
375C532k8024M0819j7665p83J4289J4497m0254J1955K1114l3443J5753R946m508
388G228j7239M1054k4595k5746K9134q512r346J1111K7974m5209J4926J5649k5855
401i426k806J7593K383k7914M2891j4506j9666O581O198j7332M264L5678l7887
414a3949Q949J0521p235j9685J8474R97k7155L9536l687j5372r309K0556k4261
$$ plain form
324 -36970 13663 4769 -12793 -7934 16020 -16649 -15586 24453 -22171 -22494 1780 10929 -24718
337 -24718 9834 6267 -34672 1058 3789 -12556 -22561 16073 -14242 -9730 16679 -12918 -23744
350 -23744 -7171 12553 -26227 9419 6870 -19136 -1873 9477 -10640 -26010 20464 -10318
362 -10318 -6111 16594 8251 -20770 -5300 19274 -23949 6678 15702 -308 -8462 23154 3532
375 3532 -24492 16327 -1338 -2121 12168 26665 -13589 -1634 19480 -13963 1790 11736 7228
388 7228 -10011 31043 6448 -19298 9836 1324 -8022 3089 31063 -14146 780 16429 -9426
401 -9426 -12232 5361 7744 -20170 22721 8215 -11451 -4870 1328 -16004 -11740 23938 -13949
414 -13949 -5000 5521 -1714 -21399 -2925 -1928 -29083 10453 6766 -8606 -17915 2641 -21620
427b1620K264L1368l0035M148J6547M735l6819K4709n47k3514K9354O354j4150
440g206j2337L4304k9553k032K1252j2043l086J7085J1625l8263K8229l200j7357
453a2582J2027J5522j0787r540L3733k9409J80J1916P01j6761J7106J6708l3678
466d864K4061j112j4033n747K7904j5540j1774L1124j8690k790K628J1646k9255
479f442J6786J6020k6235J2617O799r070j7950L2796k2529q464K4534r297p971
492A594L445J6049l4872J6500R031j6959K200J7346q095k3886L6386k1881r633
505a2775J3536N019j4663N703J9969l1002J1037L810k928j3312K1219r84k0156
518a5527K8690j3303r411R11J6875k0408R535J6894k0611O885K881K036k5337
$$ plain form
427 -21620 -19356 12012 -18023 -13875 2672 7407 -29412 -4703 -5250 -28764 590 6944 -7206
440 -7206 -19543 14761 -14792 -16824 4428 -7615 -10701 6384 18009 -20254 7975 4775 -12582
453 -12582 -555 14967 4180 -5360 28373 -1036 -856 11060 11761 -5000 12106 28814 -4864
466 -4864 19197 18085 4052 -1695 26209 10669 -1105 30019 11329 8539 11167 22813 -6442
479 -6442 10344 26364 129 12746 19545 10475 -7475 25321 2792 -5672 18862 9565 1594
492 1594 5039 21088 -13784 2716 11747 -5212 -3012 14334 6239 -17647 18739 -3142 -12775
505 -12775 761 5780 -8883 -3180 16789 -14213 -3176 634 -2294 -15606 5613 4629 -15527
518 -15527 13163 -140 -9551 -8640 8235 -12173 -2638 14256 -6355 530 3411 5447 -19890
531a9890K7345p56j6807K1087J221j5612n555K7310k9743O474J6734p992l676
544A40P802N024l1659K3011o50q133N561J2459j3656q560K6582k9504J655J0432
558E04N161j0796J1237K788k4369J6618m145j719q678K1995q654n369J7602k3934
572a1759j923Q301J2109k2418J7798N494j6138P967j792l989j5552L2854q951
585B001j0853J2023J24j0646k109J6481k6434K0168Q343o992o318K237J823j2361
599a2513J9273j4168K415R385R472k0917j433J5242k3322J9687L130p170q908
612i827K0124l665j9415J0177l641O201l127J6853k1906J110J5565j4885j29K38
626f327Q599j0565J9995j1779j1405R063J975k731r522K2773j7469N521R345j0705
$$ plain form
531 -19890 7455 6699 -10108 10979 12200 -3412 -8967 18343 -11400 -4926 11808 3816 140
544 140 7942 12966 -18693 4318 3668 -4465 1096 13555 -101 -8661 17921 -11583 -9928 504
558 504 5665 -5131 6106 8894 -15475 1143 -3002 -4721 -13399 8596 -58 -5427 12175 -11759
572 -11759 -13682 -5381 6728 -15690 2108 7602 -8536 -569 -2361 -6350 -21902 10952 2001
585 2001 -8852 3171 3295 -7351 -9460 7021 -19413 755 9098 2106 -4212 -1975 -152 -12513
599 -12513 6760 -7408 -4993 4392 13864 -7053 -8486 6756 -16566 3121 6251 -919 -9827
612 -9827 10297 6632 -12783 -2606 -6247 -46 -3173 13680 -8226 -7116 8449 -6436 -6565 -6327
626 -6327 2272 -8293 11702 -77 -11482 -2419 -444 -3175 -12697 10076 -7393 -1872 7473 -3232
640c232j1724J3791R999k5343K0814k811j443k263N558q964o603K3109j4850K790
654a172L308M385j4540J4071r35k2587K4042J471n627r205J9291j2388n141J3864
668H837j1404q84N392J5846k4348R450M224j0755N281J208r74p490K3626j7267
682G42k713N228k150m219K721J2850k4449J8937O074j4541j0460J7077o39j6260
696a1802K2753j0342j464L35R672j7127k142J5259j0304J0858m377p59r237J6865
710H188j1223j2414J9555m117Q74j363R930k3564Q851J2065j2700k064P236J3306
724A2560j9861J1813p946o564O646O730j099r264J6111j2881O826m898n156j142
738h125J2597O171j9632J6533o353m830k326J2131j1156m609K5242j2473m839
$$ plain form
640 -3232 -14956 -1165 8834 -16509 4305 1494 51 -2212 3346 -5618 -12221 10888 -3962 -1172
654 -1172 2136 6521 -8019 6052 5117 -17470 6572 8043 2416 -6789 12502 114 -5027 8837
668 8837 -2567 -3451 1941 17787 -6561 2889 7113 -3642 1639 2847 1873 -5617 18009 742
682 742 -1971 3257 1107 -3112 -391 12459 -11990 6947 13021 -1520 -11980 5097 4458 -11802
696 -11802 10951 609 -855 -520 9152 -7975 -10117 5142 -5162 5696 1319 560 -8677 8188
710 8188 -3035 -15449 4106 -11 863 -500 9430 -14134 -5283 6782 -5918 -7982 -746 12560
724 12560 -7301 4512 -3434 -9998 -3352 3378 2279 -6985 9126 -3755 3071 -1827 -6983 -8125
738 -8125 4472 10643 -8989 7544 1191 -3639 -5965 6166 -4990 -9599 15643 3170 -1669
751a669l093R898j3946P279P227r362R053l232L006j3593J1091r464L868J1301
765H364r222J375O73O061k1107J4694J034p020N829O134j610j6836J8418r755
779b968l132L003Q118m016l323J1037j6364P874m070K958k144P792j610q596J3982
794H541j2142m17k70J2167j3574M963J3451j6467K349J265N489j5353J4297N70
808D869o352O147k756O99q816J3035j2374Q393L540p384K479K735L72j6567K0129
823H149o546n189N938O467q804q318J9950j6114q9M470P349j1071M277P218j5572
838g885Q377l042L703p105J0214m695k534R685j3387L046N78O694j4180J5196
852D665K048j6994J0102L937n775j2997K3653r598m986J1161j980q734k352J6298
$$ plain form
751 -1669 -4762 5136 -8810 -1531 5696 -3666 5387 2155 5161 -8432 2659 -6805 -2937 8364
765 8364 -858 517 1190 7251 -13856 838 1872 -5148 681 6815 5205 -11631 6787 -2968
779 -2968 -6100 -3097 5021 1005 -2318 8719 -7645 229 -3841 -883 -3027 4765 3155 -5441 8541
794 8541 -3601 -4018 -4288 7879 -5695 -732 12719 -3748 -1399 -134 5355 -9998 4299 4869
808 4869 -1483 4664 1908 2607 -6209 6826 -5548 2845 6385 -999 1480 4215 4587 -11980 8149
823 8149 1603 -3586 2352 8819 15 -8303 11647 -4467 -4556 -86 7263 -3808 469 7687 -7885
838 -7885 492 -2550 1153 -5952 4262 -433 -2967 6718 -6669 -3623 -3045 3649 -10531 4665
852 4665 6713 -10281 -179 3758 -2017 -15014 8639 -959 -5945 5216 3236 -5498 -7850 8448
866H448j6853Q840J555j476K99K775k391j1496J7042j0755M777M252J110j0120
880c993M311J0250j9990R682L752J813r145J2780k167j4472J1471l674K090m397
894a689J3183j0483J466M479j0315M904l67L743j0520J8259n887j0574O694o33
908B260l813l726J9137j6160J944O758j584p867r30Q449j1445J4832m633q34m449
923b061K577k267k378J0165j4055J0071K089O93j1599O654J017j2843J6279p57
937C585k583q842J5278q279p285R721m697P55j055J4207j5405K534P18l911N295
952C6j086K813q143J4027j0469P01K820m281j807M869J1080j8460J0462j93n122
967b753k752R038j819j0704J7506p974m59k476O033q913R55J1185j0064O588l614
$$ plain form
866 8448 -8405 435 1990 514 813 3588 1197 -10299 6743 -4012 765 5017 6127 -3993
880 -3993 318 10568 -9422 260 4012 5825 -3320 9460 7293 -7179 4292 618 2708 -1689
894 -1689 11494 1011 2477 6956 -3359 1545 1178 4921 -5599 12660 6773 -3801 2893 2260
908 2260 -1553 -5279 13858 -2302 -358 6400 4816 -3051 -3981 4468 -6977 7855 3222 2388 -2061
923 -2061 516 -1751 -4129 6036 -8019 2052 4141 4834 -6765 -111 906 -11937 4342 3585
937 3585 1002 -7840 7438 -841 -8126 1595 -3102 -2347 -3402 10805 -4600 -2066 -1348 -5259 36
952 36 -1050 1763 -6380 7647 -2822 -2121 699 -3582 -5389 -520 10560 -7900 2562 2369 -2753
967 -2753 -5505 3533 1714 -8990 8516 542 83 -2393 3640 -5273 -4318 6867 -3197 3391 -223
982b23K733q490J1195m885q046J1975l545J708m428R704j5050L487R221n598j203
997a445J67P899j3375J3222o062p481N393N082k167n513J2872j5254N273L650
1011B261k038p060O467O958j5113J4389l836o424k906J2911p608n386J5793j0718
1025b310Q39p38P188j2296N168M505q133J0113j782k265q881J4467r642j438J0353
1040E148o603l69K154Q819j8763Q205L147n441L421N769k478j3117J8805r275
1054e78n275M453N041n253M00J0858j6347O555m98l04m174J0109j722j0002J4743
1069H006r286k557J76Q377j0869N401R294j2815M914j144j5q887J4734l656p954
1084f281J0156j206l555o618J2260j2328N634O844n142q60L45L135j2001J3640
$$ plain form
982 -223 2510 -5980 5215 330 -7716 4259 714 2422 -2006 7698 -7352 -3865 5356 -242 -1445
997 -1445 -1278 6621 -6754 6468 406 -7075 -1682 3400 1233 -4280 8592 -6662 -1389 2261
1011 2261 223 -6837 -370 6588 -8525 5864 2028 -4396 -7302 5609 -1999 -7385 8408 -2310
1025 -2310 -1471 -2209 4979 -7317 -2149 2356 -5777 4336 2554 289 -8592 5875 -3767 -5205 5148
1040 5148 -1455 -1824 330 9149 -9614 -1409 1738 -3703 -282 5487 3009 -10108 8697 -578
1054 -578 -5853 -1400 3641 -1612 -1212 9646 -6701 -146 -644 -948 -5122 4987 3265 -6737 8006
1069 8006 -1280 -3837 -3661 4716 -6153 -752 8542 -4273 641 -503 -518 -9405 5329 1673 -6281
1084 -6281 3875 2669 -886 -7504 4756 -7572 -1938 4906 -236 -1096 -751 2384 -9617 4023
1098D023n511k729M756N538o045p110J3249j2988M789L964P07o711P608K026j3989
1113h423J1669m062q92r30J1328q659m411J1646j0321J819J135M706j0745J2771
1127F631L41j2200P540j164j04o019J3869r790m85Q001m889l352K51P039j3126
1142g457J3502n05p798J479N745l099j0106J5196q149M41K506L307q338J743P691
1157F158j4551R444J637j643n857J0411m878r351J3902o977j598j03J0273j0712
1171c845L646L805j1857O963L632m72j1225J5138m446n279P002m225m076J030
1185d209J3580j4297M688L592n072q65N058N53j4168J6461o22m867j966O038n408
1200a504l310J1476j0469N369Q94R45p321O715J130j2204J1254p07j672j399J0835
$$ plain form
1098 4023 -1488 -4217 539 6077 32 -7078 6171 -6817 -2028 1936 2643 -4068 3540 5566 -8423
1113 -8423 3246 -816 -1708 -2638 8690 31 -4380 7266 -3055 -1236 -101 4605 -6140 6631
1127 6631 6972 -5228 2312 1148 1044 -4975 8894 -896 -1381 6620 1731 -1621 -1370 5669 -7457
1142 -7457 6045 5540 -2258 -779 4966 1867 -8239 6957 -1192 -751 1755 5062 -3276 -1533 6158
1157 6158 -8393 1051 2688 1045 -4812 5599 721 -8630 5272 -1705 -3303 -3406 6867 -3845
1171 -3845 -199 3606 -8251 -1288 2344 1872 -9353 5785 1339 -3940 3062 -1163 -5239 -4209
1185 -4209 9371 -4926 -238 3354 -1718 -2583 2475 3028 -11140 5321 4699 -168 -2134 3904 -1504
1200 -1504 -4814 6662 -3807 1562 2456 3401 -3920 2795 3925 -8279 2975 2268 596 -803 10032
1215A0032j3704k553J2618p856J105J490L999j1748J2985n8j4440L977P147K84
1229C278p608J2946j2515P8Q560l644o029J111R361r318J0168n122o226K10Q152
1244C402k994p327J3963r188J327K756l96r289O695O819j2707R625J385k831q004
1259f764J0654m941n903J3977n244m647J171J0577j3677L019M101p088O816L997
1273F048j898j2689J3189m282k716N154l057k264L484J0357j6992M193K160k942
1287b255K038N793m130r628J6620p409n000K083N380p558K456J1350j4066K478
1301a848K404J137q460R270R25q932R218k906j024l100P966r833K086R279o524
1316c42J28P3K429r727J2890l886q209Q470K966m367m065J0768j3815L695Q998
$$ plain form
1215 10032 -3672 -6225 6393 -1463 -358 1132 5131 -6617 6368 6310 -8130 -4153 2994 3278
1229 3278 -4330 8616 -3899 -3821 4739 1095 -4934 -3823 5538 -3780 6388 1266 -4960 -4750 3402
1244 3402 408 -6919 7044 -2144 -817 1939 1543 -7746 -1051 5768 -6939 2686 4071 1240 -6764
1259 -6764 3890 -1051 -6954 7023 1779 -2868 -1697 8880 -4797 -1778 2323 -4765 2051 6048
1273 6048 4150 -8539 4650 368 -2348 2806 -251 -2515 969 11326 -5666 -1473 687 -2255
1287 -2255 -217 5576 1446 -8182 8438 1029 -3971 -1888 3492 -4066 -1610 9740 -4326 -1848
1301 -1848 556 1693 -6767 2503 3428 -5504 3714 808 -216 -3316 4650 -5183 -3097 6182 -342
1316 -342 -214 -141 2288 -7439 5451 1565 -6644 1826 4792 425 -3640 7128 -6687 -2992 6006
1331F006l515o685N819N469j3944J1076k006o277J952R817n920o476J2433q856
1345a107l90J735M381q072M781M558r107O730k376j623l682R431o538k36Q495
1360F980q832j089L029M720j3201R179L362q677M528M348n929r585J6473o128
1374h22n356O624K385o773q69J0284j3291L970L397J70k883M629j789p752J1115
1389C039p010k0J805M956o743L065N075j1845O288J920j202n188J1316l993p805
1404f342J0220l530m214l33J1744j0230J771O409o347j051K480L245j0380J1631
1418E073j059n163K989J825m410l657J1509r269K901L378j223m363L203J410r669
1433f525J1460k716k642J127N284q591j214J0089j0465L334M086l6r441R854L60
$$ plain form
1331 6006 2491 -4194 1625 7094 -6850 4226 2220 -4057 -2105 7712 1792 -4684 7749 -1107
1345 -1107 -1497 238 4619 -3453 1328 5886 -3221 3509 1133 -490 -4172 5259 -1279 -1515 6980
1360 6980 -1852 -2941 88 4808 -8393 786 4148 -4529 -1 4347 -1582 -11167 5306 -822
1374 -822 -6178 446 2831 -3942 -4811 5473 -7818 -3848 -451 -281 -3164 1465 -324 -8076 3039
1389 3039 -3971 -3991 -2186 2770 -3973 -908 4167 -7678 -1390 530 -672 -5860 5456 1463 -6342
1404 -6342 3878 348 -3866 -4199 7545 -2685 -914 5495 -852 -1903 577 3822 -6558 5073
1418 5073 4014 -1149 1840 3665 -745 -4402 7107 -2162 739 4117 2894 -1469 1734 3144 -6525
1433 -6525 4935 2219 -423 704 5988 -2603 -3817 6272 -4193 -859 3227 3191 -6250 3604 3964
1448C964j2427Q596J774l298l813J2815r322m890Q241k711j958j31O281q540P386
1463A967o33n792J928J681m83l172J0837j0931Q03O874k861o055M805N515j2603
1478h120J0961K002p296l761J0479l477q318J2808m667l172K052O983j0110J391
1492b245N853p640N662R59o31o074Q752m426l727P524m495j507K443P358j2307
1507d501M809L126p107K432M481n19r060J2107m460m458L451J753n247M13J0905
1522H125j1551K868K694k597m302P101R91r969R908q63k876k137O565p420j318
1537d781J0805o481q2M77K828o740O721j691n577P169j410Q2j482N477j0671L640
1553a716Q057o901j568N263K783j2238J0708m35p410J938O633j292p067J0024
$$ plain form
1448 3964 -8463 133 1907 -1391 -5204 7611 -1711 -6601 1640 -1071 -3029 -3160 3121 -5419 1967
1463 1967 1334 -4458 -2530 -849 -1332 -4504 6333 -4598 -3795 3079 218 -5837 -1032 4483 -8120
1478 -8120 2841 4843 -2453 -6214 4265 788 -7530 5278 611 -2561 -509 6474 -3636 -2245
1492 -2245 3608 -4032 1630 2589 1958 -4116 4636 210 -3517 4007 -488 -1995 448 7806 -4501
1507 -4501 308 3434 -3673 -1241 3240 2721 -6339 5768 1308 -3150 301 2054 -3193 -2780 8125
1522 8125 -3426 -558 2136 -461 -4763 2338 3329 -6640 3268 2405 -471 -2608 3957 -3463 -4781
1537 -4781 6024 -457 -539 -62 2766 -3974 2747 1056 -4521 2648 1238 1320 -162 5315 -5356 -1716
1553 -1716 6341 -560 -2128 3135 5918 -6320 4388 3953 -3457 -1519 5114 3822 -3245 6779
1567F779p072j206K270L065m686J468M606p412O631k834k636r74N758l588r45
1582g76Q384r242j93L791L155j0535N904N114q040M380J466k891o724J0613l932
1597D74l151N812k522j276j68N184r965N104K575l758J405K874j633p371J0651
1612D235o476j799N008J616n959Q82P706j0391L421J115K59l471O045n13q045
1627f367Q385l320j389P86N174q863L907P792r813P50K255K227p695R252j227
1642A854p121O275J279l700l763R402p746K394M297l698j322J656K373p229Q231
1657C182l513j834L639K510o219j120J0428j1366K166N658p84o280N358K480r736
1672e431P144Nj419l515Q158l952m055P334n914K21R58M152o920N060M06m980
$$ plain form
1567 6779 -293 -1499 771 3836 -850 618 5224 -2188 4443 1609 -1027 -2001 3757 169 -776
1582 -776 7608 -1634 -1827 1964 5119 -5416 488 5602 -2438 1942 3408 517 -6207 4406 474
1597 474 -2677 3135 613 -663 -831 4353 -5612 -508 2067 -1691 -286 2588 955 -6416 4235
1612 4235 -2241 -4040 968 2584 -3375 -2493 5213 -5178 -1757 -642 -383 -3854 2191 1678 -6367
1627 -6367 2018 -1302 -2691 -1905 3269 -5594 -1687 6105 -3708 -2958 -703 1524 -6171 3081 1854
1642 1854 -5267 1008 2287 -1413 -5176 4226 -3520 -1126 3171 -527 -1849 -193 2180 -5049 3182
1657 3182 -331 -2165 1474 3984 -2235 -3355 7073 -4293 -2127 3531 2747 -3533 1825 4305 -5431
1672 -5431 1713 1718 299 -3216 4942 990 -3065 4269 -1645 -1424 -466 3686 -3234 1826 2232 -2748
1688b748M373j361j226k911R390o742j419O127l058l913K076O026j0196O571J569
1703B558l970K4K682j539n019R528n595n10K912J731n530J363N032q827N986J128
1719A954j171l161N617l068m324P270m081K49j09O215p260N56M326n248K098Q01
1735F64J660n462Q247m416l149M557k005j149r4P285q568K817L179l734k361L490
1751I61K157p763R043l508k733J901K053m107j180P151o125K884k16J29m581M704
1767G70Q45p451P614j775o41r27M253p183J018O625n337P92R8L925p069N220l47
1784D30n520M249K441j142m752P990o173K81L013k422n34J714M211q162N537o33
1800E28k416m3L989k615l419R965p180o81J487K330m419K126L614o973N511K58
$$ plain form
1688 -2748 1625 264 -962 -3873 5517 -1225 -2644 3483 425 -3488 -1412 4614 -5582 989 2558
1703 2558 -1412 -1388 1294 -245 -5264 4264 -1331 -1841 1071 2802 -2728 -1365 3667 -5160 826 1954
1719 1954 783 -2378 3239 171 -4153 3117 -964 -715 -824 5391 -1869 -1313 3013 -2235 -137 664
1735 664 2324 -3138 5109 693 -2456 2101 96 -1053 -1147 6138 -2430 387 3566 -168 -2529 961
1751 961 3118 -4645 4398 890 -1843 58 2111 -1996 -3176 3975 -2150 734 518 647 -3934 770
1767 770 1615 -5836 1778 3 -638 -1565 2688 -4495 -3477 3148 -2189 -1397 -1299 2626 -4443 777 430
1784 430 -5090 -841 1600 458 -4294 3696 -2477 -2196 817 -1605 -2139 -425 3786 -4376 1161 528
1800 528 -1888 -1931 2058 -557 -3976 5989 -1191 -1872 -385 1945 -2474 -348 3266 -3707 1804 2062
1816B062j149n213O591j551l071O120m592M18L14M343p825K712K863l686K997
1831A333n0j76n705Q479l638l452L629P62j496j021N641q773M178J876k151j731
1847b295L088J606o005O837m078j520J247M009m530q68O682o203K822j023M47
1862B16l442N935m81n458N946k292j2k239N394o218J536N990m956J20j69L433
1878C303o412N522j574k339L867o2j187m073O788n597J619J955j139j444J799
1893A026K799q256N673q76o40m86K953j702l224O932o160M73R2L560m091K616
1909F89J776o210N078j600k56k559O182l521j288N202n065L2L91M334o957M423
1925F51J940l324J110l50M97l902P265m277j62K447o79r87j045M022o563N196
$$ plain form
1816 2062 913 -4300 2291 740 -2331 3789 -803 -385 -71 4272 -3553 -841 2022 -1664 1333
1831 1333 1283 1107 -4598 3881 243 -3209 420 1182 -314 -1335 4306 -4467 -289 1587 -564 -2295
1847 -2295 793 2399 -3606 3231 -847 -2367 -1120 2889 -1641 -2509 4173 -2030 792 -231 216
1862 216 -3226 2709 2228 -3230 2716 424 412 -1827 3567 -2651 -1115 4875 -81 39 -130 3303
1878 3303 -3109 2413 839 -1500 2367 2305 1118 -2955 3833 -1764 -145 1810 671 -773 1026
1893 1026 3825 -4431 1242 366 -274 -760 2193 491 -2733 4199 -1961 -1488 -1396 2164 -1927 689
1909 689 2465 -3745 1333 -267 -523 -3082 3100 -421 -1709 3493 -1572 -1540 -1149 3185 -3772 651
1925 651 2591 -733 377 27 524 -3378 3887 -390 -552 1895 1216 229 -816 3206 -3357 1839
1941A839Q35j605j697K948Q3n524O997m048L60O80L248m751k99M863o151K964
1957G42o2J823m925N288j107m341M264k302Q17j873M980n519J807K652m583J490
1973h49K61J929n673O417k185k103J522N37r38l017O577n293K102K98K55k301
1989b461J053K792n873N644k096P30j383K750k181j902N228m429K111m01K841
2004B423n294L451J785n288L438k83J399l665N647l732p04K739k153R96j653M540
2020C646n620M030j31k640J113Q68L55m241O947m423L38M81K80j795l20M942o299
2037b469M197q51l15k220K648p24l829O116l428P22j322K977m028L73L254m285
2053c184L033p97K180n076M740j932k772M359j572Q07k248M605n671K222J355
$$ plain form
1941 1839 2674 1069 -628 2320 2403 -3121 3876 -172 188 868 4116 -635 -934 3929 -2222 742
1957 742 680 2503 -2422 2866 1759 -2582 1682 -620 197 -1676 3304 -2215 -408 2244 -2339 -849
1973 -849 -588 1341 -4332 2085 -100 -2203 -681 -144 -1082 -4099 2478 -2815 -713 -415 -160 -2461
1989 -2461 -1408 1384 -4489 1155 -941 -211 -1594 1156 -1025 -2927 2301 -2128 -17 -418 2423
2004 2423 -2871 580 2365 -2923 515 232 1631 -2034 3613 -119 -823 1916 -237 759 -894 3646
2020 3646 -1974 2056 1925 -715 398 1266 1621 -2620 4327 -96 242 723 1003 -792 -1112 3830 -2469
2037 -2469 1728 877 562 -1658 990 266 -3563 2553 -875 -153 -1475 1502 -2526 -2153 1101 -3184
2053 -3184 -151 -948 1232 -3844 896 -1036 -3808 551 -1021 -214 -2462 2143 -3528 -1306 49
2068D9k079J072k81K860n220N537l211r76J526J284j080j237N237o179L342m25
2084B19L4k090J940K493m779N181k403l11j846M193k413j295M785m088K297j768
2100A49K685m377K719Q16k571L470j746P21l695N527m070K24K516j964M82j77
2116G09L008o511M303j093k69L42N92M62m394O066m144J23M18J107j928M61L719
2133B971o046L324j622J612k479L097o79k953L863k659J504k808L712l859K604
2148d18K192m127K378j228J780l672M753k635j125L047l16k30l159N348m885K169
2164a28J338r47p45M58K603m812M140k975J669N6J225r76j863M125m908K851p36
2181C75J445k531K172R40m161M306k792J206k379L469j517n70J937l180J665j066
$$ plain form
2068 49 -2030 -958 -1239 1621 -3599 1938 -1273 -2249 -723 561 -519 -1756 3481 -2698 644 219
2084 219 253 -1837 103 2596 -2183 2998 595 284 -1562 2631 218 -1077 3708 -380 1917 149
2100 149 2834 -1543 1176 1992 -579 2891 1145 1866 -1829 3698 -372 -148 2368 404 886 709
2116 709 3717 -2794 1509 416 147 489 1081 1543 -2851 3215 -929 -806 -388 719 -1209 -748 2971
2133 2971 -3075 249 -1373 239 -2240 857 178 -2775 1088 -1571 -67 -2875 837 -3022 -418
2148 -418 1774 -2353 25 -1203 577 -3095 1658 -977 -2102 945 629 399 -2760 2588 -2297 -128
2164 -128 1210 263 -482 -24 2579 -2233 1907 -1068 601 657 1882 906 -957 3168 -1740 1111 375
2181 375 1820 -711 1461 2401 -1760 2546 -246 960 -1419 2050 533 -37 1900 -1280 385 -681
2197f81L054n162L442K99j433J497j632N54l061N390l175K59K28M53m89j462L860
2214A941n571L301j4J58r10M98M16k582M214m235K919j141J425j900N49K710n363
2231c585L960p92R86k776M415k397k561M303k397J060k156M414l786J601J531
2246A820k190j24l16L588m489M257k607L32J422j508N23j552L977m516L543l35
2262A825j369j189J822J872n753N451j695j12o54K089k519j028L957l810K185
2277A072j058K427m000K360M84l367L355j248R76k437M203l857N7K456k526J159
2293E6j005L384m752K765k16j023K49l19J354k825M756m233J308N02k62j011N55
2310g17K830m814L879j220K53k049K376K72l403M830k969N49p72L260l776L19
$$ plain form
2197 -681 2373 -2789 653 952 -481 1016 -616 -62 -3123 2267 -908 -649 -421 32 -457 -1919 1941
2214 1941 -3630 -329 -343 -185 -1095 -597 -181 -2763 1451 -2784 135 -1006 419 -1481 -932 1778 -3585
2231 -3585 375 -417 569 -2207 2208 -189 -2750 1553 -844 216 -1940 2474 -1312 289 1820
2246 1820 -370 -494 -810 2778 -1711 2546 -61 271 1693 185 708 -844 3133 -1383 2160 1825
2262 1825 456 -733 1089 2961 -2792 2659 964 852 198 2287 -232 -1260 2697 -1113 1072
2277 1072 14 2441 -1559 801 1285 -2082 1273 25 1001 -1436 2767 -1090 -1033 1423 -1103 56
2293 56 -949 2435 -2317 448 232 -791 -542 -861 493 -2332 2424 -1809 -501 1 -261 -1272 -717
2310 -717 2113 -2701 1178 -42 211 -1838 538 810 -2593 2237 -732 -183 -955 2305 -1471 -1152
2326a152K818k713K274j494K135l554K590j063l66K363k923J799p68L674n787
2341b167K343J204j960J286m69J489m179N033k479o28l75J585o13j843M744m431
2357a460R30k51J405j816n9K074k640L366l503J681j145J810k313l96M143l733
2373a907P68m79K030l671L018p2k472K630j288J992l077K925l444J291K483j662
2389i35k71q08L509l927K943k016k18J721N52L29l144M101l375J666J29J116k141
2406g69K1L700m186K466k011J732j166J836r09j099L838l871N47J10L186m491
2422a066J580K277l151J881p21O14l553M628j334j264J643j395Q9r39M417n541
2438a835J234J125P11k23j062O45k946N089l208mL06J315j151q58L418m876J770
$$ plain form
2326 -1152 1666 -1047 1227 -267 1868 -1686 904 -159 -525 1838 -1085 714 -54 3620 -2167
2341 -2167 176 1380 -580 706 237 1726 -2453 2580 101 -527 -902 683 70 -1773 2971 -1460
2357 -1460 -530 -781 624 -1192 -1251 823 -1817 1549 -1954 -273 -1418 392 -1921 -2317 1826 -1907
2373 -1907 -1139 -1618 412 -3259 -241 -313 -2785 -155 -1443 549 -2528 397 -3047 -1756 727 -935
2389 -935 -1206 -2014 1495 -2432 511 -1505 -1723 -2 550 879 -2265 1836 -1539 127 256 1372 -769
2406 -769 -748 2952 -1234 1232 -779 953 -213 1623 714 -385 3453 -418 129 239 3425 -1066
2422 -1066 514 2791 -360 1521 800 1414 -2139 2489 1155 -109 1534 139 228 -711 3706 -1835
2438 -1835 -601 524 1235 1012 -50 595 -2351 2738 -470 -474 -168 1147 -4 -862 2556 -2320 -550
2455e50K77J725k864J603Q42l442L737j892K76j411L553k771l29L120k343J15
2471c54j169L297k967K486j058j987K452p18O77k948M133l183J309J804j517j320
2487a063k56L608l901K816j781L14N11J448j087l055M134k404J443p79J307k157
2503i02Q22J892l413K718j899J637j822L131j801j813L309k275O94j104L438l549
2519i37R73R63j564J400r56P98k704M801k325j208J027r3q2j548M031m480K365
2536D61j42J79o68J82K87k539M707k779J09j64J482j657n87K690l218K122p29
2553b64J421k382J782n51k246L697j792N19j466L186k800M57J585k178J179p53
2569f06K327l681L529j538j591J705M50k84k174M393l473O77J75K35p01o5K191
$$ plain form
2455 -550 -273 1452 -1412 191 1033 -2409 1328 -564 -288 -1699 1854 -917 -1246 1874 -469 -354
2471 -354 -1523 1774 -1193 1293 235 -1752 700 -18 659 -2289 1844 -1339 -30 1774 257 -1063
2487 -1063 -1319 2289 -1612 1204 -577 -263 248 1696 609 -2446 1688 -716 727 -52 1255 -902
2503 -902 -80 1812 -1601 1117 -782 855 -967 2164 363 -1450 1859 -416 278 -826 2612 -937
2519 -937 36 999 -565 835 -121 677 -2027 2774 449 -759 268 175 93 -1455 2576 -1904 461
2536 461 319 498 -170 12 299 -2240 2467 -312 -203 -367 1115 -542 -1129 1561 -1657 465 -264
2553 -264 1157 -1225 557 6 -2240 1457 -335 184 -1282 1904 -896 -439 1146 -1032 147 -606
2569 -606 1721 -1960 1569 31 -1560 145 595 311 -1863 2530 -943 -266 -91 144 -557 -622 1569
2586A569l319L056j672j09j34J646j460j667M516l403R05k48J419l027J550J511
2602A133l037K278n16Q18k819L395j862j207K542j006M78j696L193l462K014j74
2618G2j132J090k54R55k766M158k893j13J582Q3j665m28M407n097K245L91m46
2635A89j514K465N36l876L925k000O47j117K182j957j81K889l248J848n22N72
2651H38k291K905o02j835K617j652K66j295L442l839J032J971k029N90M5J480
2667A643m138L970j269q27Q82j54K54j831L718l800J047N76K79j278J233J276
2683A581m154M001j302R6j509K006o07j110K663k821J237q69K061k350J905p9
2699G49k684L133j157K26j869K977k557N33K686k336n54J75L156m840K777L21
$$ plain form
2586 1569 -1750 1306 -366 -475 -609 1037 -423 -2090 2426 -977 -72 -320 1099 -1928 -378 1133
2602 1133 -1904 374 -142 676 -2143 1252 -610 -1817 725 -281 197 -1499 1694 -1768 246 72
2618 72 -1060 30 -224 731 -2035 2123 -770 -883 699 782 -883 -1311 3096 -2001 244 635 189
2635 189 -1325 1140 1676 -2200 1725 -275 372 -745 1437 -520 -701 2188 -1060 788 266 838
2651 838 -1453 1452 850 -985 1632 -20 246 -1049 2393 -1446 -414 1557 -472 118 163 1643
2667 1643 -2495 1475 206 -621 261 107 361 -1470 2248 -1552 -505 71 350 -928 305 1581
2683 1581 -2573 1428 126 222 -1287 719 112 -998 1665 -1156 81 -788 1273 -1077 828 749
2699 749 -1935 1198 41 267 -1602 1375 -1182 -649 2037 -299 -853 -678 2478 -2362 415 736
2715G36j747M10J055P66l640L500k054Q82j5L33n97n81K321l451K925j054l95
2732f06m78K169r96k251L865l235P12O55J993l529N70L032l147J316n35J144k718
2749b039L744r43k020J942j100P75j095K959l776J754J023j539M54l50J222l079
2765b068L958j928j78L77K89o25q12K971l980K192j91N10j622J241N02l202L828
2782A262j800M2r38K682k804j94L735l530L58J32K624l380J842J04j826J666l64
2799c89Q24k786L324k186P55P99j668O20p2K208l649L285j471m19P95N99o97j854
2817a982M357l292M87N37O87j762K76K863l658K533p28P37k128K377l20j897K472
2834A559j676J047r78K472l252J261J121k081J906j102J104j887L212k623p37
$$ plain form
2715 736 -1011 -601 454 1220 -2420 1080 -974 -92 -107 226 -371 -952 1369 -2082 843 -211 -606
2732 -606 -1084 1085 89 -2162 1703 -1532 -820 -165 1828 -1701 -1131 1901 -1246 70 -465 679 -2039
2749 -2039 1705 762 -1258 684 -416 359 -736 2223 -1553 201 1224 -315 139 -211 1011 -2068
2765 -2068 1890 -38 -216 161 450 -175 -987 1984 -1996 196 5 515 -1107 134 636 -2566 1262
2782 1262 -538 -496 -1434 1248 -1556 -1750 1985 -1545 -1187 -1055 1569 -1811 31 135 -1691 -25 -389
2799 -389 435 -2351 973 -1213 -458 341 -1327 -707 -779 1429 -2220 1065 -406 -825 -30 569 -128 -1982
2817 -1982 2375 -917 -430 107 794 -968 -692 2171 -1487 1046 318 1055 -1073 1304 984 -913 1559
2834 1559 -117 930 -48 2424 -828 433 1554 -527 1379 277 1381 -506 2706 83 -654
2849f54K188j115K55o54K773l924J953P03j367k21Q17R32k961L749k571j74K82
2866A1J146j375o01L080l224J815o76P68k006J447N07k177K682k017Q89j106K014
2883A177k363L83K222k706J479n72J282l381L301j063j785K271l34J05k072L701
2899A645l303R13J138j128o9J41K041l713K726p47k49j71J152n41j297L337l258
2916a383J732n83N36j038J082J244l511L113j099L65j534K806j778j008L333k538
2932b61L90p44K446l001J783N07j982J401k80J057l198L531j841k65J091p54K52
2949A32r74K835l604K299n66k81M1R6N12k759M011k676L92K80P93j536M45J872
2967A312l406K761o93L69k064K507K04k729K653j583P48j018K761k418k6J599
$$ plain form
2849 -654 1534 419 674 20 2793 -1131 822 1525 158 -63 754 1686 -1275 2474 -97 -271 11
2866 11 1157 -218 -819 2261 -963 852 176 944 -1062 385 892 -1285 1397 -620 269 -837 1177
2883 1177 -1186 -803 1419 -1287 192 -380 902 -2479 822 -241 -2026 245 -89 16 -2056 1645
2899 1645 -1658 -745 393 -735 -804 -663 1378 -2335 391 -356 -605 -776 376 -165 -1462 1875 -1383
2916 -1383 349 -234 302 -736 346 1590 -1921 1192 93 458 -1076 1730 -48 -1056 2277 -261
2932 -261 129 -615 1831 -1170 613 1120 -862 539 259 1316 -1882 1649 -192 -457 634 -120 132
2949 132 -842 1993 -1611 688 122 -159 -118 -22 490 -2269 1742 -934 -542 -262 531 -1005 -560 1312
2967 1312 -2094 667 -26 343 -1721 786 990 -1739 914 -669 79 -939 1822 -596 -622 977
2983I77j580J275j415J772k441K818j179o34R21o52O67j396K997l775J973O83
2999A011n30q20L70J456l085K997j731M85l44J266j254j224L396l338J653p36
3015d28J196k147J779N43k993K792j252J098k058K524k020J85K068k315P38o98
3031i88K276k749K160p60j235J728p47N55k187L617k696J240M45j006l50L77K138
3048A818l986K871k99r7o52J048j72j816L407k686Q80m44J569j541J28J413k579
3065a138K372p41N04j815K427j240j009K469k320J013p64K675l758J823R73j875
3081d04N58m24J674l235L521j621l00M13j82R0j072K482l181K145j87n93n77O98
3099a95R24k695L322k254N93l92J275j806k92K686k749J424q49J355k265K045
$$ plain form
2983 977 -603 672 -743 1029 -1412 1406 227 -407 514 -138 529 -867 2130 -1645 328 1011
2999 1011 481 -339 31 1487 -1598 1399 -332 153 -191 1075 -179 -1403 1993 -1345 308 -428
3015 -428 768 -1379 400 943 -2050 742 -510 588 -1470 1054 -966 -781 1287 -1028 -290 -988
3031 -988 1288 -1461 699 -61 -1296 432 -315 240 -1947 1670 -1026 214 659 -347 -697 -320 1818
3048 1818 -2168 703 404 307 -345 703 531 -1285 2122 -564 316 -128 1441 -100 28 1441 -1138
3065 -1138 1234 493 997 -818 1609 369 -640 1829 -491 522 -242 2433 -1325 498 1471 -404
3081 -404 154 -270 1404 -1831 1690 69 -231 182 0 90 -982 1500 -1681 464 277 -316 -893 -195
3099 -195 729 -1966 1356 -898 -305 -697 578 -1228 -1520 1166 -1583 -159 -1008 347 -1918 127
3115A27k73j546K198j314Q44j847K573k240O36J340j751R89n05J729l187K570
3131C43q42o28J125l09M61j765L200k840J219n6l10K81k92J691k710K721j457
3148a68K08m92J320l16j609K746k471J329q83J533j731P76Q98k318K409j281R75
3165I25k138K644j473n15J446j158Q15j159K198k862J644Q9j072R56l80Q92k197
3182a345K778k053M18K85K36m87l92K187l012J735m47J60o25P12O20k234K677
3199A213k027R71j139J576j156k68J984k467J875j086J081j930J994n29r91J832
3215I33r63N52j743K841k345P01Q70j154N50l63J485k847K698j271%L52m5q5j485
3234a319L023k870J707o87O27q35M18J095k699K513j444P31o64J236r38q12J995
$$ plain form
3115 127 -146 -1692 506 -808 36 -1811 762 -1478 -842 498 -1253 -264 -769 960 -2227 343
3131 343 -499 -1127 -2 -311 150 -1615 1585 -1255 -36 -92 -402 -121 -413 1278 -1432 1289 -168
3148 -168 40 -452 868 552 -1057 1689 -782 547 -336 1197 -534 242 1140 -1178 1231 -50 925
3165 925 -1213 1431 -42 -557 889 -269 546 -613 1585 -1277 367 456 -616 340 -40 852 -1345
3182 -1345 1433 -620 -202 83 319 -168 -560 1627 -1385 350 -97 63 -562 150 770 -1464 1213
3199 1213 -814 157 -982 594 -562 -830 1154 -1313 562 -524 557 -1373 621 92 -899 933
3215 933 -30 522 -1221 1620 -725 -24 846 -308 242 -121 1364 -1483 1215 -56 -56 296 251 166 -1319
3234 -1319 1704 -1166 541 -146 481 -354 64 1159 -1540 973 -471 260 -404 832 -106 -918 1077
3251A077k149J424p99J519k257J530O39j916J363r47J268k025K734j756q1R78
3267F02j196J062j028J967k618K060l21j108O05M94L90k156L019k014O93q8L96
3284G59k97p33J771k659K028j057Q78q65N48J24j506K680k361J263p52J375j689
3301d93L28J440k244J560j025J688k311K116j067p77J193p79P49j488K586k366
3317h90J186j49p61P25p10J337k384K475j725P02J84L1n1j053K327k665J463o60
3335f18O99r09O26P33j714J961j503R54j116J229k94p78J456j772J784j105Q89
3352E22j597J820k37j081J133o33O27j598L042k116m7N45k72O06j255K030k397
3369i08J757p77M55j63n46Q84j045J998k390J238j60J74m95L09J111k726K337
$$ plain form
3251 1077 -1072 352 -447 1072 -1185 345 984 -932 431 -516 752 -1273 1461 -295 -376 602
3267 602 -594 468 -560 1407 -1211 849 528 -580 25 519 909 -1247 1772 -242 451 363 759
3284 759 462 -271 1500 -1159 869 -188 690 -175 373 497 -1009 1671 -690 573 -179 1196 -493
3301 -493 -165 1275 -969 591 -434 1254 -1057 1059 -8 -785 408 -371 378 -1110 1476 -890
3317 -890 296 147 -614 111 -599 738 -1646 829 -896 -194 -10 21 -30 -1083 1244 -1421 42 -618
3335 -618 81 -828 -202 531 -1183 778 -725 229 -887 342 48 -730 726 -1046 738 -367 522
3352 522 -1075 745 508 -573 560 -73 554 -1044 1998 -118 -165 380 108 714 -541 1489 -908
3369 -908 849 72 527 364 -182 702 -343 1655 -735 503 343 517 22 331 1442 -1284 1053
3386A053j003N09j599J787j9j492J530j096J178j925K133j548P25K50j081J135
3402E37j107J506j418J073j330J99J017p15K19j486K576k444J499p1o44K3K24
3419c42J420k777K212j127O54m01J67J07p95J722j912J439p19M36p88Q36K05j450
3437a113J929j451R29j143J788j388M7J132j134J053j111J785k275J508k47j76
3453A33L57q06P83j169J772k075J273K76o63M09o03J552k594K217q03m5m62L20
3471a28L73j149J659j652J115q55J063m59l89P05j598J670j319J246j320J656
3487F18j196j11J612k324J475o66J386k195J527L74j242N38o34J669k267J872
3503D36q88K68j38k18Q64j273J686j740J429q22J39J55l23O83j187J921j807J042
$$ plain form
3386 1053 50 559 -1040 747 728 -764 766 -330 848 -1077 1056 -492 233 483 -598 537
3402 537 -570 936 -482 591 -739 -540 477 -238 -19 -1505 1071 -1373 126 55 -589 -566 -342
3419 -342 1078 -1699 513 -614 40 -361 -194 -87 -882 840 -1072 367 -352 84 -704 132 337 -1113
3437 -1113 816 -635 294 -849 939 -449 -402 730 -404 649 -462 1323 -952 556 309 133
3453 133 490 -316 467 -702 1070 -1005 268 544 -119 290 -313 1239 -1355 862 59 14 -448 -128
3471 -128 245 -904 755 -897 218 -637 426 -33 -422 283 -1315 355 -964 282 -1038 618
3487 618 -578 -689 923 -1401 74 -592 794 -1401 126 500 -742 -204 -838 831 -1436 436
3503 436 -452 -184 -322 -540 324 -949 737 -1003 426 -396 -257 -102 -425 258 -929 992 -815 227
3521B27l27L55n95j01J633k356J584r00J344j615R37K00j120J276j101J176j094
3538d77J170j341O54O21j208O57p35J640j886J479r15J85K47k33N95j724K117
3555H46j721J305n55J92l4p92J392j494J344j288J209l62R4q8q74J703j703J330
3573E04o41R17j250M88Q89j664J301p91J111j818J688n04n68Q32r09J195j060
3590b80J586j617O89j86j10P19j210Q52j038K150j843L17K27J0K62q66J764k320
3608h94J465n41O45q21j48O74q93J471j750J474j127P86m61j97R09j301J171j066
3626f04J217j309P33k32o32J053q30R96j525J636j206O81K11j019M82k60J136
3643E28j547J444j400N76O68j21j19j110J924j387R32p99L97j48J25J165j633
$$ plain form
3521 227 -100 255 -340 -441 1192 -1164 420 -480 864 -751 186 386 -734 542 -559 617 -477
3538 -477 693 -648 6 627 -581 76 -659 981 -905 574 -341 -156 91 -142 453 -1271 846
3555 846 -875 430 -125 67 33 -759 633 -861 483 -805 404 42 136 48 -826 877 -826 504
3573 504 -137 780 -470 18 907 -757 544 -247 864 -954 734 230 -338 494 -415 780 -280
3590 -280 1306 -311 378 192 82 801 -409 443 -595 1555 -288 29 256 266 528 -338 1426 -894
3608 -894 571 30 675 -146 -294 380 -513 958 -792 682 -445 341 -120 -317 592 -709 462 -604
3626 -604 613 -696 37 -195 -827 226 -604 392 -1133 503 -703 -22 189 -830 -348 -608 528
3643 528 -1019 425 -975 -399 269 148 29 -1081 843 -544 388 -411 -14 -162 -37 1128 -505
3660e05R00r23J322q89K37K58p04J250j417J283j335J278r61P15j33q27J458j141
3678a34R41j336J848j513J56N26n08P28j024J612k230J466j55j59j7o71R66j155
3696f59J645j668J004o78L89J02o51J175j924J848j067J029j263O07N00r42J316
3713G63j616J200r27J044q43K61L44q64J097j020J253j924J473k92j48O06p01
3730b94J094j791J742q88L94j98K36k38n28J486j919J630r46M93%j48L6o98J542
3749A005j585J416j045P87p63J61O54j145J306j067R29j035R79m62m27R09j196
3766e79J219j472J433j155N86J54l73K21p89J400j658J462j231P85K05o42M95
3783F1n87J306j439J062n44Kjj85O20j266J416r31Q69p28N77m79j27J204j821
$$ plain form
3660 -505 395 -528 794 -95 142 400 -304 946 -471 812 -523 755 -206 509 376 -451 1007 -134
3678 -134 807 -529 1319 -194 -38 488 -20 708 -316 1296 -934 532 377 218 201 -470 496 -659
3696 -659 986 -682 322 -356 33 135 -516 659 -1265 583 -484 545 -718 -111 389 -553 763
3713 763 -853 347 -580 464 -379 -118 226 -638 459 -561 692 -1232 241 -51 -199 407 -294
3730 -294 800 -991 751 -137 257 59 295 57 -471 1015 -904 726 -220 273 273 125 161 -537 1005
3749 1005 -580 836 -209 578 -185 -24 630 -515 791 -276 653 -382 597 135 -292 617 -579
3766 -579 640 -832 601 -554 32 186 -187 34 -755 645 -1013 449 -782 3 208 -434 61
3783 61 -526 780 -659 403 -141 -139 -140 -325 295 -971 445 -486 383 -345 232 -247 -374 830 -991
3802i91J382j003J119j169Q01J38r10J119j253J162j056J152j088N33M82q67J085
3819F36j288J365j623J456o60J95K8l64N92r37J556j758J187n28J56J31m08R23
3837F59j838J854j104M85p51N36L4o62J459j625J298j066J034q45M88R2o82J147
3855E13j267J181j280J313r55K25P42j194Q44q43J575j630J089o00k7M28p39J141
3873E16j478J653j075M19l25K57K32p47J489j596J374j093P86l67j29N78j046
3890e52J402j273J030r25J175q81q1J210j451J336j257J089j016J032o21k71J010
3907I56j133J073j165J148j297O49%l88O26p29J028j475J954j493N24l20n0P15
3925F23j390J575j669J282r51Q74m06j89R58j685J793j256Q55r26M93Nm45Q55
$$ plain form
3802 -991 391 -612 507 -662 139 277 -633 486 -767 395 -661 491 -597 -64 418 -449 636
3819 636 -652 713 -910 546 -114 81 109 -255 337 -600 956 -802 385 -143 13 144 -264 659
3837 659 -1179 675 -429 56 -695 -159 -125 -787 672 -953 345 -721 313 -532 -44 48 -634 513
3855 513 -754 427 -853 460 -495 -270 472 -722 122 -721 854 -776 313 -287 -314 114 -625 516
3873 516 -962 691 -384 35 -290 -33 199 -548 941 -655 719 -374 412 45 -84 494 -552
3890 -552 850 -423 607 -318 857 -24 -105 1105 -346 990 -267 822 -194 838 217 -54 956
3907 956 -177 896 -269 879 -418 231 231 -157 469 -260 768 -707 1247 -246 278 -42 -92 623
3925 623 -767 808 -861 421 -530 344 -62 -251 707 -978 815 -441 414 -512 -19 -14 -459 396
3943C96j176J114r63Q64j136R84l0o31J146r68O79j115J221o50N00j37o19J013
3961D92j068J385j732J187l88J21K70k37M64j329J524r14P71q36M46J18m03R33
3979H04j532J494j011R32q57O29r1r09J229r49J219j509J030p78K12M03o22R22
3997F16j184R18j465J761o79m70N37n02J006j393J473j784J349j66k49J07o58
4014g83J245j696J826j102P27n60L53M51j179J190j579J614r56M84k41J62L95
4031C51j154J421j081R91q69Q92p14O2O03r40R48q24J391j713J049m0n36Q13p60
4050a10J211j508J298r46M57ln68O84o57J179j687J226p58M20J17k3M50j453J651
4069I80j368P71n46N39l19l59Q69j280J410r46N72p46L68K31n17P85j466J383
$$ plain form
3943 396 -780 334 -629 235 -901 83 53 -578 568 -400 279 -836 385 -265 235 98 -521 492
3961 492 -576 809 -923 264 -124 -3 267 30 494 -835 689 -225 546 -290 156 274 -129 804
3979 804 -728 766 -245 687 -170 459 368 -541 688 -261 958 -551 479 -299 -87 316 -306 616
3997 616 -568 350 -1115 646 -33 -503 34 -468 538 -855 618 -1166 183 17 -232 -125 -783
4014 -783 462 -1234 592 -510 217 -343 10 461 -718 472 -1107 507 -449 35 -206 -44 351
4031 351 -803 618 -463 528 -341 551 -163 -101 502 -438 510 -314 1077 -636 413 373 -163 650 -110
4050 -110 1101 -407 891 -55 402 399 -169 515 -142 1037 -650 576 -182 238 355 332 782 -671 980
4069 980 -388 383 -163 376 57 -302 567 -713 697 -249 323 -423 -55 176 -341 444 -1022 361
4087C61q40J021j481Q95L76j090R54r46J452j846J325m20K36J9m59R26j181J214
4105E16j133J311j003o9O52o23O99r31J639j737J104m53L93l32m53J623j835J237
4123F05p36J009j189M20M49r01P98r81J302j372P97l33M85K68q91J114j553J244
4141E35r29P69n38jM14p55R83j211J267j245Q14j03q7k6n09J364j483R81p26Q62
4161C76o01P7J50m92R33j378J441q28L71q67N79Q58j338J114p31Q10j323J001
4179A52l16PO25r65J078j195J094o44M39r7n09J107j046Q36j250J421j087N87
4197B37ol24M64o06J493k160J342l18K94n35K07M41j326J385j314J087q17L80
4215g6L7l91R71j495J527j154P81q53J102m74o94J043j024Q75q79J253j092K5
$$ plain form
4087 361 -479 542 -939 -44 332 -758 196 -750 702 -1144 181 -239 -3 16 -443 483 -698 516
4105 516 -617 694 -309 -378 274 -349 350 -581 1058 -679 425 -28 365 33 -420 1203 -632 605
4123 605 -131 878 -311 109 558 -343 455 -526 776 -596 201 -132 353 621 -270 844 -709 535
4141 535 -394 375 -163 -164 250 -505 478 -733 534 -711 103 0 -87 -113 -622 742 -741 240 -486 376
4161 376 -225 -148 2 -490 443 -935 506 -322 49 -818 -239 619 -719 395 -336 474 -849 152
4179 152 -164 -157 468 -497 581 -614 480 -164 275 178 -331 776 -270 566 -684 737 -350 237
4197 237 231 -93 371 -235 1258 -902 440 122 416 -119 88 529 -797 588 -726 361 -456 -76
4215 -76 -39 -430 541 -954 573 -581 200 -653 449 -25 -719 324 -700 175 -704 549 -543 -518
4233e18M46k98L66r46J354j248R91o03N15K5n52P62q61Q99j323J448q58L84n8
4252g5l37R89j433J338r51Q66p72O82q1m38Q65r37P84j191J086k22M1M62o51R17
4272I42j313J225q16O27m96j44M53n80N26p34J299j399O53L2m9N8l71Q18j305
4291e74J042p26O01l93L41Qo19Q98j315J496j082K42j9K60M9j092J577j002O30
4310C22p29O74n43l1N82o85Q96j021J167j146O86l59N5L58n76Q39j179J117j071
4329f44Q67m4m76O80p99P67r32J348r87N28k66l2N80j415J697j446J265r43M11
4348A59J61m42O96q16Q82r59R30p28L46l52l3P94j069Q18o57P30o96M08r1o13
4368e32J006j005J056j135J497j485N84K29l26K77r15J381j170R83q93K28K41
$$ plain form
4233 -518 -72 -370 -4 -950 404 -844 147 -456 59 84 -468 294 -567 332 -991 457 -401 -17 -75
4252 -75 -412 577 -856 482 -469 397 -375 307 226 -212 653 -284 500 -691 395 173 214 676 25 942
4272 942 -371 854 38 665 169 25 478 -102 424 -310 989 -410 243 275 226 284 -87 731 -574
4291 -574 468 -258 343 -50 291 299 -320 578 -737 759 -323 -81 -100 160 209 -883 694 -308 322
4310 322 -407 267 -276 -307 275 -410 486 -535 632 -514 172 -187 -132 226 -350 489 -690 427 -644
4329 -644 223 179 -297 383 -416 351 -581 767 -220 308 42 10 590 -825 872 -574 691 -252 159
4348 159 320 -122 574 -242 640 -319 611 -117 229 -123 -156 638 -431 387 -270 460 -236 172 81 -532
4368 -532 474 -531 525 -610 887 -598 -14 215 -111 166 -749 632 -538 445 -448 -220 21
4385B1n69Q66r87J094r54Q10o20J33L06n74J120j553J190r17N96n08N85R1o32
4404e02J020j032J087r30O98p44M16K84q29J152j264J198j092P16l92k88O95o26
4422d33O84q80J303j209Q05j67j46M8k59J135j568J054j037R21k37M3K13p80R93
4441D83j057J139r21O62o08L19L26q75R59j014J021p99O80l94O4N03r70J220j238
4460e00R43q18N11j43k40N21o56R68j105J041p45M61l6m70N88n95R08r83J026
4479F76r46M15k5p9L04r05J079o80N35n48M59Q9j14J16q67J353j307R38m55L07
4499C45j71j84N68r50Q52j020J091n78L98j59l57N57p75Q34r17R35n57p3J65j4
4519a0M22j184J092r85J018n38J30M5k93O82j230J251j102Q41m12j7J09l66P36
$$ plain form
4385 21 -548 318 -669 425 -529 281 -339 -206 100 -474 646 -907 283 -634 -38 -546 39 130 -502
4404 -502 518 -514 573 -357 341 -403 13 297 -532 620 -644 554 -538 178 -214 -502 193 -433
4422 -433 251 -629 674 -535 270 103 -43 5 -254 881 -687 367 -670 251 14 57 270 -510 483
4441 483 -574 565 -356 306 -302 17 343 -532 427 -587 434 -365 315 -79 -15 488 -482 738 -500
4460 -500 443 -375 136 -7 -247 274 -382 586 -519 522 -223 238 202 -268 320 -275 633 -350 676
4479 676 -270 145 120 41 345 -560 519 -161 374 -174 285 374 260 376 -491 862 -445 493 38 345
4499 345 174 -10 558 -392 460 -560 531 -47 351 192 -165 392 -383 451 -466 469 -88 -161 4 -10
4519 -10 412 -772 320 -665 353 -185 -55 -10 -303 379 -851 400 -702 139 -273 -290 -181 -547 189
4538A89p34Q03q13O31k56k8J51m18Q34r27Q90p76P04k89j76M14p06Q67j106J247
4558E01r51O57l45R2k1n02J019r87Q29n89N25m14J25L13l90M92q18R98q33N86
4578B87l04j18M68o30P92j073J017m55M16l74k3J71o39Q89p65R68r12O28k52J04
4598A95K12r05J069r65N99o28M93j30l8L00m69Q25j064Q74n78M06n46K89P3l54
4618c42Q13j156J165p69L19k99K66J14o21J033r88P96n61L12qj54L70o80Q41p36
4638b85M91p18Q61r4o27P03q88R80q80R45r39M08J10j69M84r44R60j071J048o64
4658b89M57j76m54P72q50P86m65M08l96K12O1p06J055q30P77p34O95m36Q8J69
4678A44l98Q88j372J152q70Q84o44P7N68r47J113j214J145j157Q94n49L74K1m6
$$ plain form
4538 189 -545 258 -555 76 -180 -208 -57 -475 359 -568 322 -454 250 -39 -215 199 -507 360 -746 501
4558 501 -450 207 -138 -46 -67 -569 450 -537 292 -297 228 -186 -61 252 -138 354 -464 534 -299 287
4578 287 -17 -135 333 -297 495 -578 439 -16 400 26 3 174 -465 424 -341 627 -285 343 91 195
4598 195 407 -498 571 -394 205 -423 70 -60 -98 202 -267 558 -506 368 -210 196 -350 -61 12 -342
4618 -342 471 -685 480 -289 30 -269 -3 111 -510 523 -465 331 -230 82 74 -80 290 -390 451 -285
4638 -285 206 -512 349 255 -372 331 -557 423 -457 488 -451 -43 67 -102 382 -562 398 -673 375 -289
4658 -289 168 -8 -462 310 -540 246 -219 189 -207 5 66 -640 415 -415 362 -372 323 -113 -25 144
4678 144 -254 634 -738 414 -456 428 -216 -139 429 -518 595 -619 526 -631 263 -286 88 109 63
4697F3O05r22O62q13Q52o06L01K31p61R55r41R32m76K66n99K37O14q04P11j003
4717d96J162q37M61k20Q3K30o39R11r05R33r67N88j63m6p0k11R36r75Q47r06N73
4738B89k31l10O48q42R35j263J052o31L15O1J4K92p46P69q93J021q44K34l13R3
4758c50O06o24P08r34J048j150N46o7k33M91o45Q97o02P35p62K79J42l27N69o77
4778c50N56o98P49l91J59K7J9J49m19P56r88R08n19O15k15p63Q85p28J103j212
$$ plain form
4697 63 668 -254 408 -405 447 -159 142 373 -388 567 -374 558 82 348 -251 -14 600 -204 507 -496
4717 -496 666 -171 290 70 153 383 -256 655 -250 683 -284 304 141 95 25 -186 750 -225 622 -284 289
4738 289 58 -252 396 -446 489 -774 278 -353 -38 23 37 329 -417 352 -541 480 -364 -130 -443 -350
4758 -350 256 -368 340 -594 454 -696 -150 -217 -450 41 -604 293 -309 426 -336 -57 85 -242 327 -350
4778 -350 206 -492 257 -134 25 52 71 220 -199 557 -431 477 -42 573 358 -405 480 -248 855 -357
$$ [...]
8191i0
##END NTUPLES=NMR FID
##END=
