##TITLE=1H_TG-2305
 CDCl3, 8 sc, 
 28.10.2020
##JCAMPDX= 6.0         $$ Bruker NMR JCAMP-DX V2.0
##DATA TYPE= NMR FID
##DATA CLASS= NTUPLES
##ORIGIN= UXNMR, Bruker Analytische Messtechnik GmbH
##OWNER= root
$$ XWIN-NMR		Version 3.5
$$ Wed Oct 28 10:17:17 2020 Russian Standard Time (UT+4h)  she@DPX200
##.OBSERVE FREQUENCY= 200.1315066352
##.OBSERVE NUCLEUS= ^1H
##.DELAY= (6, 6)
##.ACQUISITION MODE= SIMULTANEOUS
##.ACQUISITION SCHEME= undefined
##.AVERAGES= 8
##.DIGITISER RES= 18
##SPECTROMETER/DATA SYSTEM= spect
##.PULSE SEQUENCE= zg30
##.SOLVENT NAME= CDCl3
##.SHIFT REFERENCE= (INTERNAL, CDCl3, 0, 15.7039)
##AUDIT TRAIL= $$ (NUMBER, WHEN, WHO, WHERE, WHAT)
$$ ##TITLE= Audit trail, XWIN-NMR		Version 3.5
$$ ##JCAMPDX= 5.01
$$ ##ORIGIN= Bruker BioSpin GmbH
$$ ##OWNER= she
$$ F:/spectra/data/she/nmr/H-F/1/audita.txt
$$ ##AUDIT TRAIL=  $$ (NUMBER, WHEN, WHO, WHERE, WHAT)
(   1,<2020-10-28 10:16:19.35 +0400>,<she>,<DPX200>,
      <created by zg, POWCHK disabled, PULCHK disabled
       configuration hash MD5:
       00 E9 B6 7A A2 85 ED C7 34 08 36 98 17 FE 4E 26
       data hash MD5: 16K
       82 F0 A5 D8 AA A9 3D B7 20 DC 43 43 62 FD 82 E2>)
$$ ##END=
$$ 
$$ hash MD5
$$ 69 19 57 34 EB 73 DF 78 ED 98 12 1B EA 54 BA AE
##$RELAX= 
##$RELAX= 
##$RELAX= 
##$RELAX= 
##$RELAX= 
##$RELAX= 
$$ Bruker specific parameters
$$ --------------------------
##$DU= <F:/spectra>
##$EXPNO= 1
##$NAME= <H-F>
##$PROCNO= 1
##$TYPE= <nmr>
##$USER= <she>
##$AMP= (0..31)
100 100 100 100 100 100 100 100 100 100 100 100 100 100 100 100 100 100 
100 100 100 100 100 100 100 100 100 100 100 100 100 100 
##$AQSEQ= 0
##$AQ_mod= 1
##$AUNM= <au_zg>
##$AUTOPOS= <>
##$BF1= 200.13
##$BF2= 200.13
##$BF3= 200.13
##$BF4= 200.13
##$BF5= 200.13
##$BF6= 200.13
##$BF7= 200.13
##$BF8= 200.13
##$BYTORDA= 1
##$CFDGTYP= 0
##$CFRGTYP= 5
##$CHEMSTR= <none>
##$CNST= (0..31)
1 1 145 1 1 1 1 1 1 1 1 1 1 1 1 1 1 1 1 1 1 1 1 1 1 1 1 1 1 1 1 1 
##$CPDPRG= <>
##$CPDPRG1= <>
##$CPDPRG2= <>
##$CPDPRG3= <>
##$CPDPRG4= <mlev>
##$CPDPRG5= <mlev>
##$CPDPRG6= <mlev>
##$CPDPRG7= <mlev>
##$CPDPRG8= <mlev>
##$CPDPRGB= <>
##$CPDPRGT= <>
##$D= (0..31)
0 1.2 0 0 0 0 0 0 0 0.06 0 0.03 0 0 0 0 0.0002 0 0 0 0 0 0 0 0 0 0 0 0 
0 0 0 
##$DATE= 1603865778
##$DBL= (0..7)
120 120 120 120 120 120 120 120 
##$DBP= (0..7)
150 150 150 150 150 150 150 150 
##$DBP07= 0
##$DBPNAM0= <>
##$DBPNAM1= <>
##$DBPNAM2= <>
##$DBPNAM3= <>
##$DBPNAM4= <>
##$DBPNAM5= <>
##$DBPNAM6= <>
##$DBPNAM7= <>
##$DBPOAL= (0..7)
0.5 0.5 0.5 0.5 0.5 0.5 0.5 0.5 
##$DBPOFFS= (0..7)
0 0 0 0 0 0 0 0 
##$DE= 6
##$DECBNUC= <off>
##$DECIM= 32
##$DECNUC= <off>
##$DECSTAT= 4
##$DIGMOD= 1
##$DIGTYP= 9
##$DL= (0..7)
0 120 120 120 120 120 120 120 
##$DP= (0..7)
150 150 150 150 150 150 150 150 
##$DP07= 0
##$DPNAME0= <>
##$DPNAME1= <>
##$DPNAME2= <>
##$DPNAME3= <>
##$DPNAME4= <>
##$DPNAME5= <>
##$DPNAME6= <>
##$DPNAME7= <>
##$DPOAL= (0..7)
0.5 0.5 0.5 0.5 0.5 0.5 0.5 0.5 
##$DPOFFS= (0..7)
0 0 0 0 0 0 0 0 
##$DQDMODE= 0
##$DR= 18
##$DS= 0
##$DSLIST= <SSSSSSSSSSSSSSS>
$$ [...]
##$SUBNAM2= <"">
##$SUBNAM3= <"">
##$SUBNAM4= <"">
##$SUBNAM5= <"">
##$SUBNAM6= <"">
##$SUBNAM7= <"">
##$SUBNAM8= <"">
##$SUBNAM9= <"">
##$SW= 16.880792210976
##$SWIBOX= (0..15)
0 0 2 0 0 0 0 0 0 0 0 0 0 0 0 0 
##$SW_h= 3378.37837837838
##$TD= 16384
##$TD0= 1
##$TE= 0
##$TE2= 300
##$TE3= 300
##$TEG= 300
##$TL= (0..7)
0 120 120 120 120 120 120 120 
##$TP= (0..7)
150 150 150 150 150 150 150 150 
##$TP07= 0
##$TPNAME0= <>
##$TPNAME1= <>
##$TPNAME2= <>
##$TPNAME3= <>
##$TPNAME4= <>
##$TPNAME5= <>
##$TPNAME6= <>
##$TPNAME7= <>
##$TPOAL= (0..7)
0.5 0.5 0.5 0.5 0.5 0.5 0.5 0.5 
##$TPOFFS= (0..7)
0 0 0 0 0 0 0 0 
##$TUNHIN= 0
##$TUNHOUT= 0
##$TUNXOUT= 0
##$USERA1= <user>
##$USERA2= <user>
##$USERA3= <user>
##$USERA4= <user>
##$USERA5= <user>
##$V9= 5
##$VALIST= <valist>
##$VCLIST= <CCCCCCCCCCCCCCC>
##$VD= 0
##$VDLIST= <DDDDDDDDDDDDDDD>
##$VPLIST= <PPPPPPPPPPPPPPP>
##$VTLIST= <TTTTTTTTTTTTTTT>
##$WBST= 1024
##$WBSW= 4
##$XGAIN= (0..3)
0 0 0 0 
##$XL= 0
##$YL= 0
##$YMAX_a= 419988
##$YMIN_a= -372680
##$ZGOPTNS= <>
##$ZL1= 120
##$ZL2= 120
##$ZL3= 120
##$ZL4= 120
##$ABSF1= 10
##$ABSF2= 0
##$ABSG= 5
##$ABSL= 3
##$ALPHA= 0
##$AQORDER= 0
##$ASSFAC= 0
##$ASSFACI= 0
##$ASSFACX= 0
##$ASSWID= 0
##$AUNMP= <proc_1d>
##$AZFE= 0.1
##$AZFW= 0.1
##$BCFW= 1
##$BC_mod= 2
##$BYTORDP= 1
##$COROFFS= 0
##$CY= 11.3945322036743
##$DATMOD= 1
##$DC= 2
##$DFILT= <>
##$DTYPP= 0
##$F1P= 15.9154993809931
##$F2P= -4.1035820241983
##$FCOR= 0.5
##$FTSIZE= 0
##$FT_mod= 4
##$GAMMA= 1
##$GB= 0.15
##$INTBC= 1
##$INTSCL= 1
##$ISEN= 128
##$LB= 0.24
##$LEV0= 0
##$LPBIN= 0
##$MAXI= 10000
##$MC2= 0
##$MEAN= 0
##$ME_mod= 0
##$MI= 1.114404
##$NCOEF= 0
##$NC_proc= 0
##$NLEV= 6
##$NOISF1= 3.799351
##$NOISF2= 2.8
##$NSP= 1
##$NTH_PI= 0
##$NZP= 0
##$OFFSET= 15.70392
##$PC= 1
##$PHC0= -10686.34
##$PHC1= 10.60088
##$PH_mod= 1
##$PKNL= yes
##$PPARMOD= 0
##$PSCAL= 0
##$PSIGN= 0
##$REVERSE= no
##$SF= 200.130013532006
##$SI= 16384
##$SIGF1= 3
##$SIGF2= 2
##$SINO= 400
##$SIOLD= 16384
##$SREGLST= <1H.CDCl3>
##$SSB= 0
##$STSI= 0
##$STSR= 0
##$SW_p= 3612.71676300578
##$SYMM= 0
##$S_DEV= 0
##$TDeff= 0
##$TDoff= 0
##$TI= <>
##$TILT= no
##$TM1= 0
##$TM2= 0
##$TOPLEV= 0
##$USERP1= <user>
##$USERP2= <user>
##$USERP3= <user>
##$USERP4= <user>
##$USERP5= <user>
##$WDW= 1
##$XDIM= 8192
##$YMAX_p= 0
##$YMIN_p= 0
$$ End of Bruker specific parameters
$$ ---------------------------------
##NTUPLES= NMR FID
##VAR_NAME=  TIME,          FID/REAL,        FID/IMAG
##SYMBOL=    X,             R,               I
##VAR_TYPE=  INDEPENDENT,   DEPENDENT,       DEPENDENT
##VAR_FORM=  AFFN,          ASDF,            ASDF
##VAR_DIM=   8192,          8192,            8192
##UNITS=     SECONDS,       ARBITRARY UNITS, ARBITRARY UNITS
##FACTOR=    0.000296,      1,               1
##FIRST=     0,             0,               0
##LAST=      2.424536,      0,               0
##MIN=       0,             -372680,         0
##MAX=       2.424536,      419988,          0
$$ Real data points
##PAGE= N=1
##DATA TABLE= (X++(R..R)), XYDATA
$$ [...]
2290A555j260J861k166O84K28P7j097J697j136o75J274j824J244r66J084r12j4
$$ 1555 295 2156 -10 674 902 979 -118 1579 443 -232 1042 -782 462 -504 580 -332 -346
2307c46M30q94j50Q3N80j993K942k001l2R97j641J089n91Q80p37L97J25L2j137
$$ -346 84 -810 -960 -877 -297 -2290 652 -1349 -1381 -384 -2025 -936 -1527 -647 -1384 -987 -862 -830 -1967
2326a967J397l42j592K958j966J099J60l62N4m89J662j404N23L92L72j134J498
$$ -1967 -570 -912 -2504 454 -1512 -413 -253 -615 -561 -1050 612 -792 -269 123 495 -639 859
2343H59o78p25K169j498J221p91R14j097O72L33o32P89k81R88k092J956r08o44
$$ 859 181 -544 1625 127 1348 557 1471 374 1046 1379 747 1536 1255 2243 151 2107 1199 555
2361E55J332q01J44j2M84j206R00j096P41q36N70Q16k736K667j726j95O74p66
$$ 555 1887 1086 1230 1218 1702 496 1396 300 1041 205 775 1591 -1145 1522 -204 -399 275 -491
2379d91J88J20J69o76J6m47J173k025J767m10j163J792j960O82k65Q76j327P46
$$ -491 -303 -183 -14 -690 -674 -1121 52 -1973 -206 -616 -1779 13 -1947 -1265 -1530 -654 -1981 -1235
2397a235O22q49K20p3L02j161J866p19k44R45k96n04J90J354j744J514p57M24
$$ -1235 -613 -1462 -1242 -1315 -1013 -2174 -308 -1027 -1271 -326 -622 -1126 -936 418 -1326 188 -569 -145
2415a45L47k98Q85j696K047q23j51Q73K88j046N68O04j130J516r94J088j308J229
$$ -145 202 -96 789 -907 1140 317 166 1039 1327 281 849 1453 323 1839 845 1933 625 1854
2433A854n5j288J510j062J21mQ03j110L57O7p89L81m85Q37j527J296n60n25M51
$$ 1854 1799 511 2021 959 1080 1076 1879 769 1126 1193 404 785 300 1137 -390 906 346 -179 272
2452B72n32M2o39J554j951J020m17k95m5l7P64j675J616j012k78K80M88j022M90
$$ 272 -260 -218 -857 697 -1254 -234 -651 -946 -991 -1028 -264 -1939 -323 -1335 -1613 -1333 -845 -1867 -1377
2471a377N99q81R64j006J016r95P93J94j122J672p55K31k05P62r68J022Rl63O91
$$ -1377 -778 -1659 -695 -1701 -685 -1680 -887 -693 -1815 -143 -898 -667 -872 -110 -1078 -56 -47 -410 281
2490B81j43O45j197J580p38r5P21l01L73l34J012j352J168k28p3K9L51L22j022
$$ 281 138 783 -414 1166 428 333 1054 753 1126 792 1804 452 1620 1392 1319 1348 1699 2021 999
2509I99R33r22M25j16N36j135K47R30j845J321q22O14n65K30P3r57R80j047J03
$$ 999 1932 1010 1435 1319 1855 720 967 1897 52 1373 551 1165 600 830 903 -54 926 -121 -18
2528a8m08J138j496R64l07p66N51r01J139j821J625p12n89P77n34J26o50Q48r71
$$ -18 -426 712 -784 180 -127 -893 -342 -1243 -104 -1925 -300 -1012 -1601 -824 -1358 -1232 -1882 -1034 -2005
2547b005R00l41J01l01N51O1j110J609r57N72l25N37l58J21R77j342J017o1O74
$$ -2005 -1105 -1446 -1345 -1646 -1095 -1034 -2144 -535 -1492 -920 -1245 -708 -1066 -945 32 -1310 -293 -354 320
2566C20o29N44p9k53R20o46P48o99J350j375P92L01q56J037p25R23r77R82l85
$$ 320 -309 235 156 -97 823 177 925 226 1576 201 993 1294 438 1475 750 1673 696 1678 1293
2585A293m02M91k98J44k83O43j286J157q81M80l58j2M19j701J549r92K66k43k3
$$ 1293 891 1382 1084 1228 945 1588 302 1459 578 1058 700 688 1107 -594 955 -37 229 -14 -37
2604c7j71j62M05j038R31p84N59j028O54o3q04R90q06N56o79Q98j110O34J10o91
$$ -37 -208 -370 35 -1003 -72 -856 -297 -1325 -671 -734 -1538 -548 -1354 -798 -1477 -579 -1689 -1055 -945 -1636
2624a636R72q37R50r65Q64j84l8J84J55J2j26J105j571J388n24L44K92n81J400
$$ -1636 -664 -1501 -551 -1516 -652 -836 -874 -690 -535 -523 -649 456 -1115 273 -251 93 385 -196 1204
2643A204j531J099k78p9J01P25p31K82N63q06J196j009O48n43M43L51o95O64q09
$$ 1204 -327 772 494 415 516 1241 510 792 1355 549 1745 736 1384 841 1284 1635 940 1604 795
2662G95K60k92J198j510P56q1o27N22q16Q47j023N11L4j99m14L61m67o90J445
$$ 795 1055 763 1961 451 1207 1126 499 1021 205 1052 29 540 574 375 -39 322 -145 -835 610
2681F10j739J184n65j88M00p07N00n89L21j69j67m11J023j177K58P96j448J511
$$ 610 -1129 55 -510 -698 -298 -1005 -505 -1094 -773 -942 -1109 -1520 -497 -1674 -1416 -620 -2068 -557
2699e57r85N80l77k6N39o58M80j68N47o25J516j419O34K95p20R85m04O70o92O12
$$ -557 -1542 -962 -1339 -1365 -826 -1484 -1004 -1172 -625 -1250 266 -1153 -519 -224 -944 41 -363 307 -385 227
2719B27o8L12l32M74J83j019J734j535R89j21k77O66k25K50k57J00m08P66j485
$$ 227 159 471 139 613 796 -223 1511 -24 965 844 567 1233 1008 1258 1001 1101 693 1459 -26
2738b6J451k91n70J228j702J169n15j86j7j0k8K70m26m4L17j326J506j161N6P73
$$ -26 1425 1134 564 1792 90 1259 744 558 541 531 503 773 347 303 620 -706 800 -361 -305 468
2758D68j120N22l13K53p31O70o91Q06q08K94N33j545J593j217J68O34m4k75L38
$$ 468 -652 -130 -443 -190 -921 -251 -942 -136 -944 -650 -117 -1662 -69 -1286 -1118 -484 -528 -803 -465
2777d65j56k17Q39j126J238j088R27J25j075J373j203Q19r5J32l06Q51p04K68
$$ -465 -621 -838 1 -1125 113 -975 -48 77 -998 375 -828 -9 -104 28 -278 573 -131 137
2795A37K19o30J570j870J605n66j49O55l35m2nL23n39J230j310P55m50j82J120
$$ 137 356 -274 1296 -574 1031 465 316 971 636 594 589 912 373 1603 293 1048 598 416 1536
2814A536j814J596p05q5P8O3o30O91j99r09J198j333J414j330J31N63j138J060
$$ 1536 -278 1318 613 528 606 669 39 730 531 -378 820 -513 901 -429 -298 265 -873 187
2832A87n25r1j82P28j280R29p70L8O21q81J256j667R64k39n51N77j3n0j17P13
$$ 187 -338 -429 -611 117 -1163 -234 -1004 -966 -345 -1226 30 -1637 -673 -912 -1463 -886 -899 -949 -1066 -353
2852c53j246J151q57N68j10j73P94p56P02K4k51o6J143j123N33L63j029J740j337
$$ -353 -1599 -448 -1305 -737 -847 -1020 -226 -982 -280 -256 -507 -573 570 -553 -20 343 -686 1054 -283
2871b83J111n50K8R53q59N57K1m9l00J139j633J540m66k79P30j321J513j204N21
$$ -283 828 278 306 1259 400 957 978 929 629 1768 135 1675 1209 930 1660 339 1852 648 1169
2890A169K5m95K06J14j56j70P30j643J186o06P2l3o26O23p01M74m41K81o94Q35
$$ 1169 1194 699 905 1019 863 693 1423 -220 966 360 432 399 -227 396 -305 169 -272 9 -685 150
2910A50r10j80P09j145J073q57L09j27j21K63o80O2M52L27q44J258j365Q66m4
$$ 150 -760 -940 -231 -1376 -303 -1160 -851 -978 -1099 -836 -1516 -1454 -1002 -675 -1519 -261 -1626 -760 -804
2929h04r21J425r34P68m52K75Q5K9k60P13j40k95J307j754J454l30oK36k27Q29
$$ -804 -1725 -300 -1234 -466 -918 -643 -558 -529 -789 -76 -216 -511 796 -958 496 166 160 396 169 998
2949I98p95P93l97M20q60R75n38J15R80j270Q69n65M12m00J72j19J33K06m89K63
$$ 998 203 996 599 1019 159 1134 596 711 1691 421 1290 725 1137 737 909 790 923 1129 640 903
2969I03q10J268j363L27P31p77M41n91L41o90O87n60Q0m35M15L2j243J621j629
$$ 903 93 1361 -2 325 1056 279 720 129 470 -220 467 -93 -13 -448 -33 -1 -1244 377 -1252
2988a252Q38l23J9P8k23L38q93O81m96O28o99R78o36k00P52q46M64k0L81p66Q81
$$ -1252 -414 -737 -718 -640 -863 -525 -1418 -737 -1233 -605 -1304 -326 -962 -1162 -410 -1256 -792 -812 -431 -1197 -316
3009c16j80j38K22m76J146r79J401j020L44M13l78K63Q8L50n29J101q99N17j08
$$ -316 -496 -634 -412 -888 258 -721 680 -340 4 417 39 302 390 740 211 1312 413 930 822
3028H22p3L04p27J398j374P10L9k64J19J12M7o18R56q21N93q93P43l27n23R06
$$ 822 749 1053 326 1724 350 1060 1099 835 954 1066 1113 495 1451 630 1223 330 1073 746 223 1129
3048A129q97M81m19M43j047O10k76k96L42o82P59r17Q05r40J94L67o06K66k54
$$ 1129 232 713 294 737 -310 300 24 -272 70 -612 147 -770 35 -905 -711 -344 -950 -684 -938
3067i38N44j284J208p89M82k07p9N27q71R59r77N55n4J53n80P02K00o68J000r49
$$ -938 -394 -1678 -470 -1259 -777 -984 -1063 -536 -1407 -448 -1425 -870 -924 -771 -1351 -649 -449 -1117 -117 -1066
3087a066J014q66J070k53k87O87p14P87m81O15n56P02q0l20M74j86L58o43R98
$$ -1066 -52 -918 152 -101 -388 299 -415 372 -109 506 -50 652 572 252 726 540 898 255 1253
3106A253o49L50j09j42L79l77N49r91R85l96M1j69j97J99l94O14r86P52o33L32
$$ 1253 604 954 845 703 1082 705 1254 263 1248 852 893 724 527 726 332 946 -40 712 79 411
3126D11k55Q8J38r92R61o53L35o94Q03o72j50P70r96M24k54L10o45Q18l93l57
$$ 411 156 244 382 -610 351 -302 33 -661 142 -530 -680 90 -906 -482 -736 -426 -1071 -253 -646 -1003
3146a003M57m45O03j186J307q39L55L01m21K46j10M44o94R77p72N96j58Q2K16
$$ -1003 -546 -991 -388 -1574 -267 -1106 -751 -450 -871 -625 -735 -291 -985 -8 -780 -184 -342 -260 -44
3165d4n75J292j010O58r6j60PL75R2n41R01p14O76o18O64k14l46Q86q97M70k11
$$ -44 -619 673 -337 321 225 65 72 447 539 -2 899 185 861 243 907 693 347 1233 336 806 595
3186E95K09n42P71k72k26L77o24Q34j307J294q91j90O10m90J98j47J35q34R65
$$ 595 804 262 1033 761 535 912 288 1122 -185 1109 218 28 638 148 346 199 334 -500 465
3205D65q54L81k28QK85j082J088r03K45q1K54m64N27k87m69R49r93R37n78K82
$$ 465 -389 -8 -236 -228 57 -1025 63 -840 -595 -676 -422 -886 -359 -646 -1115 -166 -1159 -222 -800 -518
3225e18rl71O62k76j75J08L65q37J176o35k1P25r02R44o83R54m66RL92p1l10M81
$$ -518 -527 -898 -236 -512 -687 -579 -214 -1051 125 -510 -531 194 -708 236 -447 507 41 50 442 371 61 542
3247E42K18j050J525q90M43rl77P70r76R21n94K99NJ82o09N06J89j036J339j106
$$ 542 760 -290 1235 345 788 779 402 1172 196 1117 523 822 827 1009 400 906 1095 59 1398 292
3267B92O36m46K11m4m37L08k23K22n23Q57j404Q95m02l79N89p39N86m80K53l37
$$ 292 928 482 693 649 212 520 297 519 -4 853 -551 344 -58 -437 152 -587 -1 -481 -228 -565
3287e65m4j69L29n66K29N93j246J353j208K90N22o37M31k96Q8K6K75p35R61q15
$$ -565 -609 -778 -449 -1015 -786 -193 -1439 -86 -1294 -1004 -482 -1119 -688 -984 -896 -870 -595 -1330 -369 -1184
3307a184M80N59j141J557j070L11J11O8R8p5N7J45K75l53P92j245R93K64q05R44
$$ -1184 -704 -145 -1286 271 -799 -488 -377 -309 -211 -286 -229 -84 191 -162 630 -615 378 642 -163 781
3327G81l69N5M8J34j65P03p34M06p1k74R15j385J182l97l49N38n23j19Q1K52n35
$$ 781 412 467 515 649 484 1187 453 859 788 514 1429 44 1226 829 480 1018 495 376 457 709 174
3348A74O86o98P06q14J0R66j648J416j182K38o1K53n51J99l1k65O77j131J128
$$ 174 860 162 868 54 64 1030 -618 798 -384 -146 -207 46 -505 -306 -337 -602 75 -1056 72
3367G2j138N90K31j090P53j89j17P2L95r83J257p92J80L21p86J347j229Q53L17
$$ 72 -1066 -476 -245 -1335 -582 -771 -888 -816 -421 -1404 -147 -939 -759 -438 -1224 123 -1106 -253 64
3386F4q17N37J85l11J55L72o87J057r30O49j00l35J133j064O36N3jl2N37q32O15
$$ 64 -753 -216 -31 -342 -187 185 -502 555 -375 274 174 -161 972 -92 544 597 596 564 1101 269 884
3407H84Oo22R73j245J231n21j49L45k14oo8j78l19R32j221J091o95M3M66j366
$$ 884 890 268 1241 -4 1227 706 557 902 688 682 614 436 117 1049 -172 919 224 267 733 -633
3427f33J181n21m5M05m66l28N49r31L36N41j086J193r11m4O71r13Q35q04J98L16
$$ -633 548 27 -18 387 -79 -407 142 -789 -453 88 -998 195 -716 -760 -89 -1002 -167 -971 -773 -457
3447d57j48m63P00p44N00K49r26J319q74O57k64j74L05j59j19L21M37o86R51j305
$$ -457 -605 -1068 -368 -1112 -612 -363 -1289 30 -844 -187 -451 -625 -320 -479 -598 -277 160 -526 425 -880
3467h80J142n8n50R00m70K88MM3k75O61n29P31k36o35J386j395J017m05k42O87
$$ -880 262 204 -346 554 84 372 376 419 144 805 276 1007 771 136 1522 127 1144 739 497 1184
3487A184n22L2Q3M6m3K99j064J065l67m31P16j003Q21o98J83j17j2j90J51l26
$$ 1184 662 694 777 823 780 1079 15 1080 713 282 998 -5 816 118 301 184 172 -18 133 -193
3507a93L5M24j180J217j142M10J91l93K39j65J22m62L74n65P16o89K73J24o81
$$ -193 -158 266 -914 303 -839 -429 -238 -631 -392 -557 -435 -897 -523 -1088 -372 -1061 -788 -664 -1345
3526a345J162q26M26K8j07j21K14N7o8K92n42Q94j082J196l07m91P38l90L27j44
$$ -1345 -183 -1009 -583 -555 -662 -783 -569 -512 -580 -288 -830 64 -1018 178 -129 -620 118 -272 55 -89
3546h9K08j62M83n89O13R2l35P59q19Q59l50j08J06o5J24j89L11m09N46j002Q33
$$ -89 119 -43 440 -149 464 556 221 980 161 1020 670 562 668 603 727 538 849 440 986 -16 817
3567H17n26NO50j018P34m21K17j39J59m44K79k06j67L36r39J081o73J11J03m03
$$ 817 291 296 946 -72 662 241 458 319 478 34 313 107 -60 276 -663 418 -255 -144 -41 -444
3587d44L01m62L98m17N59q33N59m94J44L02n53P05p80O97k51m3R2O5J5l00O74
$$ -444 -143 -605 -207 -624 -65 -898 -339 -833 -689 -387 -940 -235 -1015 -318 -569 -612 -520 -455 -440 -740 -66
3608f6o79O01l13K79N4l20N35l79L70l67N61l00M06l38J7N18n28Q25p94O89k43
$$ -66 -745 -144 -457 -178 -124 -444 91 -288 82 -285 276 -24 382 44 61 579 51 876 82 771 528
3629E28j07O5l3M14m68M62l07M24n13L30j77M2o5l67O28m43K71m43K28j27p5J6
$$ 528 421 486 453 867 399 861 554 978 465 795 618 660 595 228 856 413 684 241 469 342 267 283
3651B83m14O78p76N13l41j6j83j19K76m21N11p99N69o08M46j08l05K89l32M80
$$ 283 -131 547 -229 284 -57 -73 -256 -375 -99 -520 -9 -808 -239 -847 -401 -509 -814 -525 -857 -377
3671c77m69P35j068N97j88J88L09n19N76n46M85m41K78r8K65r3j88Q57o96N79
$$ -377 -846 -111 -1179 -582 -770 -582 -273 -792 -216 -762 -277 -718 -440 -538 -273 -366 -554 303 -393 186
3691A86n85L80o0R0M09k68K33m05M68j90N87o17L24K18m96M39k31M32n32N90j26
$$ 186 -399 -19 -79 11 420 152 385 -20 448 258 845 228 552 770 274 713 482 914 382 972 846
3712H46o8L5l99N72p30P16q32L62J69m50M34m63M34o26L53l57M66l59J08j8n78
$$ 846 778 813 414 986 256 972 140 502 671 221 655 192 626 0 353 -4 462 103 211 193 -385
3733c85P63j095P19l36p9K57j87j95j03L13n63N68n58Q26p63K12L49p83O13j01
$$ -385 378 -717 2 -334 -413 -156 -343 -538 -641 -328 -891 -323 -881 -55 -818 -606 -257 -1040 -427 -528
3753e28K9k78K85k04K57J18q2Q7m05Q56p45M18M2k53L89MK06m52N91n74P65k39
$$ -528 -499 -777 -492 -696 -439 -321 -403 -316 -721 135 -610 -192 -150 -403 -14 -10 196 -256 335 -239 526 287
3775B87J7L35n82P47q19M52k4K9M4N48o39J73M10r19Q72r02O81j62l45R29j060
$$ 287 304 639 57 804 -15 437 413 442 486 1034 395 568 978 59 931 29 710 548 203 1132 72
3796G2L95J5j86j21L47o99M79q4m19N48r73R00n29j31L61o06K91Q5k98k48J089
$$ 72 467 482 296 175 522 -177 302 218 -201 347 -626 274 -255 -386 -25 -631 -340 -255 -553 -801 288
3817B88j254O71k41l00M97o15P15n64J08J68P5m21P46k94m78R99j068Q82l84j32
$$ 288 -966 -295 -536 -836 -339 -954 -239 -803 -695 -527 -452 -873 -127 -421 -899 100 -968 -86 -470 -602
3837f02L07L0J87k43Q3M08K9j59P04q61K08O96r89R20o29O70p6j55J83j18p5K70
$$ -602 -295 -265 -78 -321 -238 170 199 40 744 -117 91 787 -202 718 89 759 683 528 711 593 518 788
3859G88r1o43J402j253O18Jn56N54m93M81k22j31N4%n89R50n56o89J352j431Q29
$$ 788 697 54 1456 203 821 822 266 820 327 808 586 455 509 509 -80 870 314 -375 977 -454 375
3880C75m82r7K62l54L0j10J77k14O46j173R73p26j15Q99j112O61k57mk08L38l47
$$ 375 -107 -204 58 -296 -266 -376 -199 -413 233 -940 33 -693 -808 91 -1021 -360 -617 -621 -829 -491 -838
3901h38N63l85r1M31q92J354p11q2O20n71m1M19lj36M59n00P12o87N27J16p75
$$ -838 -275 -660 -751 -320 -1212 142 -569 -651 -31 -602 -643 -224 -227 -363 96 -404 308 -379 148 264 -511
3922e11J453j143L58L22j37n4L89m56K11J16o02J103j047Q35j20o24R53o40J92
$$ -511 942 -201 157 479 342 288 677 221 432 548 -54 1049 2 837 717 93 1046 406 598
3941E98J55l11r5N54n94K22k66k01Q96j376R49m46j91N66n04k30N40m41m46J119
$$ 598 753 442 347 901 307 529 263 62 958 -418 531 85 -106 460 -44 -274 266 -175 -621 498
3961D98j079P12n89j22O17r60Q14n08OL40J7o45O23k62l19P27j134J215p50J62
$$ 498 -581 131 -458 -580 37 -923 -109 -617 -611 -271 -254 -899 -276 -538 -857 -130 -1264 -49 -799 -637
3981f37L78m81N91k51j41MM54n93R41p10K54M11m91P05p82O56K6k23r0L21k43
$$ -637 -259 -740 -149 -400 -541 -537 -83 -676 265 -445 -191 220 -271 434 -348 308 334 111 21 342 99
4002I9N15J44q21J152q92L18R3o08P66m07J26j5qK6K91o59N34p4p71J231q76L38
$$ 99 614 758 -63 1089 197 515 608 0 766 359 485 470 462 488 779 120 654 580 -191 1040 164 502
4024E02j01l55M24m67p4J11J2k22P19j226P49k29n01J074j021L79l32K46l5j66
$$ 502 401 46 470 3 -71 40 52 -170 549 -677 72 -157 -658 416 -605 -226 -558 -312 -347 -513
4044e13j98N11l67J68N81j325J155m72l17O24n83K75l0K63j92J16m43J033o32
$$ -513 -711 -200 -567 -399 182 -1143 12 -460 -777 -153 -736 -461 -491 -228 -420 -304 -747 286 -346
4063c46J43M34q50R77o52M17J53N2m26J48K48k31N26o73J042j060O71K07q74Q78
$$ -346 -203 231 -619 358 -294 123 276 328 -98 50 298 67 593 -80 962 -98 573 780 -94 784
4083G84l18J03m3J90m62O06n16K39K8m14P48p89O53k58k68M9j0m01K15K80p58
$$ 784 466 569 526 716 254 860 344 583 611 197 945 156 809 551 283 332 322 -79 136 416 -342
4104c42R08o60K55l00j03M17o34M16k30K2j16L51m97J02k6k29N65q65Q52n94R3
$$ -342 566 -94 161 -139 -242 175 -459 -43 -273 -251 -367 -16 -513 -411 -437 -666 -101 -966 -114 -708 -615
4125f15J50k82K28J62R3o09Q11o02N27l22j9K68l87P45o15N60k03j15J09K75j05
$$ -615 -465 -747 -519 -357 -264 -873 -62 -664 -137 -459 -478 -210 -597 148 -467 93 -110 -225 -116 159 54
4146E4j37O45p31O93m61J29j4L13J09m82O08m20K63j96N89n39J34K48n91P01q59
$$ 54 -83 562 -169 524 63 192 178 491 600 118 726 306 569 373 962 423 557 805 214 915 56
4167E6P96m78K88l63L33p0m03L75m53L28k75J78m47L90q7m00O15r09P34o40J50
$$ 56 852 374 662 299 632 562 159 534 81 409 134 312 -135 255 168 -232 383 -526 208 -432 -282
4188b82p7N4K6l07N69q08P54q66O30k87K14o5l73N57n54N55k66L48n56L43J13
$$ -282 -359 -305 -279 -586 -17 -825 -71 -937 -307 -594 -380 -445 -818 -261 -815 -260 -526 -178 -734 -391 -278
4209b78p1J50l84P16p61O51j92k1Q1j30N61n34N24l46K41mn8K06j40K19k61M37
$$ -278 -349 -199 -583 133 -628 23 -169 -190 -109 -239 322 -212 312 -34 207 203 145 351 211 430 169 606
4231F06l59K79Q3%N6r4J52n04M75m79M32k19j51M05o14L79j79J09k18P3q0j26
$$ 606 247 526 609 609 665 571 723 219 694 215 647 428 277 682 68 447 268 377 159 232 152 26
4253B6J24l7J57l79O15q67L82O0l57K72l50K44j35P0n37M33l95M5M33n27O06p58
$$ 26 150 113 270 -109 506 -361 21 81 -276 -4 -354 -110 -245 -175 -712 -279 -674 -629 -196 -723 -117 -875
4275h75N56j20K2l6j78J79L1L09n81P83o01N74l16l0L97m48K31M8N8j96L13k59
$$ -875 -319 -439 -417 -453 -631 -452 -421 -112 -693 90 -511 63 -253 -283 114 -334 -103 -55 3 -193 120 -139
4297a39K54J38j47M58p32Q42m56K33l3j47M78n28K82mJ88m51O52m29q7L71o63
$$ -139 115 253 106 564 -168 674 218 451 418 271 749 221 503 499 687 236 888 459 372 743 80
4318H0R55q00M17j99k16m4K46k54k75L45m67N57p68N57j78j57K95l26K43k84J37
$$ 80 1035 235 652 453 237 193 439 185 -90 255 -212 345 -423 134 -44 -201 94 -232 11 -273 -136
4339a36m35M04l97L24J1p05Q52r47P99l10J66J27l76J13R1M0l07N96p74N20r5
$$ -136 -571 -167 -564 -240 -229 -934 -82 -1029 -230 -540 -374 -247 -623 -510 -419 -379 -686 -90 -864 -344 -439
4360d39k46O60p87P94j25j40j17M54j94J91j85R5M56q87J003n13J36K75p5n6j1
$$ -439 -685 -25 -812 -18 -143 -283 -400 54 -140 51 -134 -39 417 -470 533 20 156 431 356 300 289
4381B89K44k27M10q22J012p24J90M68q62Q94l43K9Q2j30j54J61j65K5K13q70J017
$$ 289 533 306 716 -106 906 182 372 840 -22 872 529 558 640 510 356 517 352 377 590 -280 737
4402G37p83L65J75p31M78m52J60J0N1m09Q64j029M52o4n84R62q51M72k29k41M29
$$ 737 -46 319 494 -237 241 -211 -51 -41 10 -399 465 -564 -112 -176 -760 202 -649 -177 -406 -647 -218
4423b18l16J88o7L7l20R39j003N44k78J4M99l58K02l71K20m0M20n48O75n56n0
$$ -218 -534 -346 -413 -376 -696 243 -760 -216 -494 -480 19 -339 -137 -508 -288 -328 92 -456 219 -337 -387
4444c87O50p65R53n94J67M41l62J99R8j57N1K08o24Q46o53J20O65j049Q07n22
$$ -387 263 -502 451 -143 24 465 103 302 400 243 294 502 -122 724 71 191 856 -193 614 92
4464I2K00L73k39pJ85l65J31L17j117J323r68K39L41q71Q46o16J39J52j49r1K61
$$ 92 292 665 426 419 604 239 370 687 -430 893 -75 164 505 -366 480 -136 3 155 6 -85 176
4485A76p50N83j98l44P83q37L36k4j59J00J36j99l8N2k92N93r71J017m61l18N78
$$ 176 -574 9 -189 -533 250 -587 -251 -275 -434 -334 -198 -397 -435 -383 -675 -82 -1053 -36 -497 -815 -237
4506b37m63O15k75J62j26J96k35K23l8k76Q09q73P92m94L26J52m61L53K3k3P6
$$ -237 -700 -85 -360 -198 -324 -128 -363 -140 -178 -454 355 -518 274 -220 106 258 -203 150 173 150 226
4527B26K51o92Q72p09M16J98m45N89l20P2K40m01kL67l27J03J96p18Q91p40L28
$$ 226 477 -215 657 -52 364 562 117 706 386 458 698 297 295 662 335 438 634 -84 807 67 395
4548C95J44m71N25n45J6J75k33k73O44o81L44O4m88N99p72M54R0k67Q3p2j38J65
$$ 395 539 68 593 48 64 239 6 -267 377 -304 40 104 -384 215 -557 -103 -13 -280 -197 -269 -407 -242
4570b42j3n34O58n92N50j23m06N10m93L96k37K08R7j31k73N94k73j29P05r75P21
$$ -242 -255 -789 -131 -723 -173 -296 -702 -192 -685 -289 -526 -318 -221 -352 -625 -31 -304 -433 272 -703 18
4591A8l05N5J79L9J05p6p6J32K49o40Q30l63O5M28n48N47j99O3k13P9N7K88n29
$$ 18 -287 -232 -53 -14 91 15 -61 71 320 -320 510 147 212 640 92 639 440 503 290 369 426 714 185
4614A85K05J48p10R08o54L41J23k13K24n24M48j97N2l63N07n87M38p3n40M55m36
$$ 185 390 538 -172 736 82 423 546 333 557 33 481 284 336 -27 480 -107 331 258 -282 173 -263
4635b63J53j31J70j36k1k20P1j7j53L60m50N61m16l1M33n81L79m26N39m39M36
$$ -263 -110 -241 -71 -207 -228 -448 -377 -394 -547 -187 -637 -76 -492 -523 -90 -671 -292 -718 -179 -618 -182
4656a82k49J13R5j89J49p65Q96l22K70J85m2n5k8L03l22M45l28L90m87L30L05
$$ -182 -431 -318 -223 -412 -263 -1028 -132 -454 -184 1 -41 -96 -124 179 -143 302 -26 364 -123 207 512
4677E12p31R70p26K93j09M02k40N1N4j97N04n52L36l75L46k9l75M07l52M0jK36
$$ 512 -219 751 25 318 209 611 371 422 476 279 783 231 567 192 538 509 134 541 189 229 228 464
4699D64l23K75k44M2p2j0J71o66N88k63J34k26J79M8m41L08n16N47l52J26j67
$$ 464 141 416 172 214 142 132 303 -363 225 -38 96 -130 49 97 -344 -36 -552 -5 -357 -231 -398
4720c98M3Q7m37J81q5M10m25M17m54K05K66l81M37m50M12l08P2J59J06J03k80
$$ -398 -355 -268 -705 -524 -609 -199 -624 -207 -661 -456 -190 -571 -134 -584 -172 -480 -408 -249 -143 -40 -320
4741c20J70k09N75l45K20j65j16L19j07L22m02N38m35L37l0J30R8m30N34p34O39
$$ -320 -150 -359 216 -129 91 -74 -190 129 22 344 -58 480 45 382 352 482 580 150 684 -50 589
4762E89k50K16l41K11m6l94N91m71M99n01M56n25M32Mk50n7nJ65m12M14m13J2
$$ 589 339 555 214 425 379 -15 576 105 604 103 559 34 466 470 220 163 158 323 -89 325 -88 -76
4784g6J87j97J66m06K87m17L13j49j59K88j50J36l91L72l02M40l19r5J39o1P9
$$ -76 111 -86 80 -326 -39 -456 -143 -292 -451 -163 -313 -177 -568 -196 -498 -58 -377 -472 -333 -394 -315
4805c15k06J45k5J54k6J90m4k43L63n48L93o5K60o7m9k4R6K06l82M41m46N91l67
$$ -315 -521 -376 -401 -247 -273 -83 -127 -370 -7 -555 -162 -227 33 -34 -83 -107 -11 195 -187 254 -192 399 32
4828C2J33K16k80M32m33J85L3K85k03j83N2P7J86o09P67m08J81j63q7K09q4R6
$$ 32 165 381 101 533 100 285 318 603 400 217 269 346 532 -77 690 282 463 300 213 422 338 434
4850D34l14K67k79M27n25Q6J21l84L26k78J86j38k69N0K98k37j80L33n30N87m44
$$ 434 120 387 108 535 10 96 217 -167 159 -119 67 -71 -340 -290 8 -229 -409 -76 -606 -19 -463
4871d63L79l57k3J82l39L05j80J13k96L99K0o7m1o3N34o59L12J21k94K91Jk47
$$ -463 -84 -441 -464 -282 -621 -316 -496 -383 -679 -280 -260 -327 -368 -431 103 -556 -244 -123 -417 -126 -125 -372
4893c72M28mk88M95o69P78m70j3M69m43N19k17J34j10J5k87O23j86N1K84o90M45
$$ -372 56 52 -236 259 -410 368 -102 -115 354 -89 430 213 347 237 252 -35 588 402 453 737 47 492
4915D92l34J87M9j37o5N3J16N3J77p21N27k93J21Jl59N16k97J09j54K2K9n4m14
$$ 492 158 345 394 257 192 245 361 414 591 -130 397 104 225 226 -133 383 86 195 41 63 92 38 -376
4938c76J76K97p04O60n59L43J15o41M24k62K83j79N1j81L85m02K24J7l05P78p30
$$ -376 -200 97 -607 53 -506 -163 -48 -689 -265 -527 -244 -423 -372 -553 -168 -570 -346 -329 -634 144 -586
4959e86J72J18k14L05J07k83Q4K94k97O71q36O95j98k38L42k90L77j32k8J36L12
$$ -586 -414 -296 -510 -205 -98 -381 -297 -3 -300 371 -465 230 32 -206 136 -154 223 91 63 199 511
4980E11l07M05j71l02L95m99P01l47j89L77l48M12k21j30r3K99m81N75o96J39
$$ 511 204 609 438 136 531 32 733 386 197 574 226 638 417 287 194 493 12 587 -109 30
5000C0M28n63O07n64J79K21m05m8M33l72RJ10m66O19l75J6p5j78M31n01J12l5
$$ 30 458 -105 502 -62 117 338 -67 -115 318 -54 -45 65 -401 218 -157 -141 -216 -394 37 -464 -352 -387
5022c87L39l79M83n64K78J12m89M84o64N14j37j35J45K81k00M2M6j40O15o93M94
$$ -387 -48 -427 56 -508 -230 -118 -607 -123 -787 -273 -410 -545 -400 -119 -319 -277 -231 -371 244 -449 45
5043D5r2l2K41l23K58M3j5n7K23m31M34j46K3M75p08M43j44Q3K18l25K4J28j00
$$ 45 -47 -79 162 -161 97 140 125 68 291 -140 294 148 171 646 -62 381 237 320 538 213 237 365 265
5066B65j53P63r25O90m01N9L30r07O80m37J34K3N9j98K29k95J07J54o47Q23n75
$$ 265 112 875 -50 640 239 298 628 -279 401 -36 98 121 180 -18 211 -84 23 177 -470 353 -222
5087b22Q8K50m99J74jj29O7j28k06N55p01N05Jl60P15p16L68k05o3R0K50j50N5
$$ -222 -134 116 -383 -209 -210 -339 -272 -400 -606 -51 -752 -247 -246 -606 109 -607 -239 -444 -507 -417 -167 -317 -262
5110b62J24l47P81p69M88p8l02N53k12L8j11Q7j79N07n84N16lk49L58o15P87j87
$$ -262 -138 -485 296 -473 15 -63 -365 188 -24 14 -97 -10 -189 318 -266 250 247 -2 356 -259 528 341
5132C41j62K5m0M0J24P1k00O41p16L85m64K03K70o39P60m85J16lp7ML53l97j03
$$ 341 179 204 164 204 328 399 199 840 124 509 45 248 518 -121 639 154 270 267 190 194 547 150 47
5155D7L02n07M94m75M63j79m78M08k65M3k40L26m39M70m41K04K6l64M69o51N90
$$ 47 349 -158 336 -139 324 145 -333 75 -190 -147 -387 -61 -500 -30 -471 -267 -241 -605 -136 -787 -197
5176a97K5l43K30M0l22M43K00n45M29n36M78k54P9L34l62M95o10M10k43M29l50
$$ -197 -172 -515 -285 -245 -567 -124 76 -469 -40 -576 -98 -352 -273 61 -301 194 -416 -6 -249 180 -170
5197a70K81k81j10N23l43L10j11JN2R2j12l3J40O3K49m69M87m62K00Rk68N69n35
$$ -170 111 -170 -280 243 -100 210 99 100 152 244 132 99 239 302 551 82 569 107 307 316 48 617 82
5220H2J28K3R4j16q1nJ30K24o04N56l24K9p4k07J92k24K32j39J14k22L86o04K85
$$ 82 210 233 327 211 130 125 255 479 -125 431 107 136 62 -145 47 -177 55 -84 30 -192 194 -410 -125
5243a25n5j57L12l32J59j79J51p1p4Q2j22K51m23N42o03N10k02O8J95k14L39k99
$$ -125 -180 -337 -25 -357 -198 -377 -226 -297 -371 -289 -411 -160 -583 -41 -644 -134 -336 -268 -73 -287 52 -247
5265b47M11n06N37m27J85J28k36J99k45L05j77K92j05J09J02j16J79n41M86j68
$$ -247 164 -342 195 -232 -47 81 -155 44 -201 104 -73 219 114 223 325 209 388 -153 333 165
5285A65J87j48q5K53j54J28k12J39N2J51m94K90Q3j25J58l64L69l86K02j85O8
$$ 165 352 204 119 372 218 346 134 273 325 476 -18 272 355 230 388 24 393 7 209 24 92
5306I2J04k97L12l41M31m96K32j72j85K06k03P0o5M91n62K51r9J21j75j94M00
$$ 92 196 -101 211 -130 301 -195 37 -135 -320 -114 -317 -247 -312 179 -383 -132 -231 -110 -285 -479 -79
5327g9l18K58j51j07n7K29k23j43N36l86M90l21O9p4K1K30k99L01j63M89k96J56
$$ -79 -397 -139 -290 -397 -454 -225 -448 -591 -55 -441 49 -272 -203 -277 -256 -26 -325 -24 -187 302 6 162
5349A62l21L49l3j01K81l37M39m81L23J38j32O8j95J53q0L74m80L21o9j00%k61
$$ 162 -159 190 157 56 337 0 439 -42 281 419 287 355 160 313 233 607 127 448 379 279 279 18
5371A8N42k50q2n9J78k48J61j5k53L09n08M93l14K26j32k53M78m62J78l4J00o42
$$ 18 560 310 228 169 347 99 260 245 -8 301 -207 286 -28 198 66 -187 291 -171 7 -27 73 -569
5393e69O43n24K48m9k89M99l41M72n32K42k42K56j90j1L80m49O17o01L99J43m31
$$ -569 74 -450 -202 -251 -540 -41 -382 90 -442 -200 -442 -186 -376 -387 -7 -456 161 -440 -41 102 -329
5414c29M31k77J02K11j28k18L93m47R1K20l64P08n02J75K8O9o8K27M2nr1r4L91
$$ -329 102 -175 -73 138 10 -208 185 -262 -171 49 -315 393 -109 66 94 163 95 322 364 359 268 174 565
5437E65n47N20k23l25N27m96L53j54m1l9K95l81K01k05j27N47o42N14m96Q1L55
$$ 565 18 538 315 -10 517 21 374 220 179 140 435 54 255 50 -77 470 -172 342 -154 -73 282
5458B82l13J3L3M0j13L03p38N18m11R5M12n50N26n74L22O2k19j80L18j63K9J78
$$ 282 -31 -18 15 55 -58 245 -493 25 -386 -291 121 -429 97 -477 -155 -93 -312 -492 -174 -337 -308 -130
5480a30n05P94o38M23j20l77N63k57M9j03K56j24L21n69M42J34k74M85o72N72
$$ -130 -635 159 -479 -56 -176 -553 10 -247 -198 -301 -45 -169 152 -417 25 159 -115 370 -302 270
5500B70k02q8J81R4j65K82k08j8P32q82O04k68j87M66m12K09j52J17j81K81l20
$$ 270 68 -20 161 255 90 372 164 146 878 -4 600 332 145 611 199 408 256 373 192 473 153
5521A53N06k78m20O43o44N12k16J08m8j47k34Q3j06J05K30o65O29l74J9K96o00
$$ 153 659 381 -39 604 -40 472 256 364 316 169 -65 18 -88 17 247 -418 211 -163 -144 152 -448
5542d48M79j87l6P3j32j68M58k33j13J88n70Q69p78M01Mk03K17l21J34K20j01
$$ -448 31 -156 -192 -119 -251 -419 39 -194 -307 -119 -689 180 -598 -197 -193 -396 -179 -500 -366 -146 -247
5563b47k71N46o30N42P9n67Q52m96J61n4J25j5Rk81J69L40m08O76p04M89k42j91
$$ -247 -518 28 -602 -60 19 -548 304 -192 -31 -85 40 25 34 -247 -78 262 -146 530 -174 315 73 -118
5585a18N79n37N59j27j89j40M44n12L23J11l24M86n78K36j93L0J94j4l36K87J59
$$ -118 461 -76 483 356 167 27 471 -41 282 393 69 555 -23 213 20 50 244 230 -106 181 340
5606C40l40L26m17N47p21K00K40m40M90l20J9M2r6j20M17m80R8J74o02P62m65
$$ 340 0 326 -91 456 -265 -65 175 -265 225 -95 -76 -34 -130 -250 167 -313 -215 -41 -643 119 -346
5627c46J30J18k59M24l28k81M47j29k99P61n67L06j47j44L81n66M78J70o3j00
$$ -346 -216 -98 -357 67 -261 -542 -95 -224 -523 238 -329 -23 -170 -314 67 -499 -21 149 86 -14
5647a4J38k17J63J80k79M94o10M22K9m42L55n2J26m0j36L6K03l59M23j20k02N79
$$ -14 124 -93 70 250 -29 465 -145 277 306 -136 219 167 293 253 117 153 356 -3 420 300 98 677
5669F77p38N12l25J2J48j83J29L7k19J42M02p67P31p19J69M83q59M83k25J02k88
$$ 677 -61 451 126 138 286 103 232 269 50 192 594 -173 558 -161 8 491 -368 115 -110 -8 -296
5690b96K41j35L84m41K65n3m17L59m44K77R9j31J27j18l8J00P2j91M17m73J00
$$ -296 -55 -190 194 -247 18 -35 -452 -93 -537 -260 -161 -292 -165 -283 -321 -221 -149 -340 77 -396 -296
5711b96K65o74P39k62lK36k44Q2L21k85K18j07k75N03m00M43j73o4K79k88p6K97
$$ -296 -31 -705 34 -228 -231 5 -239 -157 164 -121 97 -10 -285 218 -182 261 88 24 303 15 -61 236
5733B36L4j00O2j46L30j67NN4k54M05k84j99M09k78K93m4j37l14N43o40M97k03
$$ 236 270 170 232 86 416 249 254 308 54 459 175 -24 385 107 400 356 219 -95 448 -192 305 102
5755A02J59o9j99L03l92R0LL21o73L48J00k91N1k78M11l40K81j3j35K33k1j50
$$ 102 261 192 -7 296 -96 -6 -3 318 -355 -7 93 -198 -147 -425 -14 -354 -73 -86 -221 12 -9 -159
5777a59l46L13j70J75Pp7J62l97L97l55L85j52J22M2k59J18J47M9l22L81j64J86
$$ -159 -505 -192 -362 -187 -180 -257 -95 -492 -95 -450 -65 -217 -95 -53 -312 -194 -47 2 -320 61 -103 83
5799H3J7j62k8J30R8j39K81j41R3j93K11M1l95N48k44L10l90J55k19K21j3k03
$$ 83 100 -62 -90 40 138 -1 280 139 232 39 250 291 -104 444 200 510 120 275 56 277 264 61
5821F1K97l26K93j82o6n7J05M5k45J48LK41m29M1n9J50j55r1L47k52J4m4k23K29
$$ 61 358 32 325 143 77 20 125 170 -75 73 76 317 -112 -71 -130 20 -135 -226 121 -131 -117 -161 -384 -155
5845a55j06j16m4N12l77L27m06J11J7j34K01m40M48j63L4k36M99k30L6R2k50K20
$$ -155 -261 -377 -421 91 -286 41 -365 -254 -237 -371 -170 -610 -162 -325 -291 -527 -28 -258 -222 -130 -380 -160
5867a60J21K40l06K6P9k5l9K5J35j58M58m88M39l08J35%q8K06j55K14l11M56l43
$$ -160 -39 201 -105 -79 0 -25 -64 -39 96 -62 396 -92 347 39 174 174 86 292 137 351 40 496 153
5890A53J94J1k09K46l66L41on9l24K04M2J05N6m27L96l84L84j69k43J75j87J9
$$ 153 347 358 149 395 29 370 364 305 -19 185 227 332 388 -39 357 -27 357 188 -55 120 -67 -48
5912d8R0P6j53J4k94L42r2k21P9m53N52m5p7m5j32P3n6K17p5J80l09J91l12K80
$$ -48 42 118 -35 -21 -315 27 -65 -286 -207 -660 -108 -153 -230 -275 -407 -334 -390 -173 -248 -68 -377 -186 -498 -218
5936b18M9k61L82k52J47m8J64j44K17j02m0J83m21O34l82L3L90l38N3j13K30o9
$$ -218 -169 -430 -48 -300 -153 -201 -37 -181 36 -66 -106 77 -344 290 -92 -59 331 -7 46 -67 163 94
5958I4L14n15O38n53K85J90m78N60m95K66j13J06M4j16l2P9J69m07M81o23L71
$$ 94 408 -107 531 -22 263 453 -25 535 40 306 193 299 343 227 195 274 443 36 517 -106 265
5979B65o9l65M67j31n9jo2j04L26o23M43J06l55K83n47N98l13J07k10Qp5o9J48
$$ 265 196 -169 298 167 108 107 45 -59 267 -356 87 193 -162 121 -426 172 -141 -34 -244 -236 -311 -380 -232
6002b32K7K09m57O36m04j3L98o85M82j99j07J48M4l3K54l00P7K60n55O50l35J36
$$ -232 -205 4 -453 183 -221 -234 164 -521 -39 -238 -345 -197 -153 -186 68 -232 -155 105 -450 200 -135 1
6024AL18l40J34j47R2r6J98r7L65m52J36J77m24N58l30R0J2M4q6J00q1K34j59
$$ 1 319 -21 113 -34 58 -38 160 63 428 -24 112 289 -135 423 93 183 195 239 153 253 172 406 247
6047B47j56N42o98M72j69k69M33n06L68k51K7m3K34m46N72m46k04O33q54P47l23
$$ 247 91 633 -65 407 238 -31 402 -104 264 13 40 -3 231 -215 357 -89 -293 340 -514 233 -90
6068i0r4J50k45J69r9j66KL35l44L21k75J2L26m67M44k58k2K26k7k41M57l70K63
$$ -90 -184 -34 -279 -110 -209 -375 -373 -38 -382 -61 -336 -324 2 -465 -21 -279 -301 -75 -102 -343 114 -256 7
6091GP9n20P89q87N97j22k46N00rk45J44n8k87O32l14K18Qn47R04o75L55j15r0
$$ 7 86 -434 355 -532 65 -57 -303 197 188 -57 87 29 -258 374 60 278 286 -261 643 -32 323 208 118
6114A18J15L8l27K66k6k12O96q59N90l02o5L70l54R6J27r6j61L54n23L16k50K1
$$ 118 233 271 -56 210 184 -28 668 -191 399 97 32 402 48 144 271 175 14 368 -155 161 -89 -68
6136f8K41n48N01p7k61L31l04K4L59n70J71L23m49N07n33L2M57m98M30k87k51
$$ -68 173 -375 126 49 -212 119 -185 -161 198 -372 -201 122 -327 180 -353 -321 136 -362 68 -219 -470
6157d70K56J67m65O21l65j14L67n41N47j70J01K33l06j0J72J00j4j63k25O42o63
$$ -470 -214 -47 -512 109 -256 -370 -3 -544 3 -167 -66 167 -139 -149 23 123 109 -54 -279 363 -300
6178c00M68P8m87P23n37K18J7j51J77K6k83J16K55j27N09p62N75k27k41M42n57
$$ -300 168 246 -241 482 -55 163 180 29 206 232 -51 65 320 193 702 -60 515 288 47 489 -68
6199f8K07J18j81j22L27o49N72m1l81M37p37O19k07k19N24j58r9J64p5k98N67
$$ -68 139 257 76 -46 281 -368 204 163 -218 219 -518 101 -106 -325 199 41 -58 106 31 -267 300
6220C00q65M52j89p3K87m33N64l23K3O1J10n11M84k82p9M29l64M60l67J53K05
$$ 300 -565 -113 -302 -375 -88 -521 43 -280 -257 -196 -86 -597 -113 -395 -474 -45 -409 51 -316 -163 42
6241D2k81J78q0P0QK85m52M30j48J38J6n23M42j28K15j94J72m7r9nJ65J31l90
$$ 42 -239 -61 -141 -71 -63 222 -230 200 52 190 206 -317 125 -3 212 18 190 143 44 39 204 335 -55
6264e5N03m59L93j7j81P1o6J79j00N9k43L40n39L19pl45M68n59O09m19j18R6j6
$$ -55 448 -11 382 365 184 255 189 368 268 327 84 424 -115 204 197 -148 320 -239 370 -49 -167 -71 -87
6287h7J4N7J64k42J74m25N28j77j46J76l44J45j99L21k97L71m07K52o2j39L76
$$ -87 -73 -16 148 -94 80 -345 183 6 -140 36 -308 -163 -362 -41 -338 33 -374 -122 -184 -323 53
6308E3p36P36j61J27k26k38L48j04J11k11K28j2p6j34J38M07m06L26k91o7L06
$$ 53 -683 53 -108 19 -207 -445 -97 -201 -90 -301 -73 -85 -161 -295 -157 250 -156 170 -121 -188 118
6329A18j07J25l5j55K0L38k84K48k34K22p6k4J19k27J63j67J17l12N56n14J64
$$ 118 11 136 101 -54 -34 304 20 268 34 256 180 156 275 48 211 44 161 -151 405 -109 55
6350E5oj16L10l80L30k23O0q1K03K8j91J33k38L31m03L9J54o0Q4j26J1l25M20
$$ 55 49 -67 243 -137 193 -30 30 -51 152 180 -11 122 -116 215 -188 -149 5 -55 29 -97 -86 -411 9
6373Ik30J61j21k45K22j69K53j21J29p3K09r6j77K6P3J34l59L95k13M07l81nL9
$$ 9 -221 -60 -181 -426 -204 -373 -120 -241 -112 -185 24 -72 -249 -223 -150 -16 -375 20 -193 214 -167 -172 -133
6396a33J04N9j38L00m60L56j13m8L04j50J36k88J79m1N2l1K35j30o8K92m38K90
$$ -133 -29 30 -108 192 -268 88 -25 -73 231 81 217 -71 108 67 119 88 323 193 125 417 -21 269
6418B69k70L09n1j35J12k48L15j79M07m82NO6L9l4k02J06k07L97m30L25k00OJ4
$$ 269 -1 308 257 122 234 -14 301 122 529 47 52 118 157 123 -79 27 -180 217 -213 112 -88 -82 -68
6441f8j47K40k58J88j45j7J72j13J49l70J41J31J19m19L36r3J32k32J1K05j88
$$ -68 -215 25 -233 -45 -190 -207 -35 -148 1 -369 -228 -97 22 -397 -61 -154 -22 -254 -243 -38 -226
6462b26m9P0J73j1q9J24j43K36l34M50l72K10OJ9J53k42K36j95J48j32J77j19
$$ -226 -275 -205 -32 -43 -132 -8 -151 85 -249 201 -171 39 45 64 217 -25 211 16 164 32 209 90
6484I0N4k32J55L12l75L44j80%j16J13p9MJ64k42K79k23J20k53R4K70l19L61l20
$$ 90 144 -88 67 379 4 348 168 168 52 165 86 90 254 12 291 68 188 -65 29 299 -20 341 21
6507B1Q2L1j54j46L67k80k79M94m43K76n8K97l60L6J23l49pK00J21q7K31l81J47
$$ 21 103 134 -20 -166 201 -79 -358 136 -307 -31 -89 208 -152 -116 7 -342 -349 -149 -28 -115 116 -265 -118
6530a18K2j43L55n39L39j42N4j05J76J11k02J72p7J89l14K38q3NJ73j29K15l12
$$ -118 -96 -239 116 -423 -84 -226 -172 -277 -101 10 -192 -20 -97 92 -222 16 -67 -62 111 -18 197 -115
6552a15M3L6K70k45J23j08j68N77m43M00n27M74nj69j3J62j50l8K30m12M42l42
$$ -115 -72 -36 234 -11 112 4 -164 413 -30 370 -157 317 312 143 130 292 142 104 334 -78 364 22
6574B2p2K79k54K98l54K02J23p3l3K1j37q1J85n63Q19n77J36j11k7J84j76j6J50
$$ 22 -50 229 -25 273 -81 121 244 171 138 159 22 -59 126 -437 382 -195 -59 -170 -197 -13 -189 -205 -55
6597e5n6q9M09o34N08j39l02O47o20L08N9l88K96pj7k18J50k05N85o39M65k18
$$ -55 -111 -200 209 -425 83 -56 -358 289 -331 -23 36 -352 -56 -63 -80 -298 -148 -353 232 -407 58 -160
6619a60k6K57m23L68j61J98q8J42j46L43l19l1L50n60M62j66l0K38k51K74j14
$$ -160 -186 71 -352 16 -145 53 -35 107 -39 304 -15 -46 304 -256 206 40 10 248 -3 271 157
6640A57q6K3K42m17M40k99J19J73o18O90k45P2j71j4j53M31l33J38m6k21L61m83
$$ 157 71 94 336 -81 359 60 179 352 -266 424 179 251 80 66 -87 344 11 149 103 -118 243 -240
6662b40K60k21R3J11m7k70L14k24n6K23l17K71K5k89M71n66M99l48J30P7J57l87
$$ -240 20 -201 -108 3 -44 -314 0 -224 -280 -57 -374 -103 -78 -367 104 -462 37 -311 -181 -104 53 -334
6684c34L72k56q1K05l16L98j65OL29l17N6J93j12R6j13r3K03M4j90M48n88M51
$$ -334 38 -218 -299 -94 -410 -12 -177 -171 158 -159 -103 90 -22 74 -39 -132 71 115 -75 373 -215 236
6706B36k14p2J44O3j47K73k69K27j40k02O13n57K74J2l97N58k37j12K41j18j14
$$ 236 22 -50 94 157 10 283 14 241 101 -101 512 -45 229 241 -156 402 165 53 294 176 62
6727F2J88j68O6J99n23M64m45M53j79j96N6p8K22k11L4j78L53o2k18J39l47M20
$$ 62 250 82 148 347 -176 288 -157 296 117 -79 -23 -101 121 -90 -56 -234 119 57 -161 -22 -369 51
6749E1m63L88o1j20n3P5J21M0j87k2K70o06O24j60k62J86j76J86J08O2k50J81
$$ 51 -412 -24 -85 -205 -258 -183 -62 -22 -209 -231 39 -567 57 -103 -365 -179 -355 -169 -61 1 -249 -68
6771f8n9K17q6q9J82k61M53j86m5l9QJ58Jrn9J65m70Q88o19P6K32m11L32q7j22
$$ -68 -127 90 4 -85 97 -164 289 103 58 19 27 185 186 177 118 283 -187 701 82 158 390 -21 311 224 102
6796A02m8K83l49J44k0j13M5j01M84o28L86j8l55K96q5K14k32K10l83M31l63P3
$$ 102 54 337 -12 132 112 -1 44 -57 427 -201 185 167 -188 108 23 237 5 215 -168 263 -100 -27
6818b7k07P5J81l16M22k80O4j6qq8q7K74k87L51m95M75l53K41L9l15K87nj17J52
$$ -27 -234 -159 22 -294 128 -152 -88 -104 -112 -200 -287 -13 -300 51 -444 31 -322 -81 -42 -357 -70 -75 -192 -40
6842d0J51k49J77j42Q0J48j95K57k52J55p6j46L18q3K6rJ83l06J15j39J99j37
$$ -40 111 -138 39 -103 -23 125 -70 187 -65 90 14 -132 186 103 129 120 303 -3 112 -27 172 35
6864C5J53J54k91J27j92O8p8J21R6j03J51j85L31l02J32j59r0J1o9J32m8J66j76
$$ 35 188 342 51 178 -14 54 -24 97 193 90 241 56 387 85 217 58 -32 -21 -90 42 -6 160 -16
6887a6K74k13J0o8j74K30j42J44m14L79k42kJ68k39J59k05L80l95K95k17L14j85
$$ -16 258 45 55 -13 -187 43 -99 45 -369 10 -232 -234 -66 -305 -146 -351 29 -366 -71 -288 26 -159
6909a59j99N27n33K65j69K80j98k5O3mj38J86K24l43K61q4K5L5j28K14j97M45
$$ -159 -358 169 -364 -99 -268 12 -186 -211 -148 -152 -290 -104 120 -223 38 -46 -21 14 -114 100 -97 348
6931C48n12L56J2pj19Q3J16l30J83O0Jj40J94r2L8J22p2Q1m34K74j15K3n5q8L90
$$ 348 -164 192 204 197 78 161 277 -53 130 190 191 51 245 153 191 313 241 322 -112 162 47 70 15 -73 317
6956C17o1j50K2m2r4O8qm3lo3J36l15R4K22k84K43j39J38k03J62p6P5k95J15K49
$$ 317 256 106 128 86 -8 60 52 9 6 -57 79 -236 -142 80 -204 39 -100 38 -165 -3 -79 -4 -299 -184 65
6981F5k47J26l04N29m70K22n2J01J98m58L66l01L6K1K80k06O3P7k72M03rQ2j91
$$ 65 -182 -56 -360 169 -301 -79 -131 -30 168 -290 76 -225 -189 -168 112 -94 -31 46 -226 177 168 250 59
7004E9Q2j59j8R7n2J50k78L51k54J22L7O3M2k1j65OP7j08J64r1L8o8R9P1m24L44
$$ 59 141 -18 -36 61 9 159 -119 232 -22 100 137 200 242 221 56 62 139 31 195 104 142 74 173 244 -180 164
7030A64k98M42j64j23J8j5J2j63K90k19K88m64Q6M6j81M53l26J75R0k20J67j23
$$ 164 -134 308 144 21 39 24 36 -127 163 -56 232 -232 -146 -100 -281 172 -154 21 111 -109 58 -65
7052f5j37L17n8k76L55o54M36J39k87O3q7J36J73o5j61J88k28Q2L04j85K0j04
$$ -65 -202 115 57 -219 136 -518 -82 57 -230 -167 -254 -118 55 -10 -171 17 -211 -129 175 -10 10 -94
7074i4O9m2Q9p0J48j46j27K58j92L92k83K10j22m27O17m00K55K04k37J00K28k32
$$ -94 -25 -67 22 -48 100 -46 -173 85 -107 285 2 212 90 -337 280 -120 135 339 102 202 430 198
7096A98L2J68o6k44k98M12l01J40m8j26K53Q6j66LJ32j98K08l28O4L01m22M35
$$ 198 230 398 332 88 -210 202 -99 41 -7 -133 120 206 40 43 175 -23 185 -143 -79 222 -200 235
7118B35m45k25M28l8j42L35l93Q6J44l47J87j99L51j50k69M46j50k00L32j58r4
$$ 235 -210 -435 -7 -45 -187 148 -245 -159 -15 -362 -175 -374 -23 -173 -442 4 -146 -346 -14 -172 -266
7139b66M89n94L71K33m57M04k13K82j45j71K41j38j72L45j34l28M69m40O86l26
$$ -266 223 -371 0 233 -224 180 -33 249 104 -67 174 36 -136 209 75 -253 216 -224 462 136
7159A36q1J87l37L56j16J8j46K04k26R7l1J2K84n15N30l15j37NM0j17K76j45L9
$$ 136 55 242 -95 261 145 163 17 221 -5 92 61 73 357 -158 372 57 -80 -75 -35 -152 124 -21 18
7182A8K40n53M60k34r9J56p8j12K3K16k26J60J9J1k38L07j6l61L97o14M83K3j44
$$ 18 258 -295 165 -69 -168 -12 -90 -202 -179 37 -189 -29 -10 1 -237 70 54 -307 90 -524 -41 -18 -162
7205a62J03p5K00n1j03n5O6l13K72j6k67P11n83K35L7j90K20J31j04k11K34j33
$$ -162 -59 -134 66 15 -88 -143 -77 -390 -118 -134 -401 310 -273 -38 -1 -191 29 160 56 -155 79 -54
7227e4L84n66M20q2j62M46m52J82N0m2k21J57K18m7k91R5L19l79M02k82j8Q1q3
$$ -54 330 -236 184 102 -60 386 -66 116 166 124 -97 60 278 231 -60 35 354 -25 377 95 77 158 75
7250G5J39r4J6k47K77l95M14l65R1K26m22N88m22m5J81M4l12L01k08M1K10k79
$$ 75 214 120 136 -111 166 -229 185 -180 -89 137 -285 303 -119 -164 17 61 -251 50 -158 -117 93 -186
7272a86J67k59J70q6q0K10k04J38J13k03j92K59j19L50j28j16J40k57K64P5j58
$$ -186 -19 -278 -108 -194 -274 -64 -268 -130 -17 -220 -412 -153 -272 78 -50 -166 -26 -283 -19 56 -102
7293a02j16L23k34L50k94l2L04m15L05M2k86K56k77M34q7j74l6J63k80L24k6K1
$$ -102 -218 105 -129 221 -73 -105 199 -216 89 131 -155 101 -176 258 171 -3 -39 124 -156 168 142 163
7315A63O7l13L65k97K74J2k55K59r8l5p3J00l75L78q0k40M71m89K63m35L25k00
$$ 163 230 -83 282 -15 259 271 16 275 177 142 69 169 -206 172 92 -148 323 -166 97 -338 -13 -213
7337b13J66q8J21K8j43L18l70L18l45J33j01J22j10r8J18J02k10j7K62k24K18
$$ -213 -47 -135 -14 14 -129 189 -181 137 -208 -75 -176 -54 -164 -262 -144 -42 -252 -269 -7 -231 -13
7358a3J5m32K92j51J40n3J10R5j59J25J40j40N7o0r9K21j02o8L17k11jM6L9k61
$$ -13 2 -430 -138 -289 -149 -202 -92 3 -156 -31 109 -31 26 -34 -133 88 -14 -82 235 24 23 69 108 -153
7382a53L1J9K38p5j06L31l36N01k13j97J07j12qJ35K9j20K85m50K36k29J75J81
$$ -153 -122 -103 135 60 -46 285 -51 450 237 40 147 35 27 162 191 71 356 -94 142 -87 88 269
7404B69j87m6K0j07J37k8Jj71Q3L6J45l17J85k32J50J51j47lj10J56l62L71k46
$$ 269 82 36 56 -51 86 58 59 -112 -29 7 152 -165 20 -212 -62 89 -58 -61 -171 -15 -377 -6 -252
7427b52K79j55k9lj54K70m60O46l31J7k44L91J00k60J77r4K12l31L25k11J05O9
$$ -252 27 -128 -157 -160 -314 -44 -504 142 -189 -172 -416 -25 75 -185 -8 -102 110 -221 104 -107 -2 67
7449F7j43Q2k2L66k68J82m5j13J99m17K69j10K82l67K10j70K22k63J33J32k82
$$ 67 -76 6 -16 350 82 264 219 106 305 -112 157 47 329 -38 172 2 224 -39 94 226 -56
7470e6M20k49J24k10M9L6j08J51j35J53p3j76Q4o5M4J4J25l02K28n7k5Mj54L27
$$ -56 364 115 239 29 78 114 6 157 22 175 102 -74 10 -55 -11 3 128 -174 54 -3 -28 -24 -178 149
7494A49k39J56k61j86j1L00N1j94J15j72K45j02M4k98L03j25J14L8k3J01k01N1
$$ 149 -90 66 -195 -381 -392 -92 -41 -235 -120 -292 -47 -149 -105 -403 -100 -225 -111 -73 -96 5 -196 -145
7516a45R6O4j63J28j26J92q8J45Lk71K27j90K29j82J22J89l06L81l19L04m50K26
$$ -145 -49 15 -148 -20 -146 46 -42 103 106 -165 62 -128 101 -81 41 230 -76 305 -14 290 -160 66
7538F6J24r6O5k57L33K8j5k08n0L32q7k63L7L8j73K97k21NJ22j72P8J83l8k86
$$ 66 190 94 159 -98 235 263 248 40 -10 322 235 -28 9 47 -126 171 -50 -45 77 -95 -17 166 128 -158
7562a58J97k6r1q9J05P0k27K25k7j12N2J6KN2p4j99L09j44j23J05M4J18l03L73
$$ -158 39 13 -78 -167 -62 8 -219 6 -21 -133 -81 -65 -63 -11 -85 -284 25 -119 -242 -137 -93 25 -278 95
7586I5j80J3M7K22j16K08m50j36L25q0P0l30K75J0%L5J2n1Q5J69j26R4p1k8O8
$$ 95 -85 -72 -25 197 81 289 -161 -297 28 -52 18 -312 -37 -27 -27 8 20 -31 54 223 97 191 120 92 160
7611A60L2N1k86K74k56K28pl8j20j09K83n6J29j99J75k00k53L04j23M8R7l01J79
$$ 160 192 243 -43 231 -25 203 196 158 38 -71 212 156 285 86 261 61 -192 112 -11 37 134 -167 12
7634A2Q8m29K95j4k11L69k13J00j21k22K33j29J15p7K13k92L73k58J95j17q2K20
$$ 12 100 -329 -34 -48 -259 110 -103 -3 -124 -346 -113 -242 -127 -204 9 -283 90 -168 27 -90 -172 48
7656D8k92L67j64r1K0j54J37N8r2J04K50k29R9k78R0J44l3J26o0Jj10N4j87M02
$$ 48 -244 123 -41 -132 -112 -266 -129 -71 -163 -59 191 -38 61 -217 -127 17 -16 110 50 51 -59 -5 -192 210
7680B10l9j9P9k03pL7J79j32qM7J38j88J23O8k26L40k50J70k55l1j21K01l2lN2
$$ 210 171 152 231 28 21 58 237 105 97 144 282 94 217 285 59 399 149 319 64 33 -88 113 81 78 130
7705A30j21L9j33K97j23m6j16r5J26l3n2j1J4N0N9K8j22J14o8L32k33j60R8n3
$$ 130 9 48 -85 212 89 43 -73 -168 -42 -75 -127 -138 -124 -74 -15 13 -109 5 -63 269 36 -124 -26 -79
7729g9L3k40J57o7J38o8J8r5J07J65m11J96o0J86Nk27L26m78L91J94k58%J12j47
$$ -79 -46 -286 -129 -196 -58 -126 -108 -203 -96 69 -342 -146 -206 -20 -15 -242 84 -394 -3 191 -67 -67 45 -102
7753a02oM25l27K09k35J40p4J63j22K74k66K1j6p4J64k30J81rJ61j76n3Qn1J55
$$ -102 -108 317 -10 199 -36 104 30 193 71 345 79 100 84 10 174 -56 125 116 277 101 48 56 5 160
7777A60j66J65R7j38l1r2K69n44M21j55q8P1n4J56J59k35j89L30k06M02l56L6
$$ 160 -6 159 256 118 87 -5 264 -280 141 -14 -102 -31 -85 71 230 -5 -194 136 -70 332 -24 12
7799A2J82m66K93q0q6Q0J22m20K86n9P5L1k25L14r7j06p8Q6J71J0q8n1J57k39
$$ 12 194 -272 21 -59 -145 -65 57 -363 -77 -136 -61 -30 -255 59 -38 -144 -222 -136 35 45 -43 -94 63 -176
7823a76K16j56m1J70k56L46l1M4o8k40J77K53k97J79J74k28K43k84K32p7l0P2
$$ -176 40 -116 -157 13 -243 103 72 116 48 -192 -15 238 -59 120 294 66 309 25 257 180 150 222
7845B22j82J50j03K8j39K94k31k0j04J55K67l18J20k05K12n8j16K96k98J79j10
$$ 222 40 190 87 115 -24 270 39 19 -85 70 337 19 139 -66 146 88 -28 268 -30 149 39
7866C9P4k39L48m09L19L3m69K69k47J25P2LJ68k53l1J65j97j83L71p4M1j24K16
$$ 39 113 -126 222 -187 132 165 -304 -35 -282 -157 -85 -82 86 -167 -198 -33 -230 -413 -42 -116 -75 -199 17
7889A7j38J89j00K0J23l78N07l18J8J45k75L84l21K48J36o4j50P9J23k48R5k3
$$ 17 -121 68 -32 -12 111 -267 240 -78 -60 85 -190 194 -127 121 257 193 43 122 245 -3 92 69
7911F9L06l15K8J11kL0l12M01k34m6J11j81J38J68l4j34Rj15K29j20j03K37l99
$$ 69 375 60 88 199 197 227 -85 316 82 36 147 -34 104 272 238 104 113 -2 227 107 4 241 -158
7934a58N2J71j01j19R1J4K5j05Q0J48j69J13j44J11j58m5J3J4n6l3K50k88L13
$$ -158 -106 65 -36 -155 -64 -50 -25 -130 -50 98 -71 42 -102 9 -149 -194 -181 -167 -223 -256 -6 -294 19
7957A9k07J35k3O1j07L4J2M1J96k65m2r0K48J0r4K31j45p2j31J93K8J44p5n0J12
$$ 19 -188 -53 -76 -15 -122 -88 -76 -35 161 -104 -146 -236 12 22 -72 159 14 -58 -189 4 32 176 101 51 163
7982A63J33j84Ml0j57L1K92q9J0J58j06j13O2k51L43k10L9l3p2L27k22o0J40j08
$$ 163 296 112 116 86 -71 -40 252 163 173 331 225 112 174 -77 266 56 95 62 -10 317 95 35 175 67
8006F7k5l3J96k65Q5r4N0J2l4Q7j91J22l9K04l69K60l40L22n7k78J50N4K4n3J5
$$ 67 42 9 205 -60 25 -69 -19 -7 -41 46 -145 -23 -62 142 -227 33 -307 15 -42 -320 -170 -116 -92 -145 -130
8031a30j44Q6K24k88J70q9J76M5J00j91K8k7NK4j52J71j69l4K66j1o8j4J19m9
$$ -130 -274 -188 36 -252 -82 -171 5 50 150 -41 -13 -40 -35 -11 -163 8 -161 -195 71 60 -8 -22 97 48
8055D8n6O0R6k68J52J37m14M33j63J02j3P9l43K92j7q6O8J65k73M2J02j51J89
$$ 48 -8 52 148 -120 32 169 -245 188 25 127 114 193 -150 142 125 39 107 272 -1 41 143 -8 181
8078A81m1k05K41J7j63r5L9J20o0L8nj9j84J23o3m4k9Mj34R0J61l04J86J98k38
$$ 181 140 -65 176 193 30 -65 -26 94 34 72 67 48 -136 -13 -76 -120 -149 -145 -279 -189 -28 -332 -146 52 -186
8103a86Q8J16Nk05O4l47L26nJ69k49J03M1O1M6l5N0l13L17p0L7p6O0J35r6k6j04
$$ -186 -98 18 23 -182 -118 -465 -139 -144 25 -224 -121 -80 -19 27 -8 42 -271 46 -24 13 -63 -3 132 36 10 -94
8129i4K58j77O3j8J23j5j12M1j36J76o9L8n0J04M6J24l04K11k3j08R2j59L2L14
$$ -94 164 -13 50 32 155 140 28 69 -67 109 40 78 28 132 178 302 -2 209 186 78 170 11 43 357
8153C57k04J17k80J36j04l0k7R0j14O6m2%R6k24K5K01%r6m1l2rK00m23J77j60
$$ 357 153 270 -10 126 22 -8 -35 55 -59 7 -35 -35 61 -163 -138 63 63 -33 -74 -106 -115 85 -338 -161 -321
8178c21J90rp2J73j03l4j6J32j09R2o8lJ87
$$ -321 -131 -140 -212 -39 -142 -176 -192 -60 -169 -77 -145 -148 39
8191C9
$$ Imaginary data points
##PAGE= N=2
##DATA TABLE= (X++(I..I)), XYDATA
0@%%%%%%%Qj6J6j6K4l2M0n6P2q8J12j36J60j92K32k80L28l83M47n18O00o92P95
$$ 0 0 0 0 0 0 0 0 8 -8 8 -8 16 -16 24 -32 40 -48 64 -72 88 -104 128 -152 176 -207 240 -278 322 -370 425
30D25r08J033j174J329j501J691j899K128k380K654k952L280l638M028m455M920
$$ 425 -483 550 -624 705 -796 895 -1004 1124 -1256 1398 -1554 1726 -1912 2116 -2339 2581
46B581n427N985o596P262p997Q809r705J0704j1823J3083j4512J6148j8045K0275
$$ 2581 -2846 3139 -3457 3805 -4192 4617 -5088 5616 -6207 6876 -7636 8512 -9533 10742
60A0742k2938K6181l0234L5458m2464N2389o7584R3885j51492M79231j10603n73632
$$ 10742 -12196 13985 -16249 19209 -23255 29134 -38450 55435 -96057 383174 272571 -301061
72c01061P08539n38615L03007J18509m02879K89069j52662J11229J92569n17990
$$ -301061 407478 -131137 171870 290379 -112500 176569 23907 135136 327705 -190285
82a90285K71894M3511j51003K60559k17330j11268K31169k5502j54229O4253j4434
$$ -190285 81609 125120 -25883 234676 17346 -93922 137247 111745 -42484 21769 7335
93G335r4712K44737j16035j00221K7888k4298J66871k05613J3456J71154k69054
$$ 7335 -87377 157360 41325 -58896 -31008 -55306 111565 -94048 -80592 90562 -178492
104a78492K75834k0619l38632L14732j32631K6836J14504k33243K25126j41227
$$ -178492 97342 76723 -261909 52823 -79808 -52972 61532 -171711 53415 -87812
114h7812L7250J22383l09508K41710K2410j60528K03241j27392l8942J00802n5927
$$ -87812 -50562 71821 -237687 4023 26433 -134095 69146 -58246 -97188 3614 -52313
125e2313L1566n8510P0381J5097m6153N7906p3813K3594l0430R9927k9986j15582
$$ -52313 -20747 -79257 -8876 6221 -39932 17974 -55839 -32245 -62675 37252 7266 -108316
137a08316K21782j69182m575J75477k50051J21897P9031j28778J39260j27027
$$ -108316 113466 -55716 -60291 115186 -134865 -12968 66063 -62715 76545 -50482
147e0482N0010M1244j56303K20727j47434l5274K09501j74893K4329N2300o3323
$$ -50482 -472 40772 -115531 105196 -42238 -77512 131989 -42904 -18575 33725 -29598
158b9598P446L4033J7954n8793M4536L0889q4592M2179M936l3431K8133J9490
$$ -29598 -22152 11881 29835 -28958 15578 46467 -38125 4054 8990 -24441 3692 23182
170B3182K6220j15071J07492J0339j65459J87722p1586n3510J20420p0335J4877
$$ 23182 49402 -65669 41823 52162 -113297 74425 2839 -50671 69749 -586 14291
181A4291m3180L3904L2767j21168J40973j5270j24336J74625j10755m2024J09576
$$ 14291 -28889 5015 37782 -83386 57587 42317 -82019 92606 -18149 -60173 49403
192D9403p7339L1746r458L3695k4584l5571P4189p6969k354P3689k6875l7117
$$ 49403 -27936 3810 -5648 28047 3463 -32108 42081 -34888 -37242 36447 9572 -27545
204b7545M1327K3899r0119M1439P2523j44280R2659O0747j37188J13795n8168
$$ -27545 13782 37681 -52438 -10999 61524 -82756 9903 70650 -66538 47257 -10911
215a0911j1186M5519p2231J06034q7984J2570J12769j59783N8740O0072j28803
$$ -10911 -22097 23422 -48809 57225 -30759 -18189 94580 -65203 -6463 53609 -75194
226g5194J06899P960p5938N8446j0254J440l8943K7201J3262l9432N3251n43l8809
$$ -75194 31705 39665 -36273 22173 11919 13359 -25584 1617 14879 -24553 28698 28155 -10654
239a0654j7002O8392m8224m1131J04382p2236q048Q7947q8950K346L3943l1699
$$ -10654 -27656 40736 -7488 -48619 55763 -16473 -24521 63426 -25524 -23178 10765 -20934
251b0934M5341o1533N7654k415p9152J34339j21339r162J18614j07696N0982J7091
$$ -20934 24407 -37126 20528 18113 -61039 73300 -48039 -57201 61413 -46283 4699 21790
263B1790n5305L8317k7346L2944k2312m9843J24993p8659k3932R3770j01563K2816
$$ 21790 -33515 4802 -22544 10400 -11912 -61755 63238 -15421 -39353 54417 -47146 -24330
275b4330M8440l2054j4926L3950O895l8017L0628j3164j8896K1155J9470p366
$$ -24330 24110 -7944 -22870 11080 17975 -20042 10586 -2578 -21474 -319 19151 11785
287A1785l3236L9875J7633q4851P3919N550r6716J30421m1458m8802O0937m5645
$$ 11785 -21451 18424 36057 -48794 25125 30675 -66041 64380 22922 -25880 35057 -10588
299a0588K7524k1240J2857K1884n3034O0669m921p0970O7440j8390l3555N5909
$$ -10588 16936 -4304 8553 30437 -22597 38072 33151 -37819 29621 11231 -22324 33585
311C3585j8261j4891k292L9249m4363j9885O7012n3432J3139K6562j9425k0353
$$ 33585 15324 433 -1859 37390 -6973 -26858 40154 -13278 -139 26423 6998 -13355
323a3355O965L9055n8095O459O0144o7357K3899M0726p8863L8630K21k356L342
$$ -13355 -6390 32665 -25430 -18971 41173 -26184 -2285 38441 -40422 -1792 -1571 -3927 -585
336e85k3903O2420p5037L1087M2368j00217O7422J6831n3043M0160m960j3960
$$ -585 -24488 37932 -37105 -6018 36350 -63867 3555 20386 -32657 7503 2543 -11417
348a1417p67K294K4389n3869M0156K7829o1282M1740q761j5402J148L0097j6361
$$ -11417 -12184 -9890 14499 -39370 786 28615 -32667 9073 312 -15090 -13942 16155 -206
361b06l4395P4433m6557j6496N5117n3317P095L3167j8077P111k6802M1894j2498
$$ -206 -34601 39832 -6725 -23221 31896 -21421 -14326 18841 764 7875 -18927 22967 10469
374A0469n5408R4057o7266o643P3593o5864J8081J546M26l427j2031L4842l6293
$$ 10469 -44939 49118 -18148 -24791 48802 -17062 1019 2565 2991 -436 -12467 22375 -13918
387a3918O029M4480n8516J1454K9101l4790J6438K401J1728m0830K9360L2643
$$ -13918 -7889 36591 -21925 -10471 18630 -16160 278 2679 14407 -26423 2937 35580
399C5580q1867N5784M21k9930K7762o295O899l3381K9662J7891o4174N4710L694
$$ 35580 -46287 9497 9918 -20012 7750 1455 8354 -25027 4635 22526 -41648 13062 16756
412A6756n3493O8526l8629q074K3889k1603L2868m9020M6142l494m9942P6561
$$ 16756 -36737 31789 -6840 -14914 8975 -12628 20240 -28780 17362 13868 -36074 40487
424D0487m7529j9792N1141k1810m786L897J2242r451k3654N8542m7349j5967O9187
$$ 40487 -7042 -26834 24307 2497 -2289 1608 13850 4399 -19255 39287 -8062 -24029 45158
437D5158n8856K1256M957q932M836k2087N0729n0617L949N4996o4244K0494K8154
$$ 45158 -13698 7558 12515 3583 8419 -13668 37061 -13556 -9607 45389 -18855 1639 29793
450B9793m6289K0718O294l264j0513J51L5611n7301L1750J3614n0330M2142n072
$$ 29793 -16496 4222 10516 7252 -3261 -3110 32501 -24800 6950 20564 -29766 12376 7304
463G304m951j6370J9982N698m4450M9303j4277l8844N6172k0027k0576K2735j6644
$$ 7304 2353 -14017 5965 11663 -32787 16516 2239 -36605 19567 -460 -21036 1699 -14945
476a4945J6267l1139L2100J284n4260P9801m8507j7290N0833m4748J6006L970
$$ -14945 1322 -29817 2283 3567 -50693 29108 -19399 -36689 14144 -30604 -14598 -10628
488a0628r09J691k1971L7990j9351k9900N8705m0983j662M3022l5724K113M702
$$ -10628 -11537 -9846 -31817 6173 -13178 -43078 15627 -25356 -27018 16004 -19720 -17607 -12905
501a2905J7888k6703Q930K5742l7528K6984O348j6599m209J2967J3510l0752K2511
$$ -12905 4983 -21720 -12790 12952 -24576 2408 8756 -7843 -12052 915 14425 -16327 6184
514F184J9745m8865M2789L585n1056N4802j9490J415O264r513K7034m7729M2816
$$ 6184 25929 -22936 19853 23438 -27618 27184 7694 9109 15373 5860 32894 -14835 27981
527B7981O03n0933N8655j1100k7490L3463j5527q481M162J0344L583l6399M6303
$$ 27981 28584 -22349 36306 25206 -2284 31179 15652 7171 11333 21677 25260 -11139 35164
540C5164j3458k8976M0740k9915j049J0460J0108j9535o847L4304l5976K684K1532
$$ 35164 21706 -7270 33470 3555 2506 12966 23074 3539 -3308 30996 -4980 -2296 19236
553A9236l1980J2657J8154j8729l760k930K2891l1501O41M0786o1342M0763J2003
$$ 19236 -12744 -87 18067 -662 -4422 -7352 15539 -15962 -15321 25465 -35877 4886 16889
566A6889m4075K6291j0175Q248j2623O740K1905m1731K5329K0564n3859L5368
$$ 16889 -27186 -895 -11070 -2822 -15445 -8705 13200 -28531 -3202 17362 -36497 -1129
578a129M425k5225K7889j2293R216k0877J9468Q647m2794M3560p894j6446K5467
$$ -1129 3296 -21929 5960 -6333 2883 -17994 1474 10121 -32673 10887 2993 -13453 12014
591A2014q910j5489P650J6560j4846j2360L2948j3916j6291L5263l2004N50J4321
$$ 12014 3104 -12385 -4735 11825 -3021 -15381 17567 3651 -12640 22623 -9381 -8831 5490
604E490J279m178j6410M3997m0357k571L9851m8474J8342J9130k2009J0330p162
$$ 5490 6769 2591 -13819 30178 -10179 -12750 27101 -21373 -3031 16099 -5910 4420 -2742
617b742P763p814j6262M3596m5124R868M2744n9022L1897k438k1162J7931m523
$$ -2742 5021 -2793 -19055 24541 -20583 -10715 32029 -26993 4904 2466 -18696 -765 -5288
630e288J1912k0139P509K1664l6487J0614K1960l9239K5532J5551k5747L058J1151
$$ -5288 6624 -13515 -6006 15658 -20829 -10215 11745 -27494 -1962 13589 -12158 -9100 2051
643B051j879k3726K8881o331j2443K1475n885n881j1026K3751j3094j3126L8118
$$ 2051 172 -23554 5327 -1004 -13447 8028 2143 -3738 -14764 8987 -4107 -17233 20885
656B0885k4434j0629M0818l3870n538K4026j9037J8614j3554J7594r149k4335
$$ 20885 -3549 -14178 26640 -7230 -12768 11258 -7779 10835 -2719 14875 5726 -18609
668a8609N0923m2110l264L9476l0585Q662J4888j8877r07J704J1675j1754r317
$$ -18609 32314 -9796 -13060 26416 -4169 4493 19381 504 -403 1301 12976 1222 -8095
681h095L7054l0971L441J8337l1251R912J1279J593j9282J7461N526k6949J8335
$$ -8095 28959 -2012 1429 19766 -11485 -1573 9706 11299 -7983 9478 15004 -11945 6390
694F390p40j9296J3014J4826j2856o599Q126J020k3734K5897j156l0321M2208
$$ 6390 5650 -13646 -632 14194 1338 -5261 2865 3885 -19849 6048 4892 -25429 16779
707A6779j5024j1911O620l085K285j2724K5995j2122j5653L2750j7332k0432K7503
$$ 16779 1755 -10156 -3536 -6621 -4336 -17060 8935 -3187 -18840 13910 -3422 -23854 3649
720C649j3471o71J3678k054m276j5193L2956k5833r100L4753k6014R851J1733
$$ 3649 -9822 -10493 3185 1131 -3145 -18338 14618 -11215 -20315 14438 -11576 -1725 10008
733A0008j0903r103N821J1272j5698M415K2566k4760M978K1708l3831J0265R904
$$ 10008 -895 -9998 -4177 7095 -8603 -4188 18378 -6382 -1404 20304 -13527 -3262 6642
746F642j91p410O697J3809l2917K4200L81k5568K1103O268p680k601P855n258
$$ 6642 6451 -959 5738 19547 -13370 10830 11211 -14357 6746 13014 5334 2733 10588 5330
760E330j6271K0361L449l1329L7672q198k0351K3756j9412M394n813J5043q59
$$ 5330 -10941 9420 12869 -18460 19212 11014 -9337 14419 -4993 -599 -6412 8631 7772
773G772k2660L3525j7052j9435K8537j5247j0035K4233p955m718l348J0541r326
$$ 7772 -14888 18637 1585 -17850 10687 -4560 -14595 9638 1683 -3035 -6383 4158 -5168
786e168j4072L1605k4010L181J9695j4590o370K102J1212k0161J3116J4867k5530
$$ -5168 -19240 12365 -11645 -8464 11231 -3359 -9729 -7627 3585 -16576 -3460 11407 -14123
799a4123J2218J2797k5713R231O238n950M026o95J8045l1781J6129J5580m0473
$$ -14123 -1905 10892 -14821 -5590 648 -5302 -1276 -1971 16074 -15707 422 16002 -24471
812b4471L3288p75j3878J5816l470m587o084P691P189j9902J8823Q707k9753K8448
$$ -24471 8817 8042 -5836 9980 6510 1923 -4161 3530 10719 -9183 9640 18347 -11406 17042
826A7042q700j7175J3348M807j492j1469K3406j6065r958K0528j3857n618J2652
$$ 17042 8342 -8833 4515 9322 7830 -3639 19767 3702 -6256 14272 415 -5203 7449
839G449M400j1403R66R979j4315o772K5415k3640K878K3497k5557R250m673Q22
$$ 7449 11849 446 1412 11391 -2924 -9696 15719 -7921 -5043 18454 -7103 2147 -2526 -1704
853a704n203N62J9410k7126J0913J6158k7574N556J3223j8017P814Q721k110j1364
$$ -1704 -6907 -6345 13065 -14061 -3148 13010 -14564 -9008 4215 -13802 -5988 2733 623 -10741
867a0741M041J4257k9487J8731M976j4527J4840k049l068j1051J5578l233j4035
$$ -10741 -6700 7557 -21930 -3199 1777 -12750 2090 41 -3027 -14078 1500 -1733 -15768
880a5768K2029m899j2631K1152j0305j2848J4497k902M964r766J6924o619j7676
$$ -15768 6261 1362 -11269 9883 -422 -13270 1227 -1675 3289 -6477 10447 3828 -13848
893a3848L1044k2400m493J8843m903l024K974M118j1402K3J4247j2700l966K3611
$$ -13848 17196 -5204 -9697 9146 4243 1219 4193 8311 -3091 -3068 11179 -1521 -5487 18124
907A8124j7195M72O427q545o00Q72J5996k3834J2180J2455k5106J2732o26q880
$$ 18124 929 1401 7828 -717 -1317 -445 15551 -8283 3897 16352 -8754 3978 3352 -5528
921e528N215O837p94j0458M817R296k4789J6806O319k5474K7839q801o187J610
$$ -5528 -313 6524 5730 -4728 89 9385 -15404 1402 7721 -17753 10086 1285 -4902 -3292
935c292r67M519j6042K0473l244j6007K0064l680j7869J3868j252m059M661L872
$$ -3292 -4259 260 -15782 4691 1447 -14560 5504 1824 -16045 -2177 -3429 -7488 -2827 1045
949A045j333j3762K1531j3549o935J8293j1970O078J707K674j0774J100J4272
$$ 1045 -288 -14050 7481 -6068 -13003 5290 -6680 -602 1105 3779 -6995 -5895 8377
962H377j6321L720J7751j7674L048J3490j7712N411Q64P539q484M14J9264k7923
$$ 8377 -7944 -4224 13527 -4147 -1099 12391 -5321 90 954 8493 9 423 19687 -8236
976h236J4039N709j7209J1009K851j176k469K495J347j1178P189J0138k2719J8030
$$ -8236 5803 11512 -5697 5312 8163 6987 4518 7013 8360 -2818 4371 14509 -8210 9820
990I820K260j5351J3797q970J114o327J1561l74j5119J7955o006j1222R930o78
$$ 9820 12080 -3271 10526 1556 2670 -3657 7904 7530 -7589 10366 4360 -6862 3068 2390
1004B390j0478J0123K352o220m225R655n932j0235J8605j3421K074O852k802l713
$$ 2390 -8088 2035 4387 -1833 -6058 3597 -2335 -12570 6035 -7386 -5312 1540 -1262 -4975
1018d975m753J3487j5091N102J2584j6277M169J0488j1920R33L532j666K253l646
$$ -4975 -9728 3759 -11332 -6230 6354 -9923 -5754 4734 -7186 -6253 -2721 -4387 -2134 -5780
1032e780J4966j9335N580J5010k3701J3995K101n507M010K403k301n378O064M441
$$ -5780 9186 -10149 -4569 10441 -13260 735 2836 -2671 1339 3742 1441 -3937 2127 6568
1046F568j1011N069J0965j6264J0372J605r926K832O428r11r297J5129r167l276
$$ 6568 -4443 626 11591 -4673 5699 7304 -2622 210 6638 5727 -3570 11559 2392 -884
1060h84P452l462k379k119J1791r590k484J1454j1105m261J6519j5174P08J1694
$$ -884 6568 3106 727 -1392 10399 809 -1675 9779 -1326 -5587 10932 -4242 -3534 8160
1074H160j1336O691r131Q560n973n082J8190j9511L856J3186j4438P60P887r566
$$ 8160 -3176 3515 -5616 2944 -3029 -8111 10079 -9432 -5576 7610 -6828 -6068 1819 -7747
1088g747L250K728L80l338k928J2397j5615N275O880q815K804M857j031r768J3307
$$ -7747 -4497 -1769 -1389 -4727 -7655 4742 -10873 -5598 1282 -7533 -4729 128 -903 -10671 2636
1103B636n576o035J0435l181k614M128J924m614j656N396K815j2724J7271o197
$$ 2636 -2940 -8975 1460 -1721 -4335 -207 1717 -2897 -4553 843 3658 -9066 8205 2008
1117B008j0583K0624j5373K737L052q94K965n684R339n906n685J3276p923o642
$$ 2008 -8575 12049 -3324 -587 2465 1571 4536 -1148 8191 2285 -3400 9876 1953 -4689
1131d689J7528j2552J269N835n839J973n151J1145j0675J240J0129j0884J171
$$ -4689 12839 287 1556 7391 1552 3525 -1626 9519 -1156 84 10213 -671 500
1144E00M512l082n755Q319q29n692M061K653r293M779L783r994O856j194K769
$$ 500 5012 1930 -3825 4494 3665 -2027 2034 4687 -4606 173 3956 -6038 818 -376 2393
1159B393p848N618K689j5386J7131n625o798R772k831l674J817L71M42m672O382
$$ 2393 -5455 163 2852 -12534 4597 -1028 -7826 1946 -885 -4559 -2742 -2371 -1929 -6601 -219
1174b19L049j4238J6619p206o460J1992q698L519o23N277m408l555Q588n149l138
$$ -219 2830 -11408 5211 -1995 -8455 3537 -5161 -1642 -2265 3012 -1396 -4951 3637 -1512 -4650
1189d650R052l572n966J1797n126k977J132M715m762k10R618j1141M667J873j769
$$ -4650 4402 830 -5136 6661 1535 -1442 -310 4405 -357 -567 9051 -2090 2577 4450 2681
1204B681l604L127M990j0070Q945l71q636O881K257r322O128J30j430J192k469
$$ 2681 -923 2204 7194 -2876 6069 5698 -2938 3943 6200 -3122 3006 3136 1706 2898 429
1219D29O173j4274J1788J010j2877J3033m582l106K983J28m158J13L385Q71p205
$$ 429 6602 -7672 4116 5126 -7751 5282 700 -2406 577 705 -3453 -3340 45 916 -6289
1234f289O345J681j1571J1407n264k933M448J802l372k797Q131q562K568K686
$$ -6289 56 1737 -9834 1573 -3691 -6624 -2176 -374 -3746 -6543 1588 -6974 -4406 -1720
1248a720k301j428L588L195p499K973L034n385J854Q588j1699O257L899p622N636
$$ -1720 -4021 -5449 -1861 1334 -6165 -3192 -158 -5543 -3689 4899 -6800 -543 3356 -4266 1370
1263A370m723P061o252L272O859j1962P635L432r400M343M541o137N389j353J143
$$ 1370 -3353 3708 -2544 728 7587 -4375 3260 6692 -2708 1635 6176 39 5428 4075 5218
1278E218m175J400O811j2179R909m95n292M979k40l478k005O786n334J7M129j964
$$ 5218 1043 2443 9254 -2925 6984 6489 1197 6176 5936 2458 453 7239 1905 1922 6051 4087
1294D087m696N303j818n136M568M09n84n452R830q746k494R994j1025M259J687
$$ 4087 -609 4694 2876 -2260 2308 2717 2133 -3319 6511 -2235 -4729 5265 -5760 -1501 186
1309A86n78j948q90K780m863m87P476o836j615J0759j2065M787J113l963K425
$$ 186 -392 -2340 -3230 -450 -5313 -5800 1676 -5160 -6775 3984 -8081 -3294 -2181 -6144 -3719
1324c719j408O983q880M257L311p878L529L818m649J750N040m687J49O00K954
$$ -3719 -5127 1856 -7024 -2767 544 -7334 -3805 13 -4636 -2886 2154 -2533 -2384 -1784 1170
1339A170o569N696K628p267Q270k921p27k656M573o83l692Q685m745k588N388
$$ 1170 -5399 297 2925 -4342 3928 1007 280 -2376 2197 1514 -2178 6507 1762 -826 4562
1354D562j881m574N557j331M7O8K132q47p283J1252q232n35P329n192J190k67
$$ 4562 2681 -1893 3664 2333 2380 2448 4580 3733 -3550 7702 -530 -1065 6264 1072 2262 1995
1370A995Q23m242J530L034k862j521O143n138j843N730p464K774M40K937m372
$$ 1995 2818 -1424 106 3140 278 -1243 4900 -238 -2081 3649 -3815 -1041 -601 2336 -2036
1385b036J045M024r145N318M04k959N62M030k091k979L312j116l272K777M071
$$ -2036 -991 3033 -6112 -794 -390 -3349 -2787 1243 -848 -3827 -515 -1631 -4903 -2126 1945
1400A945p935P139n82m265J845o43K522n347P953k770l867O300l341k543L126
$$ 1945 -5990 1149 567 -3698 -1853 -2496 26 -5321 2632 -138 -4005 2295 -1046 -3589 -463
1415d63J162k839L348P54q03m040N685k634l579R422o421K341M83M49k945n66
$$ -463 699 -2140 1208 1962 1159 -2881 2804 170 -3409 6013 -408 1933 2416 2865 -80 -646
1431f46N920o273K915L387l887p94M276m692l85K883O33j210j424N850r553M295
$$ -646 5274 -999 1916 5303 1416 622 4898 206 -179 2704 3337 2127 703 6553 -3000 1295
1447A295K511o656M858l21L20l150L040j610m158L758J416m616L838J388o468
$$ 1295 3806 -2850 2008 1687 2007 -1143 1897 287 -3871 -113 1303 -3313 525 1913 -4555
1462d555M008j576q4k613M977k3o668Q745o022o21K641j220m19M68M078l612k016
$$ -4555 -547 -2123 -2207 -4820 157 134 -6534 2211 -3811 -4432 -1791 -3011 -3430 -2962 1116 -2496 -4512
1479d512M201k400l306R149o475R80M794m555K231l688N803m113Q30O306o675
$$ -4512 -311 -2711 -6017 3132 -3343 -2363 2431 -2124 107 -3581 2222 -1891 -1061 5245 -1430
1494a430K288K910m004l24M251k259J073M44K121m222L56N457p915N240L22j402
$$ -1430 858 3768 -236 -560 3691 1432 2505 2949 5070 848 1204 6661 -1254 3986 4308 2906
1510B906K33J007J23o004O465j530k745L485k3l607K226k92k529n1J770K040p115
$$ 2906 3139 4146 4269 -1735 4730 3200 455 3940 3917 310 2536 2244 -285 -336 1434 3474 -3641
1527c641P687m056m831P452o205J803N93J304j736j832L123k881k503N391k093
$$ -3641 4046 -10 -4841 2611 -3594 -1791 -1198 106 -1630 -3462 -339 -3220 -5723 -332 -2425
1542b425l508P497n846N53J136p82o14q63O076n707J677K051k753p71L043k45
$$ -2425 -5933 1564 -4282 -3729 -2593 -3375 -3989 -4852 1224 -4483 -2806 -755 -3508 -4279 -1236 -1481
1558a481k769N407j465k201J277K052m508L213K354l284L039p43J639n517N120
$$ -1481 -4250 1157 -308 -2509 -1232 820 -3688 -475 1879 -1405 1634 891 2530 -2987 2133
1573B133L20m847P377k821j741K342L7k362R87Q15O76k151L409K77p273P879m429
$$ 2133 2453 -2394 4983 2162 421 2763 2800 438 1425 2240 2916 765 4174 4451 -2822 5057 628
1590F28j217M404j900n1r49K586m263M46K390j106j881L577j042m023M261k395
$$ 628 -589 3815 1915 1864 915 3501 -762 -316 2074 968 -913 2664 1622 -2401 1860 -535
1606e35j582J322L064m473J860J855n197L029j408J696k956K838J557n440M537
$$ -535 -2117 -795 2269 -2204 -344 1511 -3686 -657 -2065 -369 -3325 -487 1070 -4370 167
1621A67r40m047L454J777m358M159j499m14p46j59L760o699P138j111m047M832
$$ 167 -773 -4820 -1366 411 -3947 212 -1287 -1701 -2447 -2606 1154 -5545 1593 482 -3565 1267
1637A267j940j200J024J789k011J707Q90L09l506L418j32l609N720k278l73N81
$$ 1267 -673 -1873 -849 940 -1071 636 1526 1835 -1671 1747 1615 -1994 3726 1448 1075 1656
1653A656K362l976N24L935m867L116M79j26k056J459M35k553J702J851k792L23
$$ 1656 4018 42 566 4501 -366 2750 3229 3103 1047 2506 2941 388 2090 3941 1149 1472
1669A472M076p430M059K83l159K839k302L269m202K199Q29n140L087J932m438
$$ 1472 5548 -1882 2177 2460 -699 2140 -162 3107 -1095 1104 1933 -3207 -120 1812 -2626
1684b626K557J440m853L348j600N52k140J722K103n430M919j982k024J359J290
$$ -2626 -69 1371 -3482 -134 -1734 -1182 -3322 -1600 503 -4927 -8 -1990 -4014 -2655 -1365
1699a365k813J166K885l260R31K84N8j877L500r02j279K156p1n14j931M898n056
$$ -1365 -4178 -3012 -127 -3387 -2456 -2172 -2114 -3991 -491 -1393 -2672 -516 -587 -1101 -3032 1866 -3190
1716c190K512L227m211K477k91L68j377J815M22j074L76L223m078J86M851o214
$$ -3190 -678 2549 -1662 815 524 892 -485 1330 1752 678 1054 4277 199 385 5236 -978
1732i78M010j83r49Q70j96J339l766K386N82j547J87K495l684J025K151m008J634
$$ -978 3032 2849 1900 2770 2574 3913 147 2533 3115 1568 1755 4250 566 1591 3742 -266 1368
1749A368k3P98k653K832j274k204K182j300O4j600M120l806n2K800m022R04J501
$$ 1368 1345 2143 -510 2322 1048 -1156 1026 -274 -210 -1810 2310 -1496 -1548 1252 -2770 -1866 -365
1766c65j014j633K639j428K93j412J977j511j654N790n750K420J153k492J173
$$ -365 -1379 -3012 -373 -1801 -1508 -2920 -943 -2454 -4108 1682 -4068 -1648 -495 -2987 -1814
1781a814K72L16j145J555K61m40j384L634l516O85L179l544K657j98N29k352K283
$$ -1814 -1542 -1226 -2371 -816 -555 -995 -2379 1255 -2261 -1576 1603 -1941 716 518 1047 -1305 978
1798I78j41j441K451j071O15j337K739k235m69K353j447n02K486j227k535M194
$$ 978 837 -604 1847 776 1391 54 2793 558 89 2442 995 493 2979 1752 -783 3411
1814C411l244J164o9j88J235l171M379l872j58K691k460n90K591j599o54J384
$$ 3411 167 1331 1262 1074 2309 -862 3517 -355 -513 2178 -282 -872 1719 120 -534 850
1830H50j821J333k552L751k734q22L499m213J852L2l20j440J938m2j539J295k44
$$ 850 -971 362 -2190 1561 -1173 -1995 1504 -2709 -857 -825 -1145 -2585 -647 -689 -2228 -933 -1177
1847a177q83l64K671k649R06Q99l36q62P37J242l714M420j770o72J993j135R04
$$ -1177 -2060 -2424 247 -2402 -1496 -597 -933 -1795 -1058 184 -3530 890 -880 -1552 441 -694 210
1864B10j550K251j251k52K041K06k828L420j026j923L748l057K144j197J419l10
$$ 210 -1340 911 -340 -592 1449 1655 -1173 2247 1221 -702 3046 -11 2133 936 2355 2045
1880B045k016L464k519L74J204j99j540K078j130n69Q76l35K83j711L227l443
$$ 2045 29 3493 974 1348 2552 2353 813 2891 1761 1192 2068 1733 2016 305 3532 89
1896H9J216O14j629M44o05J812k937K444j009j503Q00L44n50r49J835k058J083
$$ 89 1305 1919 290 734 129 1941 -996 1448 439 -1064 -264 80 -470 -1419 416 -1642 -559
1913e59r89R48k371J652J082l433L352j989N86m42N08l68q92K082j482J13L89
$$ -559 -1548 -600 -2971 -1319 -237 -3670 -318 -2307 -1721 -2163 -1655 -2023 -2915 -833 -2315 -2202 -1813
1930a813Q01k273K578q13o53J227l80R66j830L005k148M96J410j057O41k86J679
$$ -1813 -1012 -3285 -707 -1520 -2173 -946 -1326 -360 -2190 815 -1333 -837 573 -484 157 -129 1550
1947A550k145J812j2p73M48J392q36o55K416k499J310n02J264j481Q88J252l075
$$ 1550 -595 1217 1205 432 880 2272 1436 781 3197 698 2008 1506 2770 1289 2177 3429 354
1964C54K711j335K46o17J011n20r33J664j403l04j96J221k368K309j079j051J013
$$ 354 3065 1730 1976 1359 2370 1850 917 2581 1178 874 678 1899 -469 1840 761 -290 723
1981G23j246J109k464K797j920j60J490j908J4J18P59k154J664m39L66j145R68
$$ 723 -523 586 -1878 919 -1001 -1161 329 -1579 -1565 -1447 -688 -2842 -1178 -1617 -1251 -2396 -1428
1998a428q69j155L223l024J421j87P25o49n44J630k158J954o3n5o22J750j398
$$ -1428 -2297 -3452 -229 -3253 -1832 -2019 -1294 -1943 -2487 -857 -3015 -1061 -1124 -1179 -1801 -51 -1449
2015a449L5J129o21P59n25K177k619K113p1j469J940j080J640j881K216n98r79
$$ -1449 -1414 -285 -906 -147 -672 1505 -1114 999 928 -541 1399 319 1959 78 2294 1696 717
2032G17P75J88o02Q14R08k351K558j753J049j037J78J333k656L281k110k93N29
$$ 717 1492 1680 1078 1892 2800 449 3007 1254 2303 1266 1444 2777 121 3402 1292 999 1528
2049A528k25p88L65O93j444R44q70N67j811J985r99p34J474j637P61j205J528
$$ 1528 1303 515 880 1573 129 1073 203 770 -1041 944 -55 -789 685 -952 -191 -1396 132
2066A32k285R24R86j403J130q42M08j343J237n85j71J86Q92r76j78J734l001K770
$$ 132 -2153 -1229 -243 -1646 -516 -1358 -950 -2293 -1056 -1641 -1812 -1626 -734 -1710 -1888 -154 -3155 -385
2084c85r30O1L59k45J253k000J846o43m4M65J183j704J058P65j874K039j485J694
$$ -385 -1315 -1254 -895 -1140 113 -1887 -41 -684 -728 -263 920 -784 274 1039 -835 1204 -281 1413
2102A413j183J264N8j423J397q59N56m96J610j939J400K63j244O34q04J015j295
$$ 1413 230 1494 1552 129 1526 667 1223 727 2337 398 1798 2061 817 1451 647 1662 367
2119C67J498r44K67n47N45r13p12K598l005J840m49j079L37k41K29j158J131k56
$$ 367 1865 921 1188 641 1186 273 -439 2159 -846 994 545 -534 -197 -438 -209 -1367 -236 -492
2137d92J82r86J642k349P62Q92k254K576j590J006j286N27rr15J254k41Q6o68
$$ -492 -310 -1296 346 -2003 -1241 -349 -2603 -27 -1617 -611 -1897 -1370 -1379 -2294 -1040 -1281 -1195 -1863
2155a863J972k326J045O16j182J012r1R67j518J679j095M39R4O96L11j636L131
$$ -1863 109 -2217 -1172 -556 -1738 -726 -817 150 -1368 311 -784 -345 -251 445 756 -880 2251
2172B251k490P18N42p06L29P97J6m38R36q96J152k023K457j494k28K551l122J791
$$ 2251 -239 479 1021 315 644 1441 1457 1019 1955 1059 2211 188 2645 1151 923 3474 352 2143
2190B143n69r8m43N35K9m78K67m9q9j822K568k310P96R39j612O09p07P90j842
$$ 2143 1574 1476 1033 1568 1597 1119 1386 1337 1248 -574 1994 -316 480 1419 -193 416 -291 499 -1343
2209a343J528r49L33k25j60L5j465K157j634J09Q02k89p45R57q36q54J939j901
$$ -1343 185 -764 -431 -656 -816 -781 -2246 -89 -1723 -1614 -812 -1101 -1846 -889 -1725 -2579 -640 -2541
2227b541J778j503J271J57j746K402k166P88J014j68p38J471j267O09J06n60J573
$$ -2541 -763 -2266 -995 -838 -2584 -182 -2348 -1560 -546 -714 -1452 19 -1248 -639 -533 -1093 480
2244D80j924K959j569l49J393j181L88L98O43j053J767j231M19m32M93O12j170
$$ 480 -1444 1515 -54 -403 990 -191 197 595 1238 185 1952 721 1140 708 1201 1813 643
2261F43J755j314L41N5K87j358J227R7j252K289k146J067j217O42j09j442J862
$$ 643 2398 1084 1425 1480 1767 409 1636 1733 481 2770 624 1691 474 1116 1007 -435 1427
2278A427p24q31O04K96k141K055j237l41J507j559J606k357J707j167n20J361
$$ 1427 703 -128 476 772 -1369 686 -551 -892 615 -944 662 -1695 12 -1155 -1675 -314
2294c14n37o26M65N85k215K296j319L88M16l62M92j050J399j181L10p4J170j171
$$ -314 -851 -1477 -1012 -427 -2642 -346 -1665 -1277 -861 -1223 -731 -1781 -382 -1563 -1253 -1327 -157 -1328
2312a328J247L32k257K584j791J076p7M23K21n62Q49k14l61J15J813k535K289
$$ -1328 -81 251 -2006 578 -1213 -137 -214 209 430 -132 717 503 142 257 2070 -465 1824
2329A824m86j273K108j679J204q93J054n62k8L54K77q45K59R13k164K186j053
$$ 1824 1338 65 2173 494 1698 805 1859 1297 1269 1623 1900 1055 1314 2227 63 2249 1196
2346A196Q2k0k70N1p93J394j481P40l77K79j140K48J015k373J635o73j62l3L73
$$ 1196 1278 1258 988 1039 246 1640 159 899 522 801 -339 -91 924 -1449 186 -487 -649 -682 -309
2365c09r01L04L4p87J062j292J816k628J469L96k037J927q91L73k51M45o98M29
$$ -309 -1210 -906 -872 -1659 -597 -1889 -73 -2701 -1232 -836 -2873 -946 -1837 -1464 -1715 -1270 -1968 -1539
2383a539j22P09p05K21J368k410K257p00l92Q35j00K53o98J859j212O08k70P17
$$ -1539 -1661 -952 -1657 -1436 -68 -2478 -221 -921 -1313 -478 -578 -325 -1023 836 -376 232 -38 679
2401F79n94N07J112j719J461p22J55k61J202q67J32J034j316J185j241J365j458
$$ 679 85 592 1704 -15 1446 724 879 618 1820 953 1085 2119 803 1988 747 2112 654
2418F54R57L76j437J212l62k65m00R09j349Q24j19l20J69j070J716k185J294m01
$$ 654 1611 1987 550 1762 1400 1135 735 1644 295 1119 1000 680 849 -221 1495 -690 604 203
2436B03m95M34j21l23o76J057j347Q59m42N45j223L61O20j387J182o87M28n28
$$ 203 -292 142 21 -302 -978 79 -1268 -409 -851 -306 -1529 -1168 -548 -1935 -753 -1440 -1012 -1540
2454a540R63q71j15J009j198R28o42J092r63Q83j95p56R72K12j46o34J649j176
$$ -1540 -577 -1448 -1563 -554 -1752 -824 -1466 -374 -1337 -454 -649 -1405 -433 -221 -367 -1001 648 -528
2472e28P39j05j07M26o29J579j585J338J30o96J72M71j32l10J106j269Q82k58
$$ -528 211 106 -1 425 -204 1375 -210 1128 1258 562 734 1205 1073 763 1869 600 1482 1224
2490A224J84o97K82Q41j392J479r64L08n70P02n66l64J114j431N42n68Q32j303
$$ 1224 1408 711 993 1834 442 1921 957 1265 695 1397 831 467 1581 150 692 124 956 -347
2508c47M62P0m99O44n56J81j271J812k004P09O9l09L26p31J144j445J072l41o65
$$ -347 115 185 -314 330 -226 -45 -1316 496 -1508 -799 -730 -1039 -713 -1444 -300 -1745 -673 -1014 -1679
2527a679k9Q97l82n28J427j658J125n15P98o59mJ141j656J715o48K52j82O54l07
$$ -1679 -1708 -811 -1193 -1721 -294 -1952 -827 -1342 -544 -1203 -1207 -66 -1722 -7 -655 -403 -585 69 -238
2546b38M4N90p84P24l93J234j505J563k44p65J022o00Q84j146J451j057L21N19
$$ -238 -194 396 -388 336 -57 1177 -328 1235 991 226 1248 648 1532 386 1837 780 1101 1620
2564A620m71J25k47M85j065J079l91N6n95N57j83r23J525j698J130o47J01l92
$$ 1620 1149 1274 1027 1512 447 1526 1135 1191 596 1153 970 47 1572 -126 1004 357 458 66
2582F6j40O77j389J092o97r2j17R53j255q9L46o59Q19j053J220j392Q23N0j127
$$ 66 -74 603 -786 306 -391 -483 -600 353 -902 -991 -645 -1304 -485 -1538 -318 -1710 -887 -837 -1964
2601a964J101m17J12m66J114j027N16J0J19Q5m01J132j303J215m28J32NK86Qo51
$$ -1964 -863 -1280 -1168 -1634 -520 -1547 -1031 -1021 -902 -817 -1218 -86 -1389 -174 -602 -470 -465 -179 -171 -822
2621h22J688j313J169n08M54l34j87J235j007P63o11O92p33J318q48j8Q76j219
$$ -822 866 -447 722 214 668 334 147 1382 375 1138 527 1219 486 1804 956 938 1814 595
2639E95J170j184R40p14J52M78p15L99j46o4q84J265j313Q35j08m15J82q71J045
$$ 595 1765 581 1521 807 959 1437 722 1121 975 911 27 1292 -21 814 706 291 473 -398 647
2658F47j226N55k57k9p4K50k15o97J234j484Q25m33N6j23j40M07l59J74j59K99
$$ 647 -579 -24 -281 -310 -384 -134 -349 -1046 188 -1296 -471 -904 -848 -971 -1111 -704 -1063 -889 -1048 -749
2678g49q16J185q22O6O47q11Q41o76O62k87J4L45r9j03L95L30j097J849j424P25
$$ -749 -1565 -380 -1202 -1136 -489 -1300 -459 -1135 -473 -760 -746 -401 -500 -603 -208 122 -975 874 -550 175
2698A75K99m39N89m89O78m51N38j26K32m93O88j48n52J037j064R98k84m1k6l46
$$ 175 474 35 624 135 813 362 900 774 1006 513 1201 1053 501 1538 474 1472 1188 1147 1121 775
2718G75N12n17M68m88P60j414J343o11o69J140j543R67m35j3m7j60o27N31m94
$$ 775 1287 770 1238 750 1510 96 1439 828 159 1299 -244 723 288 275 228 68 -559 -28 -522
2737e22l7Q27j836J845j294j45P13p17O48n52L00l84L43o62O35q38Q77J00j168
$$ -522 -559 268 -1568 277 -1017 -1162 -449 -1166 -518 -1070 -770 -1154 -811 -1473 -838 -1676 -799 -699 -1867
2756a867J676j165K71R9Q6j71M31J62j67N70r20J301r55O32J48p25J260o87M23
$$ -1867 -191 -1356 -1085 -986 -900 -1071 -640 -478 -645 -75 -995 306 -649 -17 131 -594 666 -21 402
2775D02k54N06n93R63o80O52j39n92J660k166J516r0m87P29k62j24N7J71o34P15
$$ 402 148 654 61 1024 344 996 857 265 1925 -241 1275 1185 698 1427 1165 1041 1098 1269 635 1350
2795A350j042J297r66j05Q38j440J210p23j53J33L02o34N21p40n1P14j350J546
$$ 1350 308 1605 639 534 1372 -68 1142 419 266 399 701 67 588 -152 -203 511 -839 707
2813G07j343L27O32j167L82j30j86OM36j065R73p99K81K87j121J415j275O90K59
$$ 707 -636 -309 323 -844 -462 -592 -778 -772 -336 -1401 -428 -1227 -946 -659 -1780 -365 -1640 -950 -691
2832f91m93OL84m84J11P43r91J380j198P63j49m62J052q31P29n4p0k5O71r32O40
$$ -691 -1184 -1178 -794 -1278 -1167 -424 -1415 -35 -1233 -470 -619 -1081 -29 -860 -131 -185 -255 -280 391 -541 99
2853I9N90q04J136j073J278q63J85M78o40M32L58J15p15J231j676J337l88k90
$$ 99 689 -115 1021 -52 1226 363 548 1026 386 818 1176 1291 576 1807 131 1468 1080 790
2871G90O84r33J125j045PK79k32j94O13p35m8R20j705J227j140O74O6q45Q40q59
$$ 790 1474 541 1666 621 628 907 675 481 1094 359 311 1231 -474 753 -387 287 353 -492 348 -511
2891e11J41P2R1p92Q87o99L8M58q72O52r41R05n86L56O6q2k8qL63j125J659j226
$$ -511 -370 -298 -207 -999 -112 -811 -773 -315 -1187 -535 -1476 -571 -1157 -801 -735 -817 -845 -853 -490 -1615 44 -1182
2913a182O64m3l41Q34n77M73k26J53J43O46r50Q68q8o67J458j547J141j18j51
$$ -1182 -518 -561 -902 -68 -645 -172 -398 -245 -102 544 -406 462 374 -293 1165 -382 759 641 490
2932D90N63n98O25m83K72J5M93j111J452j140l7R41j124Q91r26J052p73J60r4
$$ 490 1053 455 1080 597 869 884 1377 266 1718 578 541 1482 358 1249 323 1375 602 762 668
2951F68j4k73j02M75j060J405j265L05N7l25J87n44O08p77Q01q35K99p08N54J58
$$ 668 654 381 279 754 -306 1099 -166 139 196 -129 58 -486 122 -655 146 -689 -390 -1098 -544 -386
2971c86j366J714j236L40R4j69j35J50J48m99M58m22J036j468J452o38n66J086
$$ -386 -1752 -38 -1274 -934 -840 -1009 -1144 -994 -846 -1345 -887 -1309 -273 -1741 -289 -927 -1493 -407
2989d07o95O12j31L08m79M30P0L13j33K6P91j317J485j013L53L99j81L8N0Q52
$$ -407 -1102 -490 -621 -313 -792 -362 -292 21 -112 -86 705 -612 873 -140 213 612 431 469 519 1371
3009A371j279J025n31Q18o74N33K34j199J148o27K68j13J26m34M17l36k23L18
$$ 1371 92 1117 586 1404 730 1263 1497 298 1446 819 1087 974 1100 666 1083 747 524 842
3027H42o59R63j450J130j33j097R70p42L69l57L05p06O87n33j40K13m58Q06j239
$$ 842 183 1146 -304 826 693 -404 566 -176 193 -164 141 -565 122 -411 -551 -338 -796 10 -1229
3046a229J057p34N8J00k69p3k23Q02q25Q77l30l5k16J83J38m69R20m90J32J50
$$ -1229 -172 -906 -848 -748 -1017 -1090 -1313 -511 -1336 -459 -789 -824 -1040 -857 -719 -1188 -268 -758 -626 -476
3066d76N28q60M65M69p29J119r05R66o53O25k18k94P99m51L27k11P37q63N48p3
$$ -476 52 -808 -343 126 -603 516 -389 577 -76 549 331 37 836 385 712 501 1238 375 923 850
3086H50o2K14k72P43j192J033p71L46J75l51J35n32P68j010Q33l86j44m85N24
$$ 850 788 1002 730 1473 281 1314 543 889 1064 713 848 316 1084 74 907 521 377 -108 416
3105D16K7o49O89r68N69m12K64m08P6J89m28M02o73O16q57R60o49m8M30m88J78
$$ 416 443 -206 483 -485 84 -328 -64 -472 -396 -207 -635 -233 -906 -290 -1147 -187 -836 -884 -454 -942 -764
3126g64n61R25j079R07k45o1L3j3N42q91R74o41M0M65j08J37j23N34o56Q41m40
$$ -764 -1325 -400 -1479 -572 -817 -878 -845 -858 -316 -1207 -233 -874 -834 -369 -477 -340 -463 71 -585 256 -184
3147a84O92o64M58L56q33J276q46M45j31M15k25n0K48m05N70n48Q56r45R95m81
$$ -184 508 -156 302 658 -175 1101 255 700 569 984 759 709 957 552 1122 574 1430 485 1480 999
3167I99l28N93p55O24l94K98m57M04k03j21m3l21O43j111J056o63j07Q8k07o2
$$ 999 671 1264 509 1133 739 1037 580 984 781 660 617 296 939 -172 884 221 114 202 -5 -67
3187f7RL52j153R30q40O42p62L38L04r95J159r71O1J30L09o41P20k54m01O19o59
$$ -67 -58 294 -859 71 -769 -127 -889 -551 -247 -1242 -83 -1054 -993 -863 -554 -1195 -475 -729 -1130 -511 -1170
3208a170P45r57O78p7m22N69j70J70M0M70p33J076o20j66O31m67Q19q48R91k70
$$ -1170 -425 -1382 -704 -781 -1203 -634 -804 -634 -594 -124 -857 219 -401 -567 64 -403 416 -432 559 289
3228B89j38K50L01m01K17M87j143J401j113P06O7m15O54p74Q37m49k40k4O96j096
$$ 289 151 401 702 301 518 1005 -138 1263 150 856 923 508 1162 388 1225 776 536 512 1208 112
3248A12Q33j48o39P31r97Q64m56J87O9m49K03j50j7o47J054j389R62l63k86M33
$$ 112 945 797 158 889 -108 756 300 487 556 107 310 160 143 -504 550 -839 123 -240 -526 -93
3268i3m29K77m96P60o18j1j22K78m44j04J004j592J415p47J53L04l43L36k17J20
$$ -93 -522 -245 -741 19 -599 -610 -732 -454 -898 -1002 2 -1590 -175 -922 -769 -465 -808 -472 -689 -569
3288e69K9L85p71J361j290O04L51r60J393j071P06K4k49K30jO6J03Mm64J180j226
$$ -569 -540 -155 -926 435 -855 -251 100 -860 533 -538 168 192 -57 173 172 238 341 345 -119 1061 -165
3309a65R93J06o22Q11o90N19n60M45l14M94m34L15k61m06J418j862J125j70l42
$$ -165 828 934 312 1123 433 952 392 837 523 1017 583 898 637 231 1649 -213 912 742 400
3328D00K22m4k94q0R2m71P40j139J165j052P1O90j116R22o07Kq8K15o27N37l54
$$ 400 622 578 284 204 296 -175 565 -574 591 -461 -390 300 -816 106 -501 -499 -587 -372 -999 -462 -816
3349h16j33N33j112J404j093M70K61r16P10Mlm70P63m83P26p39M84J25o95J349
$$ -816 -949 -416 -1528 -124 -1217 -747 -486 -1402 -692 -688 -691 -1161 -398 -881 -155 -894 -410 -285 -980 369
3369C69j010L27N31n04J91L01m83M18K71n35J138j170J097k95m14Q69j012P57
$$ 369 -641 -314 217 -287 -96 205 -278 140 411 -124 1014 -156 941 646 232 1101 89 846
3387H46p9N3l66N69n22O82l30o62J031j082J102o58j31M07l84J45q4j63m15J040
$$ 846 767 820 454 1023 501 1183 853 191 1222 140 1242 584 453 860 476 621 537 374 -41 999
3407I99j020N12n25k8M66j069P17j96J22j17j31l40P92p60n0O63j268J405j083
$$ 999 -21 491 -34 -62 404 -665 52 -144 -22 -139 -270 -610 182 -578 -628 35 -1233 172 -911
3426i11K68K73o97P28l24k05M15q3m89J121j131M70K86n07R49j017O70n2j16K92
$$ -911 -643 -370 -1067 -339 -663 -868 -453 -536 -1025 96 -1035 -565 -279 -786 163 -854 -184 -236 -352 -60
3446f0j71k42M55J54n34J171j149O59J58k31M39o60P63l27j5r0M93n65P22m22
$$ -60 -231 -473 -18 136 -398 773 -376 283 441 210 649 -11 752 425 410 320 813 248 970 548
3466E48l92J032j020O76l54l1L63l74J3J77k32l12P97j119Q95n48l24P77r97P65
$$ 548 156 1188 168 844 490 459 822 448 461 638 406 94 891 -228 667 119 -205 572 -425 340
3486C40o14J15J18j53k81L38l58J37K61r26J096j044K74J57m45M01l23M10j71
$$ 340 -274 -159 -41 -194 -475 -137 -495 -358 -97 -1023 73 -971 -697 -540 -985 -584 -907 -497 -668
3505f68M0m70Q45p87N92J92p75P96p23N81n4Q7k1K35k11K46J54m27J022j165R08
$$ -668 -628 -1098 -253 -1040 -448 -256 -1031 -235 -958 -377 -431 -344 -365 -130 -341 -95 59 -368 654 -511 397
3526C97j79l36Q09n95K93PN2l04Q04p90O88j08l70Q89j048Q46l61k38J82l3j54
$$ 397 218 -118 691 96 389 396 448 144 948 158 846 738 368 1257 209 1055 694 456 638 605 451
3547D51J73lj65M59q73P25n96L3O12r53O95l58O5k93L79n54L14j75j74L23q32
$$ 451 624 621 456 915 42 767 171 204 816 -137 558 200 265 -28 351 -203 111 -64 -238 85 -747
3568g47Q47q29L39J0o02M43j15K01m56N37m89M28n26K95J07m31Q45r45P64j6k95
$$ -747 100 -729 -390 -380 -982 -539 -654 -453 -909 -372 -861 -433 -959 -664 -557 -988 -143 -1088 -324 -340 -635
3589f35N3J61oo6N17n04O15o14O00o1m5L41l85M08k72K43l78Q93n71L21J14n35
$$ -635 -582 -421 -427 -493 24 -480 135 -479 121 60 15 356 -29 379 107 350 -28 865 294 615 729 194
3611A94O96o79P07l92J54R8K7p0o9J89p33J026o32K67k77O0L6n35O93p45M27k25
$$ 194 890 211 918 526 680 778 805 735 666 855 122 1148 516 783 506 566 602 67 760 15 442 217
3633B17K96o62J79N6l07L40m45L56n12O08n65J26N0m49L00n00N81l01K69j91j45
$$ 217 513 -149 30 86 -221 119 -326 30 -482 126 -439 -313 -263 -712 -412 -912 -331 -632 -363 -554 -699
3654f99J72m07N15m69P42p85N37m9k76J27n8N92p60P52m58L39j27J97M2q0N78
$$ -699 -527 -934 -419 -888 -146 -931 -394 -443 -719 -592 -650 -58 -818 -66 -524 -185 -312 -115 -73 -153 425
3675D25o73M06k33M96k64J03K13m07O11k58Mk44O01n23R8M22n39P23l23K1l12
$$ 425 -248 158 -75 421 157 260 473 66 677 419 423 179 780 257 355 777 238 961 638 659 347
3696C47L94l10J07o6j46K85o59R98j150Q43l74k84L10j81L42o47L14l45J21l66
$$ 347 741 431 538 472 326 611 -48 950 -200 643 269 -15 295 114 456 -191 123 -222 -101 -467
3716d67M79n00p3Q82j175P10m09K05k65N0qp9K74n59P51q00P75m93n9N48p25N92
$$ -467 12 -488 -561 321 -854 -144 -553 -348 -613 -563 -571 -650 -376 -935 -184 -984 -209 -702 -761 -213 -938 -346
3738c46o0N8l87N96l34L46k95P6N40q84R74n44M00J63k32nR1J14j57O10m82M24
$$ -346 -406 -348 -735 -139 -473 -127 -422 -346 194 -690 284 -260 140 303 71 66 157 271 114 724 242 666
3760F66m61M03K63o10N73o35M78jJ21l02K14j68k69O29p00O87q02N97m21k18O49
$$ 666 205 608 871 261 834 199 677 676 797 495 709 541 272 901 201 888 86 683 262 44 693
3781F93n96O8J82j07j71L78o26L07l08k24O38r42Q06n32j74L11m69K31J60j59
$$ 693 97 165 347 240 69 447 -179 128 -180 -404 234 -708 98 -434 -608 -297 -766 -535 -375 -534
3801e34l62P03p94O68m79L55J77p99Q23n97J69K00K42n86N49j47k90P52q97J029
$$ -534 -896 -193 -987 -319 -798 -443 -266 -1065 -242 -839 -670 -470 -228 -814 -265 -412 -702 50 -847 182
3821A82m42L21P7l94N65k72K6J85K32o77R63n45K09L86o56Q63r20N45J19l70J66
$$ 182 -260 61 138 -256 309 37 63 248 480 -197 766 221 430 816 160 1023 103 648 767 397 563
3842E63L05n55M09J18q10J335j203N38K2m37M34m64N21o25m4Q7M31j017J024m88
$$ 563 868 313 722 840 30 1365 162 700 722 285 719 255 776 151 107 194 625 -392 632 144
3862A44n28J094j260O47k83j29K02l03J68k79J89k27M97j019J073n82l80Q56p67
$$ 144 -384 710 -550 97 -186 -315 -113 -416 -248 -527 -338 -565 -68 -1087 -14 -596 -976 -120 -887
3881h87M15j19K00l54J95l1J41m36L85O98j127J109o04o6O72o66K45J29m5oN80
$$ -887 -472 -591 -391 -745 -550 -581 -440 -876 -491 207 -920 189 -415 -481 191 -475 -230 -101 -146 -152 428
3902D28o95P88q89Q70pq39J304r87N60M8o2j98J58j10pJ37m14J058j138R91l68
$$ 428 -267 521 -368 502 495 -344 960 -27 533 581 519 321 479 369 362 499 85 1143 5 996 628
3923F28m29Q04m36k64K90k33m38Q07r73O62l08j84N79j125R41k60l75L66l96l0
$$ 628 199 1003 567 303 593 360 -78 729 -244 418 110 -74 505 -620 321 61 -314 52 -344 -374
3943c74L24l06n71J110r94Q87q84M0N84p03Q54n12l90M95J31q61J046m83O9N08
$$ -374 -50 -356 -927 183 -811 76 -808 -768 -184 -887 -33 -545 -935 -440 -309 -1170 -124 -607 -538 -30
3963c0j136J467r94J89O22p11O25j97j26K17O31j031R48o13K62J58m69R99j028
$$ -30 -1166 301 -693 -504 118 -593 32 -165 -291 -74 557 -474 474 -139 123 281 -188 811 -217
3982b17O40J02l50J43L87l00K25K27q59J143q89M24r9k39P21q92M20K19l19k27
$$ -217 423 525 175 318 705 405 630 857 -2 1141 252 676 577 338 1059 167 587 806 487 260
4002B60N61r20P16j84n24P51p00O63o70K40k95m1oL24m85j19P75j337R72l10k14
$$ 260 821 -99 617 433 -91 660 -40 623 -47 193 -102 -143 -149 175 -310 -429 346 -991 -19 -329 -543
4023e43O15p72L97j98m7oJ66p77Q86m64j37R44j319J248o81K11Q2j83K59J5P8
$$ -543 72 -700 -303 -501 -548 -554 -388 -1165 -279 -743 -880 64 -1255 -7 -688 -477 -395 -578 -319 -304 -226
4044b26K3K43o43J011q35L13O16r88R29o24L73L6J71j26K20m0R9O8m53R34j009
$$ -226 -203 40 -603 408 -427 -114 502 -486 443 -181 192 228 399 273 493 453 552 620 167 1101 92
4065I2M79J41l64L61k80jq9O48p75M89m39M28k36n60R73r92N66k27j37O6O0k16
$$ 92 571 712 348 709 429 428 339 987 212 701 262 690 454 -106 867 -125 441 214 77 143 203 -13
4087a3O8L00p74N09l69M81n02k76O35p82N38l01J34j57K24m98M28n4k63K63m57
$$ -13 55 355 -419 90 -279 202 -300 -576 59 -723 -185 -486 -352 -509 -285 -783 -355 -409 -672 -409 -866
4108h66R51p03O8J75m06L78n4N8j99O70n47M61k25l9K59l99Q05p00N78j38M5j94
$$ -866 85 -618 -550 -375 -781 -403 -457 -399 -598 72 -475 -14 -239 -278 -19 -418 387 -313 265 127 172 -22
4130b2L88j71k32Q58r52O16l96M64L3l28M29l76K67n3J02n67P58l40j3J1k81N95
$$ -22 366 195 -37 821 -131 485 89 553 586 258 687 311 578 525 627 60 818 478 465 476 195 790
4152G90p52N32n36M60k57M1J4j50J76p08Q36p09L90k07q9Q4l18K96k90K42m21
$$ 790 38 570 34 494 237 278 292 142 318 -390 446 -263 127 -80 -169 -85 -403 -107 -397 -155 -576
4173e76K60l38M55j98l53N92o48O68n42K81j46j18Q2k06N14m89P00o34N14l10
$$ -576 -316 -654 -199 -397 -750 -158 -806 -138 -680 -399 -545 -663 -581 -787 -273 -762 -62 -696 -182 -492
4193d92J13K55j39L47m37N73l11K78m23K46J92j07N54p83O29l81J79Q6M7N2j41
$$ -492 -379 -124 -263 84 -353 220 -91 187 -236 10 202 95 649 -134 495 114 293 379 426 478 337
4214C37L16m18O22m80M27l99L81q2m17L80n18O26l02jl58K70Q2k79N45p81M32
$$ 337 653 235 857 377 804 405 786 704 287 667 149 775 473 472 114 384 466 187 732 -49 383
4235C83m02K97n43L62p7l43N82o29L51m60M75r9k93R4m86M16k11M52l95J64k40
$$ 383 -19 278 -265 97 20 -323 259 -370 -19 -479 -4 -103 -396 -302 -788 -372 -583 -131 -526 -362 -602
4256f02K07p7j53L77o23O27k86K07j64J96Kk97M22m33P36n59N48k97J0K84k18
$$ -602 -395 -472 -625 -248 -871 -244 -530 -323 -487 -291 -289 -586 -164 -597 139 -420 128 -169 -159 125 -93
4277i3M39k61P0l0K41k07J85r2m8N54p16O35m76L14l0k53M14j85K9j15K75o58
$$ -93 346 85 155 125 366 159 344 252 204 758 42 677 201 515 485 232 646 461 490 375 650 -8
4299hQ74o19J79L1n69O68n09N54n47J80k72L60k39k5M8k56M40q67O51k75k49L94
$$ -8 866 247 426 457 -112 556 47 601 54 234 -38 322 83 58 106 -150 290 -577 74 -201 -450 -56
4321e6l16J65l59J28k53N78j57M9l6n45O75p40M85j21J9J20j10j8L30j42J0K39
$$ -56 -372 -207 -566 -438 -691 -113 -270 -221 -257 -802 -127 -867 -382 -503 -484 -364 -474 -492 -162 -304 -294 -55
4343e5p35J027o01P3M50n15N92k89k3K06L39o09N63m44J35M18o23Q96o14K86M0
$$ -55 -790 237 -364 -291 159 -356 236 -53 -76 130 469 -140 423 -21 114 532 -91 805 191 477 517
4364E17k43J08J30j33o5J45k68M99m91K18L36o14O73o85L47n4j55k08K62j79R
$$ 517 274 382 512 379 314 459 191 690 199 417 753 139 812 127 474 420 265 57 319 140 149
4385A49K95p81Q25j039O52nn16M69m46J40Q8n8j00K48o42O65m14m25Q08q20N85
$$ 149 444 -337 488 -551 101 96 -420 49 -397 -257 -169 -227 -327 -79 -721 -56 -470 -895 -87 -907 -322
4406c22J3l36L32k02k16L56r0l54R33r38Q55k22l20M83n11L62J16N2r0K78n51
$$ -322 -309 -645 -313 -515 -731 -375 -465 -819 114 -824 31 -191 -511 -28 -539 -177 -61 -9 -99 179 -372
4427c72Q92n66KO34r26J055n57M0J84k38K96L8M4o3L39p84R51p69L56J54o49P26
$$ -372 520 -46 -44 590 -336 719 162 202 386 148 444 482 526 463 802 18 969 200 556 710 61 787
4449G87k57n9Q6l89J12L80m30K9Q9m64O80o35L23N1n12K79m03K31q9J21m51O83
$$ 787 530 471 557 168 280 660 230 259 348 -116 564 -71 252 303 -209 70 -333 -102 -191 -70 -521 162
4471A62r12P94l19n72J021q25L71K3m34K19J8l78M67j81k06P33q09P42l78O8L33
$$ 162 -750 44 -275 -847 174 -651 -280 -257 -691 -472 -454 -832 -365 -546 -752 -19 -828 -86 -464 -396 -63
4492f3n53N17j04j03J63J89o00Q03l42p4P33j058R08n12K45K08j61J43Ppo8J75
$$ -63 -616 -99 -203 -306 -143 46 -554 249 -93 -167 566 -492 416 -96 149 357 196 339 346 339 271 446
4514D46n23R04p74L65L36r46J005l76J7J10l87m5K61k04J87K31o10P38j085Q06
$$ 446 -77 827 53 418 754 -192 813 437 454 564 177 132 393 189 376 607 -3 735 -350 456
4534D56p2n09J21J95k64m6J28l51O97p16M0J35m48P15o64L79j48j8J44j33l65
$$ 456 384 -125 -4 191 -73 -119 9 -342 355 -361 -321 -186 -634 81 -583 -204 -352 -370 -226 -359 -724
4555g24L67r1j59O27q51O31k35J08K51o87N26k3j93K18K05l28N56l60q4O78p06
$$ -724 -357 -448 -607 20 -831 -200 -435 -327 -76 -763 -237 -260 -453 -235 -30 -358 198 -162 -246 432 -274
4576b74R24p97K56L03l52l2K44j7RK45o13P84l75n5M45n27M00l16J88p2J27j75
$$ -274 650 -147 109 412 60 28 272 255 264 509 -104 680 305 250 695 168 568 252 440 368 495 320
4598C20N38n27Q2J26m59O80o94K49j10j13K34j90j37J54Ll16L12m50M51j39m47
$$ 320 858 331 413 539 80 760 66 315 205 92 326 136 -1 153 156 -160 152 -298 153 14 -433
4619d33M25n49K35p2K87k13Kl7K0l3m6L32m77L57l39j94L37k2O5jN5j10Q5j64
$$ -433 -8 -557 -322 -394 -107 -320 -318 -355 -335 -368 -414 -82 -559 -202 -541 -735 -398 -420 -355 -356 -301 -411 -326 -490
4643d90L93j37j52L16m74O94l54K78k02J98J02j38K71j07K22m64N11l03J73K20
$$ -490 -97 -234 -386 -70 -544 150 -204 74 -128 70 172 34 305 198 420 -44 467 164 337 557
4663E57l68K94l75K79j45L64k90J45k6n9J53k93L69n06K92j12j22K58r3k50O3
$$ 557 189 483 108 387 242 606 316 461 435 376 529 236 605 99 391 279 157 415 322 72 135
4684A35J93m39L89m40K88Pj70J73o20M30r6O2r5P6k37j07M18l05L17n59N07l83
$$ 135 328 -111 278 -162 126 133 -37 136 -484 -54 -150 -88 -183 -107 -344 -451 -33 -338 -21 -580 -73 -456
4706d56O2K86k93J29l48K99l15M83j22J73l77K50K39n19L81l44L36PJ86j75R2
$$ -456 -394 -108 -401 -272 -620 -321 -636 -153 -275 -102 -479 -229 10 -509 -128 -472 -136 -129 57 -118 -26
4727b6K04l17M41m50M06j58J29J80k66L74m17O79m78L73m15R8j69J13K97l79K78
$$ -26 178 -139 302 -148 258 100 229 409 143 517 100 779 301 674 259 357 188 301 598 219 497
4748D97k36J00j82K12K1k55L45k70M1l95L29k07KM61o04J73r0J88m88M30l58l7
$$ 497 261 361 179 391 412 157 502 232 273 -122 207 0 2 463 -141 32 -58 130 -358 72 -286 -323
4770c23j8J35R8m37M56m53K97j96k8j55P7K76k32L01l72M73k81J92m1k73K30k26
$$ -323 -341 -206 -108 -545 -89 -542 -245 -441 -469 -624 -547 -271 -503 -202 -574 -101 -382 -190 -231 -504 -274 -500
4792e00M25m52L93j87J64j66J28L93n17N30k14J69j73L5L16j24K78m76N18m13
$$ -500 -75 -527 -134 -321 -157 -323 -195 198 -319 211 -3 166 -7 28 344 220 498 22 540 127
4812A27L82m40J93J77k51L30k60O22n56K03m21L09N2j95L13n19N58m45P7j04m1
$$ 127 509 69 262 439 188 518 258 880 324 527 106 415 467 272 585 66 624 179 256 152 111
4833A11P7l0P4j60J31k75M60p29K70Q5k51L81m34K81o5J0k26M0M4r2K82n77M95
$$ 111 188 158 232 72 203 -72 388 -341 -71 14 -237 144 -290 -9 -74 -64 -290 -250 -206 -298 -16 -593 -98
4856i8n84N60k67l19N86m54J81J34M4k79L35m30L73O4j36K16m34N04k29K3M0J00
$$ -98 -682 -122 -389 -708 -122 -576 -395 -261 -217 -496 -161 -591 -218 -154 -290 -74 -508 -4 -233 -210 -170 -70
4878g0j62L10j73j56N77n82O76k08j71M79o70N55k27K08k36L19m15N19k68j35
$$ -70 -232 78 -95 -251 326 -256 420 212 41 520 -150 405 178 386 150 469 54 573 305 170
4898A70K88l23O12q58M92pp0n6J4r1J20J69n94O00n65J38J96o13O07n17L04l19
$$ 170 458 135 747 -111 381 374 304 248 262 171 291 460 -134 466 -99 39 235 -378 229 -288 16 -303
4920c03J54J09j24k87J72J67m65O56n74K94j0j48N7n00K55J43P4k53M71p41O78
$$ -303 -149 -40 -164 -451 -279 -112 -577 79 -495 -201 -211 -359 -302 -802 -547 -404 -330 -583 -112 -853 -175
$$ [...]
8191a2
##END NTUPLES=NMR FID
##END=
