##TITLE=1H_TG-2305-A7
 CDCl3, 8 sc, 
 17.11.2020
##JCAMPDX= 6.0         $$ Bruker NMR JCAMP-DX V2.0
##DATA TYPE= NMR FID
##DATA CLASS= NTUPLES
##ORIGIN= UXNMR, Bruker Analytische Messtechnik GmbH
##OWNER= root
$$ XWIN-NMR		Version 3.5
$$ Tue Nov 17 10:00:04 2020 Russian Standard Time (UT+4h)  she@DPX200
##.OBSERVE FREQUENCY= 200.1315066352
##.OBSERVE NUCLEUS= ^1H
##.DELAY= (6, 6)
##.ACQUISITION MODE= SIMULTANEOUS
##.ACQUISITION SCHEME= undefined
##.AVERAGES= 8
##.DIGITISER RES= 18
##SPECTROMETER/DATA SYSTEM= spect
##.PULSE SEQUENCE= zg30
##.SOLVENT NAME= CDCl3
##.SHIFT REFERENCE= (INTERNAL, CDCl3, 0, 15.7039)
##AUDIT TRAIL= $$ (NUMBER, WHEN, WHO, WHERE, WHAT)
$$ ##TITLE= Audit trail, XWIN-NMR		Version 3.5
$$ ##JCAMPDX= 5.01
$$ ##ORIGIN= Bruker BioSpin GmbH
$$ ##OWNER= she
$$ F:/spectra/data/she/nmr/H-F/1/audita.txt
$$ ##AUDIT TRAIL=  $$ (NUMBER, WHEN, WHO, WHERE, WHAT)
(   1,<2020-11-17 09:58:02.67 +0400>,<she>,<DPX200>,
      <created by zg, POWCHK disabled, PULCHK disabled
       configuration hash MD5:
       00 E9 B6 7A A2 85 ED C7 34 08 36 98 17 FE 4E 26
       data hash MD5: 16K
       9F F5 9C 3C ED 1B AB 58 0F 56 06 12 70 1D 29 EF>)
$$ ##END=
$$ 
$$ hash MD5
$$ 73 74 FA F8 27 DF 98 E4 2B B4 9A 31 82 F7 A9 50
##$RELAX= 
##$RELAX= 
##$RELAX= 
##$RELAX= 
##$RELAX= 
##$RELAX= 
$$ Bruker specific parameters
$$ --------------------------
##$DU= <F:/spectra>
##$EXPNO= 1
##$NAME= <H-F>
##$PROCNO= 1
##$TYPE= <nmr>
##$USER= <she>
##$AMP= (0..31)
100 100 100 100 100 100 100 100 100 100 100 100 100 100 100 100 100 100 
100 100 100 100 100 100 100 100 100 100 100 100 100 100 
##$AQSEQ= 0
##$AQ_mod= 1
##$AUNM= <au_zg>
##$AUTOPOS= <>
##$BF1= 200.13
##$BF2= 200.13
##$BF3= 200.13
##$BF4= 200.13
##$BF5= 200.13
##$BF6= 200.13
##$BF7= 200.13
##$BF8= 200.13
##$BYTORDA= 1
##$CFDGTYP= 0
##$CFRGTYP= 5
##$CHEMSTR= <none>
##$CNST= (0..31)
1 1 145 1 1 1 1 1 1 1 1 1 1 1 1 1 1 1 1 1 1 1 1 1 1 1 1 1 1 1 1 1 
##$CPDPRG= <>
##$CPDPRG1= <>
##$CPDPRG2= <>
##$CPDPRG3= <>
##$CPDPRG4= <mlev>
##$CPDPRG5= <mlev>
##$CPDPRG6= <mlev>
##$CPDPRG7= <mlev>
##$CPDPRG8= <mlev>
##$CPDPRGB= <>
##$CPDPRGT= <>
##$D= (0..31)
0 1.2 0 0 0 0 0 0 0 0.06 0 0.03 0 0 0 0 0.0002 0 0 0 0 0 0 0 0 0 0 0 0 
0 0 0 
##$DATE= 1605592682
##$DBL= (0..7)
120 120 120 120 120 120 120 120 
##$DBP= (0..7)
150 150 150 150 150 150 150 150 
##$DBP07= 0
##$DBPNAM0= <>
##$DBPNAM1= <>
##$DBPNAM2= <>
##$DBPNAM3= <>
##$DBPNAM4= <>
##$DBPNAM5= <>
##$DBPNAM6= <>
##$DBPNAM7= <>
##$DBPOAL= (0..7)
0.5 0.5 0.5 0.5 0.5 0.5 0.5 0.5 
##$DBPOFFS= (0..7)
0 0 0 0 0 0 0 0 
##$DE= 6
##$DECBNUC= <off>
##$DECIM= 32
##$DECNUC= <off>
##$DECSTAT= 4
##$DIGMOD= 1
##$DIGTYP= 9
##$DL= (0..7)
0 120 120 120 120 120 120 120 
##$DP= (0..7)
150 150 150 150 150 150 150 150 
##$DP07= 0
##$DPNAME0= <>
##$DPNAME1= <>
##$DPNAME2= <>
##$DPNAME3= <>
##$DPNAME4= <>
##$DPNAME5= <>
##$DPNAME6= <>
##$DPNAME7= <>
##$DPOAL= (0..7)
0.5 0.5 0.5 0.5 0.5 0.5 0.5 0.5 
##$DPOFFS= (0..7)
0 0 0 0 0 0 0 0 
##$DQDMODE= 0
##$DR= 18
##$DS= 0
##$DSLIST= <SSSSSSSSSSSSSSS>
$$ [...]
##$SUBNAM2= <"">
##$SUBNAM3= <"">
##$SUBNAM4= <"">
##$SUBNAM5= <"">
##$SUBNAM6= <"">
##$SUBNAM7= <"">
##$SUBNAM8= <"">
##$SUBNAM9= <"">
##$SW= 16.9725356469052
##$SWIBOX= (0..15)
0 0 2 0 0 0 0 0 0 0 0 0 0 0 0 0 
##$SW_h= 3396.73913043478
##$TD= 16384
##$TD0= 1
##$TE= 0
##$TE2= 300
##$TE3= 300
##$TEG= 300
##$TL= (0..7)
0 120 120 120 120 120 120 120 
##$TP= (0..7)
150 150 150 150 150 150 150 150 
##$TP07= 0
##$TPNAME0= <>
##$TPNAME1= <>
##$TPNAME2= <>
##$TPNAME3= <>
##$TPNAME4= <>
##$TPNAME5= <>
##$TPNAME6= <>
##$TPNAME7= <>
##$TPOAL= (0..7)
0.5 0.5 0.5 0.5 0.5 0.5 0.5 0.5 
##$TPOFFS= (0..7)
0 0 0 0 0 0 0 0 
##$TUNHIN= 0
##$TUNHOUT= 0
##$TUNXOUT= 0
##$USERA1= <user>
##$USERA2= <user>
##$USERA3= <user>
##$USERA4= <user>
##$USERA5= <user>
##$V9= 5
##$VALIST= <valist>
##$VCLIST= <CCCCCCCCCCCCCCC>
##$VD= 0
##$VDLIST= <DDDDDDDDDDDDDDD>
##$VPLIST= <PPPPPPPPPPPPPPP>
##$VTLIST= <TTTTTTTTTTTTTTT>
##$WBST= 1024
##$WBSW= 4
##$XGAIN= (0..3)
0 0 0 0 
##$XL= 0
##$YL= 0
##$YMAX_a= 201472
##$YMIN_a= -145992
##$ZGOPTNS= <>
##$ZL1= 120
##$ZL2= 120
##$ZL3= 120
##$ZL4= 120
##$ABSF1= 10
##$ABSF2= 0
##$ABSG= 5
##$ABSL= 3
##$ALPHA= 0
##$AQORDER= 0
##$ASSFAC= 0
##$ASSFACI= 0
##$ASSFACX= 0
##$ASSWID= 0
##$AUNMP= <proc_1d>
##$AZFE= 0.1
##$AZFW= 0.1
##$BCFW= 1
##$BC_mod= 2
##$BYTORDP= 1
##$COROFFS= 0
##$CY= 11.3945322036743
##$DATMOD= 1
##$DC= 2
##$DFILT= <>
##$DTYPP= 0
##$F1P= 15.9154993809931
##$F2P= -4.1035820241983
##$FCOR= 0.5
##$FTSIZE= 0
##$FT_mod= 4
##$GAMMA= 1
##$GB= 0.15
##$INTBC= 1
##$INTSCL= 1
##$ISEN= 128
##$LB= 0.24
##$LEV0= 0
##$LPBIN= 0
##$MAXI= 10000
##$MC2= 0
##$MEAN= 0
##$ME_mod= 0
##$MI= 1.114404
##$NCOEF= 0
##$NC_proc= 0
##$NLEV= 6
##$NOISF1= 3.799351
##$NOISF2= 2.8
##$NSP= 1
##$NTH_PI= 0
##$NZP= 0
##$OFFSET= 15.70392
##$PC= 1
##$PHC0= -11052.83
##$PHC1= 18.80089
##$PH_mod= 1
##$PKNL= yes
##$PPARMOD= 0
##$PSCAL= 0
##$PSIGN= 0
##$REVERSE= no
##$SF= 200.130013532006
##$SI= 16384
##$SIGF1= 3
##$SIGF2= 2
##$SINO= 400
##$SIOLD= 16384
##$SREGLST= <1H.CDCl3>
##$SSB= 0
##$STSI= 0
##$STSR= 0
##$SW_p= 3612.71676300578
##$SYMM= 0
##$S_DEV= 0
##$TDeff= 0
##$TDoff= 0
##$TI= <>
##$TILT= no
##$TM1= 0
##$TM2= 0
##$TOPLEV= 0
##$USERP1= <user>
##$USERP2= <user>
##$USERP3= <user>
##$USERP4= <user>
##$USERP5= <user>
##$WDW= 1
##$XDIM= 8192
##$YMAX_p= 0
##$YMIN_p= 0
$$ End of Bruker specific parameters
$$ ---------------------------------
##NTUPLES= NMR FID
##VAR_NAME=  TIME,          FID/REAL,        FID/IMAG
##SYMBOL=    X,             R,               I
##VAR_TYPE=  INDEPENDENT,   DEPENDENT,       DEPENDENT
##VAR_FORM=  AFFN,          ASDF,            ASDF
##VAR_DIM=   8192,          8192,            8192
##UNITS=     SECONDS,       ARBITRARY UNITS, ARBITRARY UNITS
##FACTOR=    0.0002944,     1,               1
##FIRST=     0,             0,               0
##LAST=      2.4114304,     0,               0
##MIN=       0,             -145992,         0
##MAX=       2.4114304,     201472,          0
$$ Real data points
##PAGE= N=1
##DATA TABLE= (X++(R..R)), XYDATA
$$ [...]
2228A127k461K108j454J730k042R48O62k147J970j759K056k176K185j260j57J146
$$ 1127 -1334 774 -680 1050 -992 -44 618 -1529 441 -1318 738 -1438 747 -513 -670 476
2244D76j615J564j726K555k392J493k77q75J029j017J943k588K732j777M94J95
$$ 476 -1139 425 -1301 1254 -1138 355 78 -797 232 -785 1158 -1430 1302 -475 19 214
2260B14n77R88j944L061l024K136p45K41k8n04J577k435K461j933J289q31N79
$$ 214 -363 625 -1319 1742 -1282 854 109 350 322 -182 1395 -1040 1421 -512 777 -54 525
2277E25m9j339K268k298K241j641J465j366mJ213k102K703k356J886j773J400
$$ 525 476 -863 1405 -893 1348 -293 1172 -194 -198 1015 -1087 1616 -740 1146 -627 773
2293G73n92j034J713j863J994j747J993j820Q32j51r67J443j901K433k507K135
$$ 773 181 -853 860 -1003 991 -756 1237 -583 249 98 -869 574 -1327 1106 -1401 734
2309G34j207OP83j240J420k034K665k356J447o74m94P91j124K210k574K458j626
$$ 734 -473 -467 316 -924 496 -1538 1127 -1229 218 -456 -950 -159 -1283 927 -1647 811 -815
2326h15R24n05j5P86k060K949k278J607r81P71l73o44J603k071K073j517J499
$$ -815 109 -396 -411 375 -1685 1264 -1014 593 -388 383 10 -634 969 -1102 971 -546 953
2343I53j262R18J85j648K252j857J697j525J538j180k46J393k108J828j229J935
$$ 953 -309 609 794 -854 1398 -459 1238 -287 1251 71 -175 1218 -890 938 -291 1644
2359A644k250J579n30p00J081j425J897k305K640k087Q28J33j049J317j751K243
$$ 1644 -606 973 443 -257 824 -601 1296 -1009 1631 -456 372 505 -544 773 -978 1265
2375A265k698K211q19l34N18r41J299j893K691k542J529q25MK54j104K236k576
$$ 1265 -1433 778 -41 -375 143 -798 501 -1392 1299 -1243 286 -539 -535 -281 -1385 851 -1725
2392a725K322j322P81n42j57R73j986K616k336J563r39J034p17o79J645j921K138
$$ -1725 597 -725 56 -486 -643 330 -1656 960 -1376 187 -752 282 -435 -1114 531 -1390 748
2409G48j563J407j348J078Rj226J962j671J442j503J911j299K07Q46j305J246
$$ 748 -815 592 -756 322 331 -895 1067 -604 838 -665 1246 -53 154 1000 -305 941
2425I41j398J997k260J963j077K0Q08j434J913k002K067j667Q28p0p91J053j294
$$ 941 -457 1540 -720 1243 166 186 994 -440 1473 -529 1538 -129 699 629 -162 891 -403
2442d03J708k204J984j170M58j90l18J172j958K187k183J446r52M84J18q81J876
$$ -403 1305 -899 1085 -85 373 183 -135 1037 -921 1266 -917 529 -423 61 179 -702 1174
2459A174k472J924j443J591q60l42N38j319J845j755J808j432J215j056N3Q10
$$ 1174 -1298 626 -817 774 -86 -428 110 -1209 636 -1119 689 -743 472 -584 -531 279
2475B79j058J506j999K310k209J616k45j468J371o95J303j685J918j368L82K16
$$ 279 -779 727 -1272 1038 -1171 445 200 -1268 103 -592 711 -974 944 -424 -42 174
2491A74q49J292j352J897j881J201o89o3O02j127J698j775K141j745M65J45l12
$$ 174 -675 617 -735 1162 -719 482 -207 -270 332 -795 903 -872 1269 -476 -11 134 -178
2508a78P01j520K424k049J362j214P83k97l33J223j914K102j534J249j372P40
$$ -178 523 -997 1427 -622 740 -474 309 12 -321 902 -1012 1090 -444 805 -567 173
2524A73R5r64J793j896J320r96J184j187J59Q74j589J556j064J380j989J666r68
$$ 173 268 -696 1097 -799 521 -475 709 -478 -319 555 -1034 522 -542 838 -1151 515 -453
2541d53m77J220j077J365j243J555j634Q80J9p98R85j052J671j911K108j658K54
$$ -453 -930 290 -787 578 -665 890 -744 136 155 -643 342 -710 961 -950 1158 -500 -246
2558b46R20r36R59j596J995j853J310n07M1M69q99J320j618J934j499Q17o26Q3
$$ -246 674 -262 697 -899 1096 -757 553 46 87 556 -343 977 -641 1293 -206 611 -15 68
2576F8K87r45J919j957J577j357O41k70j35J008j874J793j233J326j221P26j67
$$ 68 355 -590 1329 -628 949 -408 233 -37 -172 836 -1038 755 -478 848 -373 353 186
2593A86j005J615j732J653j429J258j193M31N30j164J346j369J337j500J471q56
$$ 186 -819 796 -936 717 -712 546 -647 -216 314 -850 496 -873 464 -1036 435 -421
2609d21n2Q47j306J255j241J678j399P37l72o3M15q24J493j915K078j427M27j19
$$ -421 -473 374 -932 323 -918 760 -639 98 -274 -337 78 -746 747 -1168 910 -517 -90 -209
2627b09m03J100j505J783j776J244q26M02j40r5J217j833J963j333R81q37L56
$$ -209 -612 488 -1017 766 -1010 234 -592 -190 -330 -425 792 -1041 922 -411 570 -267 89
2644H9K22q89J791j898J492j371J078n13j92Q30j034J276j305J260j281Q09J0
$$ 89 311 -578 1213 -685 807 -564 514 1 -191 639 -395 881 -424 836 -445 364 374
2661C74q53J426j252J124j260J288j340N00J10o74J265j314J724k157J261m30
$$ 374 -479 947 -305 819 -441 847 -493 7 117 -557 708 -606 1118 -1039 222 -208
2677b08K30K2n55J282j643J950j733R13k96k51O00j004J938k369J783j047L76
$$ -208 22 44 -511 771 -872 1078 -655 258 -38 -289 311 -693 1245 -1124 659 -388 -12
2694a2k38n5Q12j643K058j764J160q48O64j46m64J261j602J463j067J072j133
$$ -12 -250 -305 507 -1136 922 -842 318 -530 134 -12 -476 785 -817 646 -421 651 -482
2711d82L09O59j326J760j524J304j084R93o13j51Q89j136J153j090J227j559J049
$$ -482 -173 486 -840 920 -604 700 -384 609 -4 -155 734 -402 751 -339 888 -671 378
2728C78k27m48J199j216R83j398J869j250J51N10j000J015j097J381j582J250
$$ 378 151 -297 902 -314 669 -729 1140 -110 41 551 -449 566 -531 850 -732 518
2744E18o91J87R6p84J319j638J798j446J007n88p1K78n38J426j989J776r67J49
$$ 518 -173 14 110 -674 645 -993 805 -641 366 -222 -293 -15 -553 873 -1116 660 -307 -158
2762a58j27N4M40j269J730j439R93j017Q74m24l73J406j710J622j237Q93o72K64
$$ -158 -285 -231 209 -1060 670 -769 224 -793 81 -343 -716 690 -1020 602 -635 258 -414 -150
2780a50M02q01J099j339J629j387J085q15L00N39q97R72j243J433j476R78j23
$$ -150 252 -549 550 -789 840 -547 538 -277 23 562 -335 637 -606 827 -649 329 206
2797B06k70O95q47J244j626J575j198N35m5j36Q84j429J464j507J505j149N66
$$ 206 -64 631 -216 1028 -598 977 -221 314 269 133 1017 -412 1052 -455 1050 -99 467
2814D67Q8n40J232j886J901j591R93o78L34K57j007J524j771J556j405J004o08
$$ 467 555 15 1247 -639 1262 -329 664 -14 320 577 -430 1094 -677 879 -526 478 -130
2831a30j03O13r88J034j072J301j336O85j53o51J222j322J292j474J074j120O53
$$ -130 -233 380 -608 426 -646 655 -681 4 -149 -800 422 -900 392 -1082 -8 -1128 -475
2848d75L45q82J072q75J209j522J147o62J53M29p90J143j323J621j341N68Om96
$$ -475 -130 -1012 60 -815 394 -1128 19 -643 -490 -61 -851 292 -1031 590 -751 -183 -177 -673
2866f73R76j034J579j635J535j171M16k12j61Q91j378J781j454J352j074O23p2
$$ -673 303 -731 848 -787 748 -423 -7 -219 -380 511 -867 914 -540 812 -262 361 289
2883B89m94J194j476J209q94P42n67O29r3q83J454j650J305j140Q38n25K58M49
$$ 289 -205 989 -487 722 -172 570 3 632 539 -344 1110 -540 765 -375 463 -62 196 645
2901F45j075J285j590J458j244P66j71k85R92j560J271j091J249j464N59R4o16
$$ 645 -430 855 -735 723 -521 245 74 -211 781 -779 492 -599 650 -814 -255 -161 -777
2918g77J245j207J116j537J642o82J5L01n12P62j151J567j553Q69j2k00K96o28
$$ -777 468 -739 377 -1160 482 -200 -185 116 -396 366 -785 782 -771 98 86 -114 182 -446
2936d46J084j438J691j554Q72n59K59M70j047J487j376J104q98M66r0k60Q29j263
$$ -446 638 -800 891 -663 209 -350 -91 379 -668 819 -557 547 -351 115 25 -235 594 -669
2954f69J684j436R69q07M71O9n96J334j574J283j107J062r90K45M50q79J189j040
$$ -669 1015 -421 548 -259 212 281 -315 1019 -555 728 -379 683 -307 -62 388 -491 698 -342
2972c42P59r28R59q02J20O88r28J169j516J507j332Q81m61j86Q07j197J447j592
$$ -342 417 -511 448 -354 -234 454 -474 695 -821 686 -646 235 -226 -412 395 -802 645 -947
2990i47J479j144N71n2m25J129j492J392j334J216n87J63J55j004J195j350J455
$$ -947 532 -612 -41 -93 -518 611 -881 511 -823 393 -194 -31 124 -880 315 -1035 420
3007D20j125Q69m15k53P23r60J345j035J093j142R81o40J62O22j035J069j001
$$ 420 -705 164 -251 -504 219 -741 604 -431 662 -480 501 -139 23 645 -390 679 -322
3024c22J037j083P28j11l54R51j225J129j349J108o38L83K95o62J105j388J380
$$ -322 715 -368 360 249 -105 846 -379 750 -599 509 -129 254 549 -113 992 -396 984
3041I84j626J459p86N5M82q48J052j324J708j580P49k65l02O95r64J306j630J290
$$ 984 -642 817 31 86 568 -280 772 -552 1156 -424 325 60 -242 453 -511 795 -835 455
3059D55r44O43j92l54P40j345J678j162P04n85K03J75n78J036j354J298j144Q25
$$ 455 -489 154 -38 -392 348 -997 681 -481 223 -362 -159 16 -562 474 -880 418 -726 99
3077I9l13rL62q85J278j251J086j007R66l84j72O64j088J356j333J113j009O97
$$ 99 -214 -223 139 -746 532 -719 367 -640 326 -58 -230 434 -654 702 -631 482 -527 170
3095A70m7k68Q86j000P61j110J336j106L15L45m91P41j265J661j630J187o76K45
$$ 170 123 -145 741 -259 502 -608 728 -378 -63 282 -209 532 -733 928 -702 485 -191 54
3113E4L63p77J192j236J315j312P08j52l78N94r00R37r71J333j286L54k2j99O65
$$ 54 417 -360 832 -404 911 -401 307 155 -223 371 -529 408 -563 770 -516 -162 -184 -383 282
3132B82j073J291j253J064q62M99j09m02Q24j073J118j161J082n28J06K67n78
$$ 282 -791 500 -753 311 -551 -52 -161 -563 261 -812 306 -855 227 -301 -195 72 -506
3149e06Q93r82J242j496J062l47O1L55q51J328j473J336j080N65L5l27P57j191
$$ -506 387 -595 647 -849 213 -134 -73 282 -569 759 -714 622 -458 107 142 -185 572 -619
3167f19J465j405R77n83L48O1m47P47r88J447j303Q83p59N55j44n20J034j086
$$ -619 846 -559 418 -165 183 244 -203 544 -444 1003 -300 583 -176 379 235 -285 749 -337
3185c37J143j256J158o57Q8M90j072J338j365J113r64O96m59K25N00j045J034
$$ -337 806 -450 708 51 139 629 -443 895 -470 643 -321 375 -84 141 641 -404 630
3202F30r94J238j531O16P1k73O92r63R38j153J288j070L92K12n42P61j097J181
$$ 630 -364 874 -657 -41 30 -243 449 -514 424 -729 559 -511 -119 93 -449 312 -785 396
3220C96j027O94o68N29J49n52P31j089J582j337O28l74oO09q16J239j382J350
$$ 396 -631 63 -605 -76 73 -479 252 -837 745 -592 36 -338 -344 265 -551 688 -694 656
3238F56j165N64l65K15N19j038J122j229J287r83R06l41o0O87j347J089j138J094
$$ 656 -509 55 -310 -95 424 -614 508 -721 566 -417 489 148 88 775 -572 517 -621 473
3256D73m87L60j21o22J310j440J235r70P74p31OP59j007J056j391J434j056R17
$$ 473 -14 346 225 -397 913 -527 708 -262 512 -219 -213 546 -461 595 -796 638 -418 499
3274D99n20j66O53r60J163j359J363r48L45j5l98P78j180J154j325J070m22J68
$$ 499 -21 -187 466 -494 669 -690 673 -275 70 55 -343 435 -745 409 -916 154 -268 -100
3292a00K40j99M38j038J091j154Q38n43K03L04n12J027r65P77r05N82k89o5N30
$$ -100 140 -59 379 -659 432 -722 116 -427 -224 80 -432 595 -370 407 -498 84 -205 -270 260
3311B60p41J189j650J532q52K95N2m98R36j312J418j216J068o61M9L82m62Q87
$$ 260 -481 708 -942 590 -262 33 85 -413 523 -789 629 -587 481 -180 -131 251 -211 676
3329F76j030J275j483J119q01J66M42p71J068j286J285p79L50r5l48M54q82J076
$$ 676 -354 921 -562 557 -244 -78 364 -407 661 -625 660 -119 231 136 -212 242 -640 436
3347D36q14Q50n68P5j1k86P45j021J021j400J154m96K60J11n11R82j297J281j115
$$ 436 -378 472 -96 -21 -32 -318 427 -594 427 -973 181 -315 -55 56 -455 527 -770 511 -604
3366f04J135p06j16M50p89J127j182J166r12O20n33J33N61j094J214j081R30o32
$$ -604 531 -175 -291 159 -630 497 -685 481 -431 189 -344 -211 350 -744 470 -611 319 -313
3384c13O77k84l30Q59j164J162r86M72l67Q4J78j32M67p21R78j093Q32k15J9M51
$$ -313 364 80 -250 609 -555 607 -379 93 -274 -190 -12 -144 323 -398 580 -513 319 104 123 574
3404E74q18P49j024J030r05Q55k84o7M43m40K32q94J390j137P41l49k6M38q28
$$ 574 -244 505 -519 511 -394 461 177 110 553 113 345 -549 841 -296 445 96 70 508 -320
3423c20Q56j115J083p90L36j03k76Q02q21Q70p02L93o90M30o2m47J058j203J221
$$ -320 536 -579 504 -286 50 -53 -329 473 -348 522 -180 213 -477 -47 -109 -556 502 -701 520
3442E20r57P80n81J13J20k10O65j033Q72p78O00k25n50R67q02O99o76P03l96L56
$$ 520 -437 343 -238 -125 -5 -215 450 -583 289 -489 111 -114 -664 303 -499 200 -476 227 -169 187
3462A87j17l11P23p82O68q96J107q47L92J30m01M88o89J059j134P67l33p7L08
$$ 187 70 -241 482 -300 368 -528 579 -268 124 254 -147 341 -348 711 -423 344 11 -66 242
3481B42m21Q12j006J131j008N12k62J69J00m21Q55j330J145n74M18k92l38P05
$$ 242 -179 633 -373 758 -250 262 0 169 269 -152 703 -627 518 -56 362 70 -268 437
3499D37q10J004j131R92q78M96R5m51M92q65J000q97P43n00J89J21l81O63r89
$$ 437 -373 631 -500 492 -386 110 205 -246 246 -619 381 -516 227 -273 -84 37 -344 319 -670
3518f70J081q48O62k94J04J70o94Q13q00P64q26L24J12k29L38n63P13m85P45q33
$$ -670 411 -437 225 -69 35 205 -489 324 -476 288 -538 -214 -102 -331 7 -556 157 -328 417 -416
3538d16P19m84M4O82j118J118j111Q40k84J19ql97N86p66Q88p09N17k89J09K02
$$ -416 303 -181 -137 545 -573 545 -566 274 -10 109 101 -296 290 -476 412 -297 220 -69 40 242
3558B42l47P82j062P95n31M53k47k83L32j52L95q45R03n92M13j58l88P17q21O90
$$ 242 -105 677 -385 410 -121 332 85 -198 134 -18 377 -468 435 -157 256 98 -290 427 -394 296
3578B96q61O93l81L80J52p58O00o51Q54q08P45m49J83J13o84P57q30J180p39K36
$$ 296 -565 128 -253 127 279 -479 121 -530 324 -484 261 -188 -5 108 -576 181 -649 531 -208 28
3598B8k51L9J7j58O09q39J002p44K97J10l17L87p22J082j161J072o72R5K40m30
$$ 28 -223 -184 -167 -325 284 -555 447 -297 0 110 -207 180 -542 540 -621 451 -221 -126 114 -316
3618c16R53j014Q04n85N54m08P6L83r35J044j111J117p52N15m19r6Q30j071J103
$$ -316 637 -377 427 -158 396 -12 64 447 -488 556 -555 562 -190 325 -94 -190 640 -431 672
3637F72j136Q11m76L11J26o89P97n64N35p36Q98m74J92Pl40M89p58P09j060J058
$$ 672 -464 347 -129 182 308 -381 416 -148 387 -349 549 75 267 274 -66 423 -335 374 -686 372
3657C72p19M43J70o25N80p27J064r93O22r8j95N43q17M32m90N92n66K17j2j16
$$ 372 -347 96 266 -359 221 -506 558 -435 187 89 -106 437 -380 52 -438 154 -412 -195 -207 -323
3677c23L33m46P07q52R76o72J72O6l7Qj39N78o88L71J15j85j70Q9M81o94P80o31
$$ -323 10 -436 271 -581 395 -277 -105 -39 -76 -68 -207 371 -317 54 169 -16 -186 -97 384 -310 470 -161
3699a61N31q11O69J7m39N53o81R17p55O32k07k49J11l28Q88j185P51l62O3qp2
$$ -161 370 -441 228 245 -194 359 -322 595 -160 472 265 16 127 -201 687 -498 253 -109 -46 -54 -126
3720a26Q93o66M26q72P02o29K99m0q6O22p79K51k5Q65j043K37m3n53M51k99P36
$$ -126 767 101 527 -345 357 -272 27 -13 -99 523 -256 -5 -30 835 -208 29 -14 -567 -116 -415 321
3741C21o51j92K45L92P23r67K68m60M01q82N79J04k20O02o11O13m04M70l49L99
$$ 321 -330 -522 -277 115 838 -129 139 -321 80 -802 -223 -119 -339 263 -348 265 -139 331 -18 381
3761C81k38n8K50m81J98j52n9j03L80P1k89O27q40O49m93M45Q2m73L60l55M51
$$ 381 143 85 335 -146 52 -100 -159 -262 118 189 -100 527 -313 336 -157 288 370 -103 257 -98 353
3782C53o93P39l72L61k35l11O40p07Q39o42K96n56M54j0k54L88o99R48n22N19
$$ 353 -340 399 27 388 153 -158 482 -225 614 -28 268 -288 166 156 -98 290 -409 539 17 536
3802E36n00J4J38m29M59m29M45o34L76L8J31k3n98J007q30N32p84P04l6n26O62
$$ 536 36 50 188 -241 218 -211 234 -400 -24 14 145 122 -476 531 -299 233 -551 153 117 -409 253
3823B53p53Q06p15N98p39N18k6l03P36q42O73l78M39m06k8K86o19P07n73O67m70
$$ 253 -500 306 -409 189 -550 -32 -58 -361 375 -467 206 -172 267 -139 -167 119 -500 207 -366 301 -169
3844a69M96o87K90L51n38M05m09O15m45L84l80K67K12n61O03p26Q90p64K74J03
$$ -169 327 -360 -70 281 -257 148 -261 354 -91 293 -87 180 392 -169 434 -292 598 -166 108 211
3864B11n21R03r02P60o54L49k59j9K56k82N43o98Q04n76M65n76J44J44k62L85
$$ 211 -310 593 -309 451 -203 146 -113 -132 124 -158 385 -313 491 -85 380 -196 -52 92 -170 215
3884B15o92R55q43N44m09K25M8o99J073r07O85o27M43k48j6N64p45Q98j096R09
$$ 215 -477 478 -365 179 -230 -5 43 -656 417 -490 195 -432 11 -237 -253 311 -434 464 -632 277
3904B77n81K41K17n27P22q67O46m74L93k67J28J30k52N02p26J099q99O15l63j32
$$ 277 -304 -63 154 -373 349 -518 128 -346 47 -220 -92 38 -214 288 -438 661 -238 377 14 -118
3924a18L19l00M18q10P97o29N36q2q2J73p92R20o54Q15m53k7J68k89M36n29P26
$$ -118 201 -99 319 -491 306 -323 213 131 49 222 -570 350 -304 511 58 31 199 -90 346 -183 543
3945E43o36N24m50K47J2n09P33o79N14o55P65l08j14L47m48L84o67O80n89N09
$$ 543 -93 431 -19 228 240 -269 464 -215 299 -356 409 101 -13 334 -114 270 -397 283 -306 203
3965B03k74O0J20j89L24o39N26l60L77l54nM40o52O79q30O77l76K40L8l39M62
$$ 203 -71 -11 109 -80 244 -395 131 -229 148 -206 -211 229 -423 256 -574 103 -273 -33 5 -334 128
3986A28n15O07n00M43l76J23L05k57O34r44N99k22K79l49j5K28m85O01o16O92
$$ 128 -387 220 -280 163 -213 -90 215 -42 592 -352 247 25 304 -45 -60 168 -317 284 -332 360
4006C60n29M93J46o89N15n59P97q17P26o59M88j66k74O18p27N88n10M97m85J58
$$ 360 -169 324 470 -219 296 -263 534 -283 443 -216 272 106 -168 450 -277 311 -199 298 -187 -29
4026b9K75n56O41p69P77n44Q2K28k34O32p09N40o67M09l33J47L5j37J65l51N32
$$ -29 246 -310 331 -438 339 -205 -123 105 -129 503 -206 334 -333 76 -257 -110 -75 -212 -47 -398 134
4047A34l42O47p80J91k8J1M37o98P26p35M26j89O1J8J13P6o23P97n45N07n4k35
$$ 134 -208 439 -341 -150 -178 -167 270 -428 298 -437 -11 -200 -139 -121 -8 68 -555 242 -303 204 150 -85
4069h5j4N6N27r10P99o00N04m48J34K03l31P29p80O12m39L01k09j55N57p89L42
$$ -85 -99 -43 484 -426 373 -227 277 -171 -37 166 -165 564 -216 396 -43 258 49 -106 451 -338 4
4090DOJ54k96J05J4r6K97k97O00n12L09k59l07M31n52P41p91P50n65L97k70K01
$$ 4 10 164 -132 -27 -13 -109 188 -109 491 -21 288 29 -278 153 -399 342 -449 301 -264 133 -137 64
4112F4K72p44N20m91O58q19Q27l28k35N70o90P16p34O88m01N0Q3j21K42m61Q58
$$ 64 336 -408 112 -379 279 -540 287 -41 -276 294 -396 320 -414 274 -127 -77 6 -115 127 -334 524
4133E24j103N83j77J35K47m75N65p81R55j022O85K7l37M28l71O09q11Q33n03K1
$$ 524 -579 4 -173 -38 209 -266 299 -482 473 -549 136 163 -174 254 -117 492 -319 514 11 32
4153C2K5m2M30o39M76p55P92l73j1L10k96M37p33O95n21L45k26k0J88k14O00q01
$$ 32 57 15 445 -194 282 -473 319 -54 -65 245 -51 386 -347 348 -173 172 -54 -74 114 -100 500 -301
4175c01N05n31M54k30R9K54o20Q09p15N69l87J59j03l3N15o95M07o86O35l73L51
$$ -301 204 -327 127 -103 -4 250 -370 439 -276 293 -94 65 -38 -71 444 -251 156 -530 105 -268 83
4196H3K00m18J63l03L47n13Q22n82J84q3r4K92m84O90j074P22M0PK01o21Q26o76
$$ 83 283 -135 28 -275 72 -441 381 -201 -17 -100 -194 98 -386 304 -770 -48 -8 -1 200 -421 405 -271
4218b71M55l68J24M1M7K75l68M45p00K79J04Rj4PK62n20L94m58L95k03K97j38
$$ -271 184 -184 -60 -19 28 303 -65 380 -320 -41 63 72 58 65 327 -193 201 -257 138 -65 232 94
4240I4m55N50l36N94o11L97k12n3M01o05O04m45O88n80r6j03J06O8k84L97m75
$$ 94 -361 189 -147 447 -164 233 21 -32 369 -236 368 -77 611 31 -65 -168 -62 6 -278 119 -356
4261c56N78n88M89k39j07N74n63K87p02P57l55M38j21m48P41r43N84m03M40k10
$$ -356 222 -366 123 -116 -223 351 -212 75 -627 130 -225 213 92 -356 385 -558 26 -377 63 -147
4281a47q2L50l79N36q73M88j24J74K60l73N87p16O34n21K95m96M17M4j91J54k06
$$ -147 -229 121 -258 278 -595 -107 -231 -57 203 -170 417 -299 335 -186 109 -387 30 74 -117 37 -169
4302a69N07p44O32m27L45J57n49L97o73R25o22L92m17L21K87m55L90m51L76m96
$$ -169 338 -406 226 -201 144 301 -248 149 -524 401 -221 171 -246 75 362 -93 297 -154 222 -274
4322b74N14q9JN3n24P77o94O14p63K74J77m47O54n64O52o65L00l04K73n3j04K69
$$ -274 240 151 152 205 -319 458 -236 378 -385 -111 66 -381 273 -291 361 -304 -4 -308 -35 -88 -192 77
4344G7k24L10m50N78m03J5J2j72K82k92M72m29N84n95L60j63k72M74n71N92j61
$$ 77 -147 163 -287 291 -112 -97 -85 -257 25 -267 205 -224 360 -235 125 -38 -310 164 -407 185 24
4365B4J63k66J40K85p08O84o04M98m1k13K14j61K51n75O67n62N04n65L84j99j75
$$ 24 187 -79 61 346 -362 322 -282 216 175 -38 176 15 266 -309 358 -204 300 -265 119 -80 -255
4386b55P51n58N16p19N24p1k02J81m43N54p20P70k87L84o61M70R9m57M12p20O40
$$ -255 496 -62 454 -265 259 188 -14 167 -276 278 -442 328 41 425 -236 234 333 -124 288 -432 208
4407B08l32J17J89r3J79o09K21j10O15n37J40j22J55K46n63L19l90K30o0P3l8
$$ 208 -124 -7 182 89 268 -341 -120 -230 385 -152 -12 -134 21 267 -296 23 -367 -137 -197 -124 -162
4428a62l2P32q58N04n05K53J85l65J58j28L17l27K24j18J21K13k53J70k40O15
$$ -162 -194 538 -320 184 -321 -68 117 -248 -90 -218 99 -228 -4 -122 -1 212 -41 129 -111 504
4448E04p22L39k02j13L6J57M68o96P88q87L73j80J33J86k91K78l51N38p34O62
$$ 504 -218 121 -81 -194 -158 -1 467 -229 559 -328 45 -135 -2 184 -107 171 -180 358 -376 286
4468B86k07OK5m19L89p5K74m86J52J19j02m3l47N91k95J51k8r4M55o31L50l86
$$ 286 79 85 110 -309 80 5 279 -207 -55 64 -38 -81 -428 163 -132 19 -9 -103 352 -279 71 -315
4490c15N27m86M11l36J01M75m29k1l36P33o19K99j22j63K66k48M37n37P15p48
$$ -315 212 -274 137 -199 -98 377 -52 -73 -409 324 -295 4 -118 -281 -15 -263 174 -363 352 -396
4510c96M94j61R2j8k17M66l65L82k39m4k6K7L4k00K00l09L70r6J81L7k29L28m16
$$ -396 98 -63 29 11 -206 260 -105 277 38 -6 -32 -5 29 -171 29 -280 90 -6 175 212 -17 311 -105
4533a05K30m39M16o2K7j24J9N55q08M83l96M15k86O9J17j83L23n29O61n13L38
$$ -105 125 -314 102 40 67 -57 -38 517 -291 192 -204 211 -75 -6 111 -72 251 -278 383 -130 208
4554B08n17K94L18k76L43p32N51k58L03p1l48K67l15M98n92L75n0J06j00o0L68
$$ 208 -309 -15 303 27 370 -362 189 -69 234 163 -185 82 -233 265 -327 48 -2 104 4 -56 312
4575C12n84M04l12J40j05kJ94j73L99q35P76l92J81K5j78M28n57M13k86K58j66
$$ 312 -272 132 -180 -40 -145 -147 47 -126 273 -562 214 -178 3 28 -150 278 -279 134 -152 106 -60
4596f0J82k5j59K49l96N79n43K41j38J29J91m20M34o50N39n03M15K9j05R1j02
$$ -60 122 97 -62 187 -209 370 -173 68 -70 59 250 -170 264 -386 153 -350 65 94 -11 80 -22
4617b2L85l72Q2m74M70P6n06L52q2K62j77K67n21M96n7q4J14m47L95m67M42m88
$$ -22 363 -9 73 -401 69 145 -361 -9 -91 171 -6 261 -260 236 179 95 209 -238 157 -310 132 -356
4639c56L21L55o89M58o00O89l68M79l36o8L30n88N31o09L18j4J85j48k4J40l95
$$ -356 -35 320 -369 89 -511 178 -190 289 -47 -115 215 -373 158 -451 -133 -147 38 -110 -134 6 -389
4660c89O42n00O22l12O6j33k20N46n83K94j82K18j44q2L29j74K76l45N31m09J26
$$ -389 253 -247 375 63 129 -4 -224 322 -261 33 -149 69 -75 -157 172 -2 274 -71 460 51 177
4681A77j24j37J78l32N95o64P17n76L72k11J09ok23M63m56J70l49K76j00J70J48
$$ 177 53 -84 94 -238 357 -307 410 -166 206 -5 104 98 -125 338 -118 52 -297 -21 -121 49 197
4702A97k26L33l09P4j77K49p6k20M71n12J51l89O64n34K89J18r3J10m41M34l99
$$ 197 -29 304 -5 69 -108 141 65 -155 316 -196 -45 -434 230 -304 -15 103 10 120 -321 113 -286
4723b86K70n8j82K87l74L83l76J95k92N51j09j91M64n63M65m85M88j90n2m3K8
$$ -286 -16 -74 -256 31 -343 40 -336 -141 -433 118 9 -182 282 -281 184 -301 187 -3 -55 -98 -70
4744g0J67l14N55l81o1R7N4J71n91O00l56L75m35K17q4J81Rj66L89q48N97j03
$$ -70 97 -217 338 -43 -104 -7 47 218 -373 227 -129 246 -189 28 -56 125 134 -32 357 -491 106 3
4766CJ44K9l22M03k56K3N0K85n96M04k77L8J65n43N54l48K27j39M38r9k81K7Q7
$$ 3 147 176 -146 257 1 24 74 359 -237 167 -110 -72 93 -450 104 -244 -17 -156 282 183 -98 -71 16
4789A6M58p20N04l91L49j55l49M83l26O5k15K39N0j78L40l90J63k61O43k82o3
$$ 16 474 -246 258 -133 216 61 -288 195 -131 -66 -281 -42 8 -170 170 -220 -57 -318 325 43 -20
4810b0L9k57M01m99O10n38K30n7K51k92J53oj67L36m17J64k5J49P1k64J68l19
$$ -20 19 -238 163 -336 274 -264 -34 -91 160 -132 21 15 -152 184 -233 -69 -94 55 126 -138 30 -289
4832b89N93l94K83l08j3K17l70M13k44K30m8J18j31N4J47m10L65m69L09J5M1p6
$$ -289 304 -90 193 -115 -128 89 -281 132 -112 118 70 188 57 111 258 -152 213 -256 53 68 109 33
4854C3k95L45l22K38k71L49k81L75j40l96M29o5J08l27k3K08j27K75l34K56l91
$$ 33 -262 83 -239 -1 -272 77 -204 171 31 -365 64 -1 107 -220 -243 -35 -162 113 -221 35 -356
4875c56N14k25K1J48j18J50n13M27k50L79l31K97k17j2n7j37O54l20O5j08J86
$$ -356 158 -67 -46 102 -16 134 -379 48 -202 177 -154 143 -74 -86 -143 -280 374 54 119 11 197
4896A97j5k51J49m73M81m30L24q3j7K96j30K65n42M11l89L09J16l28J22j90N58
$$ 197 182 -69 80 -393 88 -342 -18 -101 -118 178 48 313 -229 182 -207 102 218 -110 12 -178 380
4917C80n28P78p16J53J4l67N13n67J70J66P9k4l5L8O1K04n99N06o43N87l80NL1
$$ 380 -148 630 -86 67 81 -286 227 -340 -170 -4 75 51 16 54 115 319 -280 226 -417 170 -210 -205 -174
4940a74Q8K46j15J73l94J12rN9L37n04J60r6K99l75N17j98l95K41k1L4k93N52
$$ -174 -86 160 45 218 -176 -64 -73 -14 323 -181 -21 -117 182 -193 324 126 -269 -28 -49 -15 -308 244
4962B44j93R0Q8j96O3l04M97o11N75m21O8np9O01m40L07m61K78m6K33k79j04K47
$$ 244 51 141 229 33 96 -208 289 -322 253 -168 -100 -105 -184 417 -23 284 -177 101 55 288 9 -95 152
4985A52n04O77l60K22J9j23k4m0L42n53K95k28J67J7j9p8J37p7k76N74m05n9J40
$$ 152 -352 325 -35 187 206 83 59 19 361 -192 103 -125 42 59 40 -38 99 22 -254 320 -85 -144 -4
5008dk85P03n52M02m58K42j10P5K94m93M42n97N31k63K9K57l8m1k00j6l3K89n41
$$ -4 -289 414 -138 264 -194 48 -62 13 307 -186 256 -341 190 -73 -44 213 175 134 -66 -82 -115 174 -367
5031c67M26k67J75J99l84K92m68N66L5J51l70k16M24m25K27K7j0J97m42K96r4
$$ -367 59 -208 -33 166 -218 74 -394 172 207 358 -12 -228 196 -229 -2 25 15 212 -230 66 -28
5052b8L82k70m1l44N42k86k41M94k62L65n56L16k13OJ66j62N37p53O37n45K78
$$ -28 354 84 43 -301 241 -45 -286 208 -54 311 -245 71 -142 -136 30 -132 405 -348 289 -256 22
5073B2K21l07K09l53K67j83Q5k8J90k32K00J5k16N36n52J44k93L92J6p7J22k91
$$ 22 243 -64 145 -208 59 -124 -39 -67 123 -109 91 106 -110 426 -126 18 -275 117 133 56 178 -113
5095a13L90o51O69m85J80r0n3L78l41J68p1J2q2J29q3k36L59m99M14l30N60m83
$$ -113 277 -374 295 -190 -10 -100 -153 225 -116 52 -19 -7 -89 40 -43 -279 80 -419 -5 -335 225 -258
5117b58K14p9k9L75l02K11l68L36p2l8J09k85K66l81L25q8l4J04l6J40q8J78l58
$$ -258 -44 -123 -152 223 -79 132 -236 100 28 -10 99 -186 80 -301 24 -64 -98 6 -30 110 22 200 -158
5140a58L87k08J58p3k68M79l25J23j77K45m5N9j24j18n4r3J73j97L47j09l07J93
$$ -158 229 21 179 106 -162 317 -8 115 -62 183 138 197 73 -45 -99 -192 -19 -216 131 22 -285 -92
5162i2P9P5o3L1j39P7k14J68M3k31L16k34L29j22L7r6r3L08j22O3l08L51k59J57
$$ -92 -13 62 -1 30 -109 -32 -246 -78 -35 -266 50 -184 145 23 60 -36 -129 179 57 120 -188 163 -96 61
5186F1K30l56L46o27M79j61P1M3K19j73k87K80k68L54j77N5r8J6K41k75M39m10
$$ 61 291 -65 281 -346 133 -28 43 86 305 132 -155 125 -143 211 34 89 -9 7 248 -27 412 2
5208BJ27l10M08n51K06L21k10K1n1K36j41P3l2p6Q3j80K33m02M82k06j38L29m52
$$ 2 129 -181 227 -324 -118 203 -7 14 -37 199 58 131 99 23 106 -74 159 -243 239 33 -105 224 -228
5231b28L21k52M17m34K75k06K60j24k8O2J1j9k07J83o8j24J86k47L61k62M34k46
$$ -228 93 -159 258 -176 99 -107 153 29 1 63 74 55 -152 31 -37 -161 25 -222 139 -123 311 65
5253F5J35j47k12N04n93M38l45K26j78l1K13j83J74k43J31k26N10n63M31j77J08
$$ 65 200 53 -159 345 -248 190 -155 71 -107 -138 75 -108 66 -177 -46 -272 238 -325 106 -71 37
5274C7K61l92N25n27O7L9J01J64n17J26j2L26j01K4r3l95O71k28J24n19K96K12
$$ 37 298 -94 431 -96 -29 10 111 275 -242 -116 -128 198 97 121 28 -367 304 76 200 -319 -23 189
5296A89M1j35kK44j47j81n3J39p9M0L0k26L92l98J81q2K18l22L5M04l07j7l5K69
$$ 189 230 95 93 337 190 9 -44 95 16 56 86 -140 252 -146 35 -47 171 -151 -116 288 -19 -36 -71 198
5320A98n22K98n1j23K70q3k5mJ72j98R0j64Q4L24n26N14m24M22k51j69L42m42
$$ 198 -324 -26 -77 -200 70 -13 -38 -42 130 -68 22 -142 -58 266 -260 254 -170 252 1 -168 174 -268
5342b68M92l13L01l38k5R2N9n7n30P96m40O63o69J41K00k9P8n47P00p52M35o7
$$ -268 224 -89 212 -126 -151 -59 0 -57 -587 209 -231 432 -237 -96 104 75 153 -394 306 -446 -11 -78
5364g8j33L76o16Q75n05J99M7m89R01o40j17K57k66k12M90m7K57l40J47o1k73
$$ -78 -211 165 -451 424 -81 118 165 -324 577 -63 -180 77 -189 -401 89 42 299 -41 106 45 -228
5385b28N22m99M53k27J67J14n09M73l03J24j67JJ63r2j12K31K83o29L25j66L1
$$ -228 294 -205 248 21 188 302 -207 266 -37 87 -80 -79 84 -8 -120 111 394 -235 90 -76 -45
5406d5j02j23J85k30J13M21k17J02l14K09n87O03k86N95m51q6l99N56Q1J84J17
$$ -45 -147 -270 -85 -315 -202 219 2 104 -210 -1 -588 15 -271 324 -127 -213 -612 -56 25 209 326
5427C26o38N11o43O61P66k07r69J5K50J7L1o1M7q1q5K22r6Rl17O51l56Rk13M4
$$ 326 -312 199 -444 217 983 776 -193 -178 72 89 120 59 106 25 -60 162 66 75 -242 409 53 62 -151 -107
5451a07j5K45k04R3J29k37N2n1P2j7k95O79n36K65j96J44J28l40p5K30J36k96
$$ -107 -122 123 -81 12 141 -96 -44 -95 -23 -40 -335 344 -192 73 -123 21 149 -191 -266 -36 100 -196
5473a96M35m2m43K44m2O3jN4l14K40N1k95M67n22L25k05M39m84K20n5K00j53K0
$$ -196 239 197 -246 -2 -44 19 18 72 -242 -2 49 -246 221 -301 24 -181 258 -226 -6 -61 139 -14 6
5496Fk0q3J14J2rKm8K55k14L95o17M16l42J54J52J07k36m08M47j44O8o6O7K37
$$ 6 -14 -97 17 29 20 22 -26 229 15 410 -207 209 -133 21 173 280 44 -364 83 -61 7 -59 8 245
5520B45m27M05m97M44k71J72o8n3K60l47L84l87J87k64L88r6k91K69j68M27k42
$$ 245 -182 223 -274 170 -101 71 3 -50 210 -137 247 -140 47 -217 171 75 -216 53 -115 312 70
5541G0p3j97K33K4j89L66k18O6o5K3o4K57j6m13Q6o7N9M9M1j19o8K94j92K97k72
$$ 70 -3 -200 33 57 -132 234 16 82 17 40 -24 233 217 -196 -110 -177 -118 -69 -28 -147 -215 79 -113 184 -88
5566h8J14J11nk33p4K38L1L34o55N78l59J71j09k19L34m07L47n0L36m12p8J79
$$ -88 26 137 132 -101 -175 63 94 428 -227 351 -8 163 54 -165 169 -238 109 59 395 -17 -95 84
5588H4m01L77j21K15k70J1N3J83o3l69N44k54K0l06K17r3P0L02n44N44k42K73
$$ 84 -317 60 -61 154 -116 -105 -52 131 68 -301 243 -11 9 -297 -80 -173 -103 199 -345 199 -43 230
5610B30j68q9l5KM42n34M48m20M13m68L1K32k33L06j18n0n7Lm3J0OK2L15o26M44
$$ 230 62 -27 -62 -60 382 -152 296 -124 289 -179 -148 84 -149 157 39 -11 -68 -65 -108 -98 -92 -70 245 -381 63
5635F3m3m2L0j66J89j67K91l39L90k91J21p1k14O5RK86j84J70p6L27j42m93K66
$$ 63 20 -22 8 -158 31 -136 155 -184 206 -85 36 -35 -249 -184 -175 111 -73 97 21 348 206 -287 -21
5658b1r0L44p1p8P7j38J72l81O04m46J62k62MP8J03J6k55J99k70K60l08L10K46
$$ -21 -111 233 162 84 161 23 195 -186 418 -28 134 -128 -124 -46 57 73 -182 17 -253 7 -301 9 255
5681B55l70N1j20L00k96K69K3N7j53k02M12l96O0n7L51r4m3k21k8J68l75K75M5
$$ 255 -115 -64 -184 116 -180 89 112 169 16 -186 226 -170 -110 -167 184 90 47 -174 -202 -34 -409 -134 -89
5704h9J72jj52K38m5N2m43M75m51L58K3m19N04p1q0k09J63r0K69l98J6Kk30O58
$$ -89 83 82 -70 168 123 175 -268 207 -244 114 137 -282 222 151 71 -138 25 -65 204 -194 -178 -176 -406 252
5728B52l20J52l04M67k48j31J69m7K24n07L55k36R0j35K42J37k29Mj13K93ok73
$$ 252 -68 84 -220 247 -1 -132 37 -10 214 -293 62 -174 -84 -219 23 160 -69 -65 -178 115 109 -164
5750a64L45r6J06l22K52j43K61r0j59k53M1K96o5J44j36k7M3K9L36n62K48k61
$$ -164 181 85 191 -131 121 -22 239 149 -10 -263 -222 74 9 153 17 -10 33 62 398 -164 84 -177
5772a77K50q1oj48J27M25n43L53l96L34j43J02Q0k26L1kqj78L21q0K54m3k93J54
$$ -177 73 -8 -14 -162 -35 390 -153 200 -196 138 -5 97 177 -49 -18 -20 -28 -206 115 35 289 246 -47 107
5796A07k71K85l16M43q3j17J85l00J45L1k01m4J44q4O4J71J08j86M8j76J31k41
$$ 107 -164 121 -195 248 165 48 233 -67 78 109 -92 -136 8 -76 -12 159 267 81 129 -47 84 -157
5818a57J04k1O10o18K00k64L81k44j19L13k94K14j03K22m60J23j67j57M76kL28
$$ -157 -53 -74 536 -82 118 -146 235 -9 -128 185 -109 105 2 224 -236 -113 -280 -437 39 37 365
5839C65m24J82j66NR8l18L80m20L13k94J89n4o1J17j16L44l00L05j89J36N8j84
$$ 365 -59 123 -43 -38 60 -258 122 -298 15 -279 -90 -144 -205 -88 -204 140 -160 145 -44 92 150 -34
5861c4K1p3L09k24j1R5k51K81j02J34j75j18J31K30k87m8K28j62J99l97L76k15
$$ -34 -13 -86 223 -1 -12 83 -168 113 11 145 -30 -148 -17 213 -74 -122 106 -56 143 -254 122 -93
5883i3K38j26R9M1m13M19o9j66QJ01o1l4J69j50j61k8K28k55K65o8k8J03j83L09
$$ -93 145 19 118 159 -254 165 96 -70 -62 39 -22 -56 113 -37 -198 -226 2 -253 12 -56 -84 19 -164 145
5907A45l68L28j21R4K3%Qk65J36l7Qr4K5Q0J82k13j57M16l85K46k80Q7K11j03
$$ 145 -223 105 -16 78 101 101 109 -156 -20 -57 -49 -143 -118 -38 144 -69 -226 190 -195 51 -229 -142 69 -34
5931c4k6l06M12o8Q2l02L82P9l61K62K7j8o6j4o2p9L9j78L92k26L87k92J52k08
$$ -34 -60 -366 46 -22 60 -242 140 219 -142 120 147 129 63 49 -13 -92 -53 -231 161 -65 322 30 182 -26
5955b6M0%p3m6PJ20j59K15k13J00N5k21J86k01L58k65P7K16l33L01r9K92l26j7
$$ -26 14 14 -59 -105 -98 22 -137 78 -135 -35 20 -201 -15 -216 142 -123 -46 170 -163 138 39 331 5 -12
5979a2O2r1K14l01m2l0K69l28K58L1k9j5k11M50l61J00j04P2J66k10Lj00M13l50
$$ -12 50 -41 173 -128 -170 -200 69 -259 -1 30 1 -14 -225 225 -136 -36 -140 -68 98 -112 -109 -209 204 -146
6003a46J91o1R3N4k62Q3lL2M7K3k7k70L48k48K54k42O5j01K18m6j70J75o7K51
$$ -146 45 -16 77 131 -131 -48 -51 -19 28 51 24 -246 102 -146 108 -134 -69 -170 48 2 -168 7 -60 191
6027A91j73q7j51M25j15k02K57l73J49J51J36l13M6L39n17M10k85J41pk1J50j37
$$ 191 18 -69 -220 205 90 -112 145 -228 -79 72 208 -105 -59 280 -237 173 -112 29 22 1 151 14
6049A4J49l07K33l77M42k01q7J92P2Kj24L25m88L38k03j70N04m27J28q5K83m77
$$ 14 163 -144 89 -288 154 -47 -134 58 130 132 8 333 -155 183 -20 -190 314 -113 15 -70 213 -264
6071b64M2L05j51J69j48K60m04J39J10j88J35M9j65j07K30j44L6J1N7k57Q1K28
$$ -264 -222 83 -68 101 -47 213 -191 -52 58 -130 5 54 -111 -218 12 -132 -96 -85 -28 -285 -204 24
6093B4j29N13m74J73l6k90M03o0J54k43K23n03M17l69N14k96q4K14l55L10j44
$$ 24 -105 408 -66 107 71 -219 184 124 278 35 258 -245 172 -197 317 21 -63 151 -204 106 -38
6114c8Q8n5j20L10j83Q5k75R3p0L63p5j38j38P7J10j30J78j28j11J30l3O2n5K04
$$ -38 50 -5 -125 185 2 87 -188 -95 -165 198 123 -15 -153 -76 34 -96 82 -46 -157 -27 -60 2 -53 151
6138A51l09O1K8J29N5k85L24m73L02j63L24k34M6J05k3l2j67K58k79M05r6m25
$$ 151 -158 -97 -69 60 115 -170 154 -319 -17 -180 144 -90 -44 61 38 6 -161 97 -182 223 127 -298
6160b98L69k22J09n5K35l52q0M32j25J87m54K97m1J22k10m4K2L7R2k49J40j07
$$ -298 71 -151 -42 -97 138 -214 -294 138 13 200 -254 43 2 124 -86 -130 -108 -71 21 -228 -88 -195
6182a95J71Q2lm52K17J86j99J91p3L69k42n6M7j56K55k58J74k55J81j42K28n1
$$ -195 -24 58 55 -397 -180 6 -193 -2 -75 294 52 -4 43 -113 142 -116 58 -197 -16 -158 70 19
6204A9l12M04j31K23k59O7J18l49K92K3l9j98M86m55K79k41k08L67M6m6k26K41
$$ 19 -293 111 -20 203 -56 11 129 -220 72 95 56 -142 344 -111 168 -73 -281 86 132 86 -140 101
6226A01j36J92r3j17%k76K78m4P6K18k39J08k25M00m04P0l6M89j88k11M20n13
$$ 101 -35 157 64 -53 -53 -329 -51 -95 -19 199 -40 68 -157 243 -161 -91 -127 362 174 -37 383 -130
6248a30K96l27R9K62l64M2J03K39l09O0j30K35R3l42P8q8K37p4p8J25O5j34J29
$$ -130 166 -161 -62 200 -164 -122 -19 220 -89 -29 -159 76 169 -173 -95 -183 54 -20 -98 27 92 -42 87
6271H7K48m04L23k48k9l5J53J03k93J76m0Pk35L71j20j41J57k42K11j65J33J00
$$ 87 335 -69 254 6 -23 -58 95 198 -95 81 41 48 -187 184 64 -77 80 -162 49 -116 17 117
6293A17q8O8j84m2J9L19l57J53j21J95j17j03M5J21K50m72L31k48R0j58N4J25
$$ 117 29 97 -87 -129 -110 209 -148 5 -116 79 -38 -141 -96 25 275 -197 134 -114 -24 -182 -128 -3
6315cl31M43r8J64l20K49J0j37L73m47J66r1R2k7j36J50q7J06l09J82K19j04k39
$$ -3 -334 109 11 175 -145 104 114 -23 350 -97 69 -22 70 43 -93 57 -30 76 -233 -51 168 64 -175
6338a75K81j35J27J96m53N45o15L66q0l63L66k5J80k37L12o1k11lk4L93o42M38
$$ -175 106 -29 98 294 -159 386 -229 137 57 -306 60 35 215 -22 290 229 18 15 -9 384 -258 180
6360A80m24J52jO1J15j23K82l42R2n3J18k4j64K62o2j01k71M20j88K26j37k51
$$ 180 -244 -92 -93 -32 83 -40 242 -100 -8 -61 57 33 -131 131 69 -32 -303 117 -71 155 18 -233
6382b33L75r0j69o8K02j08J68j1p4j25L4Mn4P5r4J58J37j20n5j9M41o34L02P7
$$ -233 142 52 -117 -185 17 -91 77 66 -8 -133 -99 -95 -149 -74 -168 -10 127 7 -48 -67 374 -260 42 119
6406A19p1p7j22K78q5Q8o9L7k92K42J83k09j06r0K12o6J65j1r8Q9k93L35q5Q6
$$ 119 48 -29 -151 127 42 130 61 98 -194 48 231 22 -84 -174 38 -28 137 126 28 117 -176 159 74 160
6430A60k19N1K50k43J9O4P6m02L17l02K85J70k74M2j03Q6K7L7P3p3N6j81K29k82
$$ 160 -59 -8 242 -1 18 82 158 -244 73 -229 56 226 -48 -6 -109 -23 4 41 114 41 97 -84 145 -137
6454a37J6l6K91M7l4j42j67J00j56J56k52M22k54J25K38k98O9J20O6Jl43J88J5
$$ -137 -121 -157 134 181 147 5 -162 -62 -218 -62 -314 108 -146 -21 217 -81 -12 108 174 175 -168 20 35
6477C5j48k8J94k23K35N5O9n7j52R9j69K61j88K18l03K00q4L6M5k90L31j32N9
$$ 35 -113 -141 53 -170 65 120 189 132 -20 79 -90 171 -17 201 -102 98 14 50 95 -195 136 4 63
6500F3j83K1L24m16L78k83J7mJ0K0j27L13l98L93j06p6k1l1K97k95K22k6p3p9
$$ 63 -120 -99 225 -191 187 -96 -79 -83 -73 -53 -180 133 -265 128 22 -54 -75 -106 191 -104 118 92 19 -60
6524f0N2j08k9K32k73K97k17J06j05j26J87j24K30k36M19k66r3j07J64M2j1K94
$$ -60 -8 -116 -145 87 -186 111 -106 0 -105 -231 -44 -168 62 -174 245 -21 -114 -221 -57 -15 -26 268
6546B68n34L93l12J28L01j95K1j89K41k09k30J39J57J57k9J08j85R9k9o9Q8k70
$$ 268 -266 127 -185 -57 244 49 70 -119 122 -87 -317 -178 -21 136 107 215 30 129 100 31 119 -151
6568a51K42j90L7Q8Ro6L4p4K56k62kJ47k44K46j34J06j29K73j28j92M36m15oj9
$$ -151 91 -99 -62 26 35 -31 3 -71 185 -77 -79 68 -176 70 -64 42 -87 186 58 -134 302 -113 -119 -138
6592a38K01k63J79J52o7o1j73L60k99P2k71L62l16K05R9j67K08j14j09K28k93
$$ -138 63 -200 -21 131 64 3 -170 190 -109 -37 -308 54 -262 -57 42 -125 83 -31 -140 88 -205
6613b05L82l33L03k76q3K61j45J01j41J51o1J40p9Q7m5l58M98kl29J07p0j00l2
$$ -205 177 -156 147 -129 -212 49 -96 5 -136 15 -46 94 15 102 57 -301 197 195 -134 -27 -97 -197 -229
6636b29L77j72J7m9J64n00L02j2K8J06k59K18j76K73p2Jj90L99m35K40L0k96M74
$$ -229 148 -24 -7 -56 108 -392 -90 -102 -74 32 -227 -9 -185 88 16 17 -173 226 -209 31 61 -235 239
6659B39l39j08P0J28L0KJ39k41O6j03J04o9N8k7l7P3k7J30k16j51J66j79L30o5
$$ 239 -100 -208 -138 -10 20 22 161 -80 -14 -117 -13 -82 -24 -51 -88 -15 -42 88 -128 -279 -113 -292 38 -27
6683b7rJ49j07j26Q8J09l62K38k33M43j23K91k88k60L09j38R1k16n0K66K27k62
$$ -27 -36 113 6 -120 -32 77 -285 -47 -280 163 40 331 43 -217 92 -46 45 -171 -221 45 272 10
6705A0l7J63k24L04j92J27l74K41j21J01K05j88m5K4k0O5j61K63k62K23k82L50
$$ 10 -27 136 -88 216 24 151 -223 18 -103 -2 203 15 -30 -6 -26 39 -122 141 -121 102 -180 170
6727A70m37K48k1o2L20k47K5l72M60J5rk35L14k46J28o6P6q7J04j3jl2Q3k20K47
$$ 170 -267 -19 -40 -102 218 -29 -4 -376 84 99 90 -145 169 -77 51 -15 61 -26 78 65 64 32 115 -105 142
6752A42k41K13K7k58r7J19K5j8J41n21N52J4k33J71j38J79j93P9k04L76L1k5r9
$$ 142 -99 114 141 -117 -214 -95 -70 -88 53 -468 84 98 -135 36 -102 77 -116 -37 -241 135 166 141 42
6775D2n9J20k17Q4q4R7j06n3Q4J52P4R5m91J66j6J62O2j19J94j94j6n0K3K4R4
$$ 42 -17 103 -114 -30 -114 -17 -123 -176 -92 60 134 229 -262 -96 -112 50 112 -7 187 -7 -23 -73 -50 -26 68
6800F8K23l66O8J80o9p4j09k1K73k29K5J26j49n9J76j10j27J15L2J63j01J51j95
$$ 68 291 -75 -7 173 104 30 -79 -100 173 -56 -31 95 -54 -113 63 -47 -174 -59 -27 136 35 186 -9
6823iN9m0J18q9n0l1r2J13m3J1J10j07k0R7J73k86J93k07J00R3j31K24k64N5j16
$$ -9 50 10 128 39 -11 -42 -134 -21 -64 -53 57 -50 -70 27 200 -86 107 -100 0 93 -38 186 -78 -23 -139
6848a39Qo6J86J31N2J9l95K68j01l3L6r3M2J13J57k81K88k80KJ6m7l9J48L00k68
$$ -139 -131 -197 -11 120 172 191 -204 64 -37 -70 -34 -127 -85 28 185 -96 192 -88 -86 -70 -117 -156 -8 292 24
6873B4j08l6K10Pk04L45m79K50j83K78k08O4J7q7J00LM3j85J36J4p3K02l48K79
$$ 24 -84 -120 90 97 -107 238 -241 9 -174 104 -104 -40 -23 -110 -10 -7 36 -149 -13 1 -72 130 -218 61
6897F1l75L40N4k24L33m90N14l11J49k42M87k56n3N2k82M64m80L26K9j66K4J28
$$ 61 -314 26 80 -144 189 -301 213 -98 51 -191 296 40 -13 39 -243 221 -259 67 96 -70 -46 82
6919H2J17m37K06j68J83j74L47k11K6j37L64omp9r9p5J45j83n7j06L82j51M2j1
$$ 82 199 -238 -32 -200 -17 -191 156 -55 -29 -166 198 192 188 109 10 -65 80 -103 -160 -266 116 -35 7 -4
6943dj77M80j95k26k0K62l61M04j19k2n8J10l12K21J98m1Rq9k62M08m80J51J00
$$ -4 -181 299 104 -122 -142 120 -241 163 44 22 -36 74 -238 -17 181 140 149 60 -202 206 -274 -123 -23
6966b3N5J48j97k8m1K44l09K66k99J12N2j36K74q1o6R0j24q5j98K25K27j27r0
$$ -23 32 180 -17 -45 -86 158 -151 115 -184 -72 -20 -156 118 37 -29 61 -63 -148 -346 -121 106 -21 -111
6989a11L07kql38K89j12o0M2k04K34N0k26o5J30Q3k03K31M1j71R4J71k47L28k12
$$ -111 196 194 186 -152 137 25 -35 7 -197 37 87 -139 -204 -74 9 -194 37 78 -93 1 172 -75 253 41
7013D1P3j60K36k55P8R6j74J32q2l1K69k91O22o63P8J73l88O9k1M13l31J90l19
$$ 41 114 -46 190 -65 13 109 -65 67 -15 -46 223 -68 554 -109 -31 142 -246 -177 -198 215 -116 74 -245
7036b45L18k59J96K6k26K60j67L08k91L58k88k25L94j48J74l36M3n1J24J78O1
$$ -245 73 -186 10 36 -190 70 -97 211 -80 278 -10 -235 159 11 185 -151 -108 -159 -35 143 204
7057B04k69J01k45N5J10k34L19J3j45j20Q4J36J12j45J8n9K24j51P0n1r9J17q4
$$ 204 -65 36 -209 -154 -44 -278 41 54 -91 -211 -127 9 121 -24 -6 -65 159 8 78 27 -72 45 -39
7080c9O1k16J59n0N04o39L41L7j84J38l71L41k1j9m4j48K79k02p8P1k1P4Q8m0
$$ -39 22 -194 -35 -85 419 -220 121 158 -26 112 -259 82 61 42 -2 -150 129 -73 -151 -80 -101 -27 61 21
7104B1K2Q9o9J1k76J54n6Nn3J45R6k62K37j63k6qJ65m3K9K43j96Q0j79J37j1p4
$$ 21 43 132 63 74 -202 -48 -104 -99 -152 -7 89 -173 64 -99 -125 -133 32 -11 18 261 65 145 -34 103 92 18
7130A8J76k26j16k3M84l10k9n2K4P4r8P2j18L56m16J17J42%j63rJ50k79L24l50
$$ 18 194 -32 -148 -171 313 3 -26 -78 -54 20 -78 -6 -124 232 -184 -67 75 75 -88 -97 53 -226 98 -252
7154b52K35K42l0j62l64J39M4Q7L2o1M4K56l3l23K69k0L9j36r4K00R2l82L2K16
$$ -252 -17 225 195 33 -331 -192 -148 -61 -29 -90 -46 210 177 -146 123 103 142 6 -88 112 204 -178 -146 70
7178G0j39L10k66J59o8j37J30k37J19m9Q8n8K9Q9m00O22l07j47K24q9k24L62j21
$$ 70 -69 241 -25 134 66 -71 59 -178 -59 -108 -20 -78 -49 40 -360 262 -45 -192 32 -57 -281 81 -40
7201d0j39L42k53P5R2kj19k9K25j96K93l89J55M8J15m19JR6P2K78l91J84k2j64
$$ -40 -179 163 -90 -15 77 75 -44 -73 152 -44 249 -140 15 63 178 -241 -240 -144 -72 206 -185 -1 -23 -187
7225a87R1j82K00J48j21j21n2J04mJ78j22J12r1K70k34o2LJ14rL0J25k92J95j27
$$ -187 -96 -278 -78 70 -51 -172 -224 -120 -124 54 -68 44 -47 223 -11 -73 -70 44 35 65 190 -102 93 -34
7249c4r1J18j43J86j07L57l19J41N6j45J75j94O6J43l22M8J97j23K74j88m1K3
$$ -34 -125 -7 -150 36 -71 286 -33 108 164 19 194 0 66 209 -113 -65 132 9 283 95 54 77
7271G7l7o7l1Q5l05L07m1j63L45k3K1k53K48j74J96j18k17K71m41L19n0N53o09
$$ 77 40 -27 -58 27 -278 29 -12 -175 170 147 168 -85 163 -11 185 67 -150 121 -320 -1 -51 502 -107
7294a07j26J75L41j81R5k57k12L94o8n7J95j23j16j55K85Q1k79J36p9R9L01j03
$$ -107 -233 -58 283 102 197 -60 -272 122 54 -3 192 69 -47 -202 83 164 -115 21 -58 41 342 239
7316B39l98R1J76p1nr4K11j62l7Q7K11P0k87n0Q0J23k02J67p4J22o5j83j91K11
$$ 239 -159 -68 108 37 32 -62 149 -13 -50 37 248 318 31 -19 61 184 -18 149 75 197 132 -51 -242 -31
7340c1%Q0j05J39k5K1o8L1j37J59l10L31l5j26J06R1M5m81L24O5K4m14K76M24
$$ -31 -31 49 -56 83 58 79 11 42 -95 64 -246 85 50 -76 30 121 166 -315 9 74 98 -316 -40 384
7364C84n82M03k29L8J41j51j1j90J89K5J90l02n6j30M33j09j28O2R1Q4O2k1j34
$$ 384 -198 205 -24 14 155 4 -7 -197 -8 17 207 -95 -151 -281 152 43 -85 -23 68 152 214 193 59
7387E9k77K25O5K6k32O0J05Mk2N8j31q0K71l05J21j1J23J4N4q6j50m9o3K31l5
$$ 59 -218 7 72 98 -134 -74 31 35 13 71 -60 -140 131 -174 -53 -64 59 73 127 41 -109 -158 -221 10 -25
7412b5J65j70n1M09n14K38j33Q5J86m87M06k85L12O8m66K40Q5n2j7J85l39J84
$$ -25 140 -30 -81 328 -186 52 -81 4 190 -297 109 -176 136 204 -262 -22 63 11 -6 179 -160 24
7434B4k05K09k56L90K6l82K06J24j00Q0J2k66L26j06k83J78k05K74j06j9L03l13
$$ 24 -181 28 -228 162 188 -194 12 136 36 116 128 -138 188 82 -201 -23 -228 46 -60 -79 224 -89
7456h9j04P2K94n00M12l27R3J77J06j39l25M23oR9k54K65j77K9NN6k7J95l86r0
$$ -89 -193 -121 173 -327 85 -242 -149 28 134 -5 -330 93 87 186 -68 197 20 49 54 110 83 278 -108 -198
7480a98J52J11pL81n55M87l35j6j62P7l3J30l3m7K79m60R2mo5J46Q9j7k04J55
$$ -198 -46 65 58 439 -116 371 36 20 -142 -65 -98 32 -1 -48 231 -229 -137 -141 -206 -60 29 12 -192 -37
7504c7m9J98R5m91K58k08L88o01O09j46J76k99l0R2j15J36k2J24m1j69J03J02
$$ -37 -86 112 207 -284 -26 -234 154 -447 162 16 192 -107 -137 -45 -160 -24 -46 78 37 -132 -29 73
7526G3n2n3K50m08J61J40j80J25m6o5nJ51m06K33Q9m4L36l33L04m08J77m5l0n0
$$ 73 21 -32 218 -190 -29 111 -69 56 10 -55 -60 91 -315 -82 7 -37 299 -34 270 -138 39 -6 -36 -86
7550h6N7J81j22R3j79J61k14O7J05j5R3o4j24n8L29m33J80oR9J12lo5j02K37j6
$$ -86 -29 152 30 123 -56 105 -109 -42 63 48 141 77 -47 -105 224 -209 -29 -35 64 176 173 108 6 243 227
7575B27m41K38j98L16m21N22n5k72M4OK19k91P7O9K1M0j17q3j14J15J81P3j86
$$ 227 -214 24 -174 142 -279 243 188 -84 -40 -34 185 -106 -29 40 61 101 -16 -99 -213 -98 83 156 -30
7598c0J43j35K8L9M5Q5l64K11o0J88l77K01J31k63K27j09K92p7k5k3j89J1M8l2
$$ -30 113 -22 6 45 90 175 -189 22 -38 150 -227 -26 105 -158 69 -40 252 175 150 127 -62 -51 -3 -35
7622c5p2J85Mp9rL6J82k77K1l57L64j11Kq2J67J35j80J13k10L75r2Pl85K34M4
$$ -35 -107 78 82 3 -6 30 212 -65 -44 -401 -37 -148 -146 -228 -61 74 -106 7 -203 172 80 87 -298 -64 -20
7647b0k24L65j04pj50J55o4nL00k81j45K09J39m73l7N35k06J36r4j95J45P3m15
$$ -20 -244 121 17 10 -140 15 -49 -54 246 -35 -180 29 168 -305 -342 193 -13 123 29 -166 -21 52 -363
7670c63J73N35n43M65k04k01M8K8K33k23K23j09j19Q5J12l9Q7j14k93J47N4L35
$$ -363 -190 345 -198 267 63 -138 -90 -62 171 -52 171 62 -57 28 140 101 188 74 -219 -72 -18 317
7692C17j90j09K29m98K12J99j88J13j22K73j19k87R1O6j01P1j92K89J34k04K5
$$ 317 127 18 247 -251 -39 160 -28 85 -37 236 117 -170 -79 -13 -114 -43 -235 54 188 -16 9
7713Ir4J65l57L19J60j92q1o4K57j72K55k54J78j24k34K92j28M8j51M34m64M1
$$ 9 -85 80 -277 42 202 10 -71 -135 122 -50 205 -49 129 5 -229 63 -65 -17 -168 266 -198 -157
7735a57o2R5J43k70J90j72K20j60Q3J45Q5N6j83J20j56k96M46j52NJ72k35j54
$$ -157 -219 -124 19 -251 -61 -233 -13 -173 -90 55 140 196 13 133 -23 -319 127 -25 -20 152 -83 -237
7757b37L23k27Q4j56M9L23k71K54l55J80J40O9j48l08M01k17K40j76J86k44L07
$$ -237 86 -141 -57 -213 -164 159 -112 142 -213 -33 107 176 28 -280 121 -96 144 -32 154 -90 217
7778B17j24K6j73k05K80r4J56j87R9O5j79J97q8J90k40L74k82p1K0m7l8j82J96
$$ 217 93 119 -54 -259 21 -73 83 -104 -5 60 -119 78 -10 180 -60 314 32 -39 -19 -66 -104 -286 -90
7801i0J33l0j66K86J84n91L99k62J65lN5M9l5j13J44r3k56L90l5j30L4l4j76K58
$$ -90 43 13 -153 133 317 -274 125 -137 28 25 80 129 94 -19 125 32 -224 166 131 1 35 1 -175 83
7825H3lO2n2o0p9P8r7J59j20oNJ70j01R0j58k55J63J27R5j00K1j72J90O6j29J38
$$ 83 80 142 90 30 -49 29 -68 91 -29 -35 -30 140 39 129 -29 -284 -121 6 101 1 22 -150 40 106 -23 115
7851A15k93M26Km17j9K0L42k86K22k92K68j06Mr1Q5j5j22K05j04L13j44j38J24
$$ 115 -178 248 250 -167 -186 -166 176 -110 112 -180 88 -18 -14 -105 -20 -35 -157 48 -56 257 113 -25 99
7874I9m35M99j98j13L4J37Kj18K89k87O3k92K59J15j87j9k61N63j62J85m37O33
$$ 99 -336 163 -35 -148 -114 23 25 -93 196 -91 -28 -320 -61 54 -133 -152 -413 150 -12 173 -264 369
7896C69o40M22k18j2K04k9J41m36K41p5L9k1Q5j6k50K28ok5j56P9J99j25J19m3
$$ 369 -271 151 -67 -79 125 96 237 -199 42 -33 6 -15 70 54 -196 32 26 1 -155 -76 123 -2 117 74
7920G4r7K48k48k30J85K59L5n2k71L57m06L29j23k25J84k85K80J14N8n20L39J25
$$ 74 -23 225 -23 -253 -68 191 226 174 -97 260 -146 183 60 -165 19 -266 14 128 186 -334 5 130
7942A30j54Q4j58L19m23K24j52L6J29M9P5m23L26n8J82k55j37K67k03K25r7K21
$$ 130 -24 60 -98 221 -202 22 -130 -94 35 84 159 -264 62 4 186 -69 -206 61 -142 83 -14 207
7964B07k98J62N0M6j43q1p6l6N1M5J02k50L96k39J13l7J96j31k94K39j13j98M58
$$ 207 -91 71 121 167 24 -57 -133 -169 -118 -73 29 -221 175 -64 49 12 208 77 -217 22 -91 -289 169
7987A69l41J44J80Q2l05J3K09m16J52K27q6l07P4K41R6J21m36J72k46M31l03J65
$$ 169 -172 -28 152 234 -71 -58 151 -265 -113 114 28 -279 -205 36 132 253 -183 -11 -257 174 -129 36
8009C6l6k3r0l0K16j52K74k93J13K7M5R3l44K04j6K36k92n6q9kM39j91M6k45K92
$$ 36 0 -23 -113 -143 73 -79 195 -98 15 42 87 180 -164 40 24 260 -32 -88 -177 -179 260 69 115 -130 162
8034A62l48L06Ll77L83p5K53j97j74j55K53j00j08J28J01Q3j42J1o4Q8k46L31
$$ 162 -186 120 123 -254 129 54 307 110 -64 -219 34 -66 -174 -46 55 138 -4 7 -57 31 -215 116
8056A16pk71n7J69j53R0p4L35k72J35j14l0P8l1J28j37q6K48K8j70j1J49P1j28
$$ 116 109 -162 -219 -50 -203 -113 -187 148 -124 11 -103 -133 -55 -86 42 -95 -181 67 95 -75 -86 63 134 6
8080FLp5k7J11k51M07j48j49L33k2p2q5k3n3J44j42K07k21J54r4j62K93j44lJ27
$$ 6 9 -66 -93 18 -233 174 26 -123 210 188 116 31 8 -45 99 -43 164 -57 97 3 -159 134 -10 -13 114
8105A14m3L6k28K37j7R2j09r8O6N8r7J67k03N2P8j4k33K59p5l5p3K73j39l8Nj67
$$ 114 71 107 -121 116 99 191 82 -16 50 108 11 178 -25 27 105 91 -142 117 42 7 -66 207 68 30 35 -132
8131a32J81l83K59j26Q1R8k05L16p8p8k5J15j91L29n7j42j02k02N09l7j18k20
$$ -132 49 -334 -75 -201 -120 -22 -227 89 11 -67 -92 23 -168 161 104 -38 -140 -342 167 130 12 -208
8153b08K72l22O9M14l95J34J87m4J2J0k04r4J65L8K23k52PR7j50J52l87L05l1
$$ -208 64 -258 -189 225 -170 -36 151 107 119 129 -75 -169 -4 34 257 5 12 109 -41 111 -276 29 -2
8176bK52j1l66K40j52j38q8L71l94J31O0J77k72K45M
$$ -2 250 239 -127 113 -39 -177 -265 106 -288 -157 -97 80 -192 53 57
8191E7
$$ Imaginary data points
##PAGE= N=2
##DATA TABLE= (X++(I..I)), XYDATA
0@%%%%%%%%%Qj6J6j6K2l0L2m0N6o9P7r4J18j36J60j92K24k56K96l44L93m48N10
$$ 0 0 0 0 0 0 0 0 0 0 8 -8 8 -8 14 -16 16 -24 32 -37 40 -54 64 -72 88 -104 120 -136 160 -184 209 -239 271
32B71n80O59p43Q35r39J052j176J313j460J622j799J993k204K433k685K961l263
$$ 271 -309 350 -393 442 -497 555 -621 692 -768 854 -945 1048 -1156 1277 -1408 1553 -1710
49a710L592l954M354m797N291n844O463p165P970q904J0001j1309J2902j4886
$$ -1710 1882 -2072 2282 -2515 2776 -3068 3395 -3770 4200 -4704 5297 -6012 6890 -7996
63g996J7436k0850K5673l3030M5710p3357K30618n9444k70752L22648k15730J09873
$$ -7996 9440 -11410 14263 -18767 26943 -46414 184204 124760 -145992 176656 -39074 70799
75G0799K4510j23795R1752l0085R182Q8952j99922R0196N9518j11817J14946p2931
$$ 70799 95309 -28486 63266 33181 42363 131315 -68607 21589 81107 -30710 84236 11305
87A1305k8663O4230N722o0742k2160P3940q0784Q3341k6318m4439K9164k3091
$$ 11305 -17358 46872 52594 -8148 -30308 43632 -37152 46189 19871 -24568 4596 -18495
99a8495N5326o9760j7301Q4906o1309J4653O7617j53017Q9016L7880r7651Q9636
$$ -18495 36831 -32929 -50230 34676 -26633 -11980 55637 -97380 -8364 29516 -68135 21501
111B1501q6015Q2575j7604m9055Q7491j19582N2928O3866p7114J9217L1082l5810
$$ 21501 -64514 18061 457 -48598 38893 -80689 -27761 36105 -41009 -21792 9290 -26520
123b6520L3223k0568q169J207m876P1683p8048K8467Q274j4056J1316k5519N0065
$$ -26520 6703 -13865 -22034 -20827 -25703 45980 -32068 -3601 4673 -9383 1933 -23586 26479
136B6479p3423O9492J9623p9838N0916j3434j2741K7508k1158M981J8513k9595
$$ 26479 -46944 22548 42171 -37667 13249 -185 -12926 14582 -6576 -1595 16918 -12677
148a2677O0042p8679J4128N9236r4803R3706l5860k4909M1537k1522Q707l3692
$$ -12677 47365 -31314 -17186 42050 -52753 40953 5093 -19816 21721 199 8906 -24786
160b4786K5733R885k0093J5346K0319n5701L0599J8837m3680J8248N434J8401
$$ -24786 947 10832 -9261 6085 26404 -29297 1302 20139 -23541 -5293 141 18542
172A8542m1917N0918k8529l5391N9956l8187J8060j7124K7894p616k6176M1327
$$ 18542 -23375 27543 -986 -36377 23579 -14608 3452 -13672 14222 6606 -19570 21757
184B1757l6421j4121M8647j4587l0782N4091m0943J1047J945j0369J5114m1630
$$ 21757 -14664 -28785 19862 5275 -25507 28584 -12359 -1312 633 -9736 5378 -36252
196c6252P5615m5068j2027M2333m0789O827J2234Q87k3753K8952M906j4565j3382
$$ -36252 39363 -5705 -17732 24601 -16188 -9361 2873 3760 -19993 8959 13865 -700 -14082
209a4082K2206j3220j6477M5350l3187P490K122K0758l5621l014M2791n7395M8553
$$ -14082 8124 -5096 -21573 23777 -9410 -1920 202 20960 -14661 -17675 25116 -32279 16274
222A6274o453j8719J3772n132O079j8602P115J4867j1429l662M0883o2509K3833
$$ 16274 9821 -8898 4874 -258 5821 -12781 -5666 9201 -2228 -5890 34993 -27516 -3683
235c683K8110n0450L3140j1963J9699k1988J3894O969l7522K6209L007n026j2688
$$ -3683 24427 -26023 7117 -4846 14853 -7135 6759 13728 -23794 2415 5422 396 -12292
248a2292L0578j8846n973J6443j5299j1403J9511J4902l9700L9690j8846l406
$$ -12292 18286 -560 -6533 9910 -5389 -16792 2719 17621 -22079 17611 -1235 -4641
260d641M009p394J7863m0405N5100j8208k5303L3970j8146j0921J6441K452j7618
$$ -4641 -632 -8026 9837 -30568 24532 6324 -18979 14991 -3155 -14076 2365 4817 -12801
273a2801J8702j009P719l3978K7831K891m0392N6208k8072o11Q028O272j3099
$$ -12801 5901 4892 12611 -21367 6464 9355 -31037 25171 -2901 -3512 4516 10788 -2311
286b311j2368K9765k5885J5274N351m356j0866J3405j360j7616J2767O517m103
$$ -2311 -14679 15086 -10799 4475 9826 5470 -5396 8009 6649 -10967 1800 8317 4214
299D214j3676M4315n0050P314L2752m3251K8073j3790J9053j2638n696K1702k9207
$$ 4214 -9462 34853 -15197 -7883 24869 -18382 9691 -4099 14954 2316 -3380 18322 -10885
312a0885K801K3052j5650r454L4485l2888J1569K215r198J612q262L4509l8974
$$ -10885 -8084 14968 -682 -10136 24349 -8539 3030 5245 -3953 -2341 -10603 23906 -15068
325a5068K0396M997j9447P004p97Q310k3776K9312k942j7482Q815N820j8216P684
$$ -15068 5328 10325 -9122 -2118 -2915 5395 -18381 10931 7989 -9493 -678 5142 -13074 -5390
339e390J3364k0759J8790j0563J6540k7552R540J7913l9952M2925j6948m118R121
$$ -5390 7974 -12785 6005 -4558 11982 -15570 -6030 11883 -28069 14856 -2092 -6210 2911
352B911k042k825j0834J5038m127l982Q869R556l2089K8663o270j8142J9657r215
$$ 2911 869 -1956 -12790 2248 -1879 -5861 3008 12564 -19525 9138 2868 -15274 4383 -4832
366d832J8010k8084L0938j2422k4147L5977k0503Q77M766R000r375o53M789k445
$$ -4832 13178 -14906 16032 3610 -20537 15440 -5063 -4186 580 9580 205 -448 4341 1896
380A896j4841J9739M013k9217M0993k7019M137M973j0863J1516j9741L4063k2281
$$ 1896 -12945 6794 10807 -18410 22583 -4436 -299 4674 -6189 5327 -14414 19649 -2632
393b632l119J9170j6054n073J2338l118j0364J8270n806J054j5923K3305j5400
$$ -2632 -5751 13419 -2635 -7708 4630 1512 -8852 9418 3612 4666 -11257 12048 -3352
406c352j0694L3876l1484J7630k357L986j1772l644K2344k7111J5676P383j1043
$$ -3352 -14046 19830 -11654 5976 3619 7605 -4167 -7811 14533 -12578 3098 10481 -562
419e62j960J5227j5962j814Q288j19J791j1712L0321l6564J4786J3659l1572K4490
$$ -562 -2522 12705 -3257 -5071 3217 3098 4889 -6823 23498 -13066 1720 15379 -16193 8297
433H297q792R579j0640N991M276j8205J0744Q000j7023N263K0890k9349J7052
$$ 8297 -495 9084 -1556 4435 8711 -9494 1250 9250 -7773 -2510 18380 -10969 6083
446F083o134k776j300r49J9906l4035K9075n242j5643J1290m541P17o964J7840
$$ 6083 -51 -2827 -4127 -5076 14830 -19205 9870 4628 -11015 275 -4266 -3549 -10513 7327
460G327r915n254O543N254k1867J4839N941k0730K5145j3607P503j4836J1565
$$ 7327 -2588 -7842 -1299 3955 -17912 -3073 2868 -17862 7283 -6324 1179 -13657 -2092
473b092L079k3456L0190j4680Q64O096n85j0031L029O784o984K441L090P271k0422
$$ -2092 987 -22469 7721 -6959 -6095 1 -584 -10615 -7586 -802 -7786 -5345 -2255 5016 -15406
488a5406K4168j5015q473J9867j2166R759j1665J8646j5416k466J6263j7541M618
$$ -15406 8762 -6253 -14726 5141 -7025 2734 -8931 9715 -5701 -8167 8096 -9445 -4827
501d827P958K985j3338J2946m733l683j593R972m026j2443L1529k5155N693L019
$$ -4827 3131 6116 -7222 5724 991 -2692 -4285 5687 1661 -10782 20747 -4408 1285 4304
515D304n006L420o637J8591j9052R770N853r056m311R667l916n166J5956j2439
$$ 4304 -702 2718 -3919 14672 -4380 5390 11243 2187 -2124 7543 3627 -1539 14417 1978
529A978N525o619J2767j5375n17J8560k1411J7059n297J072r069P383L228j6007
$$ 1978 7503 884 13651 -1724 -2241 16319 -5092 11967 6670 7742 -1327 6056 9284 -6723
543f723J5162k286j318l114J0632j6782L408Q468p936K769l465J4824k3179J5832
$$ -6723 8439 6153 4835 1721 12353 -4429 -1021 7447 -489 2280 -1185 13639 -9540 6292
557F292k955j5262J6008m775L968j1309J4632p922o071P867l197n949N407J2496
$$ 6292 3337 -11925 4083 -692 3276 -8033 6599 -1323 -7394 473 -2724 -8673 -3266 9230
571I230k1637J3509m235j295k972L502N494j7242K4969j3300k675K648J106j632
$$ 9230 -12407 1102 -3133 -4428 -7400 -3898 1596 -15646 9323 -3977 -6652 -4004 -2898 -4530
585d530l619J4628j4821O156M854k343j2000J2874j021r223J7046j1503N461q175
$$ -4530 -8149 6479 -8342 -2186 2668 325 -11675 1199 178 -9045 8001 -3502 1959 -6216
599f216J3636j0073q034K1168j5644P701K92J173j0652Q605L412j1653P569K119
$$ -6216 7420 -2653 -10687 10481 -5163 2538 2830 4003 -6649 1956 5368 -6285 1284 3403
613C403J564j0316J5844j5561P26J0337p014K782o241J7346j9695Q683L192j3894
$$ 3403 4967 -5349 10495 -5066 -4340 5997 -1017 1765 -4476 12870 -6825 1858 5050 -8844
627h844R609J745J785j1055J2622o278j907K87M319p103K25J8370k3143J1220
$$ -8844 765 2510 4295 -6760 5862 -416 -2323 -2036 2283 -4820 -4595 13775 -9368 1852
641A852k197q75j551M47P816j6120J8683o124n427r2N771m150k331J1637j1401
$$ 1852 -345 -1220 -2771 -2324 5492 -10628 8055 1931 -3496 -3588 2183 -1967 -4298 7339 -4062
656d062M727K75N679j6225J0207M353j2225J6353j1095N532q359J0826l736j1423
$$ -4062 665 940 6619 -9606 601 4954 -7271 9082 -2013 3519 -4840 5986 2250 -9173
670i173J6162o591R67R86L918j3183R690R97n431K037l21R182j6388J6486j1387
$$ -9173 6989 398 1365 2351 6269 -6914 2776 3773 -1658 379 58 9240 -7148 9338 -2049
685b049m088J2024n743K905p853J3728j1780K940L349o781j68O088L566j3595
$$ -2049 -6137 5887 144 3049 -4804 8924 -2856 84 3433 -3348 -3516 2572 6138 -7457
699g457J2623p120K263l671N099k701p633K1256j8482M973l64k50r06q81P823
$$ -7457 5166 -1954 309 -3362 1737 -964 -8597 12659 -5823 -850 -1214 -1464 -2370 -3251 4572
714D572j2643R800J086l110q281J1086n028k377J0642j1097O682o250J1728j3357
$$ 4572 -8071 1729 2815 -295 -8576 2510 -2518 -4895 5747 -5350 1332 -4918 6810 -6547
728f547Q41J1514j3012J1511m301R71o839R108j952p298O835P86m06m031J1648
$$ -6547 -5706 5808 -7204 4307 6 977 -5862 3246 1294 -6004 831 1617 1211 -2820 8828
743H828j6983Q348L434n057K598l980J2621j6783J2733l162r433R721N58j154
$$ 8828 -8155 193 3627 -1430 1168 -2812 9809 -6974 5759 2597 -6836 2885 3443 2289
757B289o175J1529q938K024OK455p644M765J0593j8773J3548o270J764l008K441
$$ 2289 -3886 7643 -1295 729 735 3190 -4454 311 10904 -7869 5679 -591 1173 -1835 606
772F06K919j1022J6699r610j170Q11L018n639K966M969r782P179j838M064j3350
$$ 606 3525 -7497 9202 -408 -1578 -767 2251 -3388 -422 4547 -5235 1944 106 4170 -9180
787i180J2217k457p642J4288j0614M396n318R079q029k010R786p987L450J256
$$ -9180 3037 580 -7062 7226 -3388 1008 -4310 4769 -3260 -5270 4516 -3471 -21 1235
801A235J600j1547J2740m140m080M419L99L104j0390J5894j4737J772Q012n353
$$ 1235 2835 -8712 4028 -112 -4192 227 626 3730 -6660 9234 -5503 -3731 4281 -1072
815a072J734k933R447j1593O924o50l647m66O087j066p921J3343j1351M852k840
$$ -1072 662 -2271 7176 -4417 2507 1857 -1790 -2256 3831 2765 -5156 8187 -3164 1688 -1152
830a152M058m207k032J3844j5896Q478k221p96k294L777Q21p581R818m575J16
$$ -1152 2906 -1301 -3333 10511 -5385 3093 872 76 -2218 1559 2380 -5201 4617 42 158
845A58l917Q073q151J455Q264j0525P180m733O925j2320O496L755r030R879m704
$$ 158 -3759 4314 -3837 -2382 5882 -4643 2537 -2196 4729 -7591 -1095 2660 -6370 3509 -1195
860a195J616o002R358p529n72N511k474J018k848Q787j4472J0216j240l880K998
$$ -1195 421 -5581 3777 -3752 -4324 1187 -1287 -269 -3117 5670 -8802 1414 174 -3706 -708
875g08p51N905j1558J2510q111p12M517k47r75k623R398j0651N771j684Q54l901
$$ -708 -1459 4446 -7112 5398 -2713 -3425 1092 845 -130 -2753 6645 -4006 1765 81 935 -2966
891b966N307L242j1565J2917q032K622k781M460k326l780J2106j1315L892j127
$$ -2966 2341 5583 -5982 6935 -1097 1525 -1256 3204 878 -2902 9204 -2111 1781 654
905F54L243o681M898K396p479P683l270J967q757J1324o320j880Q482q440M973
$$ 654 3897 -2784 2114 4510 -2969 4714 1444 3411 -5346 5978 -342 -2222 6260 -2180 2793
920B793m323P521j0741L990M643o558M356q48J425q022J0957o723j329L152M60
$$ 2793 -1530 5991 -4750 -760 3883 -2675 1681 833 2258 -5764 5193 -1530 -2859 293 753
935G53K46n463J1137j3908P621O57l435R30j37N847j0956J0097n443j344J841
$$ 753 999 -4464 6673 -7235 386 1043 -2392 -1462 -1599 4248 -6708 3389 -2054 -3398 -1557
950a557L509l275l396J0433j0358M752k481L727n940M292N712j2675J0933n048
$$ -1557 1952 -1323 -4719 5714 -4644 108 -2373 1354 -4586 -294 5418 -7257 3676 -1372
964a372J742l776N144j709m277J0061p056P16j744O537q946N374K640o919O708
$$ -1372 370 -3406 1738 29 -4248 5813 -1243 -527 -2271 4266 -4680 694 3334 -3585 3123
979C123l628M312r933J0143l456l706P874n582K418l548P686r661L285L659l375
$$ 3123 -505 3807 -6126 4017 561 -3145 4729 -853 1565 -1983 5703 -3958 -673 2986 -389
994c89R51J77L225j0442J1694o287m01J970J25J909p161J1145j1311M029K054
$$ -389 562 739 3964 -6478 5216 -1071 -1472 498 623 2532 -4629 6516 -4795 -766 1288
1009A288k114r19J000M536q993P614l747M32k688O107k677n176J0710r646M886
$$ 1288 -826 -1745 -745 3791 -5202 2412 -1335 -903 -3591 2516 -161 -5337 5373 -4273 613
1024F13l529M427m481J305O634j0234P202l240K039m526N591j649l237P016m590
$$ 613 -2916 1511 -2970 -1665 4969 -5265 1937 -1303 736 -3790 1801 152 -3085 3931 -659
1039f59J688n106R396r281L954L871o838O072l758N009r055P353q48l471M536
$$ -659 1029 -4077 5319 -3962 -8 3863 -2975 3097 -661 4348 -4707 2646 1798 -1673 2863
1054B863j427L64m439Q899q922L124J474k73o01j664O765j1713R612l717q18N27
$$ 2863 1436 1800 -2639 6260 -2662 462 1936 1663 1062 -602 6163 -5550 4062 345 -473 54
1070E4P82K611p725R103p270J786N27K393m275R35N001q533O810m356L184n205
$$ 54 836 3447 -4278 4825 -2445 -659 -132 2261 -2014 -1079 3922 -4611 2199 -2157 1027 -4178
1086d178N473L27p475R777o919L067l712N494m734M48O065p005L054j869M423
$$ -4178 1295 1622 -5853 3924 -2995 72 -3640 1854 -2880 -2432 3633 -3372 -318 -2187 2236
1101B236p913P514j874l489N751l505L124p584J0211o835P42M888m989K572k163
$$ 2236 -5677 1837 -37 -3526 2225 -1280 1844 -5740 4471 -2364 -1622 3266 -1723 849 -1314
1116a314N558q754O047nj933R34R34J013o824J0999q967K550R30N91l42l146Q074
$$ -1314 4244 -4510 1537 1532 -401 533 1467 2480 -4344 6655 -2312 238 1168 1759 1417 -1729 6345
1133F345j0519O607q31j306j207K893J044o771Q237o129K079j804M982n086l62
$$ 6345 -4174 2433 1602 296 -911 1982 3026 -3745 4492 -1637 442 -1362 3620 -1466 -1828
1148a828O983r245O198l696L421n060M251J242o857P312l823J131l900O630n481
$$ -1828 5155 -4090 2108 -1588 1833 -3227 1024 2266 -4591 2721 -1102 29 -3871 2759 -2722
1163b722J049M022m881K631k985O511r403O702lm327M848k814K546n871P957n121
$$ -2722 -1673 2349 -2532 99 -2886 3625 -5778 924 921 -3406 1442 -1372 1174 -4697 3260 -1861
1179a861p7K923j478j8j582O237r434O807j036n00o78M59L372p777Q973n952J252
$$ -1861 -1938 985 -493 -511 -2093 4144 -5290 1517 481 -19 -697 -238 3134 -4643 4330 -1622 -370
1196c70O70J204q54k879O692p501M627j579J747l483L454J703o773O804m586L073
$$ -370 300 1504 650 -2229 4463 -3038 1589 10 1757 -1726 1728 3431 -3342 3462 -1124 1949
1212A949l884N048l016k324O956o714L903l354M662n708L310J705n088M512k320
$$ 1949 -1935 3113 97 -2227 4729 -1985 1918 -1436 3226 -2482 828 2533 -2555 1957 -363
1227c63K927o473P364m479l38L670l525K193m044P405q183M214Q20k856K300j703
$$ -363 2564 -3909 3455 -1024 -1362 2308 -1217 976 -3068 4337 -3846 368 1188 -1668 632 -1071
1243a071L257p151P629l761k82Q86Q51l53l412P358q360M746m33P13k407N08M511
$$ -1071 2186 -4965 2664 -1097 -1379 -493 358 5 -3407 3951 -4409 337 -96 617 -1790 -1282 3229
1260C229q172P398l859J132j318L235j228l710O724n885L278k076L994n175K895
$$ 3229 -4943 2455 -1404 -272 -1590 1645 417 -3293 3431 -2454 824 -1252 2742 -2433 462
1275D62K861o835N844l633L675n090N627k359k873N782m419K167l309N771n852
$$ 462 3323 -3512 2332 -1301 2374 -2716 2911 552 -2321 3461 -958 1209 -2100 3671 -2181
1290b181L141J292l802K506j165L272p423P714l582r06K846k298J526m217P428
$$ -2181 960 2252 -1550 956 -209 3063 -4360 3354 -228 -1134 1712 -586 940 -3277 4151
1305D151p018K308J667j587n3j24L035p172P041l052J51r82K266m26m346P808
$$ 4151 -2867 -559 1108 -479 -532 -656 2379 -4793 2248 -804 -653 -1635 631 205 -4141 3667
1321C667p354L384m03J562k902L65M416o657N257k114J071k732M480j640l281
$$ 3667 -3687 -303 -706 856 -2046 -1681 2735 -3922 1335 -779 292 -2440 2040 400 -2881
1336b881N824m880L253l026M754m926J835L817o064M316k753L634m869N017j680
$$ -2881 2943 -1937 1316 -1710 3044 -1882 -47 3770 -2294 2022 -731 2903 -1966 3051 1371
1351A371k621M138k161J069l302O486o338K801J336l120J966j827M442p114N828
$$ 1371 -1250 2888 727 1796 -1506 4980 -1358 1443 2779 -341 1625 -202 4240 -2874 2954
1366B954j879j235J399q29R99l895O449n427J756%M26j354m04L918p062O185k917
$$ 2954 1075 -160 1239 410 1409 -2486 3963 -1464 292 292 718 -636 -1040 2878 -4184 2001 -916
1383i16J236j965J764Q10n090O694n127K186j345K902l162j2L765n550M542k719
$$ -916 320 -1645 119 929 -4161 2533 -2594 -408 -1753 1149 -2013 -2025 1740 -3810 732 -1987
1399a987K999m777M461k20l864M818l710L318l869N166l970M45L181l890K402
$$ -1987 1012 -3765 696 476 -3388 1430 -2280 1038 -2831 2335 -1635 -1190 1991 -1899 503
1414E03k088L935n339N053j445j966K450j348K288n146O852n233J682J076j404
$$ 503 -1585 2350 -2989 2064 619 -1347 1103 -245 2043 -3103 3749 -1484 198 1274 -130
1429a30P82k272N342o374M192j077j64n41Q36J199m742O312m725J887j292K204
$$ -130 652 -1620 3722 -2652 1540 463 299 -242 594 1793 -2949 3363 -1362 525 -767 1437
1445A437j728j595N194o471M345j613J475k819K091J210m804N140l258J701k627
$$ 1437 -291 -1886 3308 -3163 1182 -431 1044 -1775 316 1526 -3278 1862 -1396 305 -2322
1460b322M412l265o19L759m350L005k462L841n166L436R17m133L818k001J807
$$ -2322 2090 -1175 -1794 1965 -2385 620 -1842 1999 -3167 269 1186 -2947 871 -1130 677
1475F77l622N161l565j01K807k306O19j665N075o445M631r49j328R46l86K537
$$ 677 -2945 2216 -1349 -1450 1357 -949 -330 -1995 3080 -3365 1266 317 -1011 -65 -451 2086
1491B086n589O583m009N45J019J4o61j433N145o258L919j194O83j575J409J323
$$ 2086 -3503 3080 -929 -384 635 649 -12 -1445 3700 -2558 1361 167 850 -725 684 2007
1507B007n019O366m021J505j250K354j429j769M698n173L332j472J991l509K350
$$ 2007 -3012 3354 -667 838 -412 1942 513 -1256 3442 -1731 1601 129 2120 -1389 961
1522I61J262m116M106k967K447l195M549l452p89L289k985K050k477L802m562
$$ 961 2223 -1893 2213 -754 1693 -1502 3047 -405 -1194 2095 -890 1160 -1317 2485 -2077
1537b077K806P41k978K200j134K247m616N381l734L20J847j655P90k317M918n316
$$ -2077 729 1470 -1508 692 -442 1805 -2811 2570 -1164 -844 1003 -652 138 -2179 2739 -2577
1553b577L223q63k59M0j36K528n163N340k990P53o71J362p00j922N284n350L001
$$ -2577 646 -217 -476 -436 -572 1956 -3207 2133 -857 -104 -775 587 -113 -2035 3249 -2101 900
1570I00j351J751j971L49K519m897N086k834J553k369L155j276j914L868l682
$$ 900 -451 1300 -671 -322 2197 -2700 2386 -448 1105 -1264 1891 615 -1299 2569 -1113
1585a113K627k312L558m054J607J395l137L028k285K627l896M214j998j406K297
$$ -1113 1514 -798 2760 -1294 313 1708 -1429 1599 -686 1941 -1955 2259 261 -1145 1152
1600A152k059J896l145M783m749K093P99j970Q08o21L061n518M984k691q3P01
$$ 1152 -907 989 -2156 2627 -2122 -29 770 -1200 -392 -1013 2048 -3470 1514 -1177 -1260 -559
1616e59L0N04l208N491m747K073o07N47q90j84L067n124M316k008R74j617K135
$$ -559 -529 -25 -3233 2258 -2489 -416 -1023 -476 -1366 -1550 1517 -3607 709 -1299 -325 -1942 193
1633A93m32k369N010m212J895j475K894k620M24K604l979L489j405J386l341L645
$$ 193 -239 -2608 2402 -1810 85 -1390 1504 -1116 -692 1912 -2067 1422 17 1403 -1938 1707
1649A707j009j835L211k592J752k169M110m290J286K037k616J870j742K744m370
$$ 1707 698 -1137 2074 -518 1234 -935 3175 -1115 171 2208 -408 1462 -280 2464 -1906
1664a906M257j738j359K086j000J154k873M571m722J879N80p99j2r24L477n214
$$ -1906 2351 613 -746 1340 340 1494 -1379 3192 -1530 349 929 130 118 -806 2671 -2543
1680b543M353k283O5K01M78M21l199M851m200J912q15J046j324O3K996m822M128
$$ -2543 1810 -473 -408 -207 271 692 -2507 2344 -1856 56 -759 287 -1037 -974 2022 -2800 1328
1697A328k080J014k062K163r6k862M517l401K214k221K966k812M72K420l509K840
$$ 1328 -752 262 -1800 363 267 -2595 1922 -1479 735 -1486 1480 -1332 -860 1560 -1949 891
1713H91j783K463l747L214p45j513K733j905K045k955L901l376K43J762k158K045
$$ 891 -892 1571 -2176 1038 293 -1220 1513 -392 1653 -1302 2599 -777 -534 1228 -930 1115
1729A115k059L531m838L984j683n61R61m71J657l619M607m145J617r8K00j11j085
$$ 1115 -944 2587 -2251 1733 50 -511 450 -21 1636 -1983 2624 -1521 96 -2 198 87 -998
1746i98L654m860L651j989P73j155R79J004l227M231l313J622j561J745j134o32
$$ -998 2656 -2204 1447 -542 231 -924 55 1059 -2168 2063 -1250 372 -1189 556 -578 -1210
1762a210K969l747K850j806J879k661J634M43k327L143k357K036k954L577k597
$$ -1210 1759 -1988 862 -944 935 -1726 -92 351 -1976 1167 -1190 846 -2108 1469 -1128
1777a128k2K443k836K545k259L145m168L104l64j583K009j472J961l544M689l250
$$ -1128 -1150 1293 -1543 1002 -1257 1888 -2280 824 460 -1123 886 -586 1375 -2169 2520 -730
1793g30O92P81p84P79j790L785m435K953r46J03O5j29J684l874M535l213J203
$$ -730 -38 743 -41 738 -1052 2733 -1702 1251 305 408 473 344 2028 -1846 2689 -524 679
1810F79o11R61m77j702M335m502K883j679J328j902J027J592l872M048k702J591
$$ 679 68 1029 552 -1150 3185 -1317 1566 -113 1215 -687 340 1932 -1940 2108 -594 997
1826I97k001K343j543q13K985l434K446k059K418l272K224L06k419K680k082K151
$$ 997 -1004 1339 -204 -1017 1968 -1466 980 -1079 1339 -1933 291 597 -1822 858 -1224 927
1842I27l698L838k164l18K081k089J523k082L781m560K778l36j196J281q32J947
$$ 927 -2771 1067 -1097 -1415 666 -1423 100 -1982 1799 -2761 17 -319 -1515 -234 -1066 881
1858H81l912M548l072N78K03K31M67j882L808m394L014j107K60m56O37J882l651
$$ 881 -3031 1517 -1555 -977 -774 -543 -76 -1958 1850 -2544 470 -637 -377 -833 -196 1686 -1965
1875a965L759k540J298j276J744o81j567L887l750K688j870J620j851J127J299
$$ -1965 1794 -746 552 -724 1020 339 -1228 2659 -1091 1597 -273 1347 -504 623 1922
1890A922l064L016k075J499k488K972j589q94K857k867K087k405L107l616J998
$$ 1922 -1142 1874 -201 1298 -1190 1782 193 -701 2156 -711 1376 -1029 2078 -1538 460
1905D60N09k235K517k119K234l656L555j859j81J352j249J008k171L637m037K254
$$ 460 969 -1266 1251 -868 1366 -2290 1265 -594 -775 577 -672 336 -1835 1802 -2235 19
1921A9m11p3M49j380L066m035L804k541L88R9L99Q02k669L900l626K274j153J335
$$ 19 -392 -465 -16 -1396 1670 -2365 1439 -1102 -714 -615 -216 586 -2083 1817 -1809 465 -688 647
1939F47j212OK087l223L303k614J979k011J851j74j805L156l059K200k103K601
$$ 647 -565 -559 1528 -1695 1608 -1006 973 -1038 813 639 -1166 1990 -1069 1131 -972 1629
1955A629k366J206J157k511K432k251K458l300K835r86p77J806j735J990k935
$$ 1629 -737 469 1626 -885 1547 -704 1754 -1546 1289 303 -474 1332 -403 1587 -1348
1970a348L653l280J283O76j399R79j092K623m006L197j364OM81m21Q61k507L729
$$ -1348 2305 -975 308 984 -415 564 -528 2095 -1911 1286 -78 -72 409 -12 849 -1658 2071
1987B071l512J804n93M89m05q97K766l684L089j991J104j430J432O40k726L696
$$ 2071 -1441 363 -230 259 -146 -1043 1723 -1961 1128 -863 241 -1189 243 883 -1843 1853
2003A853l145J877j734K229j739k12K490l404K917j993J938k465K019k4j838K679
$$ 1853 -1292 585 -1149 1080 -659 -871 1619 -1785 1132 -861 1077 -1388 631 607 -1231 1448
2019A448k293J539k036K753k509J026J160j862J624j508K259l662L327r39r87
$$ 1448 -845 694 -1342 1411 -1098 -72 1088 -774 850 -658 1601 -2061 1266 327 -660
2034f60J633j441J598k963L620k999J511J41q05J022j617K679l955L320j586R8
$$ -660 973 -468 1130 -1833 1787 -1212 299 440 -365 657 -960 1719 -2236 1084 -502 -404
2050d04K01J78O69k634L617l386K010p78P84n25p94K470l635K933k077J323j550
$$ -404 -203 -25 644 -1990 1627 -1759 251 -527 257 -268 -1062 1408 -2227 706 -1371 -48 -1598
2067a598J576N57k319K809k739K155j877K161j625K42J808l078K969k378K151
$$ -1598 -22 535 -1784 1025 -1714 441 -1436 725 -900 -658 1150 -1928 1041 -1337 814
2082H14k066J980k45j360K128k156J821k504L136k374R11R70j564J812k169K725
$$ 814 -1252 728 483 -877 1251 -905 916 -1588 1548 -826 85 1055 -509 1303 -866 1859
2098A859l206K473p18j32Q04r70J601k857L039k370J026k47J92L26j298K871l691
$$ 1859 -1347 1126 408 276 1080 110 1711 -1146 1893 -477 549 302 494 820 -478 2393 -1298
2115a298L018j724P46l95p9J375l058L307k721J849j506J221o20p04K135k705
$$ -1298 1720 -4 742 347 268 1643 -1415 1892 -829 1020 -486 735 115 -589 1546 -1159
2131a159K109k045K107k252J394P42k369K584k632J900k054K003r54k59J434j682
$$ -1159 950 -1095 1012 -1240 154 896 -1473 1111 -1521 379 -1675 328 -626 -885 549 -1133
2147a133J425j937K586k839J912l6j081J424j798K175k966L196k055P56M95p22
$$ -1133 292 -1645 941 -1898 14 -22 -1103 321 -1477 698 -2268 928 -1127 -371 124 -598
2163e98J195k203K918l074K293o99j2J72m64J656k934L547k679J488q70P89J66
$$ -598 597 -1606 1312 -1762 531 -168 -180 -8 -472 1184 -1750 1797 -882 606 -264 525 691
2180F91j492K660l037K258j273Q35p26K78J138k298K400j967J530j601K049j145
$$ 691 -801 1859 -1178 1080 -193 642 -84 194 1332 -966 1434 -533 997 -604 1445 300
2196C00n66K020k386J819j900J967k040J203P16j933K284k462J928k325K505j433
$$ 300 -266 1754 -632 1187 -713 1254 -786 417 1133 -800 1484 -978 950 -1375 1130 -303
2212c03j78J084j409J155j859K931k778J828l31j075J327j357J868k839K980j842
$$ -303 -481 603 -806 349 -1510 1421 -1357 471 140 -935 392 -965 903 -1936 1044 -798
2228g98L87N10o10Q68k015K899k940J945p04O37k85l74J516k634L184k552J189
$$ -798 -411 99 -511 357 -1658 1241 -1699 246 -458 179 -106 -480 1036 -1598 1586 -966 223
2245B23n30P06R9j390K276k550K012j587J781j178K06J093k178K428k232J836
$$ 223 -307 399 498 -892 1384 -1166 846 -741 1040 -138 68 1161 -1017 1411 -821 1015
2261A015j480J670j010m39J658k237J830j908K382k198J387P4j392J705j898J938
$$ 1015 -465 1205 195 -244 1414 -823 1007 -901 1481 -717 670 744 -648 1057 -841 1097
2277A097k395K526j237p5P35q27J007k318K683k290J543m86l85N57j125J927k498
$$ 1097 -1298 1228 -9 -84 651 -176 831 -1487 1196 -1094 449 -37 -422 135 -990 937 -1561
2294a561K175j335Q43k44R8M81k022K382k587J911j195R12j36n93J533k320K403
$$ -1561 614 -721 122 -122 -24 457 -1565 817 -1770 141 -1054 -142 -278 -871 662 -1658 745
2311G45j783J582j629J420l71j068K023k056J883j720J774j288L69R59j681J661
$$ 745 -1038 544 -1085 335 -36 -1104 919 -1137 746 -974 800 -488 -119 840 -841 820
2327H20j818J999j934J850k86q63J149j455J530j936K366j997J144P9n86N44j388
$$ 820 -998 1001 -933 917 631 -232 917 -538 992 -944 1422 -575 569 648 62 606 -782
2344g82K255k698K464j168L83K61r73J170k112K744k496J356j56l8nn76J846k865
$$ -782 1473 -1225 1239 71 454 715 -258 912 -1200 1544 -952 404 248 210 205 -371 1475 -1390
2362a390K078j234Q71n59J37N71j791K327k074J466j094J319q68n52J628k336
$$ -1390 688 -546 325 -234 -97 474 -1317 1010 -1064 402 -692 627 -241 -793 835 -1501
2378a501K102j422J650j902J527k37r91J533j858J645j628J921j374N54M56j370
$$ -1501 601 -821 829 -1073 454 217 -774 759 -1099 546 -1082 839 -535 19 475 -895
2394h95J677j690J973k156K082p45p04R83j008J361j730J876j485P29K97n29P69
$$ -895 782 -908 1065 -1091 991 246 -458 525 -483 878 -852 1024 -461 268 565 36 805
2411H05j339J782k610K355j237M45Q9n65J070k045K677k585J666r00P11k88o30
$$ 805 -534 1248 -1362 993 -244 201 290 -275 795 -1250 1427 -1158 508 -392 319 31 -599
2428e99J463k459K382j544J287r05L27P9j348K288k348J837j785J667p42j63J178
$$ -599 864 -1595 787 -757 530 -375 -48 31 -1317 971 -1377 460 -1325 342 -400 -563 615
2445F15j869J679j464J798j786J358l51o45J175j547J863k134K007j305P24K74
$$ 615 -1254 425 -1039 759 -1027 331 -20 -665 510 -1037 826 -1308 699 -606 118 392
2461C92r88R57j256J944j861J745p18l89Q87j396K054k026K223k332J024J94n31
$$ 392 -596 361 -895 1049 -812 933 215 -174 713 -683 1371 -655 1568 -764 260 454 -77
2478g7Q03r73J852j835J297r84P11n87r8P19j850K390j884J304q93N60K3j297
$$ -77 726 -247 1605 -230 1067 83 794 207 109 828 -1022 1368 -516 788 -105 455 478 -819
2496h19K034k488K130j540J645j415O43M26j374J296j392J371j588J835r23k09
$$ -819 1215 -1273 857 -683 962 -453 190 616 -758 538 -854 517 -1071 764 -159 -368
2512c68N83j278J479j958K092j736J232k43o46J193j223J344j849J934j134L82
$$ -368 215 -1063 416 -1542 550 -1186 46 -197 -843 350 -873 471 -1378 556 -578 -196
2528a96k56j96Q18j371K130k212J457m97L7K23o90J381j930K174j601J061m66
$$ -196 -452 -648 170 -1201 929 -1283 174 -323 -286 -63 -753 628 -1302 872 -729 332 -134
2545a34K03L94j380K126k124J763j147J349r74J12O23j662K135j757J357j163
$$ -134 69 463 -917 1209 -915 848 -299 1050 76 188 811 -851 1284 -473 884 -279
2561b79J247n36r81J925j985J424j150J288j085O24J88j249J182r39J169j390
$$ -279 968 432 -549 1376 -609 815 -335 953 -132 492 680 -569 613 -326 843 -547
2577e47J890j323j40J062j423R15j183J683j649J031Q1q42P41r40J342k113K046
$$ -547 1343 20 -120 942 -481 434 -749 934 -715 316 397 -445 296 -644 698 -1415 631
2594F31j287M79K12o36P80j380K113j980J595q51N26m78n34J715k112J996j344
$$ 631 -656 -177 35 -601 179 -1201 912 -1068 527 -324 202 -276 -810 905 -1207 789 -555
2611e55O42m25R6N62r35J342j789J385q76J223p84J24M79j312J652j540J634j647
$$ -555 87 -338 -242 320 -615 727 -1062 323 -553 670 -114 10 489 -823 829 -711 923 -724
2629g24J314l41m80R50j327J374j443J882j516M86K35p49R61j419J689j697J550
$$ -724 590 249 -231 719 -608 766 -677 1205 -311 175 410 -339 622 -797 892 -805 745
2646G45q38J19K80r33J365j543K105j899J137l76l59N75j186J476j712J696j067
$$ 745 -93 26 306 -627 738 -805 1300 -599 538 162 -197 378 -808 668 -1044 652 -415
2663d15R30p06l2N43j457J960j815J383q43M49k83o00J135j452J724j174J029
$$ -415 515 -191 -223 320 -1137 823 -992 391 -452 -3 -286 -886 249 -1203 521 -653 376
2680C76j140N45L69j040J425j585J611j401J031m00k45O04r03J423j585J802j474
$$ 376 -764 -219 150 -890 535 -1050 561 -840 191 -209 -454 150 -753 670 -915 887 -587
2697e87P71k06n14J043r40J393j849K037j699N36J72k62P63r47J571j968J558
$$ -587 184 -22 -536 507 -433 960 -889 1148 -551 -15 157 -105 658 -289 1282 -686 872
2714H72q50J89J60m83Q48j304J843j682J201p74K26J85p50J532k098J746j074
$$ 872 22 211 371 -112 736 -568 1275 -407 794 20 246 431 -319 1213 -885 861 -213
2731b13P30m06k82Q83j638K018j423P70o95P91q06j81J004j377J511j233J166
$$ -213 517 111 -171 712 -926 1092 -331 439 -256 535 -271 -452 552 -825 686 -547 619
2748F19j195P07n3q95J478j389J283j305J368j094J19P18j205J364j390J617j797
$$ 619 -576 131 78 -817 661 -728 555 -750 618 -476 -357 361 -844 520 -870 747 -1050
2765a050J381m68l50Q87j136J268j401J757j209K08R8k56O37j390J586j408J136
$$ -1050 331 -137 -487 400 -736 532 -869 888 -321 -113 -15 -271 366 -1024 562 -846 290
2782B90k72P2l83O5R27j730J875j659J206p06M38l1o81J702j812J441j180J021
$$ 290 18 90 -293 -228 699 -1031 844 -815 391 -315 123 92 -589 1113 -699 742 -438 583
2800E83p46J24M58r68J351j265J163j422J130n68j00N54r20J587j708J242j022
$$ 583 -163 -39 419 -549 802 -463 700 -722 408 -160 -260 294 -626 961 -747 495 -527
2817e27Q69Lr54J239j363J339j465J290o00m7L34m95J012j392J486j369J046n67
$$ -527 342 345 -609 630 -733 606 -859 431 -169 -216 118 -377 635 -757 729 -640 406 -161
2835a61r7L90j052J821j813J554j433R28k5j84K75q64J354j058J115j064N19j45
$$ -161 -258 132 -920 901 -912 642 -791 137 112 -72 203 -661 693 -365 750 -314 205 60
2853F0j72R20j578J633j431J358q62M83o2r84J352j086J434j438J247j066K14
$$ 60 -112 808 -770 863 -568 790 -72 411 349 -635 717 -369 1065 -373 874 -192 22
2870B2M28r11J210j438J433j255J027o13k17R41j191J057j313J547j017M03j71
$$ 22 450 -461 749 -689 744 -511 516 -97 -314 627 -564 493 -820 727 -290 113 -58
2887e8m54J100j316J409j741J595q91L01k17m00P61r26J924j920R51m93Q4K02
$$ -58 -512 588 -728 681 -1060 535 -356 -55 -272 -672 89 -837 1087 -833 118 -375 -291 -89
2905h9l29Q89j536J568j273P36m09J80P42j495J461j283J211p46P70o48L9R83
$$ -89 -418 471 -1065 503 -770 -34 -443 -263 479 -1016 445 -838 373 -373 397 -251 -212 771
2923G71j638J688j452J272q44O42k09p23J423j355J429j233J172j106L98N94j004
$$ 771 -867 821 -631 641 -203 439 230 -493 930 -425 1004 -229 943 -163 235 829 -175
2940a75Q15j026J292j280J346j186J00Q66j122J249j428J390j190P04k87l96Q48
$$ -175 640 -386 906 -374 972 -214 -114 752 -370 879 -549 841 -349 355 68 -328 520
2957E20j114J280j324J251r12M18k39l10P08j084J529j334Q59o68O9L37m52J117
$$ 520 -594 686 -638 613 -299 119 -120 -430 278 -806 723 -611 248 -420 -351 -14 -466 651
2975F51j670J581j196N37l15K81J59o74J177j507J463j071P57m47p2N22q30J214
$$ 651 -1019 562 -634 -97 -412 -131 28 -646 531 -976 487 -584 173 -274 -346 176 -654 560
2993E60j418J246j108P59O6n92J121j114J315j448J171p73L36N8m21J195j302
$$ 560 -858 388 -720 39 105 -487 634 -480 835 -613 558 -215 121 179 -242 953 -349
3010c49J311j282P44n90J09O26j024J143j254J570j241O97l06m26O04p75J429
$$ -349 962 -320 424 -166 -57 569 -455 688 -566 1004 -237 460 154 -272 332 -443 986
3027I86j642J418j114O89l53j86R22j489J470j419R84p83M81j1q86J529j393J390
$$ 986 -656 762 -352 337 -16 -202 720 -769 701 -718 266 -517 -36 -47 -933 596 -797 593
3045E93j228Q91p80J69L04p89J316j339J246j278R04m69k42Q32r35J299j066R88
$$ 593 -635 256 -524 -355 -51 -840 476 -863 383 -895 9 -460 -702 130 -805 494 -572 416
3063D16j148O03K6m96P16p72J258j342J325j171N60L66o76P99r80J522j589J143
$$ 416 -732 -129 -103 -599 117 -655 603 -739 586 -585 -25 341 -335 464 -516 1006 -583 560
3081E60m42J75j93n13J261j469J722j359P20k91j17O05j169J460j575J276r52
$$ 560 118 293 100 -413 848 -621 1101 -258 462 171 54 659 -510 950 -625 651 -301
3098c01Q27l25k49N34r79J102j263J115o74K68n3k30P52j282J379j205R71q48
$$ -301 526 201 -48 486 -493 609 -654 461 -213 55 2 -228 524 -758 621 -584 387 -461
3116d61K75K07n89R74j084J278j249R78p28j69O64o60J036j245J268j209J170
$$ -461 -186 21 -568 406 -678 600 -649 329 -399 -568 96 -564 472 -773 495 -714 456
3133D56q20K1O52r13J139j454J229p43N16l9m66N07l31P58j161J453j165L49K63
$$ 456 -364 -343 309 -604 535 -919 310 -433 83 44 -422 85 -246 512 -649 804 -361 -12 251
3152B51n81J030j153J338j382J030n45J83P8q92J550j408J395r47O94m90j53L92
$$ 251 -330 700 -453 885 -497 533 -12 171 249 -643 907 -501 894 -53 641 151 -2 390
3170C90p72J218j225J132r83N61k59k96Q52j181J255j214J065p78J64M61m66P47
$$ 390 -382 836 -389 743 -240 321 62 -234 618 -563 692 -522 543 -235 -71 390 -76 671
3188F71j205J088j234J114o40J23K14n53R28j327J233j211Q91k16p4J55p31J453
$$ 671 -534 554 -680 434 -206 -83 131 -422 506 -821 412 -799 92 -124 -198 -43 -774 679
3206F79j517J239j085Q66n14O5M04p87J390j302Q57o79O22j13m03O05p67R31j177
$$ 679 -838 401 -684 182 -332 -267 137 -650 740 -562 295 -384 238 125 -278 327 -440 491 -686
3225f86J198n40K53j16m16R40j497J505r52P06k84k2L29p95J010j155J110j010
$$ -686 512 -28 225 109 -307 633 -864 641 -311 395 111 89 418 -377 633 -522 588 -422
3243d22Q88m34k03L98o56J250j532J239r79N79j39m32O44o84J142j314J128j049
$$ -422 466 32 -171 227 -429 821 -711 528 -451 128 -11 -443 201 -483 659 -655 473 -576
3261e76M80Q8o11R71j140J403j299O70j25j50M61o80J294j744J350q55N95l19
$$ -576 -96 -8 -619 352 -788 615 -684 -14 -139 -289 172 -508 786 -958 392 -463 132 -187
3279a87j2J56r34J452j326J281j208Q14k46l75P35p23J092r82R85p90N32j56o47
$$ -187 -199 -43 -977 475 -851 430 -778 36 -210 -585 150 -573 519 -463 522 -268 264 108 -539
3298e39J257j039Q23q00R41q32K70M81o86N66r42J222r65P92j71o43O62m82Q64
$$ -539 718 -321 502 -298 643 -189 81 562 -124 442 -500 722 -243 549 378 -265 397 -85 779
3317G79j335J203j035P12l6o04Q37r13R27j009J100j003P21j52l38Q94r99P27
$$ 779 -556 647 -388 324 288 -316 521 -392 535 -474 626 -377 344 192 -146 748 -251 476
3335D76j119J002o17J49L98n36R13j066J269j405Q32m15j33K67p34J059q47J216
$$ 476 -643 359 -258 -109 289 -247 666 -400 869 -536 296 -119 -252 15 -719 340 -507 709
3353G09j105M65k43K1L20p86J202j236J109q10L43k4m45P58q48Q23q24P60q11
$$ 709 -396 69 -174 -153 167 -619 583 -653 456 -354 -11 -35 -480 278 -570 253 -571 189 -622
3372f22N39L29n32Q40j304J532j099P50n10OL81o94R90j180J141p44L73j94k75
$$ -622 -83 246 -286 554 -750 782 -317 433 -77 -71 310 -384 606 -574 567 -177 196 2 -273
3391b73O54p46R99j199J226q11M33k57k11O84q45R96j019Q34o32L47j10l36P12
$$ -273 381 -365 634 -565 661 -150 283 26 -185 499 -346 650 -369 465 -167 180 70 -266 446
3410D46j073J198j019Q55p37K6P01o96O25p96Q91r15O13l89j52N90m84M65p52
$$ 446 -627 571 -448 407 -330 -304 397 -299 326 -470 421 -494 119 -270 -422 168 -316 149 -603
3429f03P94q49O94p8k62N85q76R42q32Q20o82L78K3k37L69m51P27j179R50m39
$$ -603 191 -658 36 -42 -304 281 -595 347 -485 335 -347 31 54 -183 186 -265 462 -717 233 -206
3449b06K47J63n77J157j504J017o58O28j19j97L72p72J275j175N08n50N72j46
$$ -206 41 204 -373 784 -720 297 -361 267 148 -49 323 -449 826 -349 159 -391 181 35
3467C5P0L70r56J093j046Q35p44P40k60l80R24j006Q13q72P47l80J57m9m05P09
$$ 35 105 475 -481 612 -434 401 -343 397 137 -243 681 -325 488 -384 363 -17 140 91 -314 395
3487C95j012J116r38P00n05K2L61n58N07q15J038q40P76k64q5J36p28R58r00P21
$$ 395 -617 499 -439 261 -244 -222 139 -419 88 -727 311 -529 247 -17 -102 34 -694 264 -636 85
3507H5n36L81L5n28Q24j158J345q93M90o6J19j0l20N55o50O54p43R03r76N24J54
$$ 85 -451 -70 -35 -563 261 -897 448 -445 45 -21 98 88 -232 323 -327 327 -416 487 -489 35 189
3528A89p34R90j004P41l26M80m39K65K32p58R92r61O68l68M28j5p01Q65q91P32
$$ 189 -545 445 -559 182 -144 336 -103 162 394 -364 628 -333 335 -33 395 380 -321 544 -347 385
3548C85n11L96l23L37j41k86O80r03R26p57K29j87O9N02p77O10o36O12n57N46
$$ 385 -126 270 -53 284 143 -143 537 -366 560 -197 32 -155 -86 416 -361 249 -387 225 -332 214
3568B14p6k54L22o00P53j232J110m86J31R3k27O93j125J173q47N16k35K10R3m17
$$ 214 138 -116 206 -394 359 -873 237 -249 -118 -25 -252 441 -684 489 -358 158 -77 133 226 -191
3588a91N76q37M86n34Q25m78J55K5m65R94n13K97m91M81k09kO5n47J129j035O59
$$ -191 385 -452 34 -500 325 -153 2 27 -438 556 43 340 -151 330 121 119 184 -363 766 -269 390
3609C90m73K61r1l67O83q00P48n18P10o07J97J35l54O21j126J090q10N69o0j07
$$ 390 -83 178 87 -280 403 -397 351 -167 543 -64 133 268 -86 535 -591 499 -311 258 198 91
3629I1N44r36P99p23Q60q59L81j25j11L16p40R68j144J134q86N71l43j25M19n04
$$ 91 635 -301 498 -225 635 -224 157 32 -79 237 -503 465 -679 455 -431 140 -203 -328 91 -413
3649d13Q49j049P73k93J9K82m83N03q36Q56q32R96p82M01M5n28P56o50P99q17
$$ -413 436 -613 160 -133 -114 168 -315 188 -648 208 -624 372 -410 -9 36 -492 264 -386 413 -404
3669d04P57n14J13j77k2O16p07Q42j151P86l47j00N59p96J021r06Q64n97K72r3
$$ -404 353 -161 -48 -225 -247 369 -338 504 -647 139 -208 -308 251 -545 476 -430 434 -163 109 16
3689A6M2M00q87P59n65P77p81J91N3j05N14r01P18n66L95j9k58M55n07L87p69
$$ 16 58 458 -429 330 -235 542 -239 -48 5 -100 414 -487 231 -335 60 41 -217 238 -269 118 -651
3710f51Q29n08L81m34K86K03n53Q59p90N48p30L44K49k74N04o70O24m23K56j09
$$ -651 178 -330 51 -383 -97 106 -447 412 -378 170 -560 -216 33 -241 263 -407 217 -206 50 -59
3730e9Lm4J07L32n98N33m83J76J45L79l42o33Q34n97K86m82J67J91n9L39j077
$$ -59 -56 -100 7 339 -259 274 -209 -33 112 491 149 -484 350 -247 39 -443 -276 -85 -144 195 -882
3751h82J267r89Q13j24j49R0j6L53j220J500n10K22o98N45K07j347J517j511J280
$$ -882 385 -604 209 85 -64 26 10 363 -857 643 133 355 -343 202 409 -938 579 -932 348
3770C48o17M34m05N52n2k52N16j008R72n70M72o00J46K43o63P71o13N55l77L46
$$ 348 -269 165 -240 312 260 8 524 -484 488 -82 390 -210 -64 179 -484 287 -326 229 -148 198
3790A98k66k35Q21q80O14o12N99l50j2Q7j13N6m11P50p25P11o48L99Q3l44L86
$$ 198 -68 -303 518 -362 252 -360 239 -111 -123 -36 -149 -93 -504 246 -479 232 -416 -17 66 -278 108
3811A08m16R52j196O16q2l91O77m73O30p91O74n41L72j64l1M98n20O14q40N77
$$ 108 -308 644 -552 64 -18 -409 268 -205 425 -366 308 -233 139 -25 -56 442 -78 536 -304 273
3831B73p15Q04j72l31O60p65O67o78O32m47K00M5m29O96o39P15p90P20m14j70
$$ 273 -442 362 190 -141 519 -246 421 -257 375 -72 128 173 -256 440 -199 516 -274 446 32 -138
3851a38M91o26R19q65M17m99N57q4l01J25k41N53m75N43j101R16l02K5J42n18
$$ -138 353 -273 646 -219 198 -301 256 172 -129 -4 -245 308 -167 376 -725 191 -111 -86 56 -462
3871d62Q29o25M26l41L47rm91M43p55J077q63N01j21r4r8l29R36q33Q15n64K30
$$ -462 367 -258 168 -173 174 165 -326 117 -638 439 -424 77 -44 -138 -236 -565 371 -462 353 -211 19
3892A9l02K72J20m06N16n66R08r04M83j56l5K50m17N93n65M34l17J47j5k23K84
$$ 19 -283 -11 109 -297 219 -347 561 -343 140 -16 -51 199 -218 375 -190 244 -73 74 59 -164 120
3913A20k23O44o70K70k36M77n3m29P49r27N88l56M70n98J79L11n21P48r79R84
$$ 120 -103 541 -129 141 -95 382 329 -100 649 -278 310 -46 424 -174 5 316 -205 543 -436 548
3933E48o97M58l78O7L18p93Q76o44N71m58J34K93n83L41m84P53o63O09m29M77
$$ 548 -149 309 -69 -2 316 -477 399 -245 326 -132 2 295 -288 53 -431 322 -341 268 -161 316
3953C16n57P6M76p19Q75q82N93n02j6N59n35M86n48O11n94N21l62J35K93o82Q84
$$ 316 -241 -165 311 -408 467 -415 178 -324 -340 219 -316 170 -378 233 -361 160 -202 -67 226 -456 428
3974D28p28M46n54N37J0k29N27q96Q08p81O92k05K50j36k08L42n38Q62q89N74
$$ 428 -300 146 -408 129 139 -90 437 -459 349 -432 260 55 305 169 -39 303 -235 627 -262 312
3994C12n11L43rl18L89p16R89p20N43l51J79J31n12O44o13P67q81M43r9J2q2l29
$$ 312 -199 144 135 -183 206 -510 479 -241 302 -49 130 261 -251 393 -220 547 -334 109 10 22 -60 -389
4016c89N69n89N17l19K54N1l27M97n13M91o79P27n70J88L51o25O36r18J095r46
$$ -389 180 -409 108 -211 43 94 -233 264 -249 242 -437 290 -280 -92 259 -366 270 -648 447 -499
4036d99L45PJ70m4m52R14p60M61o57L58j94K5M25m44O99p32O08m06K15j32j16
$$ -499 -154 -147 23 -21 -473 441 -319 142 -515 -157 -351 -326 99 -345 354 -378 230 -176 39 -93 -209
4057b09O57n55O14n54K27k40K21p8m97P11n49L71n09N99k1l93N26n81O90p07P70
$$ -209 448 -107 507 -47 180 -60 161 83 -414 297 -252 119 -390 209 188 -205 321 -260 430 -277 493
4078D93p38L72j4l57L16l86M73k89M29p40N61l1j61J22n81P93p97Q15n41J25O4
$$ 493 -245 127 113 -244 72 -314 159 -130 299 -441 120 89 -72 50 -531 262 -535 280 -261 -136 -72
4099g2l28N41n39O76p93O43k22J67L4m25P02p15P15q11L13O5K5R7l40P56p47O50
$$ -72 -400 141 -398 278 -515 128 -94 73 107 -318 384 -331 384 -427 -114 -49 -24 73 -267 489 -258 392
4121C92p37M92k80q4O33o15P71p19K74k55L26k41q5O32n83N65p77M65j52j9R5
$$ 392 -345 147 -133 -217 416 -199 572 -147 127 -128 198 -43 -128 504 -79 486 -291 174 22 3 98
4142I8j28M07l68L27m44M89n18L16K3o56Q29o23P39n39M75k74j40J35l39N83n79
$$ 98 -30 377 9 336 -108 381 -137 179 202 -454 375 -248 491 -48 427 153 13 148 -191 392 -187
4163a87L87j76M5J97k34j38j95M96m27M38l66K5L45m32K62n87Q26r84R41l74J1
$$ -187 200 24 69 266 32 -106 -301 195 -232 206 -160 -135 210 -222 40 -547 279 -705 236 -138 -127
4184a27L25n10N07n26M29n40O91m58J75K77m89M15m79O17o74L27J30j86K22l30
$$ -127 198 -312 195 -331 98 -442 249 -209 -34 243 -246 169 -310 307 -367 -40 90 -96 126 -204
4204b04L29k39L19l77L36rj37K83n20N99p98P75k19j98J24k28M65q41R95r25Q61
$$ -204 125 -114 205 -172 164 155 18 301 -219 380 -418 357 138 -60 64 -164 301 -540 455 -470 391
4225C91m09j6M29q29P17p24Q22m63J75l3j56N61p62O81n58L76j82j94J64k51N43
$$ 391 -18 -34 395 -434 283 -441 381 -82 93 60 -96 465 -297 384 -174 202 20 -174 -10 -261 282
4246B82o06M18k23L72l64J10M37o15J47l46M21k06J92j58K18j63j31L30n05N97
$$ 282 -324 94 -129 243 -121 -11 426 -189 -42 -388 33 -173 19 -139 79 -84 -215 115 -390 207
4266B07n49M39j63k56L86m06N34m53M38l34K31Q0k96L49m72J89j93L12M8k79M57
$$ 207 -342 97 -66 -322 64 -342 192 -261 177 -157 74 154 -142 207 -265 -76 -269 43 91 -188 269
4287B69m33M57m30L33k70J8l2l5L39l75N41n24L51l30M13k82J24N8o18P36n19
$$ 269 -164 293 -137 196 -74 -56 -88 -123 216 -159 382 -142 209 -121 292 10 134 192 -426 310 -209
4308b09M81m69K84k3j74L09m75N41m55K56k56K75k12M2M81o79O12n72L24k94P3
$$ -209 272 -197 87 64 -110 199 -276 265 -190 66 -190 85 -127 -85 396 -283 329 -243 81 -213 -140
4329a40O7r2L11m12L13l08J39n8J92L39n09M17n91O75o83N00k54q8M19m52K26
$$ -140 -73 -165 146 -266 47 -261 -122 -180 12 351 -158 259 -332 343 -340 160 -94 -182 237 -215 11
4350A1j64M26m90K62K51o80O11n39N98j82J24j66j95L31n48N93n04N27m01J58
$$ 11 -153 273 -217 45 296 -384 227 -312 286 104 228 62 -133 198 -350 243 -261 266 -135 23
4370B3L6o0L9j03M96n64L95l26J60L32l93K56n69O73n16L80k78M7p8q3J86k76
$$ 23 59 -1 38 -65 431 -133 262 -64 96 428 35 291 -278 395 -121 259 -19 28 -50 -133 53 -223
4392b23O04o44M22k32rq5n4L81n78O34m91J82j1K42J02o25P00m23M37n25L38l60
$$ -223 381 -263 159 -73 -82 -167 -221 160 -418 216 -275 -93 -104 138 240 -385 315 -108 329 -196 142 -218
4414b18J35K09l68L86l26O8j19J75j59J18L03n51M56j19K22m50K62r8j56N35n66
$$ -218 -83 126 -242 144 -182 -114 -233 -58 -217 -99 204 -347 109 -10 212 -238 24 -74 -230 305 -261
4435b61M54k94K06j24J64L9k02M77n29K20j38K17l81Q4M90n17L95n75L95k98K27
$$ -261 193 -101 105 -19 145 184 -18 459 -70 150 12 229 -152 -68 422 -95 300 -275 120 -178 49
4456D9J7j13L42l57J48m00N85n74K17Q0p6J72l31M64n06M28j09k48K64m40O08
$$ 49 66 -47 295 -62 86 -314 271 -303 -86 -6 -82 90 -241 223 -283 145 36 -212 52 -388 220
4477B20n06M92n50K05Q6N7L0l56M60m89M88l30N21n26K35J19k67K25l28M37l62
$$ 220 -286 206 -344 -139 -53 4 34 -322 138 -351 137 -193 328 -198 37 156 -111 114 -214 223 -139
4498a39J43K94m14K73o11Q53o28J65m4J11K68p91P94n80O54o83L96r9M8K93n53
$$ -139 4 298 -116 157 -454 399 -229 -64 -108 3 271 -520 274 -306 348 -335 61 -38 10 303 -250
4519b50L63j23K82n68M09j27N8J64l14L86m53N51p28J44L63k65M90n74L59l42
$$ -250 113 -10 272 -296 113 -14 44 208 -106 280 -173 378 -350 -206 157 -108 382 -192 167 -175
4539a75L19k28P2J63j24L44m96M60n41L00Q6l03K19k98K45k21L62l62J64j13M3
$$ -175 144 -84 -12 151 27 371 -125 335 -206 94 180 -123 96 -202 43 -178 184 -178 -14 -127 -84
4560h4J24k26L90n56L45j92J22J4O3J18m46M44l82L38r3j53J84QK01j00J11l64
$$ -84 40 -186 204 -352 -7 -199 -77 -63 0 118 -328 116 -266 72 -21 -174 10 18 219 119 230 -134
4582a34M06k58K07j22k77M54o45L51L43l29k65L46L7k56M23n38P88p76K35J28
$$ -134 272 14 221 99 -178 276 -369 -18 325 -4 -269 77 114 -142 281 -257 531 -245 -10 118
4602A18pK79p16M57j95M12l95K22q5k60L43o45N27l56K86O7k36L49k17K40o49
$$ 118 111 390 -326 131 -64 348 -47 175 90 -170 173 -472 55 -301 -15 52 -184 165 -52 188 -461
4623d61N72n51O98j93k23J25J25K30n20K77m22J67J8m1j6j00M78m63M28m11O8
$$ -461 111 -440 258 65 -158 -33 92 322 -198 79 -343 -176 -158 -199 -215 -315 163 -300 128 -283 -215
4644b15K57l90P40l98K7k43M55j48k43L07m3K49m79M42m10o0L69k63J61r7J80
$$ -215 42 -348 392 -6 21 -222 233 85 -158 149 106 355 -124 318 -92 -152 217 -46 115 18 198
4665A98j51Q7m2J01k20Q1J80n45N53j65K94m02J60J55l66M14o30M50j64J39j91
$$ 198 47 134 92 193 -27 54 234 -311 242 77 371 -31 129 284 -82 332 -298 152 -12 127 -64
4686f4j05L35j06K31l74J82k86J76k69K41Pj69K65l96O59o65L23N5k52M25m69
$$ -64 -169 166 60 291 -83 99 -187 -11 -280 -39 -32 -201 64 -332 327 -338 -15 40 -212 213 -256
4707b56O09n45L98m41J90J28m68M69l89K20k24M92j09j38J7l8L27m53N39p30O44
$$ -256 353 -192 206 -235 -45 83 -385 84 -305 -85 -309 183 74 -64 -47 -85 242 -211 328 -402 242
4728B42l89K49L3k87N24p44N31j74K06j98j68K38k56O14l16J22k19J87O2j23J20
$$ 242 -147 102 135 -152 372 -372 159 -15 191 -7 -175 63 -193 421 105 227 8 195 257 134 254
4749B54l51M37j30K0o56O35j59m0K74o50P25m34J33j65K72n4r7Pk36K08j77N1
$$ 254 -97 340 210 230 -426 209 50 10 284 -366 359 -75 58 -107 165 111 14 21 -215 -7 -184 -133
4771a33R9p8L17m71N30o00J88J5K86j62Q1J53o85O40n21L09P5m1k93Q6M12m34
$$ -133 -34 -112 205 -266 264 -336 -148 -133 153 -9 72 225 -460 180 -341 -32 43 2 -291 -205 207 -227
4793b27N13l11J51q7j65K30l06P50o20L72m35M95m11J37J32l70K85m28M75l44
$$ -227 286 -25 126 39 -126 104 -202 548 -72 300 -135 360 -51 86 218 -152 133 -295 180 -164
4813a64K97N3l61M64k29K56k78j22K82j54J93k75K1j63M63l15L86m40K90k96J1
$$ -164 133 186 -175 289 60 316 38 -84 198 44 237 -38 -17 -180 283 -32 354 -86 204 -92 -81
4834h1K10k70M09n57N26k54J50q4p4J8q3M26l81p8J00k18N31o23L44m76M50k25
$$ -81 129 -141 268 -289 237 -17 133 49 -25 -7 -90 336 -45 -123 -23 -241 290 -333 11 -465 -15 -240
4856b40K62K5j84K53j63J19j07J91m56J58K35p2j7k94N36l34K35n4j56J99j38
$$ -240 22 47 -137 116 -47 72 -35 156 -300 -142 93 21 4 -290 246 -88 147 93 -63 136 -2
4877bM16p35O06k21L1m05L32l5o9J33k85N09k82K2q7J79q5n0K26o25O20k29K78
$$ -2 414 -321 285 64 95 -310 22 -13 -82 51 -234 275 -7 15 -72 107 22 -28 198 -427 193 -36 242
4900B42k1j51K51k22K55m87N39m11J06k27J08J97m33O70n87K69m04K60J24k62
$$ 242 221 70 321 99 354 -133 406 -5 101 -126 -18 179 -254 416 -171 98 -306 -46 78 -184
4920a84L16k10O5m6Q3j15o1K81n33L48k51L68O4j49O5k59K70k72L46n98N05j92
$$ -184 132 -78 -13 -59 24 -91 -152 129 -404 -56 -307 61 125 -24 41 -218 52 -220 126 -472 33 -159
4942a59k9J92o9J73l76M39m04J88l2J72j39j70N59m25L87m55K40j02o3L61l84
$$ -159 -188 4 -65 108 -268 171 -233 -45 -77 95 -44 -214 345 -80 307 -148 92 -10 -73 288 -96
4963i6J35k97M27k09J20j24K14n7k40L31l39M27j66l14J41n4M62n90K77k85K05
$$ -96 39 -258 169 -40 80 -44 170 113 -127 204 -135 292 126 -188 -47 -101 361 -229 48 -237 -32
4984c2n6L7J76k29K77o44M79P4J77k15j04L36k91K37n88Q08n48K89l24J51J72
$$ -32 -88 -51 125 -104 173 -471 8 82 259 44 -60 276 -15 222 -366 442 -106 183 -141 10 182
5005A82l79M90o13N28o88N07k33Q5K50m82N40m70K77O4O8j54rJ28L7m5m77M90
$$ 182 -197 293 -320 208 -480 27 -206 -121 129 -353 187 -283 -6 58 126 -28 -37 91 128 83 -394 96
5027I6j46p9J51l74P12m61L86k46k2P4k39K94l10L83m23M32k00J96j0k81M15m86
$$ 96 -50 -129 22 -352 360 -101 285 39 17 91 -148 146 -164 219 -204 228 28 224 214 -67 348 -138
5049a38M32l36P8L3K8k15j86K81K6L29m61K81k86K1O9l42M43k77M23n16M81k19
$$ -138 294 -42 36 69 97 -118 -304 -23 3 332 -129 152 -134 -113 -44 -386 57 -220 203 -313 168 -51
5071e1j00M57p66O56m92P35m83Q7J10k63K06m17M25m47L57j42J03j7l35P04m36
$$ -51 -151 306 -460 196 -296 439 -44 43 153 -110 96 -321 104 -343 14 -128 -25 -42 -377 327 -109
$$ [...]
8191a02
##END NTUPLES=NMR FID
##END=
