##TITLE=1H_TG-2305-A6
 CDCl3, 16 sc, 
 16.11.2020
##JCAMPDX= 6.0         $$ Bruker NMR JCAMP-DX V2.0
##DATA TYPE= NMR FID
##DATA CLASS= NTUPLES
##ORIGIN= UXNMR, Bruker Analytische Messtechnik GmbH
##OWNER= root
$$ XWIN-NMR		Version 3.5
$$ Mon Nov 16 13:51:39 2020 Russian Standard Time (UT+4h)  she@DPX200
##.OBSERVE FREQUENCY= 200.1315066352
##.OBSERVE NUCLEUS= ^1H
##.DELAY= (6, 6)
##.ACQUISITION MODE= SIMULTANEOUS
##.ACQUISITION SCHEME= undefined
##.AVERAGES= 24
##.DIGITISER RES= 18
##SPECTROMETER/DATA SYSTEM= spect
##.PULSE SEQUENCE= zg30
##.SOLVENT NAME= CDCl3
##.SHIFT REFERENCE= (INTERNAL, CDCl3, 0, 15.7039)
##AUDIT TRAIL= $$ (NUMBER, WHEN, WHO, WHERE, WHAT)
$$ ##TITLE= Audit trail, XWIN-NMR		Version 3.5
$$ ##JCAMPDX= 5.01
$$ ##ORIGIN= Bruker BioSpin GmbH
$$ ##OWNER= she
$$ F:/spectra/data/she/nmr/H-F/1/audita.txt
$$ ##AUDIT TRAIL=  $$ (NUMBER, WHEN, WHO, WHERE, WHAT)
(   1,<2020-11-16 13:50:38.65 +0400>,<she>,<DPX200>,
      <continue with go, POWCHK disabled, PULCHK disabled
       configuration hash MD5:
       00 E9 B6 7A A2 85 ED C7 34 08 36 98 17 FE 4E 26
       data hash MD5: 16K
       8C BF BB 80 FB D9 CF 66 8A 58 B3 B6 53 65 E7 EE>)
$$ ##END=
$$ 
$$ hash MD5
$$ F5 E5 1A 92 76 3E 53 DD 59 58 58 F4 37 E5 36 CD
##$RELAX= 
##$RELAX= 
##$RELAX= 
##$RELAX= 
##$RELAX= 
##$RELAX= 
$$ Bruker specific parameters
$$ --------------------------
##$DU= <F:/spectra>
##$EXPNO= 1
##$NAME= <H-F>
##$PROCNO= 1
##$TYPE= <nmr>
##$USER= <she>
##$AMP= (0..31)
100 100 100 100 100 100 100 100 100 100 100 100 100 100 100 100 100 100 
100 100 100 100 100 100 100 100 100 100 100 100 100 100 
##$AQSEQ= 0
##$AQ_mod= 1
##$AUNM= <au_zg>
##$AUTOPOS= <>
##$BF1= 200.13
##$BF2= 200.13
##$BF3= 200.13
##$BF4= 200.13
##$BF5= 200.13
##$BF6= 200.13
##$BF7= 200.13
##$BF8= 200.13
##$BYTORDA= 1
##$CFDGTYP= 0
##$CFRGTYP= 5
##$CHEMSTR= <none>
##$CNST= (0..31)
1 1 145 1 1 1 1 1 1 1 1 1 1 1 1 1 1 1 1 1 1 1 1 1 1 1 1 1 1 1 1 1 
##$CPDPRG= <>
##$CPDPRG1= <>
##$CPDPRG2= <>
##$CPDPRG3= <>
##$CPDPRG4= <mlev>
##$CPDPRG5= <mlev>
##$CPDPRG6= <mlev>
##$CPDPRG7= <mlev>
##$CPDPRG8= <mlev>
##$CPDPRGB= <>
##$CPDPRGT= <>
##$D= (0..31)
0 1.2 0 0 0 0 0 0 0 0.06 0 0.03 0 0 0 0 0.0002 0 0 0 0 0 0 0 0 0 0 0 0 
0 0 0 
##$DATE= 1605520140
##$DBL= (0..7)
120 120 120 120 120 120 120 120 
##$DBP= (0..7)
150 150 150 150 150 150 150 150 
##$DBP07= 0
##$DBPNAM0= <>
##$DBPNAM1= <>
##$DBPNAM2= <>
##$DBPNAM3= <>
##$DBPNAM4= <>
##$DBPNAM5= <>
##$DBPNAM6= <>
##$DBPNAM7= <>
##$DBPOAL= (0..7)
0.5 0.5 0.5 0.5 0.5 0.5 0.5 0.5 
##$DBPOFFS= (0..7)
0 0 0 0 0 0 0 0 
##$DE= 6
##$DECBNUC= <off>
##$DECIM= 32
##$DECNUC= <off>
##$DECSTAT= 4
##$DIGMOD= 1
##$DIGTYP= 9
##$DL= (0..7)
0 120 120 120 120 120 120 120 
##$DP= (0..7)
150 150 150 150 150 150 150 150 
##$DP07= 0
##$DPNAME0= <>
##$DPNAME1= <>
##$DPNAME2= <>
##$DPNAME3= <>
##$DPNAME4= <>
##$DPNAME5= <>
##$DPNAME6= <>
##$DPNAME7= <>
##$DPOAL= (0..7)
0.5 0.5 0.5 0.5 0.5 0.5 0.5 0.5 
##$DPOFFS= (0..7)
0 0 0 0 0 0 0 0 
##$DQDMODE= 0
##$DR= 18
##$DS= 0
$$ [...]
##$SUBNAM2= <"">
##$SUBNAM3= <"">
##$SUBNAM4= <"">
##$SUBNAM5= <"">
##$SUBNAM6= <"">
##$SUBNAM7= <"">
##$SUBNAM8= <"">
##$SUBNAM9= <"">
##$SW= 16.9725356469052
##$SWIBOX= (0..15)
0 0 2 0 0 0 0 0 0 0 0 0 0 0 0 0 
##$SW_h= 3396.73913043478
##$TD= 16384
##$TD0= 1
##$TE= 0
##$TE2= 300
##$TE3= 300
##$TEG= 300
##$TL= (0..7)
0 120 120 120 120 120 120 120 
##$TP= (0..7)
150 150 150 150 150 150 150 150 
##$TP07= 0
##$TPNAME0= <>
##$TPNAME1= <>
##$TPNAME2= <>
##$TPNAME3= <>
##$TPNAME4= <>
##$TPNAME5= <>
##$TPNAME6= <>
##$TPNAME7= <>
##$TPOAL= (0..7)
0.5 0.5 0.5 0.5 0.5 0.5 0.5 0.5 
##$TPOFFS= (0..7)
0 0 0 0 0 0 0 0 
##$TUNHIN= 0
##$TUNHOUT= 0
##$TUNXOUT= 0
##$USERA1= <user>
##$USERA2= <user>
##$USERA3= <user>
##$USERA4= <user>
##$USERA5= <user>
##$V9= 5
##$VALIST= <valist>
##$VCLIST= <CCCCCCCCCCCCCCC>
##$VD= 0
##$VDLIST= <DDDDDDDDDDDDDDD>
##$VPLIST= <PPPPPPPPPPPPPPP>
##$VTLIST= <TTTTTTTTTTTTTTT>
##$WBST= 1024
##$WBSW= 4
##$XGAIN= (0..3)
0 0 0 0 
##$XL= 0
##$YL= 0
##$YMAX_a= 151513
##$YMIN_a= -94033
##$ZGOPTNS= <>
##$ZL1= 120
##$ZL2= 120
##$ZL3= 120
##$ZL4= 120
##$ABSF1= 10
##$ABSF2= 0
##$ABSG= 5
##$ABSL= 3
##$ALPHA= 0
##$AQORDER= 0
##$ASSFAC= 0
##$ASSFACI= 0
##$ASSFACX= 0
##$ASSWID= 0
##$AUNMP= <proc_1d>
##$AZFE= 0.1
##$AZFW= 0.1
##$BCFW= 1
##$BC_mod= 2
##$BYTORDP= 1
##$COROFFS= 0
##$CY= 11.3945322036743
##$DATMOD= 1
##$DC= 2
##$DFILT= <>
##$DTYPP= 0
##$F1P= 15.9154993809931
##$F2P= -4.1035820241983
##$FCOR= 0.5
##$FTSIZE= 0
##$FT_mod= 4
##$GAMMA= 1
##$GB= 0.15
##$INTBC= 1
##$INTSCL= 1
##$ISEN= 128
##$LB= 0.24
##$LEV0= 0
##$LPBIN= 0
##$MAXI= 10000
##$MC2= 0
##$MEAN= 0
##$ME_mod= 0
##$MI= 1.114404
##$NCOEF= 0
##$NC_proc= 0
##$NLEV= 6
##$NOISF1= 3.799351
##$NOISF2= 2.8
##$NSP= 1
##$NTH_PI= 0
##$NZP= 0
##$OFFSET= 15.70392
##$PC= 1
##$PHC0= -11049.39
##$PHC1= 9.200891
##$PH_mod= 1
##$PKNL= yes
##$PPARMOD= 0
##$PSCAL= 0
##$PSIGN= 0
##$REVERSE= no
##$SF= 200.130013532006
##$SI= 16384
##$SIGF1= 3
##$SIGF2= 2
##$SINO= 400
##$SIOLD= 16384
##$SREGLST= <1H.CDCl3>
##$SSB= 0
##$STSI= 0
##$STSR= 0
##$SW_p= 3612.71676300578
##$SYMM= 0
##$S_DEV= 0
##$TDeff= 0
##$TDoff= 0
##$TI= <>
##$TILT= no
##$TM1= 0
##$TM2= 0
##$TOPLEV= 0
##$USERP1= <user>
##$USERP2= <user>
##$USERP3= <user>
##$USERP4= <user>
##$USERP5= <user>
##$WDW= 1
##$XDIM= 8192
##$YMAX_p= 0
##$YMIN_p= 0
$$ End of Bruker specific parameters
$$ ---------------------------------
##NTUPLES= NMR FID
##VAR_NAME=  TIME,          FID/REAL,        FID/IMAG
##SYMBOL=    X,             R,               I
##VAR_TYPE=  INDEPENDENT,   DEPENDENT,       DEPENDENT
##VAR_FORM=  AFFN,          ASDF,            ASDF
##VAR_DIM=   8192,          8192,            8192
##UNITS=     SECONDS,       ARBITRARY UNITS, ARBITRARY UNITS
##FACTOR=    0.0002944,     1,               1
##FIRST=     0,             0,               0
##LAST=      2.4114304,     0,               0
##MIN=       0,             -94033,          0
##MAX=       2.4114304,     151513,          0
$$ Real data points
##PAGE= N=1
##DATA TABLE= (X++(R..R)), XYDATA
0 0 0 0 0 0 0 0 0 0 0 0 0 0 0 0 0 -1 16 -8 8 -8 14 -24 20 -30 32 -43 41 -55 64 -74 86 -97 107 -125 142 -159
36 -159 180 -207 234 -262 294 -327 364 -407 449 -498 553 -613 675 -745 822 -905 996 -1095
54 -1095 1206 -1330 1464 -1616 1786 -1978 2202 -2461 2763 -3118 3551 -4082 4724 -5491 6181
69 6181 -16251 151513 -93347 -10986 39280 -87769 44200 -4338 -40423 13211 -14671 -13956
81 -13956 56187 -71736 44487 -13565 -26968 42872 -25667 15051 -12630 36218 -28910 21618
93 21618 13675 -30124 39045 -20713 31904 -11921 11383 21416 -8928 -2201 26736 -16793 -585
106 -585 54727 -62222 56006 -11947 -13573 41623 -48294 44420 -18171 7019 23297 -12173
118 -12173 -5769 22605 -13447 -5461 32003 -33375 33483 -15901 16997 -2542 -13559 27083
130 27083 -27630 31407 -14176 19719 -10353 4778 18709 -25010 26214 -9838 5897 3933
142 3933 16540 -15972 20247 -2467 -5797 25354 -32129 49796 -25043 13620 22083 -26196 28366
155 28366 -3626 4296 -2940 22226 -7837 17588 -2340 1540 11389 -15241 36519 -23795 20486
168 20486 1922 4142 7300 -6214 15690 -23281 31871 -13660 7593 1783 -1431 6253 -14644
181 -14644 17133 -15955 9586 -7467 14124 -19040 7237 7991 -30686 27954 -28710 12645
193 12645 -7577 -1407 1955 -19189 10001 -12891 970 -14958 14939 -23172 9777 1922 -23919
206 -23919 13693 -20729 11853 -18472 11491 -9103 -7663 6416 -13039 6958 -21188 20815
218 20815 -20023 6374 6507 -13851 5312 -6175 8642 -16665 19077 -15185 9573 -580
230 -580 -2868 14050 -23736 26112 -15945 8280 5869 1697 -98 2024 12155 -17588 22587
243 22587 -14121 12964 -2393 3986 9241 -13664 18943 -13492 10502 -5932 15860 -7617
255 -7617 2506 12850 -18696 21066 -13536 10984 -8388 5522 3326 -7756 7747 -9572
267 -9572 8707 -15248 19588 -17388 2415 8009 -15551 12405 -15092 10216 -15455 8150
279 8150 -5098 -3845 966 -8106 8173 -22460 18940 -16588 1687 2566 -6612 3150 -9274 11954
293 11954 -19693 12923 -10931 5931 -2381 -4212 11011 -20797 19302 -12327 4024 -1380 5244
306 5244 -1619 -2013 13661 -17489 16617 -9841 12300 -5100 3214 9770 -13008 16722 -8336
319 -8336 9625 -7938 13388 -4446 393 14775 -11521 13421 -9912 14387 -9112 7471
331 7471 3939 -6594 10693 -6805 10927 -15559 15799 -9292 559 8271 -8426 8347 -11732
344 -11732 12698 -14296 8129 -2443 -1888 187 -5697 10092 -20017 15329 -13559 525 955
357 955 -3941 2254 -11554 11160 -15291 8456 -8203 3699 -6123 -2985 9755 -18895 13698
370 13698 -11856 4636 -5623 3883 -1037 -7755 12282 -13634 9507 -9367 9327 -7131 1483
383 1483 8088 -10115 11118 -7894 9049 -10749 12705 -2812 -2762 11891 -9666 12146 -9140
396 -9140 13541 -7239 4289 6286 -2849 6371 -4458 10773 -13642 15812 -6646 1708 4911
409 4911 -4855 10228 -11678 14570 -10781 5082 -248 -76 1188 -4662 9994 -15809 12075
422 12075 -8445 2232 -3356 -460 2542 -10269 11847 -14274 7902 -9454 4164 -3063 -6588
435 -6588 10416 -15093 7377 -7519 3171 -7747 4361 -2521 -5884 8028 -11185 9296 -13421
448 -13421 10706 -6950 -1120 9113 -11312 7947 -6678 8527 -10059 7634 -1641 -2033 6885
461 6885 -4656 8718 -11206 13896 -8238 4544 3049 -1710 6037 -6278 14176 -13092 11682
474 11682 -3399 -135 4983 -2712 8048 -8900 11301 -7767 5959 -3484 5081 -216 -4758
487 -4758 12846 -14901 11994 -8012 2701 -1832 -1637 6105 -10289 8464 -8388 4611 -7594
500 -7594 6009 -4487 -4021 7836 -11221 7931 -9682 6678 -9947 3117 1116 -8235 7506
513 7506 -10210 8419 -11542 7753 -4975 -4110 5641 -6033 4554 -6990 9320 -11524 7574
526 7574 -2903 -1663 4706 -6851 11298 -12435 10982 -4536 339 2941 -529 4469 -5375 11897
540 11897 -10081 9642 -3084 3681 695 -1309 9779 -10339 12073 -5536 5388 -3378 4729
553 4729 2723 -5306 12587 -9865 8825 -4673 5782 -3133 230 5214 -6831 8217 -6845
566 -6845 8200 -10175 6947 -1995 -5048 9083 -9052 7479 -8362 6722 -7447 682 818
579 818 -5327 3596 -7804 8742 -11929 6980 -5314 -2749 3190 -4969 4485 -9166 10363 -10188
593 -10188 4083 -2394 -2213 2032 -6241 9796 -10841 8463 -5222 1127 -711 631 3056 -8309
607 -8309 12251 -8482 7625 -3674 3422 104 -2859 9687 -7973 9373 -4267 6190 -3956
620 -3956 4569 3049 -5928 10985 -7031 9218 -5363 7046 -2509 -365 6765 -5605 7508
633 7508 -6048 9314 -8678 6664 6 -5025 6172 -6257 7484 -7476 8508 -6712 828
646 828 1214 -4032 3461 -7434 8929 -10865 5798 -3387 -2716 688 -5011 4384 -10009 8414
660 8414 -8900 2545 -3036 -1301 792 -7525 8487 -10888 5679 -4368 1291 -3419 -997 3103
674 3103 -8452 9506 -8086 5611 -5193 3456 -330 -4377 7652 -7686 7333 -4658 7284
687 7284 -5103 3532 2589 -5616 8942 -5748 8277 -5969 7761 -1184 -856 5897 -3764 6522
701 6522 -5873 10922 -7748 5574 1132 -2490 6153 -4961 7921 -7372 8863 -4009 1984
714 1984 915 -2039 3719 -7716 9809 -8881 4895 -2382 -948 233 -3500 5069 -9864 7397
728 7397 -7282 3536 -4126 -34 1790 -8964 8064 -9322 4685 -5092 1815 -3378 -1319 2844
742 2844 -8519 6293 -7943 5536 -6922 3631 -331 -5727 6808 -7084 5985 -6223 6620
755 6620 -5493 1621 3178 -4874 5961 -5791 7562 -6761 7039 -1213 -602 3896 -2851 7113
769 7113 -6909 10034 -6802 4751 1853 -1667 5069 -4349 8533 -6523 7501 -2344 2353
782 2353 -593 238 4573 -7120 9963 -7759 5849 -2331 1676 789 -3849 6500 -8685 7127
796 7127 -5101 3919 -3814 809 1998 -6246 7208 -7657 4654 -5985 4285 -3930 -1791 3705
810 3705 -7797 5857 -8352 6099 -6986 1270 1204 -5037 4431 -5777 4189 -7434 6780 -6057
824 -6057 1372 844 -3998 5126 -7577 8448 -8047 4480 -1005 -1474 2997 -2929 5781 -7393
838 -7393 8679 -4697 3256 -382 -22 3356 -3995 8797 -7368 6901 -3234 3637 -34 -945
852 -945 6539 -7804 9339 -5654 4410 -2192 1827 654 -2810 6230 -5995 5922 -6098 5705
866 5705 -4986 1468 3263 -6928 6805 -6510 5292 -5905 3850 -2265 -2772 3741 -5870 4264
880 4264 -7597 6044 -6995 1967 117 -3898 2866 -5654 5908 -8387 6522 -5002 -172
893 -172 1192 -4301 4418 -7588 6990 -7503 3093 -1464 -264 499 -2588 6200 -7843 8414
907 8414 -5142 3597 -659 225 3496 -5380 8247 -5964 5597 -2353 3727 -550 -368 6320 -6090
922 -6090 7851 -4427 5968 -3232 2869 1807 -2887 6353 -5785 6839 -5183 7065 -3343
935 -3343 -188 4025 -5364 6105 -5082 5624 -5910 4436 -1699 -1674 2810 -4464 5430 -7729
949 -7729 6529 -6432 967 -62 -3488 2502 -5869 5207 -8711 4878 -4334 -487 -514 -3419
963 -3419 3258 -7807 6018 -7002 2174 -3194 236 -516 -4311 5303 -8144 6390 -5544 3190
977 3190 -2351 -903 3505 -6243 6461 -5758 4347 -4242 4067 -1702 -1083 4800 -5925 6736
991 6736 -5144 6877 -4014 3302 1992 -2894 6029 -4714 6767 -5001 6411 -1900 793
1004 793 4064 -2842 5139 -4555 7044 -5063 5203 -1239 135 2579 -3847 6159 -7411 7421
1018 7421 -4552 1292 1195 -2255 2674 -4888 5742 -6556 4495 -3512 1107 -1177 -2661 3469
1032 3469 -7213 6007 -6434 3115 -3521 336 -20 -5365 5185 -7725 4784 -4886 2638 -2790
1046 -2790 -1199 2492 -5477 4727 -5945 4937 -5350 4236 -1735 -2370 4975 -5573 6185 -5850
1060 -5850 5861 -3481 1502 1995 -2108 4295 -3750 6156 -5401 6033 -1766 1138 2884 -2154
1074 -2154 5393 -5453 7204 -4967 3999 271 -132 3081 -3023 6317 -5651 6003 -3168 1868
1088 1868 88 -173 2526 -4196 6582 -6783 5289 -3826 2281 -363 -2877 4486 -6755 5309
1102 5309 -5027 2904 -3503 377 113 -4311 3922 -6545 4082 -5849 3571 -3630 -924 2116
1116 2116 -5580 4589 -5692 4425 -5305 2246 -930 -2616 3243 -4451 4488 -5619 5254 -4166
1130 -4166 1294 704 -2164 3272 -4582 6587 -6270 5171 -1949 221 2329 -1934 4837 -4761
1144 -4761 6276 -4183 3652 -707 1561 1809 -2537 6459 -5576 6833 -3043 3272 -316 -50
1158 -50 4033 -4665 6156 -4357 4646 -2834 2701 -389 -1479 4317 -5330 5159 -4847 3748
1172 3748 -3687 753 914 -4186 4253 -5655 4345 -6094 3432 -2841 -1769 2121 -4219 3066 -4794
1187 -4794 4180 -5679 2530 -1704 -2399 2023 -4938 4108 -6224 4668 -4001 232 489 -2216 2428
1202 2428 -4197 5093 -5931 4229 -1820 1017 757 -1779 4123 -5185 6006 -3935 3641 -1190
1216 -1190 1186 1874 -3090 6072 -4754 5165 -2691 3346 -434 354 3729 -3868 5366 -3395 5170
1231 5170 -3116 3352 -213 -2045 4879 -4581 5156 -3728 4333 -2880 1340 1218 -3054 3653 -4321
1246 -4321 4647 -4878 3403 -2146 -1262 1456 -3362 3334 -5181 4551 -5240 2035 -1152 -1870 1421
1261 1421 -4536 4363 -6426 3816 -3598 142 -312 -1945 2057 -4987 4657 -5442 3283 -2799
1275 -2799 554 447 -2114 3767 -5057 4992 -3896 3031 -1945 1131 1801 -3220 5384 -4257 4642
1290 4642 -2627 2940 -617 -60 3365 -3047 4780 -3568 4895 -2585 3382 761 -1117 4869 -3275
1305 -3275 4785 -3326 4190 -2195 1547 1383 -1734 3519 -3536 5164 -4628 3771 -1441 28 1387
1320 1387 -2428 3735 -4940 4561 -4194 1698 -977 -897 1378 -3504 3876 -5477 3220 -3330 644
1335 644 -1513 -1494 1346 -5170 4335 -5545 2630 -3224 810 -156 -3037 3379 -4946 3700 -3790 2659
1351 2659 -2475 216 941 -3229 3797 -4486 3542 -3767 3187 -1324 -788 2704 -3328 4409 -3320
1366 -3320 4746 -3389 1951 826 -926 3443 -2725 4415 -3862 4498 -1460 1569 1407 -838 3576
1381 3576 -3658 5118 -3815 3198 -812 556 1476 -1520 3566 -4135 4767 -3412 2343 -1442 165
1396 165 1345 -3576 4548 -4925 3505 -3071 1196 -884 -1182 2366 -4359 3591 -4201 2513 -3348
1411 -3348 536 -626 -2810 2681 -4859 2728 -3632 2368 -3191 -366 461 -3747 3071 -3769 2823
1426 2823 -4038 2062 -604 -1000 1846 -2813 2805 -4902 4485 -3709 1483 51 -1930 3064 -2649
1441 -2649 3600 -4199 3964 -1366 1373 1110 -513 3527 -3360 5362 -3356 3247 -1105 960 1163
1456 1163 -1413 4192 -3539 4377 -2266 2494 -1097 208 2369 -2999 3978 -3459 2978 -2601 1837
1471 1837 -864 -996 2565 -3644 3721 -3955 2933 -3169 869 -134 -2821 2377 -3532 2841 -3754
1486 -3754 2986 -2723 -201 800 -2956 2578 -4031 3145 -4215 2129 -1148 -1298 1096 -2776 2901
1501 2901 -4129 3545 -3502 935 -458 -1087 1964 -2754 4123 -3591 3439 -2217 780 -309 -679
1516 -679 2967 -2517 4815 -2316 2740 -1003 745 1380 -984 3539 -2733 3624 -1833 2979 -1065
1531 -1065 514 2769 -2808 4496 -2383 3792 -2004 1865 -952 -585 2986 -2876 3204 -2820 4388
1546 4388 -3179 1595 -107 -2039 2391 -3373 3283 -3963 2258 -2463 -545 335 -2399 2736 -3310
1561 -3310 3709 -4725 1441 -2035 -679 606 -2362 1532 -4569 2610 -3793 1782 -622 -687 1249
1576 1249 -2840 4186 -3361 2889 -1531 1047 -301 -1263 2425 -3333 4208 -3099 3078 -1178 1082
1591 1082 736 -1644 3598 -3241 3434 -1962 2769 -1035 287 2314 -2081 3438 -2140 3662 -1879
1606 -1879 2844 -506 -512 2459 -2375 3581 -3227 4091 -2522 1322 889 -1382 2512 -2850 3441 -3545
1622 -3545 2828 -1576 576 299 -1990 2363 -3868 3408 -3395 1766 -1205 -520 153 -2752 2577 -3952
1638 -3952 2135 -2253 985 -1204 -1820 1217 -3181 3481 -3483 2083 -2091 1363 -1178 -1724 1936
1653 1936 -3280 4386 -3493 2727 -2120 482 768 -1853 2477 -2129 2803 -2799 3456 -829 52
1668 52 1160 -1164 3347 -3021 3822 -1941 2377 -639 -585 2116 -1545 3135 -3096 3571 -1919 1524
1684 1524 635 -733 2165 -2342 3525 -3212 3097 -1357 1237 752 -1369 2674 -3236 3600 -2778
1699 -2778 1970 -1465 94 659 -2735 2674 -3659 2855 -2685 1214 -1106 -704 1183 -2968 2648
1714 2648 -3353 2376 -3014 1256 -505 -1373 1847 -3540 2659 -3636 2450 -2292 171 369 -1799
1729 -1799 2293 -2718 3035 -3128 2829 -1528 351 1985 -2170 2929 -2826 3423 -2503 2188 -250
1744 -250 -365 1274 -1841 2996 -3347 3449 -1706 1696 -24 -244 2224 -2490 3526 -2818 2841 -1631
1760 -1631 1200 481 -1352 2863 -2952 3095 -2270 2052 -1008 310 810 -2151 2613 -3123 2989
1775 2989 -2480 1670 -1499 -759 1621 -2781 2335 -3675 1849 -2788 992 -797 -2316 1987 -2876
1790 -2876 2187 -3724 2580 -2798 1000 -249 -1555 2071 -3736 2434 -3486 2064 -1758 87 1178
1805 1178 -1982 2322 -3320 2733 -2563 1698 -194 260 1394 -2050 3102 -3300 2976 -1909 1772
1820 1772 -184 -326 1608 -1247 4080 -1997 2720 -1183 1023 507 -347 2343 -1953 3006 -1703 2522
1836 2522 -1015 777 869 -2002 2794 -2651 2790 -2163 2210 -1027 -1117 814 -2426 2562 -3098 2674
1852 2674 -2621 917 -17 -766 1351 -2681 3100 -3704 1630 -1975 -363 -24 -1169 1524 -2937 2418
1868 2418 -3580 2430 -2108 14 462 -1754 2295 -3394 1972 -2117 1676 -1319 -115 1309 -1946
1883 -1946 2731 -2856 3075 -2292 1010 133 -608 1810 -1561 2570 -2615 2129 -1406 1594 874 -567
1899 -567 2915 -1967 3484 -1843 3455 -878 160 1388 -1397 2909 -2204 3615 -2227 1890 -702
1914 -702 -59 1945 -1974 2510 -3092 2882 -2491 1641 -580 -578 1514 -2433 2775 -3120 2882 -2098
1930 -2098 451 -65 -1196 1101 -3116 2712 -3520 2098 -1381 -319 -15 -1771 1823 -3254 2321
1945 2321 -3353 1227 -1237 -2 409 -2518 2769 -3018 2376 -2336 1522 -1080 -928 1174 -2206
1960 -2206 2656 -2871 2896 -1898 1432 -25 -887 2331 -2426 3014 -2282 2353 -1348 752 1047
1975 1047 -1497 2946 -2396 3292 -2046 2410 -600 -119 1238 -1011 2926 -2346 2973 -2588 1056
1990 1056 -945 -248 1741 -1965 3202 -2543 2547 -1983 851 -258 -839 1839 -2903 2965 -2793
2005 -2793 1789 -1457 15 -128 -1559 2157 -2765 2439 -2613 1552 -1737 80 351 -2406 2434
2020 2434 -3299 2126 -2733 1278 -995 -1027 1309 -2310 2117 -2948 2269 -2393 812 -122 -1072 1941
2036 1941 -2313 2593 -2812 2704 -1556 709 663 -1082 2497 -2268 3261 -2501 2476 -253 315 1390
2052 1390 -1562 2058 -1821 3136 -1732 2322 13 -1099 1354 -1557 3030 -2871 3075 -1348 852
2067 852 56 -1139 1519 -2246 2952 -2629 1923 -1507 577 -49 -1222 2093 -2475 1939 -2549 1567
2083 1567 -1383 -330 816 -1840 1750 -2830 2278 -2417 1524 -1227 -898 1195 -2292 2223 -2625
2098 -2625 2286 -2688 807 -282 -1281 1399 -2097 2487 -2250 2332 -1506 597 -112 -1022 1856 -1843
2114 -1843 2741 -2436 2027 -846 647 505 -1292 2444 -2327 3078 -1110 1314 11 -801 1316
2129 1316 -887 2663 -2296 2240 -1552 1298 32 -367 2243 -1785 2387 -2468 2964 -1830 627
2144 627 20 -1089 1969 -1911 2180 -2337 1760 -1493 60 -79 -2478 1861 -2768 2136 -2177 897
2160 897 -798 -462 777 -1900 1845 -3521 2216 -2063 993 -170 -1554 1175 -2419 2586 -2860
2175 -2860 2006 -2105 57 203 -1009 1374 -2635 2517 -2502 1767 -547 472 877 -1410 2234
2190 2234 -2505 2286 -1883 1803 -609 350 1274 -1509 2508 -1871 2950 -1714 1917 207 -274 1591
2206 1591 -1740 2350 -1983 2619 -1489 871 811 -1083 1953 -1542 2436 -1903 2309 -1177 244
2221 244 767 -1629 2196 -2578 2563 -2530 1416 -1089 -375 1023 -1749 2192 -2753 1723 -1896 1016
2237 1016 -449 -737 1129 -2317 2228 -2479 1383 -1460 397 -543 -1089 1559 -3010 2280 -2469 1245
2253 1245 -1434 -65 377 -1731 2041 -2577 2230 -2386 1826 -761 58 1354 -1484 2522 -2136
2268 -2136 2531 -1175 1167 370 -178 2028 -1479 2779 -1997 2898 -962 987 949 -389 1815 -1477
2284 -1477 2394 -2415 1869 -462 638 1120 -951 1874 -2444 2486 -2693 1173 -307 -274 772 -1583
2300 -1583 2230 -2410 2365 -2112 901 -933 -643 885 -2335 2361 -2691 1774 -1429 242 -439
2315 -439 -1205 856 -2806 2348 -2196 1602 -1944 203 412 -1663 941 -2363 1653 -2559 1278 -1007
2331 -1007 -766 1663 -2132 1676 -1614 2271 -1143 875 22 -211 1043 -1750 2776 -2421 2390 -1849
2347 -1849 1135 476 -887 1664 -1376 2540 -2193 2071 -920 569 749 -850 2124 -1934 2602
2362 2602 -1415 1808 -561 141 637 -1316 1732 -2316 2473 -1186 922 -314 -931 689 -1513 2319
2378 2319 -2115 1482 -2094 606 -520 -1073 1147 -1871 2141 -2467 1550 -1120 198 535 -1653
2393 -1653 1459 -2445 1904 -2177 1467 -1259 -303 754 -1789 1660 -2145 1685 -1976 961 -526
2408 -526 -139 825 -1733 2198 -2033 1829 -460 1550 481 -204 1357 -981 2401 -1859 1918 -1050
2424 -1050 553 240 -497 1786 -1643 1983 -1453 1908 -605 385 873 -1133 2153 -1652 2188 -1413
2440 -1413 1492 -372 -386 953 -1540 2097 -2304 1820 -1334 1091 -510 -679 1104 -1950 1914 -2231
2456 -2231 1744 -1445 146 99 -1393 888 -2338 1803 -1804 1069 -1301 -298 332 -1063 1498 -2081
2472 -2081 1966 -1580 846 -737 -336 712 -1984 1418 -2066 1697 -857 495 -403 -441 2028 -1095
2488 -1095 2068 -1436 1780 -979 629 424 -924 1798 -1749 2037 -1564 1481 -908 638 864
2503 864 -861 1815 -1422 2376 -1218 1170 -176 -1 1304 -1089 2020 -1526 1833 -1096 859
2518 859 159 -389 1361 -1592 2109 -1848 1898 -1030 621 -151 -1128 1480 -2143 1531 -2079 1292
2534 1292 -931 -25 175 -1399 1789 -2038 1477 -1847 960 -740 -203 645 -1613 1451 -2310 1305
2550 1305 -1887 234 -548 -1035 887 -1987 1623 -1534 1744 -1201 277 -56 -1204 1664 -1519 1753
2566 1753 -1573 1648 -915 -100 256 -1144 1937 -1565 1896 -1173 1490 -450 290 831 -669 2286
2582 2286 -1618 1890 -1156 1067 -115 -374 1265 -947 1495 -2026 1651 -825 524 99 -546 1632
2598 1632 -1223 1636 -1749 1139 -854 -68 341 -1091 1302 -2047 1663 -1285 873 -1040 -471 724
2614 724 -1743 1159 -1863 1100 -1453 841 -603 -968 751 -1849 1415 -2230 1191 -1479 430
2629 430 246 -1052 1290 -1606 1172 -1689 1072 -1365 133 55 -1168 1602 -1766 1699 -1481 1117
2645 1117 -521 131 868 -928 1901 -1740 1952 -885 1209 -77 79 1617 -944 1970 -1323 1695
2661 1695 -352 874 -273 -282 1386 -1385 1809 -1432 1290 -858 592 531 -966 1762 -1842 1793
2677 1793 -1530 1033 -685 -353 455 -1168 1099 -1745 1365 -1611 517 -568 -616 624 -1624 1178
2693 1178 -2182 1146 -971 317 -213 -812 823 -1567 1430 -1886 1070 -954 204 325 -1073 1567
2709 1567 -1484 1777 -1861 1077 -751 61 673 -1017 1762 -1439 1888 -1308 1172 -103 -80 879
2725 879 -1079 1937 -1316 1809 -894 793 378 -317 1568 -1206 2022 -1176 1757 -743 806 480
2741 480 -636 1662 -1567 1981 -1159 1224 -652 -167 522 -1225 1378 -1696 1848 -1272 882 -855
2757 -855 -646 1082 -1716 1064 -2030 1564 -1433 535 -62 -703 770 -1679 1404 -1701 702 -1149
2773 -1149 73 -455 -947 967 -1582 1489 -1521 920 -968 120 749 -812 1300 -1816 1393 -1505
2789 -1505 1187 -324 -351 622 -1076 1407 -1570 1390 -868 924 130 -248 1109 -1440 1719 -1395
2805 -1395 1507 -824 764 955 -859 1510 -1092 1672 -1075 943 -527 188 650 -590 1588 -1269
2821 -1269 1753 -1415 1139 -535 87 791 -1299 1311 -2197 1087 -1481 676 -476 -532 1389 -1202
2837 -1202 1271 -1539 1387 -1155 404 286 -834 675 -1748 1421 -1664 761 -810 -10 174 -864
2853 -864 1003 -1540 1469 -1600 947 -586 -9 778 -1651 1624 -1429 1609 -1151 954 -224 -501
2869 -501 947 -1355 1451 -1316 1337 -1021 833 262 -406 1325 -1190 1858 -1288 1195 -266 319
2885 319 683 -738 1746 -1310 1610 -1325 991 -219 -215 769 -744 1345 -1272 1872 -1128 358
2901 358 11 -478 844 -1604 961 -1457 1147 -966 164 -142 -750 1067 -1289 1549 -1734 721
2917 721 -1014 -98 336 -1094 1154 -1632 1408 -1388 782 -713 -868 191 -1129 1114 -1751 938
2933 938 -1299 451 -178 -542 994 -924 1584 -1505 1519 -1466 337 87 -525 1217 -981 1949
2949 1949 -1056 1250 -624 806 834 -782 1516 -1220 1827 -955 881 -243 187 529 -1044 1418
2965 1418 -980 1758 -858 492 -47 -424 872 -840 1822 -1502 1384 -934 478 94 -441 1038
2981 1038 -1490 1553 -1565 955 -1165 -215 -140 -1184 1113 -1705 1500 -1497 935 -732 -340 458
2997 458 -1290 726 -1752 1077 -1682 705 -784 -429 480 -1615 1371 -1454 1315 -1324 398 -307
3013 -307 -478 1027 -1224 1440 -1267 1323 -776 674 197 -378 1273 -1318 1927 -1117 1000 -374
3029 -374 336 1166 -972 1344 -1277 1716 -1005 917 -371 -349 909 -1018 1429 -1269 1077 -785
3045 -785 375 21 -242 839 -1149 1633 -1308 1250 -760 -115 254 -803 1035 -1623 1075 -1139
3061 -1139 1051 -979 80 168 -991 931 -1486 1412 -1216 484 -336 -606 238 -1344 1147 -1591
3077 -1591 721 -937 138 -322 -655 940 -1102 1551 -1476 1376 -756 518 253 -411 1047 -990
3093 -990 1534 -1143 788 -227 141 366 -553 1244 -1066 1284 -947 1270 -224 -200 851 -1009
3109 -1009 1286 -1148 1348 -1066 334 177 -298 1187 -1471 1387 -1397 1223 -407 200 537 -730
3125 -730 1055 -1295 1256 -1131 760 -243 -208 30 -1102 1499 -1322 1146 -1093 669 -554 -109
3141 -109 303 -1627 1063 -1437 1041 -1433 319 -335 -694 592 -1287 1053 -1663 553 -646 -87
3157 -87 -240 -895 884 -1123 1043 -1355 1033 -485 30 369 -960 1444 -1195 1422 -1064 1126
3173 1126 -225 -197 1132 -546 1431 -995 1294 -517 797 -120 -153 1138 -1028 1829 -1203 1403
3189 1403 -418 282 88 -616 1121 -1092 1648 -1217 1120 -449 -112 655 -521 964 -1678 1103
3205 1103 -1219 793 -380 -239 630 -1124 1046 -1625 1397 -1376 722 47 -621 771 -1312 1169
3221 1169 -1198 925 -904 109 -49 -698 918 -1545 674 -1183 868 -874 37 385 -837 865
3237 865 -1124 1016 -1001 745 -257 45 441 -877 1132 -1053 1102 -531 1039 133 -397 1273
3253 1273 -777 1783 -950 1374 -476 707 745 -420 1170 -953 1743 -1020 1485 -484 590
3268 590 440 -767 1208 -1239 1009 -1122 766 -332 3 560 -855 1148 -1172 1303 -985 667
3284 667 -397 -460 688 -1496 973 -1415 983 -1007 154 -225 -1133 1058 -1332 1036 -1477 836
3300 836 -735 134 20 -568 513 -1348 991 -1252 782 -254 165 588 -972 957 -1351 1447
3316 1447 -579 -12 157 -67 290 -921 1591 -999 1329 -1024 319 315 -167 973 -1498 1317 -789
3333 -789 1045 -663 719 486 -541 1096 -1366 1227 -1285 740 -338 414 560 -961 1239 -1416
3349 -1416 1517 -565 670 59 -186 1068 -661 965 -1454 1061 -820 38 -181 -721 512 -1477
3365 -1477 1135 -1261 429 -702 79 335 -593 689 -1263 1047 -926 894 -546 -511 308 -748
3381 -748 844 -1312 1088 -938 574 -508 -329 513 -1140 1205 -861 1058 -653 367 -6 -344
3397 -344 1143 -801 1118 -818 674 -124 537 512 -756 931 -1006 1179 -564 1083 -130 217
3413 217 892 -496 879 -808 890 -1022 522 -54 67 159 -1011 877 -771 1279 -659 562
3429 562 -156 -411 590 -1202 922 -1212 744 -542 -155 259 -608 784 -1707 832 -1068 464
3445 464 -638 -131 259 -1091 1187 -1565 1169 -1134 433 -480 -270 458 -1050 1037 -987 834
3461 834 -687 459 -2 -663 478 -953 548 -693 1332 -461 588 44 -495 732 -899 1068
3477 1068 -895 933 8 166 565 -478 868 -628 1244 -569 550 -65 7 769 -862 696 -863
3494 -863 1324 -642 368 310 -317 568 -948 994 -1486 1041 -338 530 -91 -470 600 -911 900
3511 900 -855 686 -288 -129 191 -766 757 -747 1137 -816 314 -343 -157 181 -1029 645 -1434
3528 -1434 766 -1127 498 -316 -452 432 -716 1355 -882 789 -779 226 120 -562 660 -1452
3544 -1452 1041 -499 597 -177 -32 717 -371 972 -642 1265 -699 724 -427 324 858 -771
3560 -771 1306 -779 740 -705 437 -66 -156 860 -1044 1397 -949 928 -474 -14 198 -344 759
3577 759 -785 953 -927 1090 -380 141 -276 -624 386 -1020 1147 -720 599 -569 30 20 -947
3594 -947 558 -997 1118 -1125 177 76 -491 438 -1177 832 -1406 689 -745 -82 31 -486 707
3611 707 -692 773 -853 818 -845 125 -138 -243 1032 -886 1075 -624 674 -247 -302 819 -294
3628 -294 975 -1065 997 -310 758 296 5 477 -871 1040 -328 892 -485 577 -204 -267 370
3645 370 -860 695 -639 1152 -427 -340 519 -869 807 -936 632 -929 758 -511 -32 93
3661 93 -684 682 -1141 949 -765 222 -165 -495 488 -951 653 -925 447 -482 2 155 -554 311
3679 311 -1240 917 -1290 489 -306 300 218 -994 712 -846 972 -657 624 -254 -58 393 -462
3696 -462 863 -918 909 -750 456 14 225 228 -672 865 -440 470 -428 542 -156 -368 401 -790
3714 -790 1184 -503 518 -271 7 327 -82 929 -1106 978 -559 241 -303 -249 284 -580 744 -559
3732 -559 529 -800 561 69 -372 95 -679 1030 -931 556 -770 390 74 -579 589 -1023 762
3749 762 -700 218 -334 -122 50 -821 528 -1060 835 -922 875 -207 -269 338 -836 963 -522
3766 -522 730 -420 844 243 -273 487 -854 997 -778 746 -351 346 -69 145 1045 -759 1146
3783 1146 -928 773 -349 -53 325 -70 958 -641 1074 -520 927 -112 177 14 -449 875
3799 875 -387 945 -838 500 -430 84 506 -945 552 -875 926 -512 413 144 -687 542 -817
3816 -817 550 -974 521 -357 377 81 -831 623 -730 546 -627 477 -656 -203 122 -611 657
3833 657 -814 495 -578 680 123 14 261 -973 751 -783 580 -915 344 214 -312 843
3849 843 -826 656 -677 653 87 335 134 -345 920 -555 914 -656 594 -217 172 489 -603
3866 -603 565 -802 1207 -793 674 -248 -97 194 -899 618 -403 705 -471 278 83 -380 277
3883 277 -786 963 -588 380 -116 -193 134 -485 616 -932 743 -1094 519 -554 -130 17 -195
3900 -195 243 -1567 584 -1012 365 -617 18 590 -619 549 -814 429 -502 414 -16 -393 185
3917 185 -522 910 -350 515 -315 -5 -202 -566 499 -737 678 -809 737 23 -150 886 -249
3934 -249 946 -785 769 -483 332 -177 123 625 -510 1003 -981 734 -333 451 -42 -418 733
3951 733 -690 518 -960 654 -416 244 380 -38 555 -838 569 -1132 325 -834 -50 100 -815
3968 -815 620 -1204 771 -936 409 -497 -282 284 -541 656 -937 903 -864 170 75 -397 473
3985 473 -690 786 -514 556 -458 447 75 -357 781 -843 675 -1090 601 -144 3 173 -590
4002 -590 357 -460 611 -464 594 -16 166 248 -486 685 -348 1009 -573 164 -15 81 231 -708
4020 -708 758 -587 597 -460 180 233 -330 565 -788 484 -702 536 -215 39 -76 -702 698
4037 698 -820 302 -563 249 -399 104 248 -727 746 -875 648 -139 225 -183 -280 1003 -825 612
4055 612 -392 434 -370 115 33 -438 261 -324 940 -504 861 -510 -53 156 -405 343 -454 1044
4073 1044 -908 372 -162 -111 505 -499 834 -656 1017 -500 608 -97 -128 523 -291 991 -428
4090 -428 933 -498 346 -123 64 470 -733 941 -737 727 -96 154 -3 -368 714 -444 485
4107 485 -276 603 -268 93 219 -271 549 -1135 715 -513 332 -498 -354 487 -638 817 -495 713
4125 713 -688 170 -16 -168 270 -892 1050 -881 715 -505 69 79 -431 1216 -681 624 -201
4142 -201 353 -245 222 52 -702 534 -740 502 -91 230 -409 -180 889 -676 808 -403 612
4159 612 -661 720 38 -237 638 -657 971 -597 718 -425 364 140 -402 269 -259 764 -775
4176 -775 507 -125 -94 -173 -406 659 -742 280 -527 363 -123 -292 324 -523 472 -1133 645 -644
4194 -644 277 88 -308 113 -843 334 -770 733 -342 -233 132 -89 365 -679 366 -836 284
4211 284 -320 -174 431 -638 574 -865 626 -442 710 50 -158 526 -490 599 -495 548 -312
4228 -312 211 129 -4 710 -338 642 -482 747 -63 298 297 -389 662 -626 754 -631 305 -353 427
4247 427 432 -614 599 -793 758 -599 523 -133 -31 569 -665 391 -745 198 -831 114 226
4264 226 -9 296 -41 665 -621 961 -598 -60 172 -385 307 -990 810 -769 446 -400 -180 30
4282 30 -1080 569 -669 363 -631 277 6 -493 94 -421 447 -899 118 -466 873 363 51 291
4300 291 228 1564 -639 813 12 504 156 3 547 98 755 -538 276 136 -82 -205 -316 416 -377
4319 -377 1041 -507 372 -540 146 564 -680 558 -362 658 -475 628 -7 -93 385 -483 484 -746
4337 -746 396 -502 144 95 -306 172 -585 654 -529 241 -113 242 158 -263 197 -476 378 -689 600
4356 600 -245 -303 103 -667 807 -660 696 -122 150 185 44 262 -391 754 -824 636 -447 -97
4374 -97 -152 -400 467 -613 623 -631 360 -426 265 74 -193 464 -409 526 -192 649 69 -81 189 -75
4394 -75 781 -362 1035 -197 552 -504 -216 71 -591 687 -443 435 -591 99 -222 -71 5 -529
4412 -529 491 -499 307 -366 -25 108 -527 394 -508 564 -658 7 -235 -221 199 -538 351 -607 409
4431 409 -509 180 -454 -403 265 -104 774 -368 721 -246 279 -59 111 450 -459 543 -254 208 -400
4450 -400 204 106 -328 115 -622 459 -79 278 8 -361 192 -658 853 -446 715 -209 310 156 -129
4469 -129 229 -211 378 -328 320 -508 125 -151 32 450 -345 239 -713 207 -662 294 -367 -118 452 -803
4489 -803 553 -852 419 -90 -366 96 -507 334 -382 320 -709 193 0 -161 438 -380 342 -890
4507 -890 352 -154 53 -284 50 128 -557 592 -706 759 -151 202 30 -505 554 -621 414 -272
4525 -272 215 -186 47 520 -292 267 -494 597 -308 263 170 139 19 -286 922 -322 554 -315 305 -156
4545 -156 26 389 -392 445 -556 215 -335 452 54 -240 163 -612 646 -557 448 -160 -222 18 -446
4564 -446 447 -445 829 -692 -72 212 -134 -109 -153 621 -612 246 -507 -104 -57 -36 99 -667 496 -446
4584 -446 394 -262 255 8 66 248 -376 88 -738 610 -125 137 187 -413 544 -179 610 -536 218 -215
4604 -215 -82 343 -387 341 -229 303 -375 236 82 77 579 -244 858 -32 420 233 240 -117 -154 663 -679
4625 -679 455 -419 410 20 50 326 -172 327 -594 848 -396 427 122 -337 10 -423 642 -657 -310
4644 -310 -169 -40 -366 -223 270 -802 92 -441 -42 -225 16 44 -94 405 -505 382 -602 23 111 39 -51
4665 -51 -447 336 -475 578 -259 349 -49 -343 207 -272 829 30 440 -216 39 -277 18 304 -435 512
4685 512 -421 823 -213 130 287 -167 307 -259 343 -129 379 -105 178 132 -262 345 -44 306 -98 172
4705 172 123 183 172 -392 403 -505 204 -459 563 -389 119 129 -396 534 -411 406 -448 -27 1 -290 -49
4726 -49 -736 157 -418 71 -608 -355 88 -160 518 -321 90 -585 156 57 82 355 -397 445 -294 154 -187
4747 -187 95 -90 257 415 -280 144 -104 202 -159 42 126 -305 542 -360 135 -630 90 -258 76 -394
4767 -394 -56 446 -531 659 -158 620 -28 169 385 -126 454 -119 285 -145 57 -463 -182 -41 -890 158
4787 158 -922 273 -332 267 82 -126 57 -286 256 -404 170 -341 405 97 -210 249 -494 343 -197
4806 -197 78 -439 -208 -156 -382 259 -474 -176 -304 417 -334 -41 -131 -279 180 -366 143 -333 166 93 -145
4827 -145 242 -383 510 -343 355 180 414 305 12 140 -400 474 -44 485 -164 -127 422 162 156 -420 121
4848 121 -175 405 -286 -276 208 -762 178 -358 151 -355 306 -167 -160 203 -94 596 -467 412 -36 -34 -25 -15
4870 -15 -61 -548 319 -485 123 -358 -84 -27 -373 453 -106 289 -382 303 -59 -66 -61 -327 36 -525 348 -203
4892 -203 143 -23 -46 -84 -386 354 -285 220 -387 0 -78 -79 218 117 469 -355 590 -356 66 83 -244 368
4914 368 -357 560 -532 494 -254 64 144 -539 412 -377 278 -501 405 266 86 -13 -271 826 -96 248
4934 248 -341 130 352 -112 346 -385 459 -535 242 -202 -160 -170 -196 473 -351 -196 -332 464 -162 -129 325
4955 325 -397 538 -560 447 -36 -139 -294 29 169 -222 140 -326 188 -91 475 10 -185 277 -434
4974 -434 333 -177 150 -124 417 186 -224 673 -349 448 -182 213 122 -74 -142 -215 397 -406 434 -246 482
4995 482 2 -281 408 83 806 -314 475 -189 61 -376 97 37 -236 512 -653 -47 -190 148 -210 -354
5015 -354 202 -378 397 -614 191 53 -102 187 -363 211 -189 351 -68 87 39 -381 -135 -245 121 -410
5035 -410 139 -86 -20 75 -84 92 -155 193 -455 70 -21 127 -154 28 223 -588 83 -91 206 -67 78
5056 78 181 -81 229 -527 439 -33 218 -161 -65 305 -29 574 -54 -95 -146 489 359 -241 255 -327 493
5077 493 -392 28 -113 26 -52 -299 213 -467 371 -209 211 -267 -125 -122 -486 461 -375 305 -392 20 -118
5098 -118 81 226 -571 468 -668 212 -73 32 -44 29 384 -258 230 -381 37 -603 -236 345 311 72
5118 72 -369 371 -411 299 -25 292 96 -275 698 -395 -93 -446 247 -50 -168 342 -237 474 -419 409
5138 409 139 129 322 51 157 -10 163 -332 263 -160 74 105 -34 172 -120 405 -509 680 30 248
5158 248 -32 239 423 -229 223 -294 82 -48 -398 483 -239 125 -21 1 -723 361 -502 -407 927 -219
5178 -219 170 -824 -555 79 -214 497 -297 714 -246 -23 -531 624 111 -599 -126 -707 519 -525 -37
5197 -37 -494 620 -187 -107 -208 -437 698 -340 645 -81 -369 -568 409 253 112 472 -499 -61 550 96
5217 96 -49 57 -73 -132 626 -314 131 -287 236 615 -144 349 -514 251 -376 -121 -302 124 228 -441 178
5238 178 -521 -1 -234 101 -318 177 109 -537 300 -469 158 -93 -87 -41 -148 58 -297 0 -309 235 -81
5259 -81 -13 226 -239 27 -567 410 -570 257 -80 51 154 -513 375 -330 85 -295 -260 -73 176 330 -481
5280 -481 362 -231 195 -287 -151 454 -4 517 104 372 -124 286 216 103 50 -467 337 -448 251 146 355
5301 355 463 117 173 -117 275 -174 -119 3 356 203 -302 65 -80 223 -248 520 16 -221 74 -83 436
5322 436 -411 314 -409 -36 2 25 141 5 219 -475 123 -274 -113 -170 -17 -280 -813 267 -152 130 -484
5343 -484 120 -22 -160 212 276 479 -339 399 -431 38 -240 147 410 -713 490 -41 696 -44 206 113
5363 113 -103 40 -264 373 -324 155 111 -41 411 -246 -231 -214 347 -163 -101 102 -453 -52 -240 519 -24
5384 -24 29 -579 43 88 -203 500 -265 343 -457 27 -306 175 -59 -345 421 -593 602 -461 320 -379
5404 -379 -309 211 -139 -207 -481 -4 -601 177 -250 200 -134 -14 386 -90 145 -197 596 -219 -55 18 -391
5425 -391 242 -329 282 46 218 -35 -226 337 167 242 -631 490 -245 -42 201 -315 285 -121 225 26
5445 26 248 -406 -5 447 -54 479 -674 -329 -598 9 307 -1101 -747 -25 498 -918 312 18 487
5464 487 354 -215 364 -696 72 -8 346 594 -653 -684 -191 930 -468 321 -392 -101 -197 -29 198 -259
5484 -259 -342 -227 567 -222 -216 -83 175 460 -254 135 -453 -511 -256 472 -2 841 -198 -273 -279 -576 -908 12
5506 12 65 60 -169 -202 51 183 -440 163 231 -176 222 -11 624 -605 191 -262 -39 202 100 196 -279 178
5528 178 -300 195 -293 46 -226 167 176 -465 94 -108 59 -397 224 -187 13 178 -165 554 -459 47
5548 47 -196 72 -208 -155 105 -498 540 5 431 -15 -37 426 -207 438 -226 174 -263 -185 19 -112 308
5569 308 -97 290 -334 -50 -64 39 111 203 -189 -95 -120 -142 577 2 93 213 -46 12 -351 49 54 -9 278 176
5593 176 -137 -295 494 -19 73 51 -93 144 -109 2 338 239 -163 -46 -249 69 177 -27 242 -760 -218
5614 -218 -179 153 -218 -190 -1 -86 376 -296 247 -12 106 -17 -28 439 -280 68 -468 105 -121 169 181 52
5636 52 85 -166 314 -128 -25 -36 -185 236 250 200 -449 240 -372 218 -153 110 77 -473 -131 -432 495 286
5658 286 405 -124 113 212 26 436 -359 104 -15 106 314 33 155 -230 17 -386 144 -388 232 236 -83
5679 -83 -111 -459 353 63 -218 -109 125 255 -109 148 -273 38 -248 -31 -176 305 -281 212 384 -227 194
5700 194 -569 -242 86 -39 95 -369 39 -78 257 -324 -346 -327 -59 250 -19 318 -311 51 114 321 309
5721 309 -89 377 -361 231 -183 149 240 -249 163 -81 558 -90 352 -445 -267 -358 8 40 109 304 311 -120
5743 -120 -306 -12 54 100 -24 -103 433 -145 117 -80 -146 -53 -5 306 -397 50 -62 -48 -141 273 29 -213 129
5766 129 -228 -114 -276 -337 98 -197 273 -334 149 -174 6 37 -102 -49 -92 52 -457 361 -409 219 -449
5787 -449 -406 -129 5 393 -193 102 11 -69 115 323 238 -163 90 -254 269 -122 -286 315 208 194 -25 84
5809 84 49 340 6 109 30 -161 333 -353 172 -391 104 -141 -95 44 -75 175 -222 482 105 -195 59
5830 59 -131 80 -482 92 -192 323 38 -332 116 19 153 -75 253 -460 324 2 56 48 -112 576 -143 216
5852 216 116 14 -183 205 -29 -8 25 88 57 -476 36 -105 226 161 143 85 -74 570 -270 260 4 -39 200
5875 200 -79 133 -423 -91 -94 182 -236 20 162 -73 250 -206 195 -224 25 120 89 265 -276 230 -101
5896 -101 125 -309 -254 -76 -528 -262 -190 329 -236 294 88 -21 86 -268 101 -25 166 -63 14 14 -383 151
5918 151 -89 475 -604 192 -210 -42 -196 -154 -40 -59 282 -96 107 185 -329 -206 -6 373 -59 -90 -306
5939 -306 109 288 -623 178 -161 163 -37 34 -29 -52 181 -43 209 -331 422 125 28 -20 -318 149 -49 106
5961 106 -440 521 -117 8 250 101 174 39 13 204 669 -311 489 -75 -93 -120 -217 425 -227 270 -265 -133
5983 -133 -479 -193 366 -119 456 -39 -47 37 89 -258 -51 391 -438 200 159 -322 121 186 20 -91 -176 -433
6005 -433 116 -533 -61 77 -61 395 58 38 85 211 75 -125 -395 -287 -67 7 -122 -52 272 225 105 184
6027 184 -304 411 -199 533 -149 -101 -33 11 425 -361 105 -69 83 -435 -223 145 -17 156 -141 155 -178
6048 -178 288 25 166 239 -185 -51 -476 610 4 634 272 -232 -299 -93 188 -536 317 -647 292 -106
6068 -106 11 23 -513 313 69 39 -277 27 -310 -76 68 -13 -73 -394 155 115 -67 -74 -225 60 -73 75
6090 75 26 -20 -184 134 32 62 142 -213 249 -819 270 -77 170 617 205 400 -510 568 -120 149 -4
6111 -4 22 -40 -103 150 -25 137 -82 182 210 -10 50 -265 263 -466 458 302 19 173 282 171 -395 661
6133 661 -464 -257 -283 -4 -39 -324 166 -97 69 -159 312 50 -304 151 -279 175 -236 189 -218 295
6153 295 178 -358 -192 -301 83 -259 574 -207 20 -171 -230 129 -179 271 -63 122 18 128 -5 -342
6173 -342 -14 -6 -87 -350 121 -28 -279 9 -222 372 -229 142 -179 81 -103 -457 190 -84 -14 -25 115 -103
6195 -103 71 -58 -349 406 145 134 -61 3 70 -164 42 43 115 88 200 -140 216 47 -371 151 -85 86
6217 86 -23 105 -175 115 -118 28 18 -130 28 -339 291 -43 190 146 -71 329 -77 74 2 196 87
6238 87 255 -175 -187 331 -391 475 -26 20 -278 316 120 -200 289 -423 -23 -153 -193 143 44 71 -5 -33 -388
6261 -388 -233 75 50 328 391 7 54 295 -20 388 -39 -45 -135 -349 13 154 -294 -38 240 92 -204 586
6283 586 199 384 74 -402 -350 62 -200 359 494 -53 375 -24 -36 -617 624 -377 -54 -23 -118 459 276
6304 276 441 -231 -73 99 -197 491 -92 -135 -651 459 -263 186 -121 -117 106 -423 -43 -205 141 -169 -35
6325 -35 -290 -111 61 -362 91 -15 -248 -82 -152 -90 -234 11 -163 123 197 20 -197 -80 -373 -529 483
6346 483 -267 -32 -308 272 163 63 290 141 268 181 -4 333 -91 419 -371 360 -130 -105 -99 -139 -131 -76 -35
6369 -35 -33 795 229 28 -180 -114 -175 -83 -138 127 394 -284 -78 -200 -12 -365 -301 113 -290 -212 -304 -343 -149 -102
6393 -102 -164 114 -41 -71 173 -19 -135 27 98 154 -227 270 -250 116 -98 -138 240 -181 156 -447 593
6414 593 -93 344 128 277 141 -183 -93 -87 209 -173 243 -107 156 404 -204 228 89 46 -143 -25 86
6435 86 -47 241 0 -72 227 -88 153 88 -160 321 87 -319 690 -181 114 54 -292 -228 -163 -43 -108 43
6457 43 -179 -48 -57 235 -209 -17 126 -188 116 185 -122 -32 298 177 -151 236 133 386 -253 33 49 -323
6479 -323 245 -154 255 -363 118 -138 -288 481 -336 404 -309 75 235 212 -423 -104 15 -80 -138 -212 448
6500 448 177 66 227 43 -15 -416 -43 -185 242 -15 147 42 -17 79 -303 342 126 166 -98 -186 -6 -360
6522 -360 -248 -85 -16 -432 -192 -119 -323 18 -177 168 -79 338 -444 233 -160 -190 -265 -481 -75 -73 -176 -102
6544 -102 -166 183 -126 96 -130 -202 -558 63 144 126 103 -150 99 -141 293 -615 23 -132 106 45 40 487 -62
6567 -62 308 -288 -98 177 142 -282 -158 21 -119 -156 20 156 31 85 34 -527 179 -49 -143 -106 -201 -108 199
6590 199 -22 -443 163 -8 -29 -31 459 -162 -29 -92 -56 -127 -505 52 -302 -144 4 -69 -43 -35 89 -11 -69 54
6614 54 -58 419 -246 -293 206 -64 -259 138 432 -126 -134 -43 39 -298 -241 -130 -20 439 163 595 -355 267
6636 267 -228 73 7 193 -124 65 -10 -408 561 -167 240 -216 -367 -108 -153 43 -539 54 -85 153 35
6657 35 -295 23 -214 13 206 -62 -142 286 14 -298 162 -138 297 -147 -216 107 -66 100 164 285 -274
6678 -274 582 -128 -117 -187 -158 -257 -251 13 -462 68 -305 -204 -114 -137 121 47 -23 29 11 13 167 253 94 205 -137
6703 -137 -103 -119 208 317 85 -308 204 344 -347 290 -2 -32 -227 22 331 -257 145 -353 -4 130 259
6724 259 282 -242 29 -114 527 -109 347 87 -90 195 -49 154 391 10 -24 -2 32 364 -627 277 -147
6745 -147 -104 -89 -223 17 -239 321 35 -375 -351 -136 37 -219 53 264 -60 326 143 212 -129 -22 -326
6766 -326 -37 78 -113 44 -397 76 -165 65 60 -351 341 -87 282 -181 159 150 -23 183 10 -74 -500 257
6788 257 99 140 20 -54 336 143 80 248 152 -44 -68 -171 59 119 -245 -11 433 -146 -12 -35 -89 -264 -367
6811 -367 112 239 -131 99 -249 120 -321 100 -223 -115 273 -503 -53 -138 53 214 230 -290 -247 184 -190
6832 -190 146 -52 -244 140 -118 31 -271 495 -338 -94 -181 -282 25 -309 150 -291 142 187 -54 -253 -227
6853 -227 -218 -446 43 -54 3 -535 -80 27 0 -39 -265 75 -157 -196 -464 -78 -103 -278 0 -305 304 -446 24
6876 24 -124 -20 196 -300 -37 -196 282 116 -166 -7 57 55 -238 -45 93 216 38 234 229 -48 202 -371
6898 -371 -5 -114 -111 -89 -191 46 90 231 -226 -261 -111 -250 -117 78 -315 -308 120 -440 201 42 462 -218
6920 -218 357 149 38 364 -71 -35 517 210 -236 -94 -7 -191 179 76 47 173 47 302 -250 222 100
6941 100 3 212 291 194 11 45 -192 118 -27 -180 -439 179 275 87 -2 277 458 21 245 -103 194 90
6963 90 -326 -28 258 367 -197 159 -68 -435 112 -32 -360 267 -65 -123 174 -84 -107 227 -512 5 -238
6984 -238 -198 -180 -135 -23 -29 -131 194 -80 -93 207 -323 -72 32 -384 135 -1 156 246 336 342 163 -108 -363
7007 -363 165 -293 27 -62 -120 -400 310 -253 13 182 -204 184 -67 -36 -299 510 379 46 131 -269 60
7028 60 -47 100 -132 -35 -192 -82 91 -212 56 234 172 610 -265 159 -132 59 210 -24 131 -306 148
7049 148 -199 -166 -178 256 50 -171 150 -2 -112 -127 277 -54 -21 190 -139 302 145 99 -24 -139 -229 233
7071 233 16 9 171 -235 207 169 -5 -176 190 -112 300 49 188 -229 15 210 -128 289 -216 265 325
7092 325 -27 -57 -269 89 -17 -100 -377 -190 149 -373 -74 -500 -14 171 -131 -134 -116 -434 191 600 135 32
7114 32 306 -373 333 414 -201 39 349 -517 -224 -73 -287 137 220 207 35 156 -60 -303 -53 -261 158
7135 158 -107 68 295 213 -210 -213 -62 -15 -231 -659 85 -162 419 -174 -413 -296 -150 -132 -27 135 21 202
7157 202 25 316 30 -86 -357 -317 292 -67 51 38 501 11 -144 -253 -97 438 -243 46 194 22 141
7178 141 331 -212 -13 349 -384 585 -395 -48 168 44 140 -34 183 -97 -370 153 -223 -188 -597 -82 86
7199 86 -65 -340 -393 193 180 133 114 -349 -118 293 119 66 126 -51 -161 38 165 -43 175 -176 -324 38
7221 38 -349 342 107 -89 -366 -340 31 -264 -228 -507 -222 456 531 -121 393 -37 -262 79 -330 473 72
7242 72 9 326 11 19 -17 520 48 556 104 -79 23 -472 99 -207 -108 -146 403 -137 -261 225 10 -287
7264 -287 -340 -2 -218 -128 -176 24 315 -225 -171 104 -333 -554 -203 104 349 111 -68 -157 -271 167 90 -2
7286 -2 65 -338 469 -6 179 218 -44 79 131 26 -6 307 170 157 79 314 -285 114 236 -391 -10 2 -109
7309 -109 -536 -70 -193 249 -126 100 356 37 368 -49 204 157 185 333 145 112 -271 204 -9 -125 121
7330 121 -172 243 -118 154 -94 117 -82 204 53 -291 250 150 -174 201 -61 -301 101 -57 -337 86
7350 86 -66 109 237 395 -18 -755 -550 159 78 205 221 149 217 152 -253 105 -281 -1 -316 171 -217 -102
7372 -102 -114 -172 153 179 161 -97 -228 -161 -217 63 430 19 -36 209 -42 -20 76 123 101 10 223 -194 24 -167
7396 -167 -53 417 22 -202 33 192 137 413 -110 -94 -4 14 269 -102 46 -96 -107 265 -91 0 -357 80
7418 80 -49 155 142 -34 -139 96 -84 -115 254 78 -189 -162 -257 69 176 11 -321 -272 -194 27 -299 -207 -198
7441 -198 16 -97 -8 318 -68 24 -50 15 -13 -358 -131 -122 218 148 -250 75 -61 306 -330 -118 -411 363 -236
7464 -236 221 258 -22 358 246 227 -75 -70 317 230 238 229 196 -129 199 -166 14 -37 57 -228 -604 418 61 180
7488 180 -309 -126 181 -126 160 -298 16 -78 -117 -266 -28 144 -186 -385 -369 101 -243 74 121 -243 -18
7509 -18 135 -5 -381 123 -347 24 -365 56 205 -45 58 -240 -22 130 -20 -21 -243 -118 -50 218 309 -102
7531 -102 250 -118 304 -199 -347 350 461 12 -79 -54 57 117 -165 64 -280 -55 -274 90 -127 46 367
7552 367 -37 -29 -166 80 31 284 214 167 96 -291 43 81 -173 -27 272 57 165 498 -401 -120 -21 -283 -347
7575 -347 -280 -243 67 225 -213 69 114 -43 -264 -207 -36 -216 202 -174 -32 -110 -168 -333 189 93 -157 88
7597 88 -449 83 -597 391 -99 263 -57 -312 495 -209 291 176 -87 -169 116 340 23 -223 -178 4 289
7618 289 208 255 -138 294 -407 -104 38 68 240 -65 232 -173 -82 -12 -105 -52 403 -71 -276 -206 -340 -147 -216
7641 -216 25 -106 115 59 -110 313 -33 118 -200 -41 -284 233 115 -278 138 -284 -42 -277 8 42 8
7662 8 108 -261 55 144 -370 -151 -249 -152 63 183 -193 -52 -28 302 30 204 105 214 116 252 105 64 183
7685 183 -274 166 -24 -239 572 -329 120 -135 82 185 204 246 -198 282 -181 263 -240 -27 69 -98 362
7706 362 -329 382 -179 -368 21 -228 212 -22 105 -194 214 -134 240 258 -209 166 114 41 -339 185 -80
7727 -80 73 169 69 162 -110 376 -200 289 -151 -47 -111 129 -196 -285 -216 -279 -211 -214 -83 174 -166 214 -42
7750 -42 -263 114 -10 -111 14 9 23 456 -42 302 -79 46 103 -83 119 -357 73 -279 7 -130 206 -169
7772 -169 89 161 -95 205 33 -75 -247 -74 -94 -241 328 -829 -157 131 37 -50 -222 100 50 826 86
7793 86 -353 -31 -12 -75 -255 -10 -95 86 -166 274 164 -315 50 31 204 -180 238 16 269 -56 -35 77
7815 77 33 -1 -103 79 40 -39 -97 181 -78 -295 84 -364 311 259 155 3 -236 343 -405 -56 112 -131
7837 -131 -45 37 -195 -240 291 -92 338 -211 -80 44 10 515 -453 71 -228 -26 -147 115 -299 -145 -79 -71
7859 -71 101 4 -8 -401 -38 45 -70 -139 -34 96 134 286 180 -105 -170 -297 75 9 249 -379 -196 -242 5
7882 5 312 -206 177 22 173 -36 873 -114 -377 1055 -16 320 -637 -371 -226 366 337 -332 230 -62
7902 -62 348 -67 -126 -114 129 16 -375 59 311 141 -149 -8 291 -67 43 -59 167 -125 -20 138 -129
7923 -129 -11 76 -92 262 100 178 -57 -11 -36 -140 -247 -39 -334 -462 333 -129 247 -107 -341 105 157 190
7945 190 -56 110 -231 -184 250 206 -72 102 -336 8 -79 200 188 -320 281 -17 -33 -142 322 -74 -31 -1
7967 -1 -107 -294 5 106 -140 101 90 -156 -188 198 164 -280 372 -254 243 50 -245 217 -302 -232 -228 105 -165
7990 -165 96 387 257 261 -247 180 -475 -87 22 -221 43 -54 -306 116 273 309 -14 -315 203 354 320 -85
8012 -85 -296 -55 -276 157 32 119 -230 -215 22 9 -19 -81 32 210 8 -6 -249 116 -314 -78 -6 106 -14
8035 -14 -7 238 184 287 -223 149 21 -55 -44 40 203 -124 307 175 145 -6 248 28 -317 -31 -240 -253 -88
8058 -88 -233 179 -280 299 -239 -104 -46 -26 255 -233 332 -52 260 248 208 80 298 198 71 -237 -210 1
8080 1 -174 401 140 -219 -39 -60 -422 300 -77 16 132 -20 299 125 260 -149 30 192 -168 488 133
8101 133 -122 -16 -287 -33 -60 51 -137 -300 -126 393 257 -75 -42 -55 152 33 67 -46 3 -375 -7 215
8123 215 -333 427 -144 -408 146 -22 64 61 278 -237 -194 -100 -139 -51 139 -175 -291 84 -392 -75 225 309 24
8146 24 180 -300 -136 278 -5 144 -204 225 54 -37 -177 291 107 -68 122 4 66 -116 -68 99 -163
8167 -163 -218 -89 134 -279 23 77 -170 82 -101 9 -196 -22 -4 -546 198 -28 374 17 -313 -442 -35
8188 -35 -48 -226 -37
8191c7
$$ Imaginary data points
##PAGE= N=2
##DATA TABLE= (X++(I..I)), XYDATA
0 0 0 0 0 0 0 0 0 0 0 0 0 0 -16 16 -16 16 -17 24 -24 40 -40 56 -58 64 -80 96 -111 133 -152 175 -200 224 -258
33 -258 289 -327 366 -410 460 -513 571 -639 706 -785 870 -961 1062 -1169 1288 -1418 1561
50 1561 -1719 1892 -2084 2302 -2541 2814 -3121 3476 -3886 4370 -4951 5665 -6552 7709 -9268
65 -9268 11500 -14977 21160 -35465 133762 43390 -94033 137108 -61069 52007 52989 -18337
77 -18337 22985 44094 -13904 72426 -23531 5069 59101 -47132 63588 -4187 4789 14929
89 14929 13881 8112 -20073 46943 -44666 35111 -3245 -54 10340 -20038 25949 -20320 -6289
102 -6289 9386 565 -31145 47858 -44304 -8198 36909 -68512 47138 -44391 4300 11456
114 11456 -35326 26230 -26514 -15166 5366 -1005 -30292 31496 -28227 -652 9737 -24488
126 -24488 19795 -37240 29271 -21896 7304 7563 -13235 14032 -21985 31390 -26615 15065
138 15065 7804 -6863 12823 5355 -1865 -2882 21923 -25444 33705 -20929 20646 13187 -28869
151 -28869 45456 -33995 19277 8851 -6334 4832 11393 3896 -5764 13225 -19800 21340 -19015
164 -19015 21580 -5584 -11899 22549 -21351 15322 -19283 14502 -17032 9916 6522 -21389
176 -21389 15841 -19347 10450 -20002 8900 -8330 -6693 2966 -6410 -2153 -19940 23587 -36525
189 -36525 15658 -5972 -14285 16248 -22995 13316 -24189 8948 -6372 -4553 -4506 3239 -1544
202 -1544 -13894 22977 -31917 15749 -6204 1450 3407 -5749 13634 -20543 19374 -12197 8794
215 8794 -8723 9058 6246 -13481 25645 -19627 10636 -1661 9465 -5931 8705 6849 -10014
228 -10014 20624 -16862 21089 -17741 12590 6550 -12435 20902 -10792 7014 -7679 15473
240 15473 -15775 10473 3161 -8593 15202 -14679 17053 -19850 11605 -4899 -5003 5736 -4122
253 -4122 5874 -18740 19540 -22003 8794 -1366 -9075 7504 -12540 14178 -18181 7292 -9555
266 -9555 2498 -6524 2053 2692 -20252 21740 -21710 8792 -6663 -554 182 -6158 11780 -14791
280 -14791 11763 -11210 11042 -12849 6958 6770 -14919 19328 -13123 9640 -7676 10754
292 10754 -7291 2092 10849 -8282 15605 -13454 18792 -13707 10130 6823 -9819 13767 -4851
305 -4851 9363 -9900 17482 -12053 6039 5604 -4577 11357 -12077 18493 -15920 9804 -192
318 -192 -2982 2885 -2878 8735 -16307 17827 -14464 3603 -1936 -1516 3825 -11004 13667 -17024
332 -17024 9314 -7636 2232 -7550 -957 6638 -17734 15807 -15352 4496 -8665 2638 -1746
345 -1746 -7895 10757 -13554 8408 -10798 10349 -12685 3056 5487 -13875 14923 -11126 8588
358 8588 -10941 9027 -3793 -1473 7690 -7334 9730 -10072 17656 -13581 7358 4621 -5964
371 -5964 10101 -5552 11455 -11834 14996 -6100 2547 4474 -2022 8984 -9330 17514 -11676
384 -11676 8402 -724 1033 1396 -1726 11427 -14930 15694 -9990 4626 -1594 -374 4454 -11103
398 -11103 13879 -10767 5430 -7174 4641 -7354 169 6810 -15160 12162 -13433 7384
410 7384 -10013 1907 -399 -10884 9237 -10696 6109 -10887 8309 -10632 780 3977 -10791
423 -10791 7103 -9520 8910 -13017 8737 -5472 -3448 5248 -7305 10408 -12909 14047
435 14047 -9512 1072 4618 -3612 4941 -3016 9543 -10503 13007 -6913 4817 560 -232
448 -232 10873 -11851 17804 -9803 5851 1707 2221 2637 -2094 11358 -9671 12362 -5716 6639
462 6639 -4840 3221 5389 -8629 13139 -9483 8955 -7747 7839 -4461 -3238 9348 -12153
475 -12153 10619 -8584 6353 -8116 2001 -190 -6475 4730 -7088 6540 -13466 11132
487 11132 -11018 -1067 3917 -10460 7313 -10465 9240 -10973 3045 -2975 -3949 1537 -4577
500 -4577 6113 -12209 11778 -9072 3045 39 -2417 3405 -6890 12657 -11565 9660 -4706
513 -4706 3085 809 -2569 9029 -10648 12917 -4881 5511 -2308 5321 94 -2033 11596 -8940
527 -8940 12416 -6913 9697 -3621 1014 8635 -9006 11343 -4858 7593 -5076 8124 -2858
540 -2858 -1055 7612 -6752 9018 -8185 10415 -8533 3335 2284 -6418 5033 -6202 8757
553 8757 -11451 9590 -6029 -1991 3306 -6236 4527 -9432 8255 -9805 4023 -3424 -1330
566 -1330 -1464 -5675 7882 -14339 10705 -7809 1031 -1726 -2558 1859 -8413 9674 -9869 6020
580 6020 -5026 4694 -3751 -3651 7373 -10699 10386 -6540 5247 -4705 3988 1510 -5614 9318
594 9318 -7976 9497 -6518 8912 -3335 -134 6623 -6671 7818 -4640 8732 -7875 8929
607 8929 -823 -2145 6492 -6050 8514 -7503 10463 -5749 2176 2293 -2779 4014 -5642 9427
621 9427 -10843 8559 -3434 -608 1657 -4401 5312 -9581 9466 -8754 3396 -2818 209
634 209 -1226 -6404 8225 -13138 7484 -6175 1848 -3187 -1812 2190 -9270 7735 -9009 4900
648 4900 -7169 4058 -2881 -4452 6965 -10681 6040 -6766 5954 -5586 3469 996 -6332
661 -6332 7106 -6666 7903 -7906 8427 -2778 -1094 6056 -5154 5245 -5151 9599 -6903
674 -6903 7002 -173 -1250 5329 -4497 8863 -7792 9943 -3499 2492 2722 -167 3291 -5598
688 -5598 10406 -9104 8075 -2669 1369 1403 -3399 6603 -9030 8852 -6489 2954 -2991 2417
702 2417 518 -6171 7507 -10383 7471 -6427 3269 -3922 -1458 3470 -8387 6303 -8297
715 -8297 4153 -7969 4649 -2190 -4914 5984 -8637 5381 -7164 5593 -6797 1634 1039
728 1039 -4991 5094 -7581 7286 -9458 7062 -2631 -1534 4281 -4834 5101 -6288 8570
741 8570 -7075 5120 -360 -181 3730 -4204 9095 -9017 9472 -2912 2819 1684 -131 5158
755 5158 -5652 10346 -7418 6045 -2020 3199 802 -1735 7547 -8051 7972 -4941 5596
768 5596 -3893 2719 1707 -5835 9425 -8391 6069 -5811 3882 -2644 -1791 3542 -6855 4662
782 4662 -6760 5989 -8323 4013 -1879 -4586 4453 -7756 5421 -8754 5502 -5858 -608
795 -608 948 -4670 2873 -7201 6353 -8731 5087 -3529 -1054 1462 -2836 5541 -8124 8825
809 8825 -7127 3925 -739 -631 3117 -5154 8892 -7593 5981 -2800 2519 -526 1471 4239
823 4239 -5145 9548 -6258 7919 -3393 4579 1461 -3193 8767 -6485 7493 -3924 5444
836 5444 -2901 2948 3127 -4354 7373 -5329 6446 -5311 6273 -2314 -979 3583 -4929 5793
850 5793 -6720 7747 -7621 2993 691 -4556 4397 -5865 4866 -7284 5921 -4686 354
863 354 -579 -2968 2242 -7789 7903 -9958 4230 -3291 -1764 667 -5003 4722 -8890 6245
877 6245 -5914 2276 -2649 14 994 -5755 6743 -7726 4847 -4371 3540 -2279 -956 4242
891 4242 -6946 7809 -5976 6218 -4013 2807 1553 -3288 7200 -4702 5365 -4296 7004
904 7004 -3973 2722 2979 -4181 6657 -5000 7529 -5536 5961 -440 -569 4618 -3659 5419
918 5419 -6095 7767 -5672 3528 902 -2140 2951 -4491 6618 -7840 6446 -4079 1344
931 1344 -202 -2153 3687 -8174 7822 -7530 3485 -2406 -364 -32 -3911 4655 -7899 5692
945 5692 -6091 3736 -3657 -421 1483 -6379 6369 -7311 4527 -4651 2914 -2369 -1826 4045
959 4045 -6469 5584 -5632 5139 -4830 3268 762 -3155 4971 -4924 5706 -5739 6917
972 6917 -3928 1843 2923 -3408 5756 -5351 7306 -5634 5264 218 -435 3138 -2510 5259
986 5259 -5474 7720 -5076 3552 106 25 3074 -4577 7161 -7377 6009 -3145 2307 114
1000 114 -1673 4372 -6709 6649 -6217 3385 -2963 969 -468 -3262 4217 -7297 5228 -6568
1014 -6568 3695 -4184 23 2518 -6394 5471 -6793 3637 -4716 2631 -2310 -1936 2994 -5108
1028 -5108 4147 -6515 5696 -5660 2862 386 -3120 4553 -5214 5797 -6848 5867 -3174
1041 -3174 592 2576 -3005 4897 -4661 6842 -5123 4481 -1128 1137 2264 -1621 6395 -6536
1055 -6536 8017 -4337 3310 431 -508 4057 -4026 7233 -4802 4896 -2407 2828 -434 -366 4389
1070 4389 -5212 6614 -5294 4345 -3609 1835 572 -3513 5499 -6349 4768 -5148 3470 -3365
1084 -3365 -408 1862 -4894 3902 -5376 4164 -6295 3417 -3018 -1788 2269 -5101 4600 -7459
1098 -7459 5348 -5492 941 361 -3071 2644 -4528 4224 -6798 5098 -3589 1090 274 -2236
1112 -2236 4088 -5999 6613 -5942 3458 -1142 200 2086 -2834 5917 -5488 6059 -3004 3239
1126 3239 -796 846 3283 -3391 6736 -4848 5521 -3275 4153 -243 -820 5259 -4842 6361
1140 6361 -3890 4374 -2804 1899 1507 -2682 4540 -4135 4816 -5505 4882 -3585 263 2173
1154 2173 -4511 4365 -5831 5285 -5852 2539 -1640 -1795 2023 -3840 3724 -6705 4849 -5118
1168 -5118 554 -710 -2109 2069 -4971 4941 -6832 4041 -3834 352 -25 -2842 3639 -6253 5272
1183 5272 -4561 2551 -1965 517 596 -2878 4950 -5390 5160 -3921 3630 -1269 33 3162 -4536
1198 -4536 5955 -3811 4628 -2837 3638 22 -1024 4483 -4084 5438 -3948 5183 -2919 2475 1842
1213 1842 -2201 4675 -3297 5278 -5023 4979 -2335 -102 2510 -2806 4232 -4995 4824 -4776
1227 -4776 2997 -832 -708 1469 -3399 4185 -6265 5168 -4035 641 -798 -1549 1732 -4819 4482
1242 4482 -6221 2928 -3457 748 -935 -2554 3053 -6034 4779 -4504 2058 -2563 932 273 -3656
1257 -3656 4491 -5071 4393 -3645 3319 -2015 -384 2397 -3827 4357 -3989 4492 -3965 3534 -167
1272 -167 -1060 3985 -3169 4935 -4299 5416 -2683 2118 1648 -1485 3564 -3537 5625 -4615 5174
1287 5174 -1781 311 1958 -1858 3796 -4338 5443 -4199 2570 -943 202 1549 -2974 4579 -5529
1302 -5529 4657 -3329 1024 -543 -1083 1955 -4219 4165 -4720 2678 -3547 1668 -1013 -2437 3152
1317 3152 -5258 3915 -4739 2306 -3226 239 363 -3479 3632 -4682 3693 -4412 2659 -1817 -777
1332 -777 1957 -3339 3513 -4072 4421 -4286 2581 -759 -1457 2928 -3472 4655 -4670 4430 -2313
1347 -2313 1325 1009 -567 2942 -2645 5066 -4047 4153 -1454 989 1349 -1133 4407 -4116 5535
1362 5535 -3137 2885 -596 967 1626 -2492 5148 -4041 4082 -2629 2092 -890 -523 2218 -3718
1377 -3718 4614 -4018 3655 -3334 1722 -237 -2724 3144 -4309 3428 -3940 2522 -3251 206 65
1392 65 -3107 2510 -4153 3634 -5182 2894 -2332 -1395 1452 -3206 2632 -4499 3743 -3892 1683 -497
1408 -497 -1302 2105 -3117 3659 -4496 3550 -2594 1282 516 -942 2696 -3816 5472 -4113 3189 -2118
1424 -2118 1041 1483 -1170 3946 -3469 5227 -1868 2908 -1625 1237 1654 -2320 4568 -2898 4118
1439 4118 -2458 3131 -619 -578 2954 -3494 4483 -3414 3606 -3172 2100 89 -2263 2928 -3405
1454 -3405 3029 -4138 3282 -2837 144 761 -2726 2063 -3690 3437 -4473 2124 -1624 -1381 489
1469 489 -2816 2663 -4504 3456 -3490 1493 -1071 -1405 1254 -3433 3737 -4521 3242 -2339 743
1484 743 -715 -1125 2082 -3829 4489 -3817 3498 -1879 1095 466 -1625 3761 -3667 3959 -2448 2851
1500 2851 -1043 1153 1638 -2571 3761 -3242 4337 -2514 3449 -434 -59 2651 -1933 3388 -3114
1515 -3114 3763 -1639 2456 192 -1465 2287 -2182 3201 -2752 3768 -2351 986 550 -1162 2135
1530 2135 -2873 3455 -4045 2565 -1630 -206 345 -2385 3140 -5283 2877 -3062 1539 -1317 -592
1545 -592 913 -2769 3191 -4618 2864 -2613 898 -1015 -1662 2475 -3594 2887 -3249 2480 -1222
1560 -1222 1213 0 -1414 2308 -2999 3182 -3762 2826 -1207 1202 1631 -3219 3089 -3103 3341
1575 3341 -2795 2188 183 -708 2787 -1718 3271 -2977 3659 -2298 2339 680 -622 2390 -2499
1590 -2499 3911 -3513 3409 -1971 699 560 -860 1909 -3193 3372 -3785 2143 -1480 657 444
1605 444 -2774 2515 -3683 3063 -2951 1659 -1687 -242 1155 -2856 2410 -3390 2598 -2423 785
1620 785 -910 -826 1414 -3502 2508 -3595 2227 -2773 963 -829 -2452 2042 -3490 2927 -2817 2904
1636 2904 -1992 703 1346 -2520 2427 -3381 2966 -3426 2360 -908 274 1785 -1915 2884 -2062
1651 -2062 3822 -2024 1860 -479 -627 2459 -2404 3579 -3766 2625 -1328 1526 191 -198 3164
1666 3164 -3609 3832 -2786 2821 -1407 1142 603 -1878 2677 -3089 3001 -2289 1832 -1261 -286
1681 -286 1066 -2698 3211 -3616 2491 -3023 1425 -1124 -1393 1701 -3232 2028 -3614 2397 -2752
1696 -2752 659 166 -2191 1811 -3320 2637 -3553 2718 -2295 170 1091 -2345 2008 -2982 2788
1711 2788 -3012 1676 -593 -90 1264 -2056 2718 -3371 3439 -2215 1540 217 -195 1799 -2193
1726 -2193 4188 -2428 2822 -1167 1819 575 26 2509 -2847 3628 -2807 2468 -514 1509 1036
1741 1036 -1360 3018 -2809 3275 -2148 2211 -1181 41 2010 -2273 2956 -2641 2724 -2406 1549
1756 1549 -1050 -1112 1399 -2720 2274 -3481 2531 -2867 542 -185 -2038 1440 -3247 2520 -3397 1977
1772 1977 -2667 -218 -222 -2643 1527 -4231 2666 -2980 1165 -1488 -386 927 -2149 3178 -3587 2402
1788 2402 -1851 716 -1068 -126 1182 -2177 3572 -3073 2713 -1912 604 824 -553 2666 -2297
1803 -2297 3450 -2781 3322 -940 799 1566 -1415 2722 -2276 3755 -1687 2372 -1733 686 2418
1818 2418 -2041 2728 -2460 2476 -2338 2162 -560 -170 587 -2293 2251 -2577 3010 -2093 1450
1833 1450 360 -1418 1480 -2771 3019 -3648 2631 -1933 494 -200 -1789 1955 -3727 2578 -3315
1848 -3315 1245 -1678 358 455 -2410 2623 -3209 2788 -2804 976 -858 -229 964 -2511 2474 -2680
1864 -2680 2884 -2366 861 189 -689 2516 -2304 3617 -2412 2242 -1298 981 1134 -1237 2956 -2081
1880 -2081 3225 -2076 2435 -952 676 1799 -1203 3294 -2815 3644 -2080 1537 144 -654 2309
1895 2309 -1625 3061 -2230 2808 -1435 1119 -368 -299 1250 -2398 2540 -2797 2603 -1900 327
1910 327 14 -1785 1995 -2930 2724 -2689 1568 -1732 -259 319 -2492 2216 -3551 1739 -2946 1455
1926 1455 -625 -829 925 -2768 2121 -2962 2524 -2585 1519 -55 -1230 1661 -2636 2985 -3108
1941 -3108 2887 -1922 578 858 -924 2259 -2420 3293 -2172 2597 -1048 460 1349 -1356 2763
1956 2763 -2540 3284 -1864 1850 -47 -98 1342 -1720 3181 -2516 3036 -1826 1090 46 -676 1689
1972 1689 -1988 3040 -2262 2210 -1261 1152 178 -1215 2521 -2972 2315 -2594 1873 -1985 295
1987 295 346 -2053 2359 -2854 2340 -3278 1341 -1820 -1055 948 -2768 2135 -3100 2418 -2650 1207
2003 1207 -521 -1457 1789 -2311 2547 -3340 2496 -2039 341 491 -1555 1490 -2698 2734 -2936
2018 -2936 1843 -1071 588 725 -1056 2861 -2379 3075 -2004 1914 -532 330 1343 -1750 3380
2033 3380 -2762 2831 -1620 1671 14 -34 1858 -2068 3412 -2172 2500 -1297 1611 25 -496 2065
2049 2065 -2399 3297 -2915 2204 -1873 -51 742 -1608 1477 -3979 3132 -2989 1221 -966 -935 973
2065 973 -2172 1836 -3573 2233 -2371 373 -1172 -997 808 -2755 1985 -3247 1816 -2648 -4
2080 -4 -268 -1514 1735 -3087 2611 -3082 1894 -1193 51 271 -1375 1894 -2449 2556 -2581 1816
2096 1816 -1253 101 1006 -1672 2692 -2545 2754 -1238 1625 -368 129 1858 -1972 2534 -1883
2111 -1883 2759 -1378 1631 -70 -874 2223 -2237 2830 -2252 2359 -1192 644 527 -1183 1967
2126 1967 -2497 3074 -1902 1344 -1136 -800 1069 -862 2592 -2446 993 -2266 1247 249 -1005
2141 -1005 560 -2148 2243 -3264 1634 -2225 -15 547 -1263 771 -2871 2366 -2674 1453 -1259
2156 -1259 -26 -412 -1401 2385 -2878 2315 -2612 1852 -1884 -192 943 -1810 3061 -2592 2202
2171 2202 -2323 1558 -705 -31 1855 -1826 3026 -2247 2440 -1440 1720 777 -1190 2575 -1905
2186 -1905 2874 -1847 2480 -996 480 820 -1244 2165 -2125 2763 -2379 2089 -623 188 722 -1353
2202 -1353 2245 -2727 2509 -1759 854 -706 -759 958 -2066 2369 -2817 2150 -1700 879 -103 -884
2218 -884 1141 -2190 2119 -2916 1296 -1691 237 35 -1456 1541 -3065 2033 -2151 1076 -961
2233 -961 -233 615 -1939 1945 -2472 2428 -2092 1102 -684 -499 1160 -1942 2344 -2713 2205 -1902
2249 -1902 1021 269 -777 1504 -2045 2849 -1761 1861 -901 832 590 -567 1982 -1626 2807
2264 2807 -1593 2109 -427 279 916 -1420 2726 -1949 2621 -1960 1574 -396 -138 1173 -2098 2327
2280 2327 -2349 2325 -2153 1063 -724 -782 1769 -1379 2137 -3123 1557 -1107 1087 91 -1654 1126
2296 1126 -2590 1834 -2313 1992 -1254 -345 604 -1638 1806 -2125 2218 -2344 1195 -924 -601 912
2312 912 -1598 1978 -1932 2047 -1331 1144 -38 -448 1850 -770 2329 -1660 1812 -739 1306
2327 1306 444 -881 1956 -1050 2288 -1043 2701 -528 665 1155 -673 2289 -1770 2556 -998
2342 -998 1599 -115 387 1172 -1501 2337 -2140 2208 -1586 1180 -264 -527 1241 -1909 2352 -2274
2358 -2274 1390 -1476 361 -38 -1421 950 -2267 2032 -2362 1252 -1137 95 483 -1566 1296
2373 1296 -2676 1718 -2260 1055 -820 -999 542 -1703 1539 -2538 1611 -1524 636 -274 -364 1102
2389 1102 -2126 1649 -2279 1710 -1406 686 179 -831 1819 -1710 2739 -1799 1444 -606 461
2404 461 956 -712 2024 -1641 2424 -1220 1871 -285 432 2025 -952 2256 -1754 2717 -1095 1244
2420 1244 -243 62 1607 -1781 2207 -1893 2025 -1179 454 307 -478 1437 -1933 1863 -2037 1388
2436 1388 -1179 179 233 -1412 1524 -2253 1455 -2246 978 -1007 -532 458 -1887 1653 -2250 1600
2452 1600 -1758 746 -526 -946 844 -2305 1640 -2141 1642 -1412 328 160 -1019 1157 -1761
2467 -1761 1847 -1961 1647 -1042 178 486 -723 1970 -1572 2351 -1372 1560 -48 173 1047 -1325
2483 -1325 1846 -1685 2356 -1390 1176 -112 -31 1293 -1184 1980 -1341 2236 -1451 964 112 -896
2499 -896 1312 -1311 2035 -1696 1573 -968 86 339 -1252 1302 -1888 1815 -1478 1065 -327
2514 -327 -19 484 -1648 1584 -2634 1664 -1674 662 -737 -217 742 -1610 1506 -2160 1356 -1735
2530 -1735 127 -607 -1191 1277 -1862 1873 -1788 1197 -1092 889 495 -1212 1278 -2053 2034 -1716
2546 -1716 1179 -933 0 940 -1003 1943 -1774 1901 -1153 1055 158 -23 833 -1077 2081 -1814
2562 -1814 1865 -1157 837 567 -361 1220 -1601 1922 -1093 1381 -769 735 422 -1208 1505 -1539
2578 -1539 1520 -1523 1371 -783 184 507 -1284 1288 -2203 1478 -1628 874 -352 -532 728 -1850
2594 -1850 1654 -1977 1108 -1348 368 -529 -728 711 -2046 1607 -2310 932 -1352 145 -107 -925
2610 -925 1205 -1572 1632 -1816 1058 -930 218 691 -1191 1437 -2130 1553 -1380 1071 -187
2625 -187 103 831 -1298 1558 -1465 1863 -610 1173 296 60 982 -737 1934 -1365 1953 -544
2641 -544 506 164 -472 1746 -1483 1197 -1287 1643 -579 305 596 -917 1793 -1348 2034 -1224
2657 -1224 1155 -462 -507 673 -1693 1615 -2021 1085 -1689 700 -228 -952 568 -1505 1632 -1926
2673 -1926 1060 -1184 333 231 -942 623 -1782 1525 -1876 1058 -658 34 358 -1467 839 -1677
2689 -1677 1172 -1533 922 -950 -461 619 -1391 1639 -1346 1770 -1429 907 98 -390 1175 -902
2705 -902 1865 -1421 1838 -477 595 353 -729 1589 -1479 1728 -1531 1472 -683 190 718 -930
2721 -930 1743 -1582 1795 -1232 998 -493 340 756 -1082 950 -1178 1421 -1075 582 -55 -301
2737 -301 802 -1371 1464 -1362 1143 -1281 212 -71 -1221 1330 -1845 1798 -1963 924 -843
2752 -843 111 -148 -1261 1353 -1813 1506 -1467 553 -558 -27 533 -1194 1585 -1563 1321 -1186
2768 -1186 834 135 -325 651 -1250 1270 -1696 1512 -628 865 224 -625 1551 -1434 1948 -1193
2784 -1193 1027 -361 435 372 -785 1475 -751 1696 -1027 1353 -451 6 923 -1061 1413 -1763
2800 -1763 1651 -1333 1065 124 -250 1023 -1552 1600 -1793 1856 -1035 177 -18 -517 1044 -1583
2816 -1583 1841 -1562 1003 -1118 -102 -74 -1192 564 -1650 1249 -1666 781 -715 -181 132 -1107
2832 -1107 1148 -1476 999 -1578 639 -344 -368 860 -1887 1556 -1637 1286 -1536 695 -128 -715
2848 -715 1672 -1206 1845 -1112 975 -394 500 339 -690 1273 -1318 1516 -1230 1409 -338 145
2864 145 903 -742 1391 -1424 1417 -1035 912 3 100 1037 -785 1651 -1084 1348 -1303 619
2880 619 358 -370 989 -1489 1735 -1375 1190 -888 -43 389 -843 1104 -1950 910 -1431 907
2896 907 -720 -183 63 -1660 1257 -1997 1536 -1458 406 -794 -472 714 -1512 1076 -1927 1190
2912 1190 -1256 684 -19 -575 941 -1479 1596 -1672 1314 -890 459 381 -983 1052 -1475 1336
2928 1336 -1304 1159 -450 161 502 -854 1479 -1271 1598 -984 1333 -393 -120 772 -853 1644
2944 1644 -1490 1730 -1031 831 173 -368 1374 -1354 1440 -1216 951 -933 590 440 -492 1177
2960 1177 -1662 1735 -1677 1281 -866 158 548 -1547 760 -1525 1557 -1691 788 -478 -426 333
2976 333 -1381 1082 -1791 1223 -811 294 -291 -344 850 -1351 1068 -1494 1240 -1191 294 11
2992 11 -717 1163 -1651 1697 -963 1155 -1098 334 949 -555 1277 -1409 1413 -816 1189 7
3008 7 134 703 -636 1819 -1470 1717 -948 877 320 -118 1116 -932 1794 -1479 1440 -589 402
3025 402 478 -546 1302 -1162 1767 -1292 1147 -801 -47 405 -966 913 -1787 1475 -1285 637
3041 637 -638 -4 394 -1289 1158 -1885 1040 -1213 94 -350 -566 377 -1499 1488 -1601 1152
3057 1152 -1077 -41 -316 -681 933 -1277 1319 -1388 867 -867 144 349 -722 1707 -1737 1340
3073 1340 -1221 1001 -245 -295 646 -880 1327 -951 1214 -446 1187 -243 -235 1031 -885 1697
3089 1697 -860 1296 -413 449 646 -405 1261 -1068 1467 -1400 1059 -600 437 294 -337 1013
3105 1013 -1262 1543 -1105 690 -338 93 410 -1043 1333 -1687 994 -1013 681 -106 -512 661
3121 661 -1146 873 -1510 1105 -1107 459 -119 -580 912 -1322 1176 -1392 850 -827 11 -425
3137 -425 -1203 982 -1314 1312 -1342 925 -600 -463 535 -967 1193 -1216 1396 -951 961 -119
3153 -119 -112 954 -1383 1381 -1056 1487 -1268 426 217 -302 1220 -911 1848 -943 1135 -209
3169 -209 480 158 -532 1222 -1092 1390 -757 967 -35 5 256 -997 1364 -1425 1332 -1085 763
3186 763 -528 -596 540 -938 1273 -1467 1152 -1184 163 -319 -469 974 -1182 1267 -1482 772
3202 772 -829 123 450 -1050 1002 -1566 905 -1321 593 -770 -103 507 -831 1277 -1105 1665
3218 1665 -1135 839 -469 -160 343 -755 1128 -858 1164 -1085 676 -102 -84 1347 -921 1605
3234 1605 -1140 1002 -658 836 572 -352 1205 -1395 1400 -985 877 -434 0 207 -698 1420
3250 1420 -1018 1262 -1048 547 -344 -303 668 -752 962 -1361 1006 -948 146 107 -509 253 -1211
3267 -1211 1200 -1348 516 -424 -60 -274 -1164 636 -1157 1227 -1639 543 -668 -544 271 -1048
3283 -1048 910 -1474 1346 -691 329 -420 -300 552 -874 1037 -1256 1040 -392 891 -444 -175
3299 -175 612 -1105 1307 -1061 1293 -488 599 563 -472 1182 -976 1503 -949 865 -69 297
3315 297 1120 -869 1327 -912 1369 -659 685 142 -59 951 -743 1191 -1030 877 -992 623
3331 623 222 -562 691 -1099 1158 -1055 703 -936 23 306 -398 812 -1178 855 -1324 774
3347 774 -585 -233 251 -753 550 -1272 1392 -927 409 -338 -384 194 -1096 758 -1483 662 -1043
3364 -1043 497 56 -325 632 -901 1207 -1445 1092 -337 407 399 -485 1034 -993 1277 -840 521
3381 521 -107 102 514 -239 808 -1083 1179 -854 719 2 183 1036 -984 739 -718 1277 -1010
3398 -1010 418 139 66 600 -887 1278 -1405 1082 -1105 396 48 -225 653 -988 1252 -997 894
3415 894 -693 39 180 -946 747 -1432 1050 -1203 603 -580 -399 -25 -695 824 -1114 797
3431 797 -1456 182 -203 -491 372 -821 618 -1095 922 -621 471 7 -496 1037 -1245 1255
3447 1255 -736 1012 -340 420 173 -356 1108 -916 1198 -1100 577 -157 279 826 -557 1109
3463 1109 -1147 828 -879 230 -162 -132 905 -656 993 -522 1254 -585 -52 329 -466 798
3479 798 -763 860 -540 854 -11 529 147 -548 867 -1217 1241 -1124 714 104 -126 569 -918
3496 -918 860 -1101 777 -1066 334 -414 -383 803 -938 541 -1302 819 -900 199 21 -375
3512 -375 274 -1274 1070 -825 467 -772 76 128 -694 739 -869 942 -936 540 -462 -82 907
3529 907 -421 1030 -696 1212 -457 712 -142 89 290 -1027 1200 -867 1039 -564 478 248
3545 248 -193 743 -710 1287 -859 755 -508 177 515 -574 939 -757 760 -762 607 -566
3561 -566 -24 -56 -752 1180 -832 870 -771 480 -84 16 571 -803 518 -1068 681 -742 209
3578 209 -421 -644 730 -993 470 -725 722 -590 -78 138 -372 700 -959 971 -657 407
3594 407 -700 -239 785 -507 420 -1106 811 -643 298 238 -30 590 -672 727 -624 857 -629
3611 -629 112 91 -306 715 -570 1158 -336 948 -404 111 352 -867 459 -529 796 -872 840
3628 840 32 278 133 -743 940 -483 1444 -459 462 264 -389 643 -1173 413 -1647 322 -790
3645 -790 57 -164 -503 194 -823 601 -865 824 -1018 33 -154 -387 647 -1197 520 -734 816
3662 816 -525 111 22 -422 1005 -1328 671 -1094 879 90 154 306 -714 386 -785 823 -532
3679 -532 313 279 -82 611 -668 1344 -490 766 -338 441 144 -472 958 -639 1149 -497 542
3696 542 -130 -58 402 -267 736 -882 998 -510 590 -361 -491 683 -449 853 -897 1047 -477
3713 -477 487 95 -402 838 -562 592 -548 849 -294 85 -122 -534 258 -1127 741 -1121 548
3730 548 -550 80 428 -738 719 -1063 631 -771 348 -403 -134 152 -779 851 -676 1120 -893
3747 -893 457 -315 -89 756 -707 522 -686 777 -308 476 228 -506 1254 -643 826 -448 434
3764 434 -425 107 270 -448 796 -987 883 -418 393 51 229 757 -616 640 -271 530 -371 575
3782 575 -115 -121 346 -638 790 -1003 702 -707 217 271 -553 483 -664 567 -762 443 -475 -449
3800 -449 90 -652 584 -715 604 -670 447 -391 174 208 -890 446 -1090 514 -356 -10 -230
3817 -230 -84 583 -467 546 -687 671 -317 459 31 -392 586 -981 774 -1200 744 -360 238
3834 238 -12 -516 684 -489 988 -308 1318 -12 40 216 -627 1708 -384 898 -609 362 208
3851 208 -34 411 -466 683 -657 806 -562 453 107 -383 121 -825 765 -569 536 -676 -85
3868 -85 363 -851 368 -801 701 -945 308 -183 382 251 -641 673 -678 427 -773 239 -394
3885 -394 -477 324 -865 319 -397 814 -451 538 -12 -166 507 -604 743 -616 400 -965 -179
3902 -179 43 -687 691 -460 855 -468 625 43 199 375 -558 653 -684 742 -436 493 2
3919 2 66 261 -436 970 -471 544 -163 -67 403 -622 121 -701 1037 -403 694 -667 200 95 -613
3938 -613 457 -854 712 -723 580 -668 -97 -7 -954 675 -740 731 -522 310 -147 -390 292
3955 292 -540 770 -864 776 -543 40 -185 -440 283 -795 355 -888 1118 -300 114 362 -249
3972 -249 741 -1208 902 -487 444 -257 120 310 -467 1144 -645 1096 -502 289 -251 -74 735 -575
3990 -575 734 -526 762 -559 -21 50 -208 431 -764 691 -441 696 -495 361 441 -269 749
4007 749 -652 663 -919 792 -594 95 497 -553 685 -754 768 -459 48 130 -319 129 -728
4024 -728 461 -554 655 -750 302 -151 -389 209 -600 353 -892 274 -399 50 -115 -434 556 -622
4042 -622 888 -499 482 -64 -119 330 -180 378 -903 1341 -187 330 178 -88 252 -264 566 -358 945
4061 945 -395 483 92 13 955 -175 733 -498 875 -157 541 348 -16 785 -845 917 -366 746
4079 746 -131 347 277 -562 698 -640 621 -117 338 -616 -115 538 -478 498 -449 826 -501 -32
4097 -32 -179 -90 342 -836 433 -778 469 -616 105 76 -503 259 -571 523 -473 569 -514 132
4115 132 -18 -257 754 -754 807 -1119 136 109 -158 397 -200 516 -931 878 -195 397 71 -193
4133 -193 120 -182 866 -714 434 -284 473 485 -133 861 -467 1042 -795 687 31 25 173 -64 811
4152 811 -931 762 -669 281 -91 46 109 -699 686 -879 666 -196 280 -15 -397 338 -596 605
4170 605 -658 502 -582 102 -152 -71 46 -564 526 -643 405 -1008 -77 38 -529 580 -856
4187 -856 381 -758 330 -231 -173 302 -338 339 -850 482 -475 387 -58 -91 70 -480 445 -458 611
4206 611 -171 423 180 -274 593 -488 673 -498 772 -442 419 175 47 825 -304 936 -395
4223 -395 831 340 -161 86 -152 1007 -137 342 -327 687 71 -246 277 -923 912 -691 494
4240 494 -595 277 -193 -229 -26 -651 567 -889 501 -330 -33 -224 -746 355 -767 867 -685 471
4258 471 -372 1 164 -788 714 -453 1010 -441 171 -105 -151 76 -657 412 -578 471 145 198 200
4277 200 -310 370 -598 671 -742 538 -559 347 37 -195 484 -323 912 -559 87 -54 217 85
4295 85 -55 683 -1203 877 -654 221 81 -187 571 -529 761 -476 362 -288 309 52 -174 545
4313 545 -195 261 -760 781 -391 -152 406 -307 267 -539 815 -628 464 -353 353 -192 -281 907
4331 907 -1131 651 -358 159 108 -118 342 -248 129 -75 287 -452 -119 25 -460 471 -712 684 -764
4350 -764 627 -477 102 156 -127 319 -325 648 -453 622 -86 138 -18 45 686 -435 672 -415
4368 -415 407 33 160 186 -317 419 -606 568 -349 359 96 55 677 -222 460 -351 207 31 390 115
4388 115 -222 221 -688 593 -172 567 -417 131 426 -337 665 -522 827 -595 184 -362 354 125
4406 125 -383 112 -836 341 -202 125 -95 -21 245 -381 330 -833 430 -706 23 -61 -268 895 -488
4425 -488 556 -459 235 -293 309 662 -75 655 -750 492 -456 446 100 -127 52 -79 409 -333 751
4444 751 -580 232 211 -290 596 -235 693 -720 567 -72 497 379 12 514 -47 754 -561 255 -555
4463 -555 -2 233 -164 429 -285 400 -439 227 -168 -58 213 -183 304 -724 384 -30 764 -10 299
4482 299 429 -738 -29 -293 496 -506 396 -52 -260 449 -828 523 -377 541 -266 449 301 -193 628
4501 628 -822 200 -631 603 294 41 334 -283 702 -539 514 -415 -176 -165 292 335 -429 608 -236
4520 -236 397 -470 -11 359 -270 397 -641 424 -133 230 -72 163 -37 -188 507 -397 715 -411 607
4539 607 -44 92 -34 -254 495 -556 462 -423 -25 142 -463 141 -419 188 -196 108 -536 -417 -124
4558 -124 -237 234 -297 221 -398 55 -363 -452 431 -251 100 -630 880 -614 393 304 -80 285 -397 419
4578 419 -339 671 -4 34 369 212 507 -242 456 -259 683 -206 495 70 190 729 -370 444 -176 583
4598 583 44 218 156 233 311 -439 351 -472 307 -748 353 417 -264 327 -590 359 -246 -83 -20 142 247
4619 247 -505 447 -475 459 -174 291 -331 -478 567 -280 340 37 390 -211 210 263 -641 201 -424 808
4639 808 -378 171 -448 -46 -46 -136 372 -343 330 -388 -115 -14 -218 -61 -51 479 -566 859 38 165
4659 165 -71 -134 237 -323 498 -673 228 -314 95 394 -308 498 -473 706 -131 446 -47 45 107 -66
4679 -66 209 -614 203 -723 338 -63 79 437 -624 88 -642 528 -301 117 -113 -206 -1 -363 169 -246
4699 -246 682 -338 224 178 -77 -159 -563 366 -273 613 156 309 156 -484 243 -618 313 -369 416 331 -117
4720 -117 181 -576 603 -446 278 -124 245 -327 -156 -13 28 531 -348 143 -427 264 100 -44 533 -235
4740 -235 864 -299 731 -44 -121 207 -348 448 -466 270 -399 55 -130 -323 42 -136 420 -379 392
4759 392 -460 109 -182 -45 404 -381 260 -607 333 -405 154 -17 -358 283 -486 390 -583 480 -189 77
4779 77 -127 -565 364 -455 399 -429 117 -333 -87 273 -290 462 -541 259 -633 376 94 -535 -283 -654
4799 -654 412 -274 388 -234 204 56 178 613 -648 455 68 165 144 247 114 232 603 -397 443
4818 443 -140 59 -113 129 434 113 492 -189 716 -130 274 230 -45 -99 -450 73 13 443 -731 478
4838 478 438 48 408 -362 223 -526 336 -317 240 325 -2 310 -533 278 -487 193 -36 -236 188 -198 73
4859 73 -579 334 -280 285 42 -251 283 -242 724 -360 141 -323 -62 -221 -266 240 -225 309 -328 430
4879 430 -452 -61 -192 -321 513 -617 465 -396 382 125 -76 475 -245 758 -418 406 -404 495 -183
4898 -183 66 133 -227 362 -428 584 -359 459 -60 -166 266 -263 576 -225 108 -288 345 -131 3 429
4918 429 -374 500 -60 431 -180 -334 36 -530 281 -879 -218 -413 90 -330 -249 -57 287 434 -283 269
4938 269 -261 368 92 -414 -31 -560 311 -291 315 -358 -34 1 -119 136 -539 193 -267 260 208 353 80
4959 80 -295 207 -177 144 -628 20 173 -106 372 -216 325 -96 373 -156 277 -22 -136 118 2 79 -390
4980 -390 395 -214 480 262 161 217 -324 145 -401 104 -5 -37 215 -119 -75 -539 697 -419 147 -120
5000 -120 -416 158 -579 441 -569 137 -726 -104 309 -291 317 -260 562 -286 308 -158 356 -2 -31 357
5020 357 -239 699 -162 463 30 181 437 -364 529 -455 248 -881 353 7 -392 222 -557 160 -498
5039 -498 536 -192 138 92 330 274 94 591 -453 405 70 -308 20 -38 198 -144 364 -368 173 -183
5059 -183 330 87 -325 545 -650 319 -337 316 -116 127 109 -323 640 -329 199 -291 86 -73 -289 114
5079 114 -692 391 -171 336 -36 -431 -347 -22 110 -162 69 -132 -50 -192 171 -125 -668 402 -400 472
5099 472 -32 -151 9 396 384 -175 166 -178 343 -106 56 -20 237 -114 -85 442 -291 346 -80 93 0
5120 0 -469 300 -166 590 -387 9 -80 77 58 -390 180 57 133 -349 383 -81 46 268 -110 229 -547 494
5142 494 -266 -140 -12 206 286 75 466 -300 417 -37 -17 336 47 57 -357 169 -774 332 -208 91 87
5163 87 -392 109 -1097 204 -224 568 69 -39 157 293 202 -731 662 -753 404 655 -508 162 -545
5182 -545 265 -109 952 -253 494 -61 737 471 -9 306 259 465 -526 47 -120 251 570 -768 465
5201 465 353 690 -376 -428 178 -124 527 -434 235 -418 -274 303 368 -347 -237 240 -217 164 -194 -111 205
5222 205 -11 170 -518 128 -616 75 -160 557 408 -126 229 -466 547 -602 138 135 111 90 -23 258 -426
5243 -426 482 -415 98 -115 -10 215 -514 107 -97 173 -191 81 191 -26 315 -185 65 -170 622 -1
5263 -1 314 86 -452 262 -473 430 -460 116 -105 -76 155 -86 204 -328 370 -629 369 -210 -172 227 -252
5284 -252 162 -170 202 -368 374 19 -244 388 -98 305 -92 160 -344 481 235 12 352 -207 505 23
5304 23 370 -250 -60 41 -143 203 -325 378 -117 -109 -160 56 135 87 90 -335 505 -445 25 324 -296 88 -37
5327 -37 167 -334 155 -346 -225 36 -252 330 -454 408 -381 351 251 187 61 126 398 -215 274 67 -134
5348 -134 222 -70 -40 -80 425 -241 358 -32 88 136 -131 476 -480 290 -46 650 -519 102 217 -131 481
5369 481 -295 194 -193 18 12 -217 463 -483 250 -250 40 -31 309 5 67 420 -331 338 -377 435 -205
5390 -205 218 -51 129 321 -133 44 -457 222 -148 -44 -104 -37 206 -389 556 -306 537 -203 -398 182 -199
5411 -199 366 -362 369 -352 187 122 226 20 -116 150 -140 -156 123 -36 -216 97 326 -75 -187 -67 233
5432 233 -43 211 -79 19 180 -118 406 -514 128 -69 32 223 -118 341 -89 680 -424 529 -238 -296
5452 -296 -335 -52 -148 59 425 133 1285 -263 -231 174 -156 78 -298 375 134 -213 -419 -549 117 191 989
5473 989 -646 545 135 184 -463 -398 65 -562 573 -239 269 -173 -264 866 -208 -2 51 445 -568
5492 -568 240 -217 -233 146 391 141 -978 286 -514 1382 615 368 713 186 195 -322 -294 -269 -101 221 -346
5513 -346 400 623 268 -174 80 -47 -303 167 -274 244 -73 366 -266 281 -270 -139 6 130 98 -536
5533 -536 514 80 19 140 -496 158 -134 176 -510 188 -133 101 207 -315 186 -514 333 -73 -123 173
5553 173 -11 -17 262 160 -30 272 283 362 119 -39 240 -47 493 -420 484 -113 67 -170 129 -40 27 25
5575 25 -510 244 -240 238 258 244 569 -254 187 -160 694 -307 -307 194 -210 415 106 376 -341 35 104 74
5597 74 453 -221 176 -531 294 -208 -63 -172 -147 214 -337 104 -63 318 -395 12 -71 -305 85 -265 592
5618 592 -184 238 84 -201 210 62 44 -416 512 -206 173 -42 214 -11 -24 526 -496 331 -82 289
5638 289 27 -6 31 -97 287 -327 117 222 -106 -155 -123 94 128 286 -339 321 -18 256 220 -315 503 -197
5660 -197 -33 -174 82 169 20 363 -226 175 -108 255 47 160 -70 -245 -83 -185 469 -224 -103 -168 -113
5681 -113 -319 -152 69 -390 55 -175 121 12 246 259 -484 317 -300 9 -525 106 269 42 192 -20
5701 -20 313 -600 767 -22 225 -81 278 152 294 442 32 356 -69 205 6 -142 241 -273 512 -260
5721 -260 314 -34 -88 12 -20 70 29 484 -69 449 112 179 -27 -181 336 -280 342 201 86 -71 229 320
5743 320 -379 369 -347 320 -348 -3 211 15 82 -294 15 -283 -373 -229 211 196 -11 348 -622 125 -500
5764 -500 157 -171 -458 -52 -531 189 -387 274 -94 -72 -153 86 148 -93 533 -597 83 -293 90 46 -315
5785 -315 115 122 217 -200 -62 -174 158 46 -159 -199 123 246 -314 -6 -162 175 412 297 94 -180 379
5806 379 -164 137 106 41 293 -374 56 -147 46 -261 225 272 149 -120 -314 196 178 779 -143 -55 345 3
5828 3 396 -120 153 -207 195 -348 -337 84 -306 377 -141 329 -252 -228 8 112 -150 -258 545 -736 75
5849 75 -397 205 -185 -483 238 85 179 -430 44 -344 -247 102 -47 -112 -87 108 24 96 169 -125 -213 7 392
5872 392 -145 489 48 -133 -222 94 213 116 150 -524 -71 -128 71 -435 189 404 324 314 -126 160 -369 -164
5894 -164 215 -177 281 -484 151 355 366 -152 100 123 29 154 -173 -84 -371 47 135 87 491 -257 -79 -148
5916 -148 -349 -88 334 169 292 375 -137 126 -393 40 -396 46 72 -306 15 -91 325 -651 454 104
5936 104 11 19 -118 -220 -14 143 4 -118 132 -222 -15 -44 4 -91 340 467 -246 -145 89 275 -153 358
5958 358 -311 201 21 78 201 1 155 -28 205 -344 471 201 71 129 -446 355 -659 -99 -41 223 -229
5979 -229 -111 -102 -14 431 -114 221 -487 -17 55 37 169 23 347 -143 155 -211 328 -82 -240 19 223 480
6001 480 -433 87 -53 83 46 -493 141 -166 480 -681 223 57 -284 -160 98 439 -218 397 -645 -202
6021 -202 -34 171 425 33 405 -190 211 -93 383 336 -44 -33 -82 -78 -499 328 -198 174 390 -348 179 -93
6043 -93 15 -328 33 193 56 80 56 -119 -355 159 -336 149 218 -10 -374 68 567 -384 335 -273 315
6064 315 94 -68 64 -209 -122 -192 86 -130 140 36 -161 143 -311 460 -73 -58 101 -57 125 -125 59
6085 59 350 314 -214 205 33 301 -9 -154 381 -307 435 -457 110 252 152 329 -236 150 -52 81 101
6106 101 -332 233 33 448 44 272 -314 187 46 83 52 -527 -114 -324 453 -493 151 -101 106 108 -83
6127 -83 109 -273 426 73 176 -26 257 341 -133 -73 -406 357 -345 -275 37 -221 168 -197 105 -89 5 44
6149 44 47 -119 -84 470 -617 504 11 -12 14 -190 351 -111 -9 -263 441 26 87 -278 380 203 34 216
6171 216 -478 166 -345 136 390 -34 580 -170 -67 42 86 -166 271 -77 -211 306 -135 351 -70 12 234
6192 234 517 129 -530 264 54 112 328 78 105 36 -102 -417 166 -459 106 -441 -125 -19 24 53 -245 94
6214 94 -373 -19 3 -25 204 76 433 -423 180 75 -197 52 172 -277 -453 128 -22 265 -491 171 -119
6235 -119 -101 -285 -225 109 -230 221 25 377 25 -18 -156 -162 220 -242 124 61 119 157 -231 17 -52 262 57
6258 57 202 -88 14 4 129 -476 -36 279 -724 -43 253 -74 324 -430 636 533 -133 -228 431 591
6278 591 -533 -259 41 320 199 142 -164 48 226 -285 385 -594 320 390 68 -499 -398 -460 -145 20 -759
6299 -759 343 -249 55 -51 -109 -150 -168 293 -202 295 -453 -539 -100 201 204 -269 152 43 82 -179 4 365
6321 365 -666 532 -16 -138 190 180 17 -112 -38 274 185 -98 402 -444 -96 -171 -147 297 -28 228 52
6342 52 489 -336 -154 63 -232 298 -54 23 63 448 -194 -109 152 -255 -96 -1 266 79 -134 -214 100 -269
6364 -269 203 344 -215 -229 -179 499 -513 21 153 -179 142 67 251 -176 310 -522 -181 265 -58 -317 -119
6385 -119 326 383 95 205 170 222 -491 -83 -7 -67 86 78 -111 -346 131 -132 -12 -458 -87 -280 230 135 -41
6408 -41 2 -287 -7 -8 -94 140 -82 -89 -313 328 -80 204 158 -85 407 -436 189 20 201 -494 369 -369 -96
6431 -96 66 -220 -162 -91 351 -416 288 -145 -41 93 7 290 -598 82 -414 -182 -42 -14 -2 -342 370 -445
6453 -445 190 -213 116 31 -128 -41 29 119 -328 285 31 -19 324 -215 381 -195 -55 35 54 72 138 449 13
6476 13 283 -44 315 -186 -217 96 58 33 186 100 -66 -173 -104 -55 -61 -344 -92 -178 -173 -204 246 244 167 -3 -260
6501 -260 57 -92 140 -213 -83 -74 -97 278 63 42 -340 -63 -116 87 -11 -71 -240 -264 -41 -452 255 19 -252
6524 -252 -375 -2 70 -604 386 -101 -153 -119 -222 70 105 103 -268 135 107 -288 42 -78 242 -75 155 63 48
6547 48 39 -101 169 -168 396 -67 -141 -411 34 229 130 -370 -38 644 -315 -433 -189 81 -197 38 45 28 -35
6570 -35 -508 227 -458 99 -109 -216 76 -425 353 -337 386 181 101 130 -516 -114 -319 182 -30 291 53
6591 53 89 -107 -401 26 -96 -119 -41 -196 230 -29 -175 -179 210 -157 298 -75 45 -166 -98 94 -341 -46
6613 -46 -195 67 -226 323 -65 -51 -250 -147 -39 -8 -122 47 -152 -106 36 -52 113 26 -83 144 -89 -231
6635 -231 -133 -13 -242 59 2 470 -31 30 -81 -36 218 -219 110 434 203 33 -257 -86 -47 -394 329 -117
6657 -117 -96 -30 -98 36 -4 -176 -270 -46 102 119 -191 248 -279 -234 488 -197 -1 50 146 -58 307 153 -48
6680 -48 -216 -214 316 -248 70 407 129 71 286 216 -467 -305 -114 -163 130 -83 126 -187 309 8 266 39
6702 39 -148 195 -110 -259 22 92 25 -81 254 56 24 -120 -22 13 74 -60 56 -97 -210 156 33 342
6724 342 -7 152 -26 30 7 -65 -8 -4 331 -300 -112 -126 183 124 -31 35 37 1046 -13 -106 159 -354 12
6747 12 393 109 -409 178 75 213 105 21 -26 3 492 -178 222 48 -131 -75 146 248 -407 99 129 27
6769 27 -112 135 -226 -118 -131 -634 -114 159 362 142 136 205 135 522 -219 114 57 262 -204 138 -189 -191 130
6792 130 -23 -102 -181 41 72 51 70 -210 -348 115 101 19 -177 346 128 244 -51 42 -139 -19 -16 138 23
6815 23 -131 -25 65 -172 -151 -2 -91 -132 -63 -242 233 128 332 81 -273 6 -107 258 57 412 -303 84
6837 84 -282 241 153 -73 57 -145 28 -59 53 -209 418 -145 -232 -152 -218 23 -272 -31 165 5 44 -367
6859 -367 -49 -65 -262 -702 -235 -232 254 403 -198 239 151 362 179 18 -22 -110 -82 -397 469 -103 429 -167
6881 -167 -383 262 -303 149 -10 437 -356 173 -200 -101 23 144 -104 -203 -189 -382 365 -153 15 -247 -388
6902 -388 40 -174 -15 -61 -127 -60 -466 263 -246 253 -409 269 -279 -309 -389 -604 352 124 305 -357 -110 -22
6924 -22 50 0 135 24 -337 186 -242 210 -46 153 341 239 88 183 117 -58 227 80 -65 -118 0 517
6946 517 -30 172 111 -458 230 -47 -54 -118 126 -264 385 71 153 -212 28 230 -309 306 -97 -139 104 -353
6968 -353 239 64 291 -132 240 39 24 -31 -1 355 -209 421 -148 140 130 160 282 -553 257 174 -33 -142
6990 -142 -222 -170 90 -131 54 -86 -18 55 -154 -176 237 189 202 139 -41 -209 291 -100 120 -79 -215 -82 -2
7013 -2 11 -175 218 96 389 105 366 -71 -137 33 58 207 -59 86 175 -502 -422 -61 280 -69 -29 55 -419
7036 -419 107 -163 85 -150 192 -60 58 114 249 -226 -183 -42 -154 -107 -6 47 -255 -271 47 25 348 -287
7058 -287 -344 -80 -138 -9 173 -58 22 136 -13 150 -62 -414 149 443 89 -282 17 286 0 -202 66
7079 66 -74 -481 -166 -368 -54 -70 141 366 -26 -98 -213 318 -38 -379 30 58 -146 60 317 -181 312
7100 312 31 123 69 -149 305 440 222 -91 -56 167 103 68 -86 80 132 360 -592 -121 249 -220 -156 -32
7122 -32 174 -302 186 -38 222 -503 -607 235 -193 54 -298 512 193 105 -84 -26 -53 5 238 -55 -403 -365
7144 -365 96 18 -283 -135 -8 17 72 97 -87 -48 164 -254 -144 -85 -71 -401 0 85 -88 -216 13 45 -110
7167 -110 -210 -205 85 -144 135 6 -285 194 -53 503 174 88 -279 53 99 -88 -75 190 -88 -343 -168 -68
7189 -68 86 157 214 130 -59 575 -362 -186 56 -14 133 -232 355 243 -109 29 -479 78 -285 215 221 92
7211 92 -267 -345 179 22 183 -128 185 -227 151 2 390 178 342 386 -113 -91 116 164 144 -203 23 -69
7233 -69 70 -7 -73 -95 209 175 -50 57 -475 126 -492 169 255 -274 -365 64 73 -197 30 142 80 -182 4
7256 4 -182 -356 64 -4 -42 -78 -3 -471 -299 112 -199 224 89 153 20 -159 -92 -292 -545 840 776 -254
7278 -254 -58 85 -88 -394 278 227 -254 414 49 -163 -77 -311 88 93 109 175 -34 -392 61 -305 -87 262
7300 262 -152 -64 -204 284 -183 257 264 99 321 -99 127 60 -211 -62 192 -118 26 88 -212 165 10 131
7322 131 -80 -58 -68 7 173 -79 272 -286 -11 387 -459 -157 -3 59 -273 246 -283 -292 -373 256 293 -19 198
7345 198 51 -221 -192 -6 0 9 -193 -110 -233 42 180 194 -216 27 -237 -199 -38 204 330 351 145 -13 57
7368 57 -285 105 -403 237 -113 -65 75 24 -77 -100 169 93 73 -151 178 -187 118 -170 -291 -11 -32 190
7390 190 145 27 251 281 -258 -476 84 45 188 -129 -168 135 -72 -360 -14 79 12 187 -62 -38 -47 -229 -99
7413 -99 -287 132 -163 229 26 157 -223 125 231 -47 -196 -26 -35 -23 -179 -15 6 79 -242 -198 -13 -101 297
7436 297 126 323 -225 13 -58 -14 -426 113 208 -29 111 -84 196 72 -46 -342 274 -124 -211 107 -146
7457 -146 50 -161 62 -108 -252 -327 -13 109 -633 -127 42 -204 -154 31 296 -61 178 -18 318 -506 -12
7478 -12 -65 9 93 -397 284 -312 -92 146 -258 101 7 98 -121 -121 -45 -10 -92 44 210 28 -97 -56 142 20
7502 20 -164 278 167 154 -162 143 -50 -256 -329 28 132 -372 102 63 245 -379 110 -73 -149 167 153 183
7524 183 -412 54 -90 -53 66 110 -82 -100 -54 -533 282 -212 -285 -301 323 -132 -343 138 36 251 296 -164
7546 -164 280 -144 502 -135 -50 -217 31 -271 345 264 -449 82 -265 -219 33 -306 29 110 -110 -150 -269 22
7568 22 -444 -53 76 -39 7 169 -380 91 -84 -178 -116 77 -55 200 242 -81 143 623 177 86 200 64
7590 64 -563 -258 -34 49 -256 42 -277 107 48 -185 -330 -174 116 62 -13 -105 -188 115 -110 366 -46 117
7612 117 -151 -125 -375 78 409 -131 410 -301 335 -39 43 197 -150 -163 -172 40 -144 -56 96 -51 274 -1
7634 -1 -25 117 -119 115 -119 147 176 104 -409 109 -35 206 -138 50 118 126 11 -280 -79 160 -15 120 -114
7657 -114 346 41 -91 -214 460 -530 27 -72 23 105 -258 -58 -271 286 243 278 -286 -247 -423 -112 35 202
7679 202 -92 -106 83 -19 -307 -75 -198 225 -33 -13 81 307 214 -99 84 28 356 -228 -125 145 -249 -32
7701 -32 -116 465 95 247 341 -58 -40 -232 -114 -331 311 -70 147 -82 61 -27 -83 -138 79 127 145 -437 138
7724 138 37 231 -373 407 13 -51 -81 102 -2 -193 103 17 17 8 -109 262 126 62 259 124 9 20 -93
7747 -93 -50 -21 324 -84 -350 -40 -680 200 -317 -45 -136 -125 -51 128 127 -247 -154 -156 -94 -32 144 -145 -126 485 -135
7772 -135 -202 -285 -169 6 50 25 -240 83 134 -81 522 -80 539 -208 -48 142 -70 -198 459 295 -87 431
7794 431 103 424 -134 508 -36 -102 -40 64 121 162 271 -74 36 19 17 86 3 247 -65 109 -15 33 258
7817 258 -181 116 -49 311 0 -110 -23 25 188 62 93 -286 -96 -279 55 103 107 -106 298 -3 -111 378
7839 378 -4 336 265 250 -126 141 684 -64 -55 -251 204 84 325 -254 -77 -156 -173 413 -66 -433 -206 298
7861 298 -106 -122 202 -266 226 -340 47 -358 42 156 -198 -51 241 -184 71 -594 -96 128 195 -88 35
7882 35 -107 307 -859 -313 43 -89 75 -395 108 -755 309 -512 489 2 -63 0 233 374 -103 -121
7902 -121 176 -310 111 -37 -25 7 -21 99 -27 100 -157 260 280 214 -287 243 -28 279 71 -276 117 82
7924 82 40 -307 -115 -34 50 317 -143 270 -275 101 100 200 95 33 -81 428 58 10 -78 -192 -90 56 -32
7947 -32 -104 -456 -12 -368 283 72 -223 263 4 301 -282 -220 -180 36 -374 6 133 125 64 -462 341 18
7969 18 -55 101 -275 80 -285 -79 157 154 -165 71 5 75 -21 -38 303 -107 191 84 69 -229 -4 215 -152
7992 -152 -46 -116 -71 24 5 9 -220 -167 -114 -308 53 228 -36 180 -38 80 -35 7 -199 40 119 270 -97
8015 -97 -199 135 -130 63 54 343 45 5 -156 331 -145 55 -352 -240 -37 0 533 -118 241 -58 82 -304
8037 -304 199 -183 28 79 -192 -30 -159 -91 -305 -327 -190 327 203 326 254 -530 -30 116 -303 369 -87
8058 -87 154 -122 149 -344 85 27 -92 150 -310 57 -133 336 -250 298 152 25 65 -298 -235 -496 531
8079 531 123 -506 398 252 -7 153 251 49 67 80 -111 236 -276 -2 -565 -128 -250 52 -30 186 11
8100 11 -214 5 168 -272 102 -62 -18 223 513 -232 606 212 -109 30 -56 -1 59 316 -366 322 -227 131
8122 131 46 -234 317 11 37 -143 279 -165 -25 -43 2 184 313 315 4 -181 -196 -61 178 68 -42 39 -60
8145 -60 -232 59 118 334 -154 -298 51 71 474 -343 -317 97 -16 -4 -168 516 121 164 -185 -159 151 301
8167 301 24 -4 60 222 -60 -105 -96 -147 -282 -59 -652 300 -141 -133 -178 -119 -69 108 101 -176 -115 -120 209 -58
8191e8
##END NTUPLES=NMR FID
##END=
