##TITLE=1H_TG-2305-1
 CDCl3, 8 sc, 
 30.10.2020
##JCAMPDX= 6.0         $$ Bruker NMR JCAMP-DX V2.0
##DATA TYPE= NMR FID
##DATA CLASS= NTUPLES
##ORIGIN= UXNMR, Bruker Analytische Messtechnik GmbH
##OWNER= root
$$ XWIN-NMR		Version 3.5
$$ Fri Oct 30 10:34:26 2020 Russian Standard Time (UT+4h)  she@DPX200
##.OBSERVE FREQUENCY= 200.1315066352
##.OBSERVE NUCLEUS= ^1H
##.DELAY= (6, 6)
##.ACQUISITION MODE= SIMULTANEOUS
##.ACQUISITION SCHEME= undefined
##.AVERAGES= 8
##.DIGITISER RES= 18
##SPECTROMETER/DATA SYSTEM= spect
##.PULSE SEQUENCE= zg30
##.SOLVENT NAME= CDCl3
##.SHIFT REFERENCE= (INTERNAL, CDCl3, 0, 15.7039)
##AUDIT TRAIL= $$ (NUMBER, WHEN, WHO, WHERE, WHAT)
$$ ##TITLE= Audit trail, XWIN-NMR		Version 3.5
$$ ##JCAMPDX= 5.01
$$ ##ORIGIN= Bruker BioSpin GmbH
$$ ##OWNER= she
$$ F:/spectra/data/she/nmr/H-F/1/audita.txt
$$ ##AUDIT TRAIL=  $$ (NUMBER, WHEN, WHO, WHERE, WHAT)
(   1,<2020-10-30 10:33:24.92 +0400>,<she>,<DPX200>,
      <created by zg, POWCHK disabled, PULCHK disabled
       configuration hash MD5:
       00 E9 B6 7A A2 85 ED C7 34 08 36 98 17 FE 4E 26
       data hash MD5: 16K
       C8 A0 D0 2E 59 D3 90 61 CC 03 2A F2 24 18 43 D5>)
$$ ##END=
$$ 
$$ hash MD5
$$ D5 D0 0B 5F F1 0E 71 DA 56 A2 A6 02 0F C7 A8 0D
##$RELAX= 
##$RELAX= 
##$RELAX= 
##$RELAX= 
##$RELAX= 
##$RELAX= 
$$ Bruker specific parameters
$$ --------------------------
##$DU= <F:/spectra>
##$EXPNO= 1
##$NAME= <H-F>
##$PROCNO= 1
##$TYPE= <nmr>
##$USER= <she>
##$AMP= (0..31)
100 100 100 100 100 100 100 100 100 100 100 100 100 100 100 100 100 100 
100 100 100 100 100 100 100 100 100 100 100 100 100 100 
##$AQSEQ= 0
##$AQ_mod= 1
##$AUNM= <au_zg>
##$AUTOPOS= <>
##$BF1= 200.13
##$BF2= 200.13
##$BF3= 200.13
##$BF4= 200.13
##$BF5= 200.13
##$BF6= 200.13
##$BF7= 200.13
##$BF8= 200.13
##$BYTORDA= 1
##$CFDGTYP= 0
##$CFRGTYP= 5
##$CHEMSTR= <none>
##$CNST= (0..31)
1 1 145 1 1 1 1 1 1 1 1 1 1 1 1 1 1 1 1 1 1 1 1 1 1 1 1 1 1 1 1 1 
##$CPDPRG= <>
##$CPDPRG1= <>
##$CPDPRG2= <>
##$CPDPRG3= <>
##$CPDPRG4= <mlev>
##$CPDPRG5= <mlev>
##$CPDPRG6= <mlev>
##$CPDPRG7= <mlev>
##$CPDPRG8= <mlev>
##$CPDPRGB= <>
##$CPDPRGT= <>
##$D= (0..31)
0 1.2 0 0 0 0 0 0 0 0.06 0 0.03 0 0 0 0 0.0002 0 0 0 0 0 0 0 0 0 0 0 0 
0 0 0 
##$DATE= 1604039604
##$DBL= (0..7)
120 120 120 120 120 120 120 120 
##$DBP= (0..7)
150 150 150 150 150 150 150 150 
##$DBP07= 0
##$DBPNAM0= <>
##$DBPNAM1= <>
##$DBPNAM2= <>
##$DBPNAM3= <>
##$DBPNAM4= <>
##$DBPNAM5= <>
##$DBPNAM6= <>
##$DBPNAM7= <>
##$DBPOAL= (0..7)
0.5 0.5 0.5 0.5 0.5 0.5 0.5 0.5 
##$DBPOFFS= (0..7)
0 0 0 0 0 0 0 0 
##$DE= 6
##$DECBNUC= <off>
##$DECIM= 32
##$DECNUC= <off>
##$DECSTAT= 4
##$DIGMOD= 1
##$DIGTYP= 9
##$DL= (0..7)
0 120 120 120 120 120 120 120 
##$DP= (0..7)
150 150 150 150 150 150 150 150 
##$DP07= 0
##$DPNAME0= <>
##$DPNAME1= <>
##$DPNAME2= <>
##$DPNAME3= <>
##$DPNAME4= <>
##$DPNAME5= <>
##$DPNAME6= <>
##$DPNAME7= <>
##$DPOAL= (0..7)
0.5 0.5 0.5 0.5 0.5 0.5 0.5 0.5 
##$DPOFFS= (0..7)
0 0 0 0 0 0 0 0 
##$DQDMODE= 0
##$DR= 18
##$DS= 0
##$DSLIST= <SSSSSSSSSSSSSSS>
$$ [...]
##$SUBNAM2= <"">
##$SUBNAM3= <"">
##$SUBNAM4= <"">
##$SUBNAM5= <"">
##$SUBNAM6= <"">
##$SUBNAM7= <"">
##$SUBNAM8= <"">
##$SUBNAM9= <"">
##$SW= 16.880792210976
##$SWIBOX= (0..15)
0 0 2 0 0 0 0 0 0 0 0 0 0 0 0 0 
##$SW_h= 3378.37837837838
##$TD= 16384
##$TD0= 1
##$TE= 0
##$TE2= 300
##$TE3= 300
##$TEG= 300
##$TL= (0..7)
0 120 120 120 120 120 120 120 
##$TP= (0..7)
150 150 150 150 150 150 150 150 
##$TP07= 0
##$TPNAME0= <>
##$TPNAME1= <>
##$TPNAME2= <>
##$TPNAME3= <>
##$TPNAME4= <>
##$TPNAME5= <>
##$TPNAME6= <>
##$TPNAME7= <>
##$TPOAL= (0..7)
0.5 0.5 0.5 0.5 0.5 0.5 0.5 0.5 
##$TPOFFS= (0..7)
0 0 0 0 0 0 0 0 
##$TUNHIN= 0
##$TUNHOUT= 0
##$TUNXOUT= 0
##$USERA1= <user>
##$USERA2= <user>
##$USERA3= <user>
##$USERA4= <user>
##$USERA5= <user>
##$V9= 5
##$VALIST= <valist>
##$VCLIST= <CCCCCCCCCCCCCCC>
##$VD= 0
##$VDLIST= <DDDDDDDDDDDDDDD>
##$VPLIST= <PPPPPPPPPPPPPPP>
##$VTLIST= <TTTTTTTTTTTTTTT>
##$WBST= 1024
##$WBSW= 4
##$XGAIN= (0..3)
0 0 0 0 
##$XL= 0
##$YL= 0
##$YMAX_a= 614977
##$YMIN_a= -503104
##$ZGOPTNS= <>
##$ZL1= 120
##$ZL2= 120
##$ZL3= 120
##$ZL4= 120
##$ABSF1= 10
##$ABSF2= 0
##$ABSG= 5
##$ABSL= 3
##$ALPHA= 0
##$AQORDER= 0
##$ASSFAC= 0
##$ASSFACI= 0
##$ASSFACX= 0
##$ASSWID= 0
##$AUNMP= <proc_1d>
##$AZFE= 0.1
##$AZFW= 0.1
##$BCFW= 1
##$BC_mod= 2
##$BYTORDP= 1
##$COROFFS= 0
##$CY= 11.3945322036743
##$DATMOD= 1
##$DC= 2
##$DFILT= <>
##$DTYPP= 0
##$F1P= 15.9154993809931
##$F2P= -4.1035820241983
##$FCOR= 0.5
##$FTSIZE= 0
##$FT_mod= 4
##$GAMMA= 1
##$GB= 0.15
##$INTBC= 1
##$INTSCL= 1
##$ISEN= 128
##$LB= 0.24
##$LEV0= 0
##$LPBIN= 0
##$MAXI= 10000
##$MC2= 0
##$MEAN= 0
##$ME_mod= 0
##$MI= 1.114404
##$NCOEF= 0
##$NC_proc= 0
##$NLEV= 6
##$NOISF1= 3.799351
##$NOISF2= 2.8
##$NSP= 1
##$NTH_PI= 0
##$NZP= 0
##$OFFSET= 15.70392
##$PC= 1
##$PHC0= -10687.07
##$PHC1= 9.20088
##$PH_mod= 1
##$PKNL= yes
##$PPARMOD= 0
##$PSCAL= 0
##$PSIGN= 0
##$REVERSE= no
##$SF= 200.130013532006
##$SI= 16384
##$SIGF1= 3
##$SIGF2= 2
##$SINO= 400
##$SIOLD= 16384
##$SREGLST= <1H.CDCl3>
##$SSB= 0
##$STSI= 0
##$STSR= 0
##$SW_p= 3612.71676300578
##$SYMM= 0
##$S_DEV= 0
##$TDeff= 0
##$TDoff= 0
##$TI= <>
##$TILT= no
##$TM1= 0
##$TM2= 0
##$TOPLEV= 0
##$USERP1= <user>
##$USERP2= <user>
##$USERP3= <user>
##$USERP4= <user>
##$USERP5= <user>
##$WDW= 1
##$XDIM= 8192
##$YMAX_p= 0
##$YMIN_p= 0
$$ End of Bruker specific parameters
$$ ---------------------------------
##NTUPLES= NMR FID
##VAR_NAME=  TIME,          FID/REAL,        FID/IMAG
##SYMBOL=    X,             R,               I
##VAR_TYPE=  INDEPENDENT,   DEPENDENT,       DEPENDENT
##VAR_FORM=  AFFN,          ASDF,            ASDF
##VAR_DIM=   8192,          8192,            8192
##UNITS=     SECONDS,       ARBITRARY UNITS, ARBITRARY UNITS
##FACTOR=    0.000296,      1,               1
##FIRST=     0,             0,               0
##LAST=      2.424536,      0,               0
##MIN=       0,             -503104,         0
##MAX=       2.424536,      614977,          0
$$ Real data points
##PAGE= N=1
##DATA TABLE= (X++(R..R)), XYDATA
$$ [...]
2391c18k183L097k896J823n89J7J71j075L379l517J878O4l79n80J508j011j83
2408g94K116k088J714j849K483k066o0K161k199J975o18J02j315K544j743j13
2424B50J185p33J098j950J969j817J406r1o95L7Q24O11l151L235k338R59j29l43
2442C27Q32j264J584k194P01J15R19k850K779l16j936K764l560K366j118O59o32
2459h24n14J894j466l13k28J746k460K694j870l57J905j785J059j775K624j918
2475a588J230l81O2p8l55J434k916L747j638j27M36k54L38m64R86j666K344j436
2493c26J544k173J388J088l220L261j561J013n21O46j069Q80Q2r67Q52o99K072
2510B290l095J910l09j005J631j610Q33n93K051k717J104j67K05j38j197K178
$$ plain form
2391 -318 -2501 596 -2300 -477 -1066 -1049 -878 -1953 1426 -2091 -213 -149 -528 -1108 400 -611 -794
2408 -794 1322 -766 948 -901 1582 -484 -544 1617 -582 1393 775 877 -438 2106 363 250
2424 250 1435 702 1800 -150 1819 2 1408 1317 622 659 1483 2094 -1057 2178 -160 799 670 327
2442 327 1159 -105 1479 -715 -14 101 1020 -1830 949 633 -1303 1461 -2099 267 -851 -192 -824
2459 -824 -1338 556 -910 -1223 -1451 295 -2165 529 -1341 -1698 207 -1578 -519 -2294 330 -1588
2475 -1588 -358 -739 -677 -755 -1110 324 -2592 1155 -483 -610 -174 -428 -90 -554 432 -1234 1110 -326
2493 -326 1218 -955 433 1521 -1699 1562 1 1014 493 1139 70 950 1032 65 917 218 2290
2510 2290 -805 1105 796 -209 1422 -188 645 52 2103 -614 490 323 528 390 -807 1371
2526A371k439J950j081n04J53J180r67n63J879k315K410k442J518j113K58J614
2542I09k773K399n64j4j192J768j710J213N16j929K087j671J935k637J666O91
2558F94j231Q44j13L41j244K100k517J548N66p19J9n25J784k020J627j356J260
2575A058q26J071n13j496L114l225J647p72Q70p71L67M57j352J078r86J200j738
2592h17K548j860k42J446k141J370j171J746j862J380n06n85L94j09N88j771K217
2609F25k204J145K13n15k05k37J529k159K034j290R83o35J05K20j416K533j971
2626a245J071l62O56j225P75J80j024J806j610J651j761J817j181l13J813j310
2642b62Q18j026J738k026J521n85r0N43l27P20j533K336j903O32J04j33k2l83
$$ plain form
2526 1371 -1068 882 -199 -703 -550 630 -337 -900 979 -1336 1074 -1368 150 -963 -705 909
2542 909 -1864 535 -29 -43 -1235 533 -1177 36 552 -1377 710 -961 974 -1663 3 694
2558 694 -537 307 194 535 -709 1391 -1126 422 988 269 288 -237 1547 -473 1154 -202 1058
2575 1058 232 1303 790 -706 2408 -817 830 58 928 157 524 981 -371 707 -279 921 -817
2592 -817 1731 -129 -371 1075 -1066 304 -867 879 -983 397 -109 -694 -300 -409 179 -1592 625
2609 625 -1579 -434 -221 -736 -941 -1178 351 -1808 226 -1064 -81 -716 -611 -391 -1807 726 -1245
2626 -1245 -174 -536 120 -1105 -330 -150 -1174 632 -978 673 -1088 729 -452 -765 1048 -262
2642 -262 556 -470 1268 -758 763 178 88 631 304 1024 -509 1827 -76 556 660 527 505 122
2660A22J920k781K248j161K64l68L16J59j315K009j710Q49r13J505j707P16Q50
2677A003j897J848j462J070j527J362p33l44J048r93O21j173J390j456J143k89
2693c89j23N52p56R92j965K453j656N04K40p3J99r22J784k199J555o08P26o78
2711c64Q83m79q41J688j531J328j389J708j211J78Q71j559J413q30J014j404J704
2728A179o82p37J107j052P34j150K102k200J620m33o11O33p62J119k064K476j655
2745c76O22m22Q4n5n93J634k066J594q81M83q98O32R7j158J679j565J446j605
2763a348J523j099j93J515j591J401q62Q13j713K119j314m2R23p07R26j490K028
2780H89j751J029M3n62N72l14J003j758J907j384P77l24K54L59o39J214j941J556
$$ plain form
2660 122 2042 -739 1509 348 612 244 560 719 -596 1413 -297 552 -361 1144 -563 153 1003
2677 1003 -894 954 -508 562 -965 397 -336 -680 368 -625 -4 -1177 213 -1243 -100 -389
2693 -389 -512 40 -716 276 -1689 764 -892 -388 -148 -221 -22 -944 840 -1359 196 -412 314 -364
2711 -364 519 40 -801 887 -644 684 -705 1003 -208 -30 841 -718 695 -135 879 -525 1179
2728 1179 497 -240 867 -185 549 -601 1501 -699 921 488 -123 510 -252 867 -1197 1279 -376
2745 -376 246 -176 -92 -147 -740 894 -1172 422 -459 24 -874 -242 -145 -1303 376 -1189 257 -1348
2763 -1348 175 -924 -1117 398 -1193 208 -654 159 -1554 565 -749 -791 132 -575 351 -1139 889
2780 889 -862 167 210 -352 220 -94 909 -849 1058 -326 451 127 381 740 101 1315 -626 930
2798I30q23Q89r89J102J60j828K047j601J072j116J126q22K35P96j196Q63o24
2815B21J276k326J950o79o01J074j480J246j324J529j612R17k02k63P3k89Q65
2832C75j928K322j751O18o0J37r0q41J343j494J509j347R69q95N47O90k025J934
2850A3r79N63n89J151j160P39Q7j050J370j021K087k572J707k1q62R13n84P65
2868E57o73J333j744J199l50L07l10o17K225k277J629j164N07J10L78l70o75J669
2886A734j786J696j760J205p27j67J064j762J500m52k48r36J829j556M54O69j876
2903a119K057j721J292j525Q58N59j095J7N11J16j152J532k069J732j19r34M51
2920f09o40J889k152J045o22J040p05N81j94p38K097k813J687l84O39m05n45P46
$$ plain form
2798 930 107 996 7 1109 1269 -559 1488 -113 959 -157 969 147 382 1178 -18 845 221
2815 221 1497 -829 1121 442 -159 915 -565 681 -643 886 -726 191 -11 -274 -201 -490 375
2832 375 -1553 769 -982 -364 -424 -287 -377 -1218 125 -1369 140 -1207 -238 -1133 -586 104 -1921 13
2850 13 -966 -403 -992 159 -1001 -262 -175 -1225 145 -876 1211 -1361 346 325 -537 376 -208 557
2868 557 -116 1217 -527 672 322 629 319 -298 1927 -350 1279 115 622 732 1110 740 65 1734
2886 1734 -52 1644 -116 1089 362 195 1259 -503 997 545 297 -639 1190 -366 88 757 -1119
2903 -1119 938 -783 509 -1016 -158 401 -694 -677 -166 -50 -1202 330 -1739 -7 -126 -1060 -609
2920 -609 -1249 640 -1512 -467 -1089 -49 -754 -173 -367 -1105 992 -1821 -134 -518 121 -284 -829 -83
2938h3j42N46r02J100j277K203j822l56K060j773J480j378J075o05P29p34K78
2955C99j95M43O69k357K815j908P85J77p50N82k44O03j673J538q88J122j387O4
2973b05Q39j624K312k260J105k1K66j393R19K12p51J106j881K271j864J087n99
2990d81j005J999j212k68n6J303j190Q65j062K92Q82j261J460j974K577j101m05
3007f37L05J94q0o6Q09j557K234j557O89m68L48P70j758J851q28P21r03R62j541
3026e12J360L88j670J935j609J432r84K02P4k00M14o47L15n55J772k357J322l48
3044C32l87R80j552J293j295J336j319L43M2P13p51o65J548j673J337j414N38
3061e94K04j7K37j120J493j364J372j966K034j137N6J335k069J651r97O90r13
$$ plain form
2938 -83 -225 321 -581 519 -758 1445 -377 -733 1327 -446 1034 -344 731 126 855 121 399
2955 399 204 647 1316 -1041 1774 -134 651 828 78 660 416 1019 -654 884 -4 1118 -269 -205
2973 -205 634 -990 1322 -938 167 146 412 -981 -62 150 -601 505 -1376 895 -969 118 -481
2990 -481 -1486 513 -699 -967 -1023 280 -910 -45 -1107 -815 67 -1194 266 -1708 869 -232 -637
3007 -637 -332 -138 -218 -284 525 -1032 1202 -355 334 -134 214 984 -774 1077 249 970 67 1029 -512
3026 -512 848 1236 -434 1501 -108 1324 340 542 616 416 830 183 498 -57 1715 -642 680 332
3044 332 -55 925 -627 666 -629 707 -612 -269 -227 486 -265 -930 618 -1055 282 -1132 -594
3061 -594 -390 -407 -170 -1290 203 -1161 211 -1755 279 -858 -802 533 -1536 115 -882 -192 -1105
3078a105J339q20Q7L92o60J188j457J798j760Q30O56q57O76l64Q57j347J453j261
3096c55R81l96K93l8r43J963j921J286n48L39n37M90L20j194J311j177J150j152
3114a28R43n09l34Q82q64O62o22P89j592J624n87m70O86j198J686j996J927j215
3132c16L66R5p40N70m57P44j182J445j217O95m98M85J40j198J729j612J223p26
3150d54M80n23M22K35j232J734j256R67j050Q80p26J69O97j094J345j061J215
3167G48j408J363n20m46Q02q63J077j298J443j113O16m69K2K73l20J044j573J445
3185H23j024O08o66K81L20p97J359j695J275q47N41p83O24K12j200J324j017J062
3203D00j274J246j091M76L19j334J430j366J365j386J048q5m69N41m93Q37j313
$$ plain form
3078 -1105 234 -586 -499 -107 -767 421 -1036 762 -998 -168 488 -369 307 -57 800 -547 906 -355
3096 -355 626 230 523 485 -458 1505 -416 870 322 661 124 614 934 -260 1051 -126 1024 -128
3114 -128 815 306 -28 854 -10 652 30 819 -773 851 264 -206 480 -718 968 -1028 899 -316
3132 -316 50 145 -595 -25 -482 262 -920 525 -692 3 -495 -10 130 -1068 661 -951 272 -454
3150 -454 26 -497 -75 160 -1072 662 -594 373 -677 203 -523 -354 343 -751 594 -467 748
3167 748 -660 703 183 -263 539 -324 753 -545 898 -215 401 -68 -46 227 -93 951 -622 823
3185 823 -201 407 -259 22 342 -455 904 -791 484 -363 178 -605 19 231 -969 355 -662 400
3203 400 -874 372 -719 -243 76 -1258 172 -1194 171 -1215 -167 -252 -721 -180 -673 164 -1149
3220a149J393j204P62j30j52K12m26J138j419J679j198O71l68J21M32j093J597
3237H66j734J397o56O80p29J50J034j371J235q13P95r54J161q45M9P27j221J400
3255A171j156J312j487Q89j35k30M45m86Q10j365J656j617P55j74j21J11n81J322
3273A119j781J306m28K46o66P3K25o25J089j497J261p67N77p40n8O51p81P85j111
3292a122J127j439J519r05j25J053j037O00o83J092j098P46l85L29M0l38P64j716
3310a578K261j444M41M72m82N23o88P17q51J343r65P01n34K07Q05j478J700j259
3328a09O74k67M03p88O87L85j077Q73j145J737j338N05J12n96J263j271K11j62
3346I7J022j639J029p71O34L82j328J447j523J581r64n29R45j93n26l11R31j215
$$ plain form
3220 -1149 244 -960 -198 -328 -480 -268 -694 444 -975 704 -494 177 -191 -70 362 -731 866
3237 866 -868 529 -127 553 -176 -26 1008 -363 872 59 854 -100 1061 216 265 992 -229 1171
3255 1171 15 1327 -160 729 594 364 809 323 1133 -232 1424 -193 562 388 267 378 -203 1119
3273 1119 -662 644 216 462 -204 -131 94 -531 558 -939 322 -445 132 -608 -666 -15 -796 -11 -1122
3292 -1122 5 -1434 85 -820 -945 108 -929 -329 -1012 80 -1018 -272 -657 -328 -288 -626 138 -1578
3310 -1578 683 -761 -320 152 -330 193 -495 222 -629 714 -251 450 -84 123 928 -550 1150 -109
3328 -109 565 298 701 -87 600 985 -92 781 -364 1373 35 540 652 56 1319 48 259 97
3346 97 1119 -520 509 -262 372 754 -574 873 -650 931 -33 -562 383 190 -336 -647 284 -931
3364i31J654k004J049K63n14P73j725J714p37K92p94R85p61O05J95j298J858j032
3382d08Q34j107K65N36j47J45n29P49q49J752k256J196L85o63Q41j332J422n44
3400B90L06o43L68j97J003j243l34K183k011J318r10j58J115p32M0o41J158o39
3418B73K78j481J704n05p06J122j515J940j101j77j56Q58o85K13m23l12J614k407
3436a466J919j466O57O25j391P47M9K30p63L89q49J663j052K7O36j227K131j986
3454a127M81M64n5p8J51k85K38Q58j827J592j193J533l97j180J586o17L79n18
3472EK34n10J662j478J30O99q27J489j846J120l0m50L67l98K02M14j48j520K295
3491A410j261O40q33k80J271j243R70p30L80j33N23j239N70K95j251J371j331
$$ plain form
3364 -931 723 -1281 -232 31 -483 290 -1435 279 -458 -166 -960 25 -736 -131 64 -1234 624 -408
3382 -408 426 -681 -416 120 -27 118 -411 338 -511 1241 -1015 181 566 -97 744 -588 834 290
3400 290 596 -47 321 124 1127 -116 -450 1733 -278 1040 130 -28 1087 355 395 -246 912 273
3418 273 551 -930 774 269 -437 685 -830 1110 9 -168 -324 534 -151 62 -361 -673 941 -1466
3436 -1466 453 -1013 -356 269 -1122 -375 -326 -96 -859 -470 -1319 344 -708 -681 -45 -1272 859 -1127
3454 -1127 -646 -182 -237 -315 -164 -449 -211 647 -1180 412 -781 752 355 -825 761 144 523 5
3472 5 239 -271 1391 -87 43 742 -85 1404 -442 678 648 198 565 167 369 783 635 -885 1410
3491 1410 149 789 -44 -324 947 -296 674 -56 324 191 714 -525 45 340 -911 460 -871
3508h71J325p58j1J36l47M62o68N53j124J742j553J000l07o92J488j327Q55r35
3526a032J102q24M44o57O69J65p69J270j662J804q07j26K22k41P19p03N87m33
3544b72Q46r79N80k83R7J022j487J081p96J049o37R6n4K34J74j014J246j001J159
3563A061j335N02M69m22M52p44P42r09J096j183Q81m25l29O76j327J489j535J230
3581C89n31KJ12J2P4q21J235j248J249q86O90m59j62N37j003J102r01P37r16R51
3601A63p17K63L59q59Q99o72Q85o29K16J15j14N3l13J041j206J337j005L58K15
3620C89l57M16o23J131j269J072p46L43l01R7O74q07Q39q74P31n06L45n18P1O66
3640G73j272Q49o36J044r03P55l84n17P30q57O39n21N34n15N98l65m06N11o56
$$ plain form
3508 -871 454 -304 -315 -179 -526 -64 -732 -179 -1303 439 -1114 -114 -421 -1113 375 -952 -97 -1032
3526 -1032 70 -754 -310 -967 -298 -133 -902 368 -1294 510 -297 -423 -201 -442 277 -426 161 -272
3544 -272 574 -405 175 -108 -11 1011 -476 605 -191 858 221 317 263 497 671 -343 903 -98 1061
3563 1061 -274 228 697 275 727 -17 725 -184 912 -271 610 185 -144 532 -795 694 -841 389
3581 389 -142 -140 -28 -16 58 -763 472 -776 473 -413 277 -182 -344 193 -810 292 -609 128 -788 163
3601 163 -554 -291 68 -791 108 -564 321 -308 -92 23 -91 -38 -351 690 -516 821 -184 174 389
3620 389 32 448 -175 956 -313 759 13 356 55 152 826 19 858 -16 715 209 554 36 107 773
3640 773 -499 350 -286 758 -145 610 226 -291 439 -418 221 -300 234 -281 317 -48 -454 57 -599
3659e99Q97j127J267r86L11K6j82J73m48Q04j249R58n05N30m06J8L48n72R21p31
3679e52M22m83P83q13L36N32r70Q55o02J053j050P19k47o0O56q05M97p29J134
3698F76p48N05n2k92O14q53J080j516J501p43K55k14J64J25o17R10j033R13p08
3717c3K54k9k8M22q01R96j071P18o66M25l71j03O67j224J193q20N43o94P35m27
3737c14m21O33n08P13j043J175j094N67J6k78M19o40Q57n52N49o19K46o5L62j29
3757a26m91J051j221R82m61L0J55l76N86n15R72q78N03p10P76l15n2Q16j138J020
3777F08o52N29o62N93l65J5K51k76R37j374J247p25M12J75q56N42j96J16p09J062
3797F72o95O34n30j13N89j109J391j238M87j75K43m67K70R0m84O17j162J273r99
$$ plain form
3659 -599 298 -829 438 -548 -237 -211 -393 -220 -668 136 -1113 -155 -660 -130 -536 -518 -170 -742 179 -552
3679 -552 -130 -613 170 -643 -307 225 -745 110 -492 561 -489 230 -17 -77 579 -226 271 -458 676
3698 676 -72 433 381 89 703 -150 930 -586 915 172 427 213 377 502 -115 795 -238 675 -33
3717 -33 221 192 164 586 -215 781 -290 428 -238 187 -184 -287 380 -844 349 -471 72 -622 113 -314
3737 -314 -735 -102 -610 103 -940 235 -859 -292 -276 -554 -135 -775 82 -470 79 -540 -294 -359 3 -126
3757 -126 -617 434 -787 195 -266 -236 -81 -457 129 -386 586 -292 211 -499 277 -38 -90 726 -412 608
3777 608 -44 485 -177 416 51 66 317 41 978 -396 851 126 538 713 -143 399 203 319 -390 672
3797 672 -23 611 81 -32 557 -552 839 -399 88 -87 156 -311 -41 49 -435 182 -980 293 -706
3816g06N56Q1p29J139o43J37l36M99n06Q91j275K75J230j360Q43j067R11K30m05
3835b35kN27l63l7N10j217J706j158L87J57m63R27j095O42k85O22l09L24q74J015
3855G79J39j280J461j132Q66l49l70L16k59M61m82K26m26J259j631P83Q4p63J274
3874I56j409N12JK09l40J83n58R78l82j014J459j244J129p49n91P57J23j59l74
3893e13L71l19Q96j442J020m23r1J008j812J334l83L6k20K74N1O64o00p84J425
3912D92r97J168j356L58Q35o86J22l0K16j65N43j411J639n13K9N09j443J889j185
3931A4M43q9k82K55M94p51l39J534j747J392j265O42M85j098R45r54P65m0K09
3950F13j446J491o59K9K73j190J686j103K05k05j6M13k47m01J76P69j597J469
$$ plain form
3816 -706 -150 -69 -798 341 -302 -165 -501 -2 -508 383 -892 -617 613 -747 96 -971 -60 170 -235
3835 -235 -237 290 -73 -110 400 -817 889 -269 118 275 -188 739 -356 286 1 623 314 638 -236 779
3855 779 918 -362 1099 -33 833 484 114 430 171 632 150 376 -50 1209 -422 361 445 -318 956
3874 956 -453 59 60 269 -71 112 -446 532 150 -864 595 -649 480 -269 -860 -103 20 -139 -513
3893 -513 -142 -461 435 -1007 13 -410 -501 507 -1305 29 -354 -318 -538 -264 -213 451 -149 -933 492
3912 492 -505 663 -693 -335 500 -186 -64 -94 122 -43 500 -911 728 215 244 753 -690 1199 14
3931 14 457 368 86 341 835 84 -255 1279 -468 924 -341 301 786 -312 633 -321 444 404 613
3950 613 -833 658 -1 28 301 -889 797 -306 -101 -306 -322 91 -156 -557 -381 388 -1209 260
3968B60j099P04K12j042O26k56O64n18l9m4O74p22K52L7o13J700j624O76n5L10
3988A03k8n89P17k34K45q78J067j071J291n65n63J407j031M58l58L66l18P12n17
4007B14n7L15o58J130j521J377l27l84L95n51K89J18L01j007Q11n66Q12q39m5
4026a93R96j190P21p54L75n6K08o49M86J64o82P60j086J081n43R1J89n90N96l67
4046d43L75l48P43r44O62l39L3N52j103R93r72R34m67P1o4J11J57n96R24j056
4066g77J280p23J48J34m08R88p54L72k85O25o55Q02n52JM04q20P60o25N11l34
4086I2L37j15j96O93p09N26o29Q37r96K75J37l58N67p87O59o50R62j061N29j53
4106d0l7J31m93R78j104N82r9j8j97j08L46o57Q83r18J009r00O28n61J56M40q29
$$ plain form
3968 260 -839 -135 77 -965 -339 -595 69 -449 -488 -532 142 -580 -328 -291 -904 796 -828 -152 -207 103
3988 103 75 -514 203 -31 214 -664 403 -668 623 58 -505 902 -129 329 -29 337 19 731 214
4007 214 157 472 -186 944 -577 800 473 89 484 -67 222 340 641 -366 445 -121 691 -148 -193
4026 -193 803 -387 334 -420 -45 -101 107 -542 -56 108 -574 186 -900 181 -362 -271 -82 -672 -76 -443
4046 -443 -68 -416 327 -617 45 -294 -261 291 -812 181 -791 143 -324 -253 -317 -206 -49 -645 279 -777
4066 -777 503 -220 -72 62 -346 642 -112 260 -25 600 -55 747 195 196 600 -220 540 -85 426 92
4086 92 429 314 118 811 102 628 -1 836 -160 115 252 -106 461 -326 333 -317 645 -416 113 -40
4106 -40 -77 54 -439 539 -565 17 -82 -100 -297 -405 -59 -716 167 -751 258 -642 -14 -575 -419 21 -808
4127h08J004o75N25o04O40k47k02N85q14Q62p40P92p53M71k5j68M46n33N96q19
4147d67J125p73L12M8k02O02j004P76m93N57m19K57l52K13K38m18Q12r66P06o14
4167f2M13j07o9O9m01N74n79O83q58O36l49k40O09m67K27m65N90n56K29p5q2M13
4189A33o87N68n58Q13o57J95j43l1L02n60P63o69L79m79L03l97K66K68m44Q69
4209B34o95O44p11O92n87K79J36j78M50o96P19o41O47j06n84P09m25N37n78O39
4229D85n66M48k18L7N38o56P14r52O02k90J09J10p4p9l05O95o22M31o17M92L0
4250C12m59O58r23Q16l60J00l58K73K6J7P7m74P10p83M13p70Q39q2o02K38p0N53
4272A51q28O96r52Q94n32K1O07q95J142p50M48k41J18j99L11k13j52P12j074R99
$$ plain form
4127 -808 196 -479 46 -558 82 -165 -367 218 -596 266 -474 318 -435 36 11 -157 289 -244 352 -467
4147 -467 658 -115 197 245 43 645 -359 417 -76 481 62 319 -33 180 418 0 812 -154 552 -62
4167 -62 351 244 175 244 -157 417 -162 521 -337 299 -50 -290 319 -148 79 -386 204 -352 -123 -198 -280 133
4189 133 -554 14 -544 269 -388 -193 -336 -367 -65 -625 138 -531 -152 -631 -328 -725 -459 -191 -635 234
4209 234 -461 183 -528 164 -423 -144 -8 -186 264 -432 287 -354 293 187 -397 312 -113 424 -154 485
4229 485 -81 367 149 186 724 68 782 -170 432 142 251 361 287 208 -97 598 -24 407 -210 282 312
4250 312 -147 511 -412 404 44 144 -214 59 85 102 179 -295 415 -368 45 -725 114 32 -570 -332 -402 151
4272 151 -677 19 -933 -39 -571 -550 57 -838 304 -446 2 -239 -121 -320 -9 -222 -374 338 -736 263
4292B63l73J49J89o85O80m31M04k77Q34j115J157p54j27O89j076J384q36Om1L08
4312C48K12o11K92l9M16r80J005q34M34J57p36P19k42K80n26L31m59P57j060M92
4332d4J52q21J382j196O25K2k45k39J28K2L0J60r25J474j011O13l86n39J382r43
4352c59K80l54L41o7K51p59M74M33q64J087j526J267k98k82L84m61N53QK0n79
4372d51J243j202M54n0j03J128j105K82j04J38OJ16o65J005m05p07J080q68J172
4391I64n80n70O19l64M08k05l50O1O01j188J039k91l15R82j334O93l20J38k30
4410b42m49K23Q75p07k4Q59j330J310j212K60O32p48P70o75o3L70J98r38Q22l78
4430d47J62M56j141J039m45J05l4J23p1M31k49k87M14n32R86j221R19J24o59O49
$$ plain form
4292 263 -110 39 228 -457 223 -208 196 -81 753 -362 795 41 -86 603 -473 911 75 81 40 348
4312 348 560 -51 241 202 618 -362 643 -191 243 400 -336 383 141 421 -105 226 -233 524 -536 -44
4332 -44 108 -713 669 -527 98 120 -125 -364 -236 -214 -184 -24 -949 525 -486 127 -259 -798 584 -359
4352 -359 -79 -433 -92 -159 92 -667 -193 240 -624 463 -1063 204 -94 -376 8 -453 100 108 128 -451
4372 -451 792 -410 44 -6 -109 1019 -86 196 92 230 236 352 -313 692 287 -420 660 -208 964
4391 964 384 -186 433 69 477 272 -78 -17 584 -604 435 144 -171 811 -523 170 -150 -12 -242
4410 -242 -691 -468 407 -300 -324 535 -795 515 -697 -437 195 -553 217 -458 -521 -151 47 -891 -69 -447
4430 -447 -285 171 -970 69 -376 -271 -305 -182 -253 178 -71 -358 56 -476 510 -711 208 332 -327 322
4450C22m36K92R3J55n53N13l63K22K06p98J161j086N65k7j15N45l85l09K71L40
4470F13p39Q02r94Q69k6r40R83p35M43m02O0j91O49p14K19J24o36J326j270O66
4490A07n69K72K98m24P7k49M84n33P88q54N20j25m75P22n93P32o22o5N38P7n68
4511d62M49K32q24J267j293Q77k78O8j02j21N15o41N24l27M12k82N30l76k51N90
4531E07m60P72p95M86l77L00k21o7K39k60L29p34O40k77O4M3m08M28m33L32j82
4552g4M61o19O72n69J45K59o71J130j004L30k96J10k29J68J21j87J75n81P62n07
4572d04K49k27l5L82o11O13k85L35k55Q2J06OK51p44P53p13Q13q04M42l09J41
4593b14O14n31M80p25P06l87L09j04QJ58l55M52k53J96o36Q00k33j28K67n90P87
$$ plain form
4450 322 -114 178 271 426 -127 386 23 245 451 -347 814 -272 293 266 151 696 311 2 273 613
4470 613 -126 676 -318 551 525 -415 568 -167 276 -126 -66 -257 392 -322 -103 21 -615 711 -559 107
4490 107 -462 -190 108 -316 -239 -488 -4 -537 251 -603 -83 -208 -683 39 -554 178 -444 -509 29 106 -462
4511 -462 -13 219 -605 662 -631 246 -32 36 -66 -187 328 -313 211 -116 296 14 544 168 -83 507
4531 507 47 819 24 510 133 433 212 145 384 124 453 -281 359 82 146 189 -219 209 -224 108 -74
4552 -74 387 -232 440 -129 16 275 -396 734 -270 60 -236 -126 -355 -187 -66 -253 -78 -659 103 -404
4572 -404 -155 -382 -417 -35 -646 -33 -318 17 -238 -156 -50 -44 207 -537 216 -497 316 -488 -46 -355 -214
4593 -214 400 -131 349 -376 330 -57 252 148 156 314 -41 411 158 354 -282 518 285 157 424 -166 621
4614F21o80M73l27N19l52J22J5m90N61m56M96l51Q1j09k05L06k88M53p84O94l16
4635a7p1p9K75k18n11P01o10N78j59K65n42L1J07l16N85o20P14m39O1N11p20N15
4657D1l04M94n27M06l32K84j82M3J25m62Q15r04N97j32R7J5m43O20j79O2k29N26
4679D31m00L37m81K01K30q55J064n60M34q3j14j34J38M1l10M42p11P95o95M77
4699B47r4l76M43p04J029p74L08k12K17o0k61O82r33Q30p12M44m7P7m44m9J94
4720a95k5K98n57P74q40K22OMM80n20K16p1p1k30M07l09K70R3m27Q69o17Q83p55
4743i5J80R5q6L07l77K48k52N80r30M77Mj01O42q80Q77o04J99l62N42m47P1K48
4765C36m48R35j120Q09n18K47L38p76M90l42L16m57L35k96N73p12J96M79r38R11
$$ plain form
4614 621 -59 414 87 606 254 376 391 -99 462 6 502 151 232 123 -82 224 -64 389 -395 299 -17
4635 -17 -88 -167 108 -110 -621 80 -530 48 -111 154 -388 -357 -250 -566 19 -601 113 -326 -265 246 -474 41
4657 41 -263 231 -296 110 -222 62 -120 -77 48 -414 401 -503 94 -38 59 74 -369 251 72 134 -95 431
4679 431 31 368 -113 88 318 -537 527 -33 401 318 204 70 208 249 -61 381 -330 465 -230 247
4699 247 153 -223 220 -484 545 -229 79 -133 84 24 -237 445 -488 342 -370 74 27 104 -340 -389 -195
4720 -195 -220 78 -479 295 -545 -323 -317 -313 167 -353 -137 -208 -279 -509 -102 -411 -141 -48 -475 394 -223 660 -95
4743 -95 85 180 94 401 24 272 20 600 -330 147 151 50 692 -188 689 85 284 -78 464 17 88 336
4765 336 -112 823 -297 512 -6 241 579 -197 293 -49 267 -190 145 -151 422 -290 -94 385 -553 358
4785C58p20L65j40J43m43J55j0K2M30r88J114q28L96M4l40L75m08N99k99M9l57
4806d83Q29q33k0L76n07R52p15J1K16K9K24j03k49J23O47j085Q78m72N15p8o29
4827c74Q73k33N7k28N5o3L94p31L24K93o10J051j081N92Q2m40N44l74Q1M2j12
4848A42m39O85o98O41l86l02P85n81K17l36L84j8m5o94P49O9n46P52j170Q24p6
4869d3n32M44l69L82N3p0m19N61o66Q11o36N4R88j346Q67k53J35K04k03l29N36
4890A69o8l27N38q68J111n85q7L70m86P94m42r7N6L83p72P92l96l7L65n48O15
4911D80n16L89k90K11m7L23m5m55L11p66J258j164J78M51m30M60p03M80q9N7k89
4932a96O28p08L26K89j173J113o18O16l88j9j21J33m06K78K92n31P25r55L30L60
$$ plain form
4785 358 -362 3 -137 6 -437 -282 -292 -270 160 -828 286 -542 -146 -102 -442 -67 -475 124 -175 -126 -483
4806 -483 346 -487 -507 -131 -638 314 -401 -390 -174 -145 79 -24 -273 -150 497 -588 290 -182 333 255 -374
4827 -374 499 266 323 95 150 87 481 -250 74 367 -243 808 -273 319 401 -39 505 131 212 254 142
4848 142 -297 388 -310 331 -55 -357 428 -153 64 -272 112 94 49 -645 104 173 -373 379 -791 33 -43
4869 -43 -575 -131 -500 -118 -65 -135 -554 7 -659 152 -484 -430 558 -788 79 -174 -39 165 -38 -367 169
4890 169 101 -226 312 -556 555 -30 -117 253 -233 561 119 22 78 461 -311 481 85 48 413 -135 480
4911 480 -36 353 63 274 227 550 505 50 361 -405 853 -311 -133 318 -112 348 -355 125 36 93 -196
4932 -196 432 -276 50 339 -834 279 -339 277 -111 -130 -251 -118 -524 -246 46 -485 240 -715 -385 -25
4952b5p1j7n53O86k26K07l83M52m08L37J85o60P52o26L36k88P0J78J08P8l59K79
4974E2l58Q41p98O44j64m78R84j086Q78l60j49L49q1M0k14PM2L50o22N15l19L1
4996A04J72k01J57m52L69k08J86m24O30k71l67P67r32O91l81K25r0Q5k54K42l
5017D5m35O21r58R28m01L46k3m93L31n7k9j70M69o29O40o37K4N11o33N58o12O50
5039D6k11Q1r7j58L18j69M20p11O64n79N62n8l05N57m33K55k93K37J01M59o21
5060F5j44L74m59N59p01P13l00M3M4o4oj90K97n28N78m24J39J74k98L05m06O27
5082C98n82N16m49J72k65K01N6m87O00l27L36m09K38j90p9K61k42K93m26M40o88
5103f33N15%n75R30o84L68j97N04m22K00j10q8N38m78K10j44O7r7J97r3k14K64
$$ plain form
4952 -25 -96 -113 -666 20 -206 1 -382 70 -338 -1 184 -476 276 -350 -14 -302 -232 -54 54 132 -227 52
4974 52 -306 535 -263 381 217 -261 723 -363 515 155 6 355 274 314 100 107 149 499 -123 392 73 104
4996 104 276 75 232 -220 149 -59 127 -297 333 62 -305 462 -470 221 -160 65 -25 60 -194 48 45
5017 45 -390 231 -727 201 -200 146 123 -370 -39 -96 -125 -295 174 -455 185 -452 -428 83 -550 8 -604 46
5039 46 -165 -84 -181 -339 -21 -190 230 -481 183 -396 166 108 -197 360 -73 182 -111 126 227 686 65
5060 65 -79 295 -164 395 -306 407 107 150 194 130 124 -66 231 -297 281 -143 -4 170 -128 177 -229 398
5082 398 -184 332 -117 55 -210 -9 47 -440 160 -167 169 -240 -2 -192 -271 -10 -252 41 -385 55 -633
5103 -633 -118 -118 -693 237 -447 -79 -276 228 -194 6 -104 -192 346 -132 78 -66 1 -96 101 8 -206 58
5125E8k04L76m01N81n64L34M2j17K78l56J64k12N37n20K44o6mL2k05K70l16M74
5147D25l74M2L43m02K96o40O79n43L87k12J05j55q0J85l62M63n27K86j12K1k02
5168c77L69j81k77M14q08J041n50K58j96L5K53m43L73j40J61k92N86l17L7J69
5188A15n42P42n43L77l84M18j68n2K44l73N18m95N26n42K24J2k64L96k96N68m35
5209D6J44l1j55j27L25j05k36R42r78O24k53j68J78k91J91j9K15n66Q41p21P1
5230g3L82m10M38p87N30k50M52m71L34n46L89n9m10N74p64R47o22o5N29l58L65
5251A25l75K75k30K14l00L08j98J63J27p95J057m36J42j24k83J63K34j39k04N22
5271B46o19O83n70K42M64l79L37m57K04J59L5r11R49r1j79L50q18J170j009M69
$$ plain form
5125 58 -146 230 -171 410 -154 180 222 105 383 27 191 -21 516 -4 240 174 170 202 -3 267 -49 425
5147 425 51 93 436 34 330 -310 369 -174 213 1 106 -49 -129 56 -306 157 -370 -84 -196 -175 -377
5168 -377 -8 -189 -466 -52 -860 181 -369 -111 -307 -272 -19 -462 -89 -229 -68 -360 226 -91 -54 115
5188 115 -427 315 -228 149 -235 183 15 -37 207 -166 352 -143 383 -159 65 77 -187 209 -87 481 46
5209 46 190 159 4 -123 202 97 -139 803 -175 449 196 28 206 -85 106 87 302 -264 577 -144 -73
5230 -73 309 -101 337 -450 80 -170 282 -189 145 -401 -12 -71 -481 93 -671 276 -346 -411 118 -240 125
5251 125 -250 25 -205 9 -291 17 -181 -18 109 -686 371 -65 77 -47 -330 -167 67 -72 -276 246
5271 246 -373 310 -260 -18 446 67 404 -53 151 310 345 -566 383 292 113 463 -355 815 -194 275
5291B75k09K70Q1j39j80J0M02o88P79q06L72K70o10O58q81O41pk26m06O52k54
5312Dr3O3m76J299j052J13K13j35l4j32j19N5L65p13O60q39R91k72m06P86n37
5333b59N48p31K44j8M98m12J34j31k15Q66q96L00J35j39R4k92M34O0J23n26O46
5354D63p93R75n78l47Q79o97N35n84P5M12k13P3Q6qj62M64j171R69q9P4k75q7
5376AM28j78j75j91M00o00M32l45P1N85o98K81l26L61lK01m75N3K37l73K62p96
5398h48P61P6j52J82k73L07j47k1j21J61l56M44k49Q7M76n87N01m20K60K07o96
5419d08K61L55j84j49K23n46J086p00J33K42n55P52p70M86r9K52j45J2l10M19
5439C55K9o65N60m42P99l92l02j1M01j44J9N5n04Q43m82K24j27j56J50m85M86
$$ plain form
5291 275 66 336 417 278 98 108 510 -178 601 -205 167 437 -173 485 -396 245 238 12 -394 258 4
5312 4 -89 -26 -502 797 -255 -142 71 -64 -98 -230 -349 -294 71 -642 18 -821 170 -102 -508 278 -259
5333 -259 289 -442 -198 -216 282 -130 4 -127 -342 524 -372 -72 63 -76 18 -274 160 220 343 -183 463
5354 463 -330 645 67 -280 599 -98 437 -147 -72 340 127 200 286 278 116 580 -591 378 289 363 88 1
5376 1 429 251 76 -115 285 -315 117 -228 -157 428 -270 11 -315 46 43 244 -231 -178 59 -314 -52 -848
5398 -848 -87 -11 -163 19 -254 53 -94 -115 -236 -75 -431 13 -236 -149 327 -260 241 -179 81 288 -408
5419 -408 -147 208 24 -125 98 -448 638 -62 71 313 -242 510 -260 226 127 379 234 246 -64 355
5439 355 384 -281 279 -163 636 244 -58 -69 332 188 207 262 -242 601 119 343 216 60 210 -275 211
5460B11k57L92l50J29k81P5P3l88P42q34O01l04q9K49l85M15j45m9j72N08p30
5481e89O66k75N9R3m52Q02n44J29n5J69k27J30L3m92Q32n90N30p12K30J48%L01
5503A86m16J40M8K80m64M60r1n5J35k98M82n94N40m99L93k77K24J16l41M56n39
5524a14L80l66L16J0k00K6N3L2j58J14k92L52k5l42M72m12K36n36M68l14J46J39
5546a5j2J45m75L50m21N03n05L53P7k45K33k86M88n07K27k49L15j24m4J68k44
5567b68N79p92M95l8J7l3N6J25j03K17n34O41n10M25p7k13K65m20M74k11q6m7
5589c8M14o22L99J90n24N77m69L03m73L37P2k49J53J26qj84L64o48L27j14J74
5610A07Rj71K52j35j32l55K92k0p8J80k85L92m15N99n23K53l0k58N89q10N67j89
$$ plain form
5460 211 -46 346 -4 125 -156 -81 -8 -396 346 -488 113 -191 -280 -31 -416 -1 -146 -195 -367 141 -589
5481 -589 77 -198 -139 -46 -498 304 -240 -111 -166 3 -224 -94 -61 -553 279 -311 219 -493 -263 -115 -115 186
5503 186 -230 -90 -42 238 -226 234 143 88 223 -75 407 -187 353 -146 247 -30 194 310 -31 425 -114
5524 -114 266 -100 216 226 26 52 105 137 -21 93 -199 153 128 -214 258 -154 82 -454 14 -300 -154 -15
5546 -15 -27 118 -357 -7 -428 75 -430 -77 0 -245 -12 -298 190 -317 -90 -339 -24 -148 -192 -24 -268
5567 -268 311 -481 14 -24 -7 -40 16 141 38 255 -279 362 -148 277 200 -13 252 -168 306 95 9 -38
5589 -38 376 -246 153 343 -181 396 -73 230 -243 94 166 -83 70 196 188 4 368 -280 47 -67 107
5610 107 116 -55 197 62 -70 -425 -133 -153 -231 -51 -336 56 -359 240 -283 -30 -60 -318 271 -539 28 -161
5632a61K31l65L77m97K10K94k34M26p29O26k07%J05k51K02J58j28m24N39l24M18
5653B66j14j12J65j70L07j18P6l51L36j88J17K23l55N01o67M57j55p6m2j79L62
5674B83k77L50m78P06o77j5L53l70L15m03N10o29K16P4j10j06J63K80n27K23k66
5695c85M88l10J23O6J01j14j94q3k25N75m40L11p5j3K66n95L19n4K28j04J4k73
5717c74K38K75l47M09n78N31n02N08j09k03N14n51P1j02P05k57M3k05l28O56n63
5738a69N69l84K06O5m46K48K42n8l61K08m27R00o33R4Q4k08K20j91J51k19J65
5759E6k80L85n36L67J74o49O73l48L45j54m08J39J41j23j35N09m22M59n28K55
5779h0J57m75N15l86J72o9J13l00L90k02K22J99l99N40n16R2P3k77K80p8J23l9
$$ plain form
5632 -161 70 -295 82 -415 -205 89 -145 281 -448 178 -29 -29 76 -175 27 185 57 -367 172 -152 266
5653 266 152 40 205 35 342 224 300 -51 285 97 214 437 82 583 -84 373 218 142 100 -79 283
5674 283 6 356 -122 584 -93 -108 245 -125 190 -213 297 -332 -116 -42 -152 -258 -95 185 -342 -119 -385
5695 -385 103 -207 -84 -18 83 -31 -225 -308 -533 42 -398 -87 -162 -175 91 -504 -185 -239 -11 -115 -101 -374
5717 -374 -136 139 -208 201 -377 154 -348 160 51 -152 362 -189 -118 -220 485 228 271 66 -262 394 -169
5738 -169 400 16 222 287 -159 89 331 273 -88 120 -307 593 -40 54 138 -70 150 -41 110 -109 56
5759 56 -224 161 -375 -8 166 -483 190 -158 187 33 -375 -236 -95 -218 -353 156 -266 193 -335 -80
5779 -80 77 -398 117 -269 -97 -166 -53 -353 37 -165 57 256 -143 397 -119 -27 46 -231 49 -29 94 55
5801E5L19m37M31p06O35j11j74M57n98L83m5J75j88K03j90K05j76m31R75q86M35
5822C31k93O2L71n10J16k63L40k58L08p51O39K2m42M29o26P99m28j33J19K00j72
5843a40Q7j54k51P04p84P97l37j03M46r06M40K58j79k74L93m70P77m30k75L45
5863e6m65P38o06L91j73K70k93J46j13L20j2o92P36k31R2rm49M91m2j22NJ78m63
5886c59Q24m62j10N76o84Q22q95L46J51K60r6m01P9j1K09n84O33l56P7J45n84
5907d20R77o93J52J2j53l2M64m34k18M57l21L91m15K48K46n40N74m36M6k48M30
5928H7n84P35l11r7R9l17O67o07L57l48J53J21R3j49j28J56m03O83n83K94Q0j88
5950a90M52m36J17mJ35o4L86o81O62r5j76K75m80O80m27J68m45J84j05K1P4K00
$$ plain form
5801 55 374 -63 368 -338 297 186 12 469 -129 254 209 384 196 399 209 414 238 -193 782 -104 331
5822 331 38 100 471 -39 77 -186 154 -104 204 -547 92 114 -328 101 -525 274 -154 -287 -168 32 -140
5843 -140 -53 -207 -458 246 -538 259 -78 -181 265 -641 -201 57 -122 -396 -3 -473 304 -126 -401 -56
5863 -56 -521 217 -389 2 -171 99 -194 -48 -161 159 147 -545 191 -40 52 43 -406 85 43 -79 -74 104 -359
5886 -359 465 3 -107 469 -215 607 -288 58 209 469 373 -28 51 40 249 -335 298 -58 19 164 -420
5907 -420 557 -136 16 28 -125 -157 307 -127 -345 112 -209 182 -233 15 261 -279 295 -141 -95 -343 87
5928 87 -497 238 -73 -170 -71 -388 279 -328 29 -319 -166 -45 48 -101 -229 -73 -476 207 -376 -82 -2 -190
5950 -190 262 -174 -57 -61 74 10 396 -285 377 282 106 381 -99 581 154 322 -123 61 -44 -23 51 251
5972B51J91m85R9j75N8N10n42qr0J79lR3m10N70m39k7M94m32K40m26N23n17L58
5995A2l23l5M27lP0n64O02l13PK41l42M6lK82j12K71l12j63K95m13L15l2K18j92
6019b1n0J7L52j3m75K76k28L47m71P49o23K33J26j04J70m41K49j00K43l52L95
6040B79m5l37J33k58N38k81K71k39k07L26j45K36m71L10k11M05k68K74j53l93
6060b36M01m3M5m64O22m20K03j85P2R9n86O00m81L72k58o6O1J00J92m66L74k65
6082c29M39m47M11k56j96K90j22J94l33M14m39M84k37pL25l62K92k98O22o29K87
6103A03j89o7L67k86L53j33R0k65k7R4j31K00j5O7n7L0j32L46l45J79Ql96N27
6126C21l29L08n90M24K16m14O2oM36n57M96o63M72k12q5J30l07O55m71j4o9J95
$$ plain form
5972 251 442 -43 56 -119 -61 449 -93 -101 -191 -12 -15 78 -332 238 -201 -228 266 -166 74 -352 171 -346 12
5995 12 -311 -346 81 78 148 -416 186 -127 -120 121 -221 -175 -178 104 -8 263 -49 -212 83 -330 -15 -47 171 -21
6019 -21 -71 -54 298 285 -190 86 -142 205 -266 483 -140 93 219 115 285 -156 93 -7 236 -116 279
6040 279 234 -103 30 -228 310 29 300 61 -146 180 35 271 -200 110 -101 304 36 310 157 -236
6060 -236 165 122 167 -297 325 -95 108 -77 -5 94 -492 108 -373 -1 -259 -325 -264 -164 28 -438 -64 -329
6082 -329 110 -337 74 -182 -378 -88 -210 -16 -349 65 -374 110 -127 -134 191 -171 121 -177 445 -184 103
6103 103 -86 -153 214 -72 281 148 238 -27 -54 40 -91 109 94 161 104 134 2 348 3 182 190 -206 321
6126 321 -8 300 -290 134 350 -64 -2 -8 428 -129 367 -296 176 -36 -121 9 -298 357 -114 -128 -197 -2
6148bj78j3pK07J65m78M30m60N6K48l61M91j86J13q3K9k15J26L0m0K49l96M76
6171B01m95O07l06J13k26J7n2k6M12k23K27o40M20m9n5M41l93K58l51L78l10L18
6193B66k5j1j84j69N49p13N47j0k88J25R4p7j63K45n32N87n30N78l21j02K40l88
6215b82N61o66M09j89L38k90K13R6n02M20q91J040m00k84M83n92M28r3J24j5J25
6236C3m16M29l23m5P21o36L81m11J45K74jl59K85r2q1K00o51Q78m40J79L52n58
6258a36N18j32k11LK63m16O76m44oK76n37O68p30M18J00k35k9J77l24K96j14k24
6280a43O56q63N04k80K0L14k66k0J04j54k00O41n43L41Pn16P81p00M80k70j16
6301b23L55j66o4r6q3r7N52n43K37k1k87N07m54N90l18M30m79j9rM25k63j68N98
$$ plain form
6148 -2 -180 -193 -200 7 172 -306 124 -336 -280 -32 -393 98 -88 25 -58 -29 -244 -118 -88 -128 121 -275 201
6171 201 -294 313 7 120 -106 -89 -141 -167 245 22 249 -391 29 -20 -75 366 -27 231 -120 258 -52 266
6193 266 241 230 46 -123 426 -287 260 250 -38 87 181 104 -59 186 -346 241 -289 289 -32 -134 106 -282
6215 -282 279 -387 22 -167 171 -119 94 190 -312 108 -783 257 -143 -427 56 -536 -108 -201 -77 -92 33
6236 33 -383 46 -277 -322 399 -237 144 -267 -122 152 151 -208 77 -15 -96 104 -547 331 -109 70 422 -136
6258 -136 382 250 39 42 305 -111 565 121 115 391 -146 522 -208 210 310 75 46 223 -101 195 81 -143
6280 -143 513 -350 154 -126 -106 208 -58 -78 26 -128 -328 313 -230 111 118 -398 383 -317 163 -107 -223
6301 -223 132 -34 -98 -194 -277 -374 178 -365 -128 -149 -436 71 -383 207 -111 319 -160 -179 -188 237 -26 -194 404
6324D04n86M35j8o09M41j7N8M1j07o6M19n93K83mj78N62r23Q19m37J68j40J02
6346E4p5K66l03K68Q8o75O39o21L53K92l17K47Kj68k49L87n51M20r5j2J17l65
6368b98N19m07j39J60J49k31K41j2l58N72p91O01k14J09K79n60M04j63K72j3p9
6389D1m98M92j05q8L40m19M45n29K00Q1N3M0j58J13K01o2k45M82n32K70k00R2
6411A4L41l36L90l50J17j21M07o22M16j13k06O78m66J98l33K00ll20j9K40P6m14
6433b26M71n46M87Q3m17L58m01L77m32K94k54J26l83L82K00n43M05m66M61q5q4
6454a93Q2j59K82l4K65m55J8K3l0R2j01J70k37L44l01J35J02M2m0k8P7j30P7N1
6478E2K50k69J75j00j90K98k95K76j75M05l15J60l56N0L40l44J39k4K28k34K46
$$ plain form
6324 404 -182 253 235 -374 67 50 108 149 42 -24 395 -198 85 81 -97 465 -458 361 -76 92 -48 54
6346 54 -21 245 -58 210 298 -377 262 -359 -6 286 -31 216 218 50 -199 188 -363 57 -38 -50 67 -298
6368 -298 221 -186 -325 -165 -16 -247 -6 -18 -376 196 -595 6 -208 -99 180 -380 24 -139 133 120 41
6389 41 -457 35 -70 -158 182 -237 208 -321 -121 -40 13 53 -105 8 209 147 -98 384 -148 122 -78 14
6411 14 355 19 409 59 176 55 462 -160 256 143 -63 615 149 347 14 214 211 -109 -128 112 188 -226
6433 -226 245 -301 186 269 -148 210 -191 186 -246 48 -206 -80 -463 -81 119 -424 -19 -485 -24 -109 -193
6454 -193 -111 -270 12 -22 243 -212 -194 -171 -201 -109 -210 -40 -277 67 -234 -99 3 45 5 -23 54 -76 1 52
6478 52 302 33 208 108 -82 216 -79 197 22 427 112 272 -84 -34 306 -38 101 77 305 71 317
6499C17j95j48J14k75M90m21K16j75j43K70j52K57m98M41k20K10Qj52k39N5L99
6520A59m65L25r9p8J2J37O0j47m3j3K90o06O62m79J70%N4K57j59N0l01J46r9L71
6544B04l43qJ47l67M41k77K89j11k0K05k85L52m29N07k20m4l3M5L3k9J06m71N59
6567B51j95L13l46J17r2J86j06P4K6j51J06j62L2p7K39Oj82L22o15M21m67Q13
6589E13k66m38K02m58M64j99O9O3p2k7K6K26L0L9l18J55o7Q7k97K23R0o6Rk24
6613b36L80m24M66m19J59m8q6L23j07J03l87L48j77p7J87j02K80l91L04l03L80
6634A73Qj77J7K4J45k24K81l18L03k33K00K56o54P20m53K1mn0P3L1n5m45N48m16
6658b29O24m43L07ln17M96l28l8P2P6j99M01n82M34j14j27J77n52O64l65K95k39
$$ plain form
6499 317 122 -26 88 -187 303 -118 98 -77 -220 50 -102 155 -343 98 -122 88 96 -56 -295 -240 159
6520 159 -306 19 -80 -158 -146 -9 51 -96 -139 -152 138 -468 194 -285 -115 -115 -61 196 37 87 -214 -68 -167 204
6544 204 -139 -147 0 -367 74 -203 86 -25 -45 160 -125 227 -202 305 85 41 8 53 86 57 163 -308 251
6567 251 56 369 23 140 48 234 128 202 228 77 183 21 53 -24 215 221 39 361 -254 167 -300 513
6589 513 247 -191 11 -447 17 -182 -113 -50 -122 -149 -123 103 133 172 -146 9 -58 29 -268 -45 45 -21 -12 -236
6613 -236 144 -280 186 -233 -74 -122 -208 115 8 111 -276 72 -105 -182 5 -97 183 -208 96 -207 173
6634 173 181 4 21 45 190 -34 247 -71 232 -1 199 455 -199 521 68 89 85 35 108 139 84 -361 187 -229
6658 -229 395 -48 259 256 -261 235 -93 -131 -59 17 -182 219 -363 71 -43 -170 7 -545 119 -246 49 -190
6680a90K31k47J79K49p07L48l20L23j45K79K9j99J46k14R4j46M10l16J61k04q8
6701c27N08n28N00J7l66M44l79J57K7J59k47K70j34M8r8l59O51m24N61j78j68
6722A34P8J30l80J51J4m1M63r69N53q9J49r0k85M7r6M75l22J12k60N51l58m7L48
6745B68n47L91j85j52K06M10l67l3l6J61M0m64N43m65K64o4q2J0k1K91l80M04
6767A92m34K05n6K51j66k28M45m46L47p6m3N2J17j60J70j19k67L74M3n8R5j34
6789A04J95k84L8J7M0M5J97m40K84j39k26N59n08M24o0k86J73k0p3r7L6j11N50
6812D18p02K95Kj03K96l60L06J03j16j18N8l80M30k17j60M65m97L08k04L65r5
6833I4k71K42j69J86k23M79q21M63Q6j12m6j33J43P8j32O9k3n2K33j93l3M53m72
$$ plain form
6680 -190 41 -206 -27 222 -485 -137 -457 -134 -279 0 29 -170 -24 -238 -144 -290 120 -196 -35 -239 -327
6701 -327 181 -347 153 170 -196 248 -131 26 53 212 -35 235 101 149 51 -308 343 -81 480 302 134
6722 134 212 342 -38 113 127 86 549 -420 133 44 193 103 -182 -135 -231 244 -78 34 -226 325 -33 -80 268
6745 268 -279 112 -73 -225 -19 391 24 -9 -45 116 156 -308 235 -230 34 -30 -112 -102 -123 168 -212 192
6767 192 -242 -37 -93 158 -8 -236 209 -237 110 34 -9 43 160 0 170 51 -216 158 201 143 238 104
6789 104 299 15 53 70 110 155 352 -88 196 57 -169 390 -118 306 246 -40 133 113 40 -57 -21 -132 418
6812 418 -284 11 13 -90 206 -154 152 255 139 21 79 -301 129 -88 -248 217 -280 28 -176 189 94
6833 94 -177 65 -104 82 -141 338 -483 -20 66 -46 -92 -225 -82 -4 -136 -67 -90 -142 91 -102 -135 318 -154
6856a54L41k87M05j14l16M80l09K9J65J41m79L45m52K59K97o15M78R3j01j61p9
6877c4J06J15k22nK31k46L36m11K77j28j24K27l35L77j73Lk05L09k61m2m6j51
6899d02N43m72j01K51Q0L06l84J22k63L50n34M09l64L65O7l65K89j63L98j88l9
6920i5N4L27o72L20R2j18K82k06R6Kr7j36J27J0NJ68r2K13m33L78Q5l02L87m42
6944d7N61m12k3J21J2l25L6J89j36N19n70L81k84j33J07j29L73m51J96l7L22k87
6966a7K09l85J20K25k30J4k32M92n06K60Q0P1k39k34M96l91J62j1M8k71N7J93
6988h9j66M03k76K56j39J08k16K01q2l48O10j36j55N9K95n59N8K60l73L86k42
7009a45L27r3O1K36j44n3j17O7j03J04l95M82j46N6K62o00K45j33M53k95J6n3
$$ plain form
6856 -154 187 -100 305 191 -125 355 46 75 240 381 -98 247 -205 54 351 -264 214 307 206 45 -34
6877 -34 72 187 -35 -40 191 -55 281 -130 147 19 -105 122 -213 164 -9 -6 -211 98 -163 -205 -251 -402
6899 -402 141 -331 -432 -181 -101 205 -179 -57 -320 30 -504 -95 -459 -94 -27 -392 -103 -266 132 -56 -95
6920 -95 -41 286 -386 -66 26 -92 190 -16 80 82 -15 -151 -24 -14 -9 159 67 280 -153 225 310 8 395 -47
6944 -47 514 102 79 200 212 -113 -77 112 -24 495 -75 306 22 -111 -4 -133 240 -211 -15 -52 270 -17
6966 -17 192 -193 -73 152 -78 -64 -296 196 -310 -50 30 101 -138 -372 124 -267 -105 -116 -68 -339 -282 -89
6988 -89 -255 148 -128 128 -11 97 -119 82 0 -348 262 126 -29 30 325 -234 -176 84 -289 97 -145
7009 -145 182 89 150 386 242 189 72 139 36 140 -255 227 81 137 399 -201 44 -89 364 69 85 32
7031C2J9J46j61M6j78N26m59J82k25K0K03k40l7j43N01m32J98l10L05m7k21J73
7053a02j24J81k87N10r8k55qN3J29m00O09l85p7K99k75M10l60O1L3K83m19L75
7075A53k82L04k28J97K02l39P6k09J44M1j46J67k66N18k97K63m77M47k82J54j8
7096A22j11J61k38K51m36L77k18J47R0j50N47n79K60k21J30R2k27n2m7L74m15
7117a43L83l93L30j81J15q4k3K71n24M51j44L1j16R3r4j66J31k74N32m03K71k32
7139a69k58N93k75N4q8K57k32J79k22LJ13j95L74m42P26m34j20L6M14j89k59L64
7161B30n33O46n73L72J83l71K41k21K04M2j01k21N90o30J62J14l69L76j0n8J96
7182B69k37P4k58J60n1K6j71L16j65J94l13j03L93n21N58k89R2j2J62n00L40r1
$$ plain form
7031 32 51 197 36 82 -96 430 -29 153 -72 -52 151 -89 -126 -269 232 -200 -2 -312 -7 -54 -275 -102
7053 -102 -226 -45 -332 178 80 -175 -183 -130 -1 -401 208 -177 -254 45 -230 180 -180 -119 -86 197 -222 153
7075 153 -129 175 -53 144 346 7 83 -126 18 59 -87 80 -186 332 35 298 -179 268 -14 140 122
7096 122 11 172 -66 185 -251 126 -92 55 145 -5 542 -37 223 2 132 224 -3 -55 -102 272 -143
7117 -143 240 -153 177 -4 111 27 4 275 -249 202 58 89 -27 66 -28 -194 -63 -337 195 -208 63 -169
7139 -169 -427 166 -109 -55 -143 114 -118 61 -161 -158 -45 -240 134 -308 418 -16 -136 -100 314 125 -134 230
7161 230 -303 343 -230 142 325 -46 195 -26 178 220 119 -102 488 -142 20 134 -235 141 131 73 269
7182 269 32 106 -152 8 -43 -17 -188 128 -37 157 -156 -259 134 -387 171 -118 -26 -38 124 -376 -36 -127
7204a27n9L43k33J03o1j84L09j48L31o1l79L3L31m06M81k56l6L2l52N98k02q0
7226b3r1L35n65N7L50k43N80n97O89m90K71l46k46K26Q4K3j41J69o5R9k77K32
7248C1L48o44M80n22L26K72n0l33K17Lj90K01l05K22k72J13K56p7L54n62J1J59
7270C8J67l11K23k72j3K76k76L41n49L60k66L51q3j02r2K30m5n14P48k72J60j15
7292a6k33N69o72L55M9n7OJ43k33L0L20m30K36l71M14n7J26J0k05K20l09J56J9
7315G0K72n89N70j53j81M1j37M81k21K5k22J33k2J36j56j10L66o12O32l42K4J13
7337A18P8k66K40nk29R2j15K42l28P6K08l18L33l26M59k07l13M12m65M41k61R8
7359c6k39M21n31L20J01r6P6j40K66l94L35k14l5J89p6J07k76J74k25M26m03K90
$$ plain form
7204 -127 -186 157 -76 27 -34 -218 91 -57 274 213 -166 -133 198 -208 273 17 -19 13 -339 259 57 -23
7226 -23 -114 221 -344 -287 63 -180 400 -197 492 2 273 -73 -319 -93 -9 14 -127 42 -23 76 -201 31
7248 31 379 -265 215 -307 19 291 241 -92 125 128 -62 139 -166 56 -216 -103 153 76 430 -132 -121 38
7270 38 205 -106 117 -155 -168 108 -168 173 -376 -16 -282 69 -14 -116 -208 22 -23 -537 211 -61 99 -16
7292 -16 -249 320 -352 3 52 -5 1 144 -89 -59 261 -169 67 -304 110 53 179 189 -16 204 -105 51 70
7315 70 342 -247 323 170 -11 30 -107 374 153 178 -44 89 67 203 47 -63 303 -309 323 -19 5 118
7337 118 196 -70 170 165 -64 28 -87 155 -173 -97 111 -207 126 -200 259 52 -261 151 -314 127 -134 -36
7359 -36 -275 146 -385 -65 36 -60 16 -124 142 -252 83 -131 -166 23 -53 54 -222 -48 -273 153 -250 40
7381D0J29j88%Q5J23j89J4M7o6K7j68L27j55L11k27l8j08L51k18k42J09L1J27
7404A22l95O34k99m3j70kM00j88J21j49K90n23O8K19k76J64N4L5l20L12k77J78
7426d5R0j97%K0K67Lk56k14mM44m49L39j20P4l70N99n22K97J34m10L47j00K06
7449A33l95L11j07K00j10O1J01l26N60p56M67j47N7J62J52j70k02N9P4P6k14j20
7471a34K08j58O9l2Q4O9J26k61K85l14J02M06m51M52m37jo0J24j04pJ12k68J87
7494cj34K57m04L38o9N5j03k03N40m46J25lj83M8K82J9k86L76j73n1k92J92kl28
7518d48L48n9K76m28M50m60M96j14j97L10n14P58n50K48l39L03j71J46J54l04
7538i5J65k19L37j85J85j49P2k0l13M11l41M18l28J40M8k37L62j63K44k53J51
$$ plain form
7381 40 169 -19 -19 66 189 0 14 61 -5 22 -146 181 26 337 110 72 -36 315 97 -145 -36 -5 122
7404 122 -273 361 62 19 -151 -153 247 59 180 31 321 -202 -134 85 -191 -27 27 62 -258 54 -223 -45
7426 -45 45 -152 -152 -132 135 138 -118 -332 -336 108 -341 -2 -122 -48 -418 181 -341 -44 90 -320 27 -73 133
7449 133 -262 49 -58 142 32 93 194 -132 428 -328 139 -8 49 211 363 193 -9 50 124 200 -14 -134
7471 -134 74 -84 -15 -47 37 106 232 -29 256 -58 44 450 -1 451 14 13 -47 77 -27 -34 78 -190 -3
7494 -3 -137 120 -284 54 -15 40 -63 -266 274 -172 -47 -50 -233 -185 97 116 -170 206 33 -18 -310 -118 -120 -448
7518 -448 -100 -159 117 -311 139 -321 175 61 -136 174 -340 418 -132 116 -223 80 -91 55 209 -95
7538 -95 70 -149 188 3 188 39 111 91 -222 189 -152 266 -62 78 126 -111 251 88 332 79 230
7559B30n39L04M3k38k8J35K86k68L62j58k51K3j41K71n9j12%P2l30M91r3j71Q4
7582h7l80N34k18K92m39L13k86K58k4qQ6l68L20O1m3k38J97K79m41N3K03k38K29
7605E5o7j44M15j35k18L91m09J44j90J14K56j18q5J64j51L6L83n67N11k56j88
7626e9K60n28N99m52K60m8j3j54L38j38o6K61k62%j86L36k8n1k27o1J66M6k9j53
7650a89K42k48J91P0k04J61l61M62k81J52R3%k37J92n7m9R1l52N30k78j03K33
7672E8l63K85K27j00k9N3j75J75l33L96J45k32q1P7k57J97J02j24q8Q0n0L84m45
7695i8M62m09j67K45j74M28l48P0P2J55k78J23Mo7L38o18J39%K28L1q5m2K36o6
7719A79k30J57m35K58J7l1J29j76K20k70j22K62j25r1L11k13K2K06j17K63m10
$$ plain form
7559 230 -309 -5 38 -200 -228 -93 193 -75 287 129 -122 -99 -240 31 -28 -140 -140 -68 -398 93 0 -171 -87
7582 -87 -467 67 -151 141 -298 15 -271 -13 -37 -45 41 -327 -7 54 11 -227 -30 249 -192 -139 64 -174 55
7605 55 -12 -156 259 124 -94 297 -112 32 -158 -44 212 94 9 173 22 58 441 -126 385 129 -59
7626 -59 201 -327 272 -180 80 32 19 -135 203 65 -1 260 -2 -2 -188 148 120 69 -158 -219 -53 -7 -36 -189
7650 -189 53 -195 -4 66 -138 23 -338 124 -157 -5 88 88 -149 43 -14 -63 28 -324 206 -72 -175 58
7672 58 -305 -20 207 107 78 131 -44 131 -202 194 339 107 26 103 -154 43 145 21 -67 13 -37 347 -98
7695 -98 364 -45 -212 33 -141 287 -61 9 81 236 -42 81 85 18 356 -262 -123 -123 105 136 51 9 245 179
7719 179 -51 106 -329 -71 -54 -85 44 -132 88 -182 -304 -42 -167 -258 53 -160 -138 68 -49 214 -196
7740a96J38O6k67L03J10l5m43M42m92N76k14L9Oj57L84k67J12m34J59K43j46o8
7762a41J20R3l37N72k40j82L72m01K31J00O9j40j73k06N54l69J28l5Q0P0r4O5
7784A36p5p9J57L3j0j45N9k10M76o38O42k20l21J79j81J82J01k01j72K48k33L53
7806H1l5j48J73l72L24k71k9K60q3J09m1Pq0K15n12K42J72O7P8l39L00l01R4p6
7830a65N4J05j15K15m10L03RJ82j61M2L53n37j18L42k67R2J02k3M9J5n8K54k09
7853E4K1k09K15m8J81k05K81j18k59L21l72N02l36n8M98l99J58k74J47m24K63
7874f1n2J69k47L1Q4o3J67j86Q7K0J37k84JJ78N8N0l17J54j43M47k73k00K59m08
7898c92J26K62J43p0K83m59P7j3j14Q5j57M26j63r5J81j23J28l78K93K4K75o16
$$ plain form
7740 -196 -58 8 -259 44 154 119 -324 118 -374 202 -12 27 33 -124 260 -7 105 -329 -170 73 -73 -141
7762 -141 -21 72 -265 307 67 -115 257 -144 87 187 256 116 -57 -263 291 -78 50 15 95 165 71 136
7784 136 61 -18 139 172 162 17 76 -134 342 -296 346 126 -195 -16 -197 -15 86 -115 -287 -39 -272 81
7806 81 46 -102 71 -301 23 -248 -277 -17 -100 9 -32 -25 -105 110 -402 -160 12 79 157 -182 118 -183 -89 -165
7830 -165 -111 -6 -121 94 -316 -13 -4 178 17 59 412 -125 -243 99 -168 -76 26 3 52 67 9 263 54
7853 54 75 -134 81 33 214 9 290 172 -87 234 -138 364 28 -30 468 69 227 -47 100 -324 -61
7874 -61 -113 56 -191 -160 -76 -139 28 -158 -71 -51 86 -198 -197 -19 39 89 -228 -74 -217 230 -43 -243 16 -392
7898 -392 -266 -4 139 69 352 -107 -30 -43 -157 -72 -229 197 34 -61 120 -3 125 -253 40 64 339 -277
7920b77L40K96o25M36k56L40l09J52q5K20l17J85j42j6K60k75K00j49R6K33l60
7941e3J00R4p0l93L90j95J78j84J37J81k47K07p3j37o8R1k4J0LO0P7k24J1j36
7965b65L12R2k23p8m3L31m21N94k91K30l81N4K07k62L1rK68r8j4k19J47o6K85
7988A81k39k17M51k46J52l6j80K87j50J54j22L24l68L04j71k8Q8j74NM3J24l13
8010a31M7J87J0j16M9K67m83K06J4k95M11m47L73L1m1k32L67n38N65l88m4L23
8032A35j47N3l09J05K98m04K13J9P2l16J89k04M56m03L93r8k81K98j40L14m81
8053b38M29l29k2J45O4o8j0K29k94J92j82L40m2l62M83j10J17k02j12j54qQ8l
8076d9J00j35J58r9J53j89J82j30J36k61J93M6l3K14k98K27J7l01L4k25J49J6
$$ plain form
7920 -277 63 359 -266 170 -86 254 -55 97 12 232 -85 100 -42 -58 202 -73 127 -22 74 307 -53
7941 -53 47 141 71 -322 68 -127 51 -133 4 185 -62 145 72 -65 -133 -42 -66 -56 -53 7 84 -140 -129 -265
7965 -265 47 139 -84 -162 -205 126 -295 299 8 238 -143 -89 118 -144 -113 -122 146 48 34 -185 -38 -104 181
7988 181 -58 -275 176 -70 82 46 -134 153 3 157 35 359 -9 295 124 96 184 10 15 58 182 -131
8010 -131 -84 103 113 -3 46 313 -170 36 50 -245 166 -281 92 123 82 -150 217 -321 244 -144 -188 135
8032 135 -12 41 -268 -163 135 -269 -56 -37 35 -281 -92 -296 160 -243 150 52 -229 69 -71 243 -238
8053 -238 191 -138 -160 -15 49 -19 -29 200 -94 98 -84 256 214 -148 335 225 342 140 28 -126 -134 -46 -49
8076 -49 51 -84 74 -25 128 -61 121 -9 127 -134 59 105 72 286 -12 215 232 -69 -35 -260 -111 -95
8098i5J55j51Q2k18Q1J53k16K25l2l0rL4R1ON8m53N07l31K50j98PJ11O6%n35M18
8124b4k73K28r3L63k01n5K11j62K50m29K64j69L28q5j49J27j48K53l95Q9l04M78
8146A04j50J70J52m03L07l50L92k67j22J24J73o0j31K33j99K36l43oJ95K7R1j18
8168E5j2j04K17l09K13L3M9J8m35N87l13m6q7N5R7p2J14n1J08n59N62l76Q6
$$ plain form
8098 -95 60 -91 -9 -227 -146 7 -209 16 -16 -46 -55 -21 70 76 134 -319 188 -143 107 -91 -84 27 93 93 -442 -24
8124 -24 -297 -69 -162 201 0 -55 156 -6 244 -185 79 -90 238 153 4 131 -17 236 -159 -70 -374 104
8146 104 -46 124 276 -127 180 -170 222 -45 -167 -43 130 70 -61 172 -27 209 -134 -140 55 82 173 55
8168 55 43 -61 156 -153 60 93 142 160 -275 312 -1 -47 -134 -79 18 -54 60 9 117 -442 120 -256 -170
8191a70
$$ Imaginary data points
##PAGE= N=2
##DATA TABLE= (X++(I..I)), XYDATA
0@%%%%%%qJ6j6K4l2L4m2N6q0J04j28J60j92K28k76L28l85M57n37O26p30Q46r75
29e22J122j283J460j659J879k121K390k685L009l365L752m176M638n143N696o300
45c308O959p679Q468r329J0272j1311J2457j3723J5136j6719J8498k0515K2826
58A2032k5505K8649l2402L6972m2674N0014n9847P3753r5004J31679k11685O61623
70E27605j68256p85364R50347p28052M62490J21552n42199L79706k01610J60220
80A76439K76690p04515L35067O4142j92659L60404k69714j69526K67455o158k03887
91f6262J39618m1775k30007L95533j17506j15293O935j09015K63536k18219J3609
102g8846K10962m07409L69472M8268m55744M06144k35247L1123K34158l19591
$$ plain form
0 0 0 0 0 0 0 0 -8 8 -8 16 -16 18 -24 32 -48 56 -72 88 -104 124 -152 176 -209 248 -289 337 -393 453 -522
29 -522 600 -683 777 -882 997 -1124 1266 -1419 1590 -1775 1977 -2199 2439 -2704 2992 -3308
45 -3308 3651 -4028 4440 -4889 5383 -5928 6529 -7194 7942 -8777 9721 -10794 12032
58 12032 -13473 15176 -17226 19746 -22928 27086 -32761 40992 -54012 77667 -134018 527605
70 527605 359349 -426015 524332 -203720 258770 380322 -161877 217829 16219 176439
80 176439 453129 -251386 83681 147823 -44836 315568 45854 -123672 143783 137625 -66262
91 -66262 73356 31581 -198426 197107 79601 -35692 -28757 -137772 125764 -92455 -78846
102 -78846 132116 -275293 94179 142447 -313297 92847 -142400 -111277 122881 -196710
112a96710K86136k10011K9492J97790l72892K82996J8645k26930K55816p0013
122e681p4963O3149o4108K9057j2297J37787j16924m4228J47982j29204J18300
133D8870j63973P3992J11897k08852L19750k23471j30562L51329k92193N8472
143e4741J62337k21051J84346q2591J2880P3221k41251K43553j01271l0020J91307
154A36719k01754M6208L5753K453l9610l0893R1416q2780Q1463O9219k18323R3038
166a7091O9967r2224N8806l4257O7411j01791R1471O6282k74163K09249q853q0949
178d6142J26905q7886K5301l7805K4119O4450j71187J29246M5333j61363K20888
189A31859j31602j03029J54383o1326K9671n2073P1818l9395l7965J37370j63869
$$ plain form
112 -196710 89426 -120585 -91093 106697 -266195 16801 35446 -191484 64332 -5681
122 -5681 -80644 -17495 -81603 -52546 -64843 72944 -43980 -88208 59774 -69430 48870
133 48870 -115103 -41111 70786 -138066 181684 -41787 -172349 178980 -113213 -54741
143 -54741 107596 -113455 70891 -11700 1180 74401 -166850 76703 -24568 -54588 136719
154 136719 -65035 -18827 16926 19379 -20231 -51124 40292 -42488 38975 108194 -110129 -17091
166 -17091 52876 -39348 19458 -14799 52612 -49179 42292 108574 -165589 43660 34807 -46142
178 -46142 80763 -7123 18178 -19627 4492 68942 -102245 27001 72334 -89029 131859
189 131859 257 -102772 51611 -9715 19956 -32117 39701 306 -37659 99711 -64158
200f4158r067J16310l9115J502j9109K7704j3783p0875J53040j40459l5148K19432
212A26274j96654P8796M1533j28319P5566j2688L1545m3294L339P8517q1339P832
224a8892N6065j07996M3392P4809m5377k8603K9849M6423j24050R1961M497j04118
236h2040J32481l1594k0139r443J0435J0087n8751Q0406k0802p1071J32339n0867
248B1041q2964R5670o3582L6671j9614K1741L3619j19817J57859p9213r5053J53074
260E9432p8011o616P6816o4872N893P625q70P331o5418J02101m1636l0406R6638
273F8007j02758M383M2340R955n3809J9318P0007q5650L1678L7519q5625K1356
285b3279O2818l9193l853Q806L0615n6042J1213O0846j23647R9894J4055o3561
$$ plain form
200 -64158 -73225 43085 3970 5472 -13637 14067 284 -70591 82449 -58010 -93158 126274
212 126274 -70380 8416 49949 -78370 -2804 -15492 16053 -27241 -23902 54615 -26724 -18892
224 -18892 37173 -70823 -27431 47378 2001 -26602 3247 49670 -74380 17581 22078 -82040
236 -82040 50441 18847 -1292 -10735 -300 9787 -48964 31442 10640 -60431 71908 21041
248 21041 -61923 33747 -29835 6836 -12778 8963 42582 -77235 80624 1411 -93642 59432
260 59432 -18579 -25195 51621 -13251 -7358 267 -603 6728 -58690 43411 1775 -28631 68007
273 68007 -34751 -30368 11972 21927 -31882 -12564 57443 -28207 3471 40990 -44635 -23279
285 -23279 39539 346 -3507 5299 35914 -20128 -8915 51931 -71716 28178 42233 -21328
297b1328N8217m4591J4883j8324K0338K3905p8715P5489M0166j28260Q4943M295
309C1018q6558Q9245j6503o730k4639M4341k686p1179P4483l5617r433L6672m94
322B1920j9903k0283M7460l2141m0142R3784o6618k6470J32451j29821K0376M6301
334B6914n7655M4195m7371P1502m3064l4985J02851r9429m126Q1379p3598K2561
346a0826L9468m2348N609j1831M9797p1288J3381P8084r8684O1405L525l9146
358b2854L608J6588J7340o1760O1195J0288o8262O5659j4949n7343O8771l0194
370a1913J0404k724n0L7477j03001J10631l1193r0482J36460n6811k3528M2639
382A7909k0168l779j5468L2598R17n6006P9770k3215m6238O3724m9501J6250j751
$$ plain form
297 -21328 36889 -7702 7181 -11143 9195 33100 -45615 29874 70040 -58220 26723 31018
309 31018 -55540 33705 17202 10472 -14167 30174 27488 -43691 30792 -4825 -14258 22414 21920
322 21920 2017 -18266 29194 -2947 -43089 50695 -15923 -42393 90058 -39763 -19387 26914
334 26914 -30741 13454 -33917 37585 -5479 -40464 62387 -37042 -41168 40211 -33387 -10826
346 -10826 28642 -13706 -8097 -19928 29869 -41419 -28038 50046 -48638 12767 16292 -22854
358 -22854 -19246 -2658 14682 -47078 14117 24405 -43857 21802 6853 -50490 18281 -11913
370 -11913 -1509 -4233 -4283 33194 -69807 40824 9631 -80851 55609 -1202 -24730 17909
382 17909 -2259 -6038 -21506 11092 12009 -43997 35773 12558 -33680 30044 -19457 -3207 -4958
395d958K3545k0597k0858P9461r1037L1030L8968p2593M6172J4089j8960l682
407E80n343M4559o2169K042Q8978j14647O1930L1028p2008N1615l5668L3153l2507
420h457J2404M8579q7457N7366K3126p6061M9261l8k7934L4089j3872J1887m3886
433b0993N1603L512q7184J01582m2671j5148L9621l0073J4406l1694M3733j8073
445H621m7909Q6761l9195m6427Q5681n7532o735L1791k3292J6616l0428N8444
457C6396n2097j2537O9968p1298J9312J5482p481n219K080K2128n1533K2676M9254
470C7131q7997M2025L8784p2436N9168l5407R464L01j8949O2688r4768O0160L4362
483C4526r6464O6562j353m1781M0896j7061Q45L140j895K2639o4433N8984P416
$$ plain form
395 -4958 18587 -2010 -22868 56593 -34444 -3414 35554 -37039 9133 23222 4262 580
407 580 -4763 39796 -22373 -20331 68647 -46000 15930 46958 -25050 26565 -9103 24050 -8457
420 -8457 3947 52526 -34931 22435 45561 -30500 18761 18723 -9211 24878 11006 22893 -20993
433 -20993 30610 34122 -53062 48520 5849 -9299 30322 249 14655 -17039 26694 8621
445 8621 -39288 47473 8278 -38149 47532 -10000 -16735 15056 -8236 8380 -22048 36396
457 36396 -15701 -28238 41730 -29568 -10256 5226 -2255 -7474 -5394 16734 -34799 -12123 37131
470 37131 -50866 -8841 29943 -42493 16675 -18732 -9268 -8967 -27916 34772 -59996 164 34526
483 34526 -61938 4624 3271 -38510 2386 -14675 -13830 -10690 -12585 10054 -54379 4605 12021
496A2021o1807N1305p176k202j3470K6842k7259j2136O9684o4477j419N0092k9565
509i567K627l644j58J8308l5781N7325l8353l2813J07247j00091K2553M2922n8137
522b7562M6428j9580R264l461j3899M0527m4459q38O2235o6465J3903M1774m3160
535e293J2625k221J2073l0902L4778R093o0695N5270l837j7400r552R646J6928
548B0513k8692K9760j0242m4040P1531k1375o0091P1356l3719J1283M175k2080
560a1621K9870m6005N5837k8628m0169P9013l7666k4269M2425k0113j0953J2267
572a2Q62J905j9718M2704l3852j3476N3252m5723M621Q539J6510j8393j556K6002
586B1665m4799L2353J3810m5158K1007K4373j9277K93o564J5949k0821J0476L1681
$$ plain form
496 12021 -49786 1519 -5657 -7859 -21329 5513 -21746 -33882 35802 -28675 -30094 19998 -9567
509 -9567 -6940 -10584 -10742 7566 -28215 29110 -9243 -42056 65191 -34900 -12347 30575 -27562
522 -27562 18866 -714 8550 5089 -8810 31717 -12742 -13580 48655 -17810 -3907 37867 -5293
535 -5293 7332 5111 17184 -13718 21060 30153 -30542 24728 20891 3491 -6061 3585 20513
548 20513 -8179 21581 11339 -32701 38830 17455 -42636 28720 -4999 6284 10459 -11621
560 -11621 18249 -27756 28081 -547 -40716 38297 631 -23638 18787 -1326 -12279 -12
572 -12 850 2755 -16963 25741 -8111 -21587 31665 -14058 -9437 -898 15612 -2781 -4337 21665
586 21665 -23134 9219 23029 -22129 -1122 23251 3974 4267 -2297 13652 -7169 3307 34988
599C4988p4162O3872O613n2279L5920j7464J3122j2554P736J4971l8869L4652
611A6546R374o1488N2214m95m0631M4772k1327J0357j6571O832J0261l7851N0100
624B2093k2538k4756M2085m527l4899J5481J2270j7796Q012J3044j8563p510M0109
637B2505l5630q377J9240L855m301j4797M1027m9396J6346L4932o1682L2593J8187
650A4502k9290J7627K57p267j021j1712M0276m3168R631M7707o9984M3136M083
663A4777l4732J8160N823O231j7154J4106L638k3971J8439J0741m0039K8979J4847
676A9845k0410Q20L352M050k7842M3349k3378k1663M9391k3495o085j507O803
689C230m591p978K5255j3101k1507M3998k5408k4355M4546l5768J2319R924K68
$$ plain form
599 34988 -39174 24698 31311 -20968 14952 -2512 10610 -1944 5792 20763 -18106 16546
611 16546 25920 -35568 16646 16151 -24480 20292 -1035 9322 -7249 -417 9844 -28007 22093
624 22093 -445 -25201 16884 12357 -22542 -7061 5209 -12587 -4575 8469 -10094 -17604 22505
637 22505 -13125 -21502 -2262 1593 -2708 -17505 23522 -25874 -9528 25404 -36278 -3685 14502
650 14502 -14788 2839 3096 -4171 -5192 -16904 23372 -19796 -10165 37542 -32442 10694 14777
663 14777 -19955 -1795 4028 10259 -6895 7211 10849 -13122 5317 16058 -23981 4998 19845
676 19845 -565 255 3607 7657 -20185 23164 -214 -21877 27514 4019 -2066 -3573 3230
689 3230 -1361 -9339 15916 2815 -18692 25306 -102 -24457 20089 -15679 -3360 6564 6832
702F832q224j6521L8095l5474K547K5981k5363N612K3084j8402j6096J4653Q446
715E170j7256K037L1100m2811K4085J3950l9538K0527l981J4580j8430J3103J2387
728A4923l9816L1878M362l7418K6849J2394k1983J8044q581J307j4653J6131J1168
741A4605m2409M9373j2345j9654K3071j1569p095o41K2966j3624r998K6364j2697
754F347k1942L3829k1728q626K8097r896K225j7482K8622k4908r220L8880l8520
767a4322J4397J8953j7508o667P327P98j1702L931K2645k5897J467L2213m5435
780a9800J7135M673j0235O934P59J7443l7944K4457P481l5619K3462O668j5918
793a0504J2827M685j1362o819M678J5741l4361L2914K787l3305M0198k1541o981
$$ plain form
702 6832 -1392 -17913 20182 -15292 -12745 13236 -12127 -6515 16569 -1833 -17929 -3276 5170
715 5170 -12086 -10049 21051 -21760 2325 16275 -23263 -2736 -6717 7863 -10567 2536 14923
728 14923 -24893 6985 11347 -26071 778 13172 -8811 9233 652 1959 -12694 3437 14605
741 14605 -27804 21569 9224 -10430 12641 1072 -6023 -6664 16302 2678 -7320 19044 6347
754 6347 -15595 18234 -3494 -12120 15977 6081 8306 -9176 19446 -5462 -14682 24198 -14322
767 -14322 75 19028 1520 -5147 2180 2978 -8724 -4793 17852 -8045 -6578 25635 -19800
780 -19800 -2665 2008 -8227 -1293 -534 16909 -21035 3422 10903 -24716 -1254 5414 -10504
793 -10504 2323 7008 -4354 -11173 -6495 9246 -25115 7799 10586 -22719 17479 -4062 -11043
806a1043J567J0968J006j5169K7615j5023j6609K8594j2693k2220L2448o510k699
819B32M13N349o416k0237M1462l0805J148K6697k0640O097p77j9j5761J1729J7878
834A6350k2601K844K5404l2877P891J5722k8993J7134J279J4603k4658M728K2531
847A9357m3153K7070N310k0631J4337Q763r807o006L023J303j1556J5701J0079
860A3790l3860L4925r947j7393J3395o684P457j2497K9344j6372j8087L1911j8803
873b821j2024K1374m043n689J1371j225k893k0012K9822j4355j5349M1269l0921
886e496R616P276j1309l714K41J6121j5709M863J6820j8746n464K1399k3703L871
900c934J4109m944j759k7J3021l4140K2743N673k4071K0951j479J678j1551P303
$$ plain form
806 -11043 -9476 1492 2498 -12671 14944 -79 -16688 11906 -787 -23007 9441 2931 232
819 232 645 5994 -422 -20659 20803 -10002 -8854 17843 -2797 3300 2523 2504 -13257 -1528 16350
834 16350 -6251 -3407 21997 -10880 -2989 12733 -16260 874 2153 16756 -7902 -3174 19357
847 19357 -23796 3274 8584 -12047 2290 11053 1246 -4760 -1737 -434 -11990 3711 13790
860 13790 -20070 14855 4908 -12485 910 -5774 1683 -10814 18530 2158 -15929 15982 -2821
873 -2821 -14845 6529 2486 -3203 8168 6943 4050 -15962 13860 -495 -15844 25425 -5496
886 -5496 4120 11396 87 -3627 -3386 12735 -2974 1889 18709 -37 -5501 15898 -7805 -3934
900 -3934 10175 5231 3472 3445 16466 -17674 5069 10742 -13329 7622 6143 7821 -3730 3573
914C573j389j8014K2614N652l1162K9677K555l0252K4040j7728R873k702L929
927F66J0447k8231K9505j2627j8611K2875m021j1185J8206k699j1348M410J221
940a392l245j1505K8958j5295p149J9159j0936m775n701J9377j9624J0448J8126
953A6446k8946J0876P963j4519J426O081j081O672p406J3490k2870M205K6706
966A9043m3549K8454P141j6888J1675n900L70p763P449N108j2015R940J5374l1130
980a2691J2462Q911j8248J0544p29O630r885J5937j3355j3729K3317r051l556
993c443R01J3937r476n592J0281j3862k899K3817j5220r040K6968k1120N327n971
1007e392K407L519j2126K8798k5647K433K0303k6119R08J7258j1702J826P396
$$ plain form
914 3573 2184 -15830 6784 12436 -18726 10951 13506 -16746 7294 -10434 -561 -3263 666
927 666 11113 -17118 12387 -240 -18851 4024 3 -11182 7024 4325 -7023 -2613 -1392
940 -1392 -4637 -16142 12816 -2479 -9628 9531 -1405 -6180 -11881 7496 -12128 -1680 16446
953 16446 -12500 -1624 6339 -8180 -6754 -673 -1754 4918 -2488 11002 -11868 -7663 19043
966 19043 -24506 3948 11089 -5799 5876 -24 346 -7417 32 5140 -6875 3065 18439 -12691
980 -12691 -229 8682 -9566 978 249 6879 -3006 12931 -424 -14153 9164 113 -3443
993 -3443 -2542 11395 1919 -3673 6608 -7254 -10153 13664 -1556 -10596 16372 -4748 579 -5392
1007 -5392 -2985 534 -11592 17206 -8441 -6008 14295 -11824 -10916 6342 -5360 -3534 3862
1020C862l871L47r869J6712k1676P735K2172k5863R665L956j723j0661Q558j074
1034a730p123J9209n559j2966P067J0055j6116K568N588L923o378R974k762k2767
1048a7017L3352j8808o071J6427n081N136j0605R151n379r071J6043m642j3064
1061i629K8113j5649j1270J9591j6121P567p425J1350k428p735J6819k0595J470
1074e942J2822o220r922J5793r91q751N004j470q175L108J5077j9461R208M098
1088D178k598o218k993J4125k1521K1688p92j8288J9257m072j1960O434K705p95
1102h50O82j509J2166k2160J4915L047k5032L0078q722n129N028K311l166o824
1116e165Q504l817j165R463l3j5690J6357m086j0073O791N072l030n647J8546
$$ plain form
1020 3862 -9 338 -9531 7181 -14495 -6760 15412 -10451 -786 3170 1447 -9214 -656 -1730
1034 -1730 -8853 10356 4797 -8169 -1102 8953 -7163 -4595 993 4916 -1462 8512 5750 -17017
1048 -17017 16335 -2473 -8544 7883 2802 7938 -2667 6484 1105 -7966 8077 3435 -9629
1061 -9629 18484 2835 -8435 11156 -4965 2602 -4823 6527 4099 -3636 13183 -7412 -5942
1074 -5942 6880 660 -9262 6531 5540 -3211 1793 323 -7852 -4744 10333 -9128 80 4178
1088 4178 1580 -4638 -7631 6494 -15027 6661 5869 -12419 6838 2766 -9194 -2760 -55 -850
1102 -850 -168 -1677 10489 -11671 3244 6291 -18741 11337 2615 -2514 2514 4825 1659 -5165
1116 -5165 3339 -478 -1643 7820 7787 -7903 8454 4368 -5705 1086 6158 3128 -2519 16027
1130A6027k1492M454R639j2503N064J08Q512j1818L301P271j4272K164J3737j7281
1144g089P686J1991k0608J1718o438N117p834J412J4760k1008J4122J558j5196
1157i809N409Q701j0311J435P098l051k854O94M235j5463J6362j521q636R070
1171A359k062O12j0849J5475j0927l199J7478j0613l103Q995l556q541R031q12
1185g12K52o044J5012q127j1079K0939j8799O753N587l377j052R75P080j2593
1199e185L623N781o421l10J3576j3898J817P410p996J007j274J0942j5591J1740
1213E221L481j6567J1083q44k531l110R211l464m623O526l31j2072R526N447j5707
1228h754J5684n327j479j511K985N64j1798J7984q386l149Q069l583o591O475
$$ plain form
1130 16027 -5465 -1011 8628 -3875 1189 1297 9809 -2009 1292 8563 -5709 -3545 10192 -7089
1144 -7089 597 12588 -8020 3698 -2740 2377 -5457 -4045 10715 -10293 3829 5387 -9809
1157 -9809 -4400 4301 -6010 -4575 2523 -528 -3382 -2688 1547 -13916 2446 925 -7711 1359
1171 1359 -703 -91 -10940 4535 -6392 -9591 7887 -2726 -5829 3166 -390 -8931 100 -712
1185 -712 -460 -6504 8508 381 -10698 10241 -8558 -1805 3782 405 -647 328 7408 -5185
1199 -5185 -1562 4219 -2202 -2512 11064 -2834 -1017 6393 -1603 -596 -1870 9072 -6519 5221
1213 5221 8702 -7865 3218 2374 -157 -3267 5944 2480 -2143 4383 4052 -8020 1506 6953 -8754
1228 -8754 6930 1603 124 -1387 1598 2162 -9636 8348 -38 -3187 4882 1299 -5292 1183
1242A183J452p395M692L553j188q846J5045j2653j812J3505j1065M000p17O899
1256F653j0810J804Q811j2380M268Q294o919k915R987r574J965O22K985n170J112
1271a267J2119j9181J1186O78p871L979K668L5o496J0071m147o459N307L898j2114
1286g594J0246K703j0518P307k723K725r767J0945k369r044J5368q965k742L814
1300f14K146p146L744L569m304k063P021k976j0134J6013j0696J196M574j950
1314a620j236l215J1293j4027M428P054p462R95N789n071k840P305m164l31j189
1329d291J0198j1934L923Q612j5785J0786j016n89k417M840Q01p068P573r12o320
1344c599M199P827j2318P110J258l592L58J682K827j0832J4652n571m941P123
$$ plain form
1242 1183 2635 -4760 -68 3485 2297 -6549 8496 -4157 -5969 7536 -3529 471 -246 6653
1256 6653 -4157 -2353 6458 -5922 -1654 6640 -279 -3194 6793 -2781 -816 -194 2791 -2379 -1267
1271 -1267 10852 -8329 2857 3535 -4336 -357 2311 2346 -4150 5921 1774 -4685 622 4520 -7594
1286 -7594 2652 5355 -5163 2144 -579 2146 -7621 3324 955 -8089 7279 -1686 -4428 -614
1300 -614 1532 -5614 -1870 1699 -2605 -4668 2353 -623 -10757 5256 -5440 -4244 330 -1620
1314 -1620 -2856 -6071 5222 -8805 -4377 2677 -4785 -3790 1999 -3072 -5912 1393 -2771 -3102 -4291
1329 -4291 5907 -6027 -2104 6508 -9277 1509 493 -96 -2513 2327 3128 -3940 3633 2721 -3599
1344 -3599 600 8427 -3891 3219 4477 885 1243 2925 5752 -5080 9572 4001 -940 6183
1358F183l396k91k075P078o647P7O544l960o665J1086o025n220J1572r403M242
1373C100l671O120n071n201J3195j2678K771O554n349l688P479m646k046L183
1387E2l49j471k565J0887j3261L806N503o864J821K96M311r303J0057k725p755
1402g560Q099M81m905J728M385m511J568l32L862j0009R924J622j3608J7234q852
1417h74j026L286l85Q0l144N896k066l461N760mj1122J3649m289n485P272l385
1433G02J636m166P619q696J207P607o374o27K101L790r068N407J174n867L825
1448B70N073r421K903O653j0451N707l730N465m602K2Q017j3992J0875k78r468
1463f957O931L527o901K695R88j259L11k756P257j1156J0258J162j1286Q957j159
$$ plain form
1358 6183 2787 2496 421 7499 852 929 7473 3513 -3152 7934 1909 -3311 8261 -1142 3100
1373 3100 -571 5549 478 -4723 8472 -4206 -1435 5119 -230 -3918 3561 -1085 -3131 52
1387 52 -297 -1768 -4333 6554 -6707 -2901 2602 -4262 -2441 -2145 2166 -7137 2920 195 -7560
1402 -7560 539 1020 -3885 -2157 2228 -2283 -715 -1047 2815 -7194 2730 4352 -9256 7978 -874
1417 -874 -1900 1386 1001 1081 -2063 3833 1767 -1694 4066 4062 -7060 6589 2300 -3185 4087 702
1433 702 2338 -1828 5791 -2905 -1698 5909 -465 -1092 1009 4799 -4269 1138 2312 -3555 270
1448 270 5343 -4078 -1175 5478 -4973 734 -2996 2469 -2133 -2111 5906 -8086 2789 2511 -6957
1463 -6957 -26 3501 -3400 -705 283 -976 -665 -3421 3836 -7320 2938 4100 -7186 1771 612
1478F12j849k498O157m647J134M688n246j027K893K387p696N452K042k544k536
1493b678O487n878k760J2392j3509O441J925k267Q8l574O894o244O51N731n636
1508a937n50J0331j3052K800O619p316M800m350O471n604J527L599r123N646L488
1523C349m271l170R277o210j132L330k544j202L237K006p632P299k141p89l887
1538d480N030J489q835J2633q716l74O124n689j244M290K46k224K21J352K009
1553A832q818J0621o137l119J2449r706J854J012J744m073J337L077l282K071
1567H62K423k109m992R293n713j201M352M64k592Q36M380r584P806j817j938J799
1583B269J333J867q009P155j750m239M474J621o680P240p48p226O093l396L919
$$ plain form
1478 612 -1237 -3735 2422 -2225 -1091 3597 -1649 -2676 217 2604 -5092 360 2402 -142 -2678
1493 -2678 3809 -2069 -4829 7563 -5946 495 2420 153 241 -3333 3561 -2683 -2032 3699 -1937
1508 -1937 -2487 7844 -5208 -2408 4211 -3105 1695 -2655 3816 -1788 -261 3338 -5785 -139 3349
1523 3349 -922 -4092 5185 -1025 -2157 1173 -1371 -2573 664 2670 -4962 2337 196 -593 -4480
1538 -4480 550 2039 -6796 5837 -2879 -3253 2871 -2818 -4062 228 474 -1750 -1529 -177 1832
1553 1832 -6986 3635 -2502 -5621 6828 -2878 -1024 -12 1732 -2341 -1004 2073 -1209 862
1567 862 3285 1176 -3816 5477 -236 -1437 2915 3379 787 1623 6003 -3581 4225 2408 470 2269
1583 2269 3602 5469 -2540 4615 2865 -1374 3100 4721 -1959 5281 4533 -2693 3400 4 3923
1598C923o191N322J210p865Q402m952k865L717K184o410M441J160l486m0L47J000
1614a03n793R106m514j897L610r57k668j382P695q591M901K307m113N06J460j116
1630a549l054N422j063p47q25N693p732J951N394r322P824p28m03k103K264P76
1646A798n177M756J82k040J180M970q897M133J389l795J848O37K787o674P016
1661D113l785k594L510r87l70q36N259o280J536J784k081k584M827o14m028O544
1677C414n272Q68j715L862l254j415Q077p508K240J350j902k763M698q85k101
1692b306K898k00r72k948O729p410L083M000m622K500r76K292n905N077o83k904
1708b347M166O93k873n27M086o005L128N85J270l202L585J321q007P457l491n
$$ plain form
1598 3923 -2268 3054 4264 -3601 4801 -151 -3016 701 2885 -3525 916 2076 -1410 -1450 -1103 -103
1614 -103 -5896 3210 -1304 -3201 409 -548 -3216 -4598 3097 -5494 -593 1714 -2399 -1893 -433 -1549
1630 -1549 -4603 819 -244 -991 -1816 3877 -3855 -1904 3490 -5832 1992 1264 861 -1242 1022 1798
1646 1798 -3379 1377 1559 -481 699 5669 -3228 905 2294 -1501 347 984 3771 -2903 4113
1661 4113 328 -2266 1244 257 -113 -949 4310 -1970 -434 1350 -731 -3315 1512 898 -3130 3414
1677 3414 -1858 -990 -2705 1157 -2097 -3512 4565 -2943 -703 647 -1255 -4018 680 -205 -2306
1692 -2306 592 392 -580 -3528 3201 -4209 -1126 2874 -1748 752 -224 2068 -3837 1240 557 -2347
1708 -2347 1819 2512 -361 -888 3198 -2807 321 906 2176 -1026 2559 3880 -4127 3330 -161 -166
1724a66J292J968j813j982M528m497J92J669J528m482N992k155l586L649k561
1739d24J470l203O447m722K8M315n072Q3J027J689m091M437r85k009L56J885l048
1756a817j953P080o405L496l06p68j820K66L815o760N796p10j935L89J941l840
1772c531J1L918l000J400n31L715p201M819J33n198O250j919J309k695L927l292
1788a885j148L812j615p12K194K246n560M698k511j58M79J847L06m073P868o720
1804i32J246R10p62J02Q93K958m952L176k92j788j294M785l825M08M500n106J928
1821A955k680M173m922K199K999n668M423j082j991j502M189l128M20J395r2j608
1837i20l49L284p436N657l24j249Q50q1L96m264N744m239L89K520l11j419P52
$$ plain form
1724 -166 1126 3094 1281 -701 3827 -670 -478 1191 2719 -1763 4229 2074 -1512 2137 -424
1739 -424 1046 -2157 4290 -432 -404 3911 -1161 -1078 -51 1638 -2453 1984 999 -1010 -654 1231 -1817
1756 -1817 -3770 3310 -3095 401 95 -673 -2493 -2227 1588 -5172 624 -86 -2021 -1632 309 -3531
1772 -3531 -3520 398 -2602 -1202 -1733 1982 -5219 -400 -267 -5465 785 -1134 175 -2520 1407 -1885
1788 -1885 -3033 779 -836 -1548 646 2892 -2668 2030 -481 -639 -160 1687 1993 -2080 5788 -932
1804 -932 314 1224 462 564 1457 4415 -537 2639 2347 559 -735 4050 225 633 5133 27 1955
1821 1955 -725 3448 -1474 725 3724 -1944 2479 1397 -594 -2096 2093 -1035 -615 780 688 -920
1837 -920 -1269 2015 -5421 236 -88 -1337 -487 -568 -172 -4436 1308 -2931 -2542 -22 -333 -1752 -1000
1854a000J276l832K522K77J159l214N655l746k161O210o151L157p76K412j903
1869a15j18K747m037J297J827j120k228O661n053O09J304j276N38j786M767n732
1885a715M342j18k494L42J022P00m144N696k505r32Q12M92l151K321J073l661
1901a920M004k378K204m715L567j21m528O907m250L47J584j80l048J896J84k09
1917f56k38K55K296n541O228m304r93M225k049L38j121L662m691K452l07r35R12
1934d67J232M71l777M380j973q87L24K918l466J985K382o240N712l098J203j626
1950i27J497K396m790L588n65k282J153K664n825N395j55l040K119k522L854n293
1966b733M059l95k093L232j349k013K94L508n006L119o5p13Pl4L67l009M187k510
$$ plain form
1854 -1000 276 -3556 -1034 -757 402 -2812 2843 -903 -3064 3146 -3005 152 -624 1788 -115
1869 -115 -233 2514 -1523 -226 1601 481 -1747 4914 -139 470 1774 498 1036 -750 4017 -1715
1885 -1715 2627 2509 15 357 1379 2079 -2065 3631 1126 194 1006 1498 -1653 668 1741 -1920
1901 -1920 2084 -294 1910 -2805 762 641 -3887 3020 -1230 -883 701 521 -2527 -631 -447 -656
1917 -656 -894 -639 1657 -3884 2344 -1960 -2953 1272 -777 -439 -1560 2102 -2589 -137 -444 -1379 -467
1934 -467 765 1236 -2541 1839 -134 -1021 -697 2221 -1245 740 3122 -3118 2594 -504 699 -927
1950 -927 570 2966 -1824 1764 1199 -1083 70 2734 -3091 2304 2149 -891 1228 -1294 2560 -2733
1966 -2733 1326 931 -1162 2070 721 -1292 -998 2510 -2496 623 558 -155 -148 -182 185 -2824 1363 -1147
1984a147P28r34L510l578j159M558n797M505q55r20K56J078m79k014J218J014
2000a6o7l029N915n658K713J689n342M077r55J559k711K433l44q77J45K93l47
2017e22q11M711n747L128N80j681m34J292J058l056M519l587J419j054J394j211
2033bj650N036l893J165Q76l34k658L509j946p91L208k602J939l886M701l335
2049f63n88L938l825J464Q69k22l296L774k158K29J15O00M39k807M250m647J786
2066g42J018o88j127J585J424m701M290k428O68o9R23o90p63K910l239R69R1K233
2084A664m345M150o86k599M118l476J802j823L133j478r63K266j162p61L29K094
2100B263m264M786k217l65J150p47O37k650M253l478J496N15l67j002K17J845
$$ plain form
1984 -1147 -419 -1353 2157 -1421 -2580 1978 -3819 686 -169 -1089 -833 245 -234 -2248 -1030 -16
2000 -16 -83 -3112 2803 -2855 -142 1547 -3795 282 -673 886 -1825 608 264 -613 -468 -175 -522
2017 -522 -1333 3378 -2369 759 1339 -342 -776 516 1574 -1482 3037 -550 869 -185 1209 -2
2033 -2 -1652 3384 -509 656 1532 1198 -1460 2049 103 -688 2520 -82 1857 -2029 2672 -663
2049 -663 -1251 2687 -1138 326 1195 973 -2323 1451 -707 -478 -363 237 676 -2131 2119 -2528 -742
2066 -742 276 -412 -1539 46 1470 -3231 1059 -1369 -701 -770 153 -537 -1300 1610 -1629 -660 -569 1664
2084 1664 -2681 1469 783 -1816 2302 -1174 628 -1195 1938 460 -503 1763 601 -160 169 2263
2100 2263 -2001 2785 568 203 1353 606 1243 -1407 2846 -632 864 1379 1012 10 227 2072
2116B072m068L904j243m04o92J819j996m94K486l146K456j722K791l614J337J455
2132I41l730L412j371R1q44K488k889N80J090r80r8n63L340n021M177j642q12
2149a831J237n38O91k244M221l255P83N10K56j282P87J802l171L232j640R47j643
2166a138K394j118j489M072l622J975j054J591k035J116J510k613J932l65M52
2181A608k241L693l108N34J620j264P51j609L687m744K672k63j335J061M9K78
2197A389k208L126k815R31oQ72j924P61J815m160L546k138J108j315J391k29k383
2214b239L261k612P70m11J726k542J513N02j750J268o52J350l342M358k689q7
2230a576J756j524J079k076L347l376J927N08j195K55J057j56k008L624k780J354
$$ plain form
2116 2072 -1996 1908 665 261 -431 1388 -608 -1102 1384 -1762 694 -1028 1763 -1851 -514 941
2132 941 -2789 623 -748 -657 -1501 987 -1902 -1322 -232 -1212 -1310 -1873 1467 -3554 623 -1019 -1831
2149 -1831 -594 -1132 -441 -2685 1536 -1719 -936 -426 -170 -1452 -665 1137 -2034 1198 -442 505 -1138
2166 -1138 1256 138 -1351 2721 -901 1074 20 1611 -424 692 2202 -411 1521 1156 1608
2181 1608 -633 3060 -48 486 2106 842 1593 -16 3671 -1073 1599 1336 1 1062 1111 1389
2197 1389 -819 2307 -508 423 417 1289 -635 126 1941 -2219 1327 -811 297 -1018 373 144 -2239
2214 -2239 1022 -1590 -820 -1231 495 -2047 -534 -32 -1782 -514 -1166 184 -3158 1200 -1489 -1576
2230 -1576 180 -1344 -265 -2341 1006 -2370 -443 65 -1130 -875 182 26 -1982 1642 -1138 216
2246B16o36J817j831k54K917m039L280j194M79j053J610j12j899K666j681P63
2262A049j095K390l167J988L39j797J367q91J950l528L635j666j440K091j376
2277a51N27r53K164k457J624n25l70o41J017L97l035M182l170Q29k14Q70q86q44
2295a636K717l378K387q12L32j505J746k86j692K203r29P71j908L206l316J570
2311e30J048k366K466j385J722k645K321o65r89J381K57m22n69K672l540K304
2327A060r48M63j95N4J999l423L028j403J90l11J071q63l38K324l281J935p47
2344F15P17j656J932l76j429J878j556J137k607L352k544N89J649k924K013q97
2360a07O58k176J964p08k48PM56k18j891L316l534K301j40q90N34k97J468k948
$$ plain form
2246 216 -420 1397 -434 -688 2229 -1810 1470 276 755 -298 1312 1200 -699 1967 286 1049
2262 1049 -46 2344 -823 1165 1504 -293 1074 183 2133 -1395 2240 574 -866 1225 -151
2277 -151 376 -577 1587 -870 754 229 -141 -782 235 632 -2403 1779 -1391 -562 -776 94 -792 -1636
2295 -1636 1081 -2297 90 -722 -390 -1895 -149 -435 -2127 76 -853 -82 -1990 1216 -2100 -530
2311 -530 518 -1848 618 -767 955 -1690 631 -34 -1023 358 615 193 -376 2296 -1244 1060
2327 1060 112 575 380 434 2433 -990 2038 635 825 514 1585 722 384 2708 -573 1362 615
2344 615 1332 -324 1608 1232 -197 1681 125 1262 -1345 2007 -537 52 1701 -1223 790 -107
2360 -107 551 -1625 339 -369 -617 -610 -154 -372 -2263 1053 -2481 -180 -320 -1210 -676 -973 495 -2453
2378b453K487j093R61j024J347r01j070K936l148J914m72J296k209K002n29j166
2394a122K064k137K131j929K366j485q11K387j764M76p0J139k233K806k301O40
2410A57K68j71R67k599L480k391O41O07q88o73Q25P91k380K588j609J120k146
2427a413J567m8j062K204k489J196j70Q24l011K162O70k022K230k143J809j388
2443a084J157j014m41J326r4o36r3K571l825K826j694R8J592j477J455k287K792
2460A172j619r7L01J081j320N44J252k909L357k124Q18m27Q11M97j314J115j187
2477d9J478j790K197k342J459J128k957K156j032Q27j097J398j452J237l85m34
2493C42L43j641L102l657K307Nr81J075j175Ln23J710k050J182p37J475j417j064
$$ plain form
2378 -2453 34 -1059 -98 -1122 225 -676 -1746 1190 -1958 -44 -516 780 -1429 573 44 -1122
2394 -1122 942 -1195 936 -993 1373 -112 -923 1464 -300 176 106 1245 -988 1818 -483 157
2410 157 425 254 1221 -1378 2102 -289 352 959 71 -602 223 1014 -1366 1222 -387 733 -1413
2427 -1413 154 106 -956 1248 -1241 -45 -215 609 -2402 -240 430 -1592 638 -1505 304 -1084
2443 -1084 73 -941 -1382 -56 -150 -786 -879 1692 -2133 693 -1001 -903 689 -788 667 -1620 1172
2460 1172 -447 -544 -243 838 -482 62 1314 -1595 1762 -362 456 29 840 1337 23 1138 -49
2477 -49 1429 -361 1836 -506 953 2081 -876 1280 248 1075 -22 1376 -76 1161 776 342
2493 342 685 -956 2146 -1511 796 801 -180 895 -280 -277 -800 910 -1140 42 -695 780 -637 -1701
2511a701K679l024K055q99lP9J121j469n30J938j483J319j508J550j421K92Q70
2528a35j495J051J28N83j736K741k017O12L89j129J950j809K312k092O47Q81j006
2545a25PP46J78j008K486k977J814o55M26k88r67K435k163J306p66O77q04O85
2563A007n71p54K451k039O70j097J843j382L9N51p90J346j673J399k628K750j455
2580c33p86J788j407J242j583J408j685J385p50L95n28N71M66k409K693j776O41
2597f68k92N28J63q72J194j683J377o38R72j296J293j86j165J827j396Q84j011
2614i69J958j750N28J001j396J416j434J621j923K188p38n69J058n05j74q60K149
2631A601k217J797q84N14k39l69J006k370L199j866K57q7M01n08j24J199j833
$$ plain form
2511 -1701 978 -2046 9 -890 -893 -814 307 -1162 -1692 246 -1237 82 -1426 124 -1297 -1005 -135
2528 -135 -1630 -579 -451 132 -1604 1137 -880 -268 121 -1008 942 -867 1445 -647 0 881 -125
2545 -125 -118 628 806 -202 2284 -693 1121 466 892 604 -363 2072 -91 1215 449 1126 322 1007
2563 1007 436 -318 2133 94 764 -333 1510 128 167 718 -72 1274 -399 1000 -1628 1122 -333
2580 -333 -1119 669 -738 504 -1079 329 -1356 29 -721 -326 -854 -283 183 -2226 467 -1309 -668
2597 -668 -960 -432 -269 -1141 53 -1630 -253 -891 81 -1215 78 -108 -1273 554 -842 42 -969
2614 -969 989 -761 -233 768 -628 788 -646 975 -948 1240 502 -67 991 486 312 -548 1601
2631 1601 -616 1181 297 811 572 203 1209 -1161 2038 172 429 342 743 235 111 1310 -523
2648e23J577r10R23j667R18J50j517J931j520J335j644J733j496J96Q35j700J376
2665cp64J247j758J311p84l63N66k9M46j146K016k201J365m14m48L34L5R74k116
2684a732K341j460N19m60R28l11m98J664j858J581j411J302j499J379R4j231J873
2701A221j233Q81j532J764r69J72Q52r66Q84r39J224j916J760n41j01K40m10Q83
2719A274j967K284k179J470k40l26Qj99R96k266J899j193N73o11J101o32p74J660
2737H78k359J846j331J120j387R09M71j644J451j115J147j442J568j062L73M78
2753i9j080O12p24J538j953J842o47j52L63o20J032j376K304j927Q60L1l38o4
2771c98J4J031j926K272j248J164j248R09k14r04J822j560J486r52P21j252J076
$$ plain form
2648 -523 1054 144 1067 -600 318 468 -1049 882 -638 697 -947 786 -710 -514 321 -1379 -3
2665 -3 -767 480 -1278 33 -751 -1114 -548 -577 -131 -1277 739 -1462 -97 -511 -959 -625 -590 384 -1732
2684 -1732 609 -851 -332 -792 136 -175 -673 991 -867 714 -697 605 -894 485 579 -652 1221
2701 1221 -12 869 -663 1101 132 304 1156 190 1074 135 1359 -557 1203 662 561 801 391 1274
2719 1274 -693 1591 -588 882 642 316 324 125 1121 -1145 754 -439 134 -477 624 -8 -782 878
2737 878 -1481 365 -966 154 -1233 -324 147 -1497 -46 -1161 -14 -1456 112 -950 -577 -99
2753 -99 -1179 -567 -1291 247 -1706 136 -511 -663 -300 -920 112 -1264 1040 -887 -27 4 -334 -398
2771 -398 -384 647 -1279 993 -255 909 -339 570 356 -548 1274 -286 1200 248 969 -283 793
2788G93J49j339J619q09Q21j489J491j278O81M59q26N31j003K094k955J940k77
2805F02o02N31o52R25j264J641j559P39p48Q68q41l8J607k414K159j513N07m00
2823d52P8L17q27J141j207R22r45J297j331J045L25j649J746j177P48j354J444
2840A21n11K89K94p77Q76j043J826k490J623L78p61O16n50O71r46J353j754J573
2858G88o19P65j145j78K414k818J386l73L60k65K78l92l53J116j397Q76j119K024
2876A348j569k94J185j496J260q50M40r22J651j342J06M41q00J159j774J667j401
2893a191Q98L8o42m03J164k8j458K041k152J925j094M2O71j189K082j751N63K91
2911a93N61j470J489p77j26J333j759J304q39J459r47l17J013l15L94j029J350
$$ plain form
2788 793 942 -397 1222 413 1234 -255 1236 -42 639 1098 272 803 -200 1894 -1061 879 602
2805 602 0 531 -121 804 -460 1181 -378 361 -387 481 -360 -398 1209 -1205 954 -559 -52 -452
2823 -452 -374 -57 -884 257 -950 -28 -973 324 -1007 38 363 -1286 460 -717 31 -1323 121
2840 121 -390 -101 193 -584 292 -751 1075 -1415 208 586 -175 441 -109 562 -384 969 -785 788
2858 788 169 934 -211 -389 2025 -793 593 220 580 315 593 201 -152 964 -433 443 -676 1348
2876 1348 -221 -515 670 -826 434 -416 24 -898 753 -589 -483 -42 -842 317 -1457 210 -1191
2893 -1191 -293 -255 -897 -1300 -136 -164 -1622 419 -1733 192 -902 -860 -189 -1378 704 -1047 -484 -193
2911 -193 368 -1102 387 -390 -516 817 -942 362 -477 982 35 -282 731 416 810 -219 1131
2928A131j867K698k102mJ821j399R54j405J389p33L57o49M47l22J71P65k429K968
2946A791j539K57q3n31Q59m33M20r61P91p08Q92j996J567K36j676K094k263J319
2964C6l90L00r02N11M28o86R4r15K307k341J606m86o18J616j050k23n16J786j763
2983a206J113r85R43J35j198J617k261K287m51n28n5J108o68R0M73j241K414k397
3001h10J571r83O66P93k103J654n43O65r31J102j328J354J6j521J584j288J501
3018A399j496N99J00l11K38l06L17r93J981k573J592l29l23L12j210J526j239
3035g16J213j149N59m59J385j379n87J774j929J864j623R98l85j11L70j053J444
3052B16p05N15j462J734q24P2P42j295J511r05Q79j190J157j94j24k17J8J077
$$ plain form
2928 1131 -736 1962 -140 -144 1677 278 1232 -173 1216 483 840 191 638 316 487 1252 -1177 1791
2946 1791 252 509 426 -105 754 321 741 -220 571 -137 755 -1241 326 562 -1114 980 -1283 36
2964 36 -354 -54 -956 -445 -17 -703 -609 -1524 783 -1558 48 -438 -1056 560 -490 -713 -1229 557 -1206
2983 -1206 -93 -1078 -135 0 -1198 419 -1842 445 -6 -534 -589 519 -149 -59 414 -827 1587 -810
3001 -810 761 -222 444 1237 -866 788 245 910 -21 1081 -247 1107 1123 -398 1186 -102 1399
3018 1399 -97 502 602 291 529 223 540 -453 1528 -1045 547 218 -105 207 -1003 523 -716
3035 -716 497 -652 -93 -552 833 -546 -1133 641 -1288 576 -1047 -49 -434 -545 -175 -1228 216
3052 216 -489 26 -1436 298 -526 -454 288 -1007 504 -401 478 -712 445 251 127 -90 -72 1005
3070A005j659J833j376P01l2l03L24%Q21j430J279r86J073q71K00K20r19J900
3088A780j949J142q29P07o37J96J66r86J281j097J126j656J509r89j06R83j213
3105e72O87o63R24j695J276m23M2M5j83O51j729J698r44N54k32M6l73N9Q47j990
3125a975K018j277R30r13Q48J55p36J150j497J277q92J305j320N77N62j180J197
3142B29r73J467j574J541o90K16L62q38P31p63J398j635J253r3o3%m18P41r92
3161a01J270j247P65l00K64n6o64J579k131J850r45N08l43k21L61r97J680j580
3179c08R11q84J037j285J95Q26j033Q88j007J246j586J359n90m34P02p10Q42j407
3197a238J440j625J312m62L04k73j48Q60j480J700j517J036n24K27J6n87J590
$$ plain form
3070 1005 -654 1179 -197 504 472 169 493 493 1314 -116 1163 177 1250 379 579 799 -120 1780
3088 1780 -169 973 144 851 214 410 576 -410 871 -226 900 -756 753 -236 -342 641 -572
3105 -572 115 -548 376 -1319 -43 -466 -424 -379 -562 89 -1640 58 -886 -332 -564 -518 -891 -832 15 -1975
3125 -1975 43 -1234 -304 -1217 -369 -214 -950 200 -1297 -20 -912 393 -927 -350 212 -968 229
3142 229 -744 723 -851 690 0 216 578 -260 471 -292 1106 -529 724 631 568 568 150 891 -101
3161 -101 1169 -78 687 387 651 595 -69 1510 -621 1229 284 792 449 228 589 -408 1272 -308
3179 -308 603 -281 756 -529 -334 492 -541 347 -660 586 -1000 359 -231 -665 37 -673 169 -1238
3197 -1238 202 -1423 -111 -573 -269 -542 -690 170 -1310 390 -1127 -91 -615 -388 -372 -959 631
3214F31j774J259r06R55o05M06R7p57J238j153J128j007J250j012J65Q58j145
3231c72J077r56J045r83J058p07j1M58n37P90j357J837j726R60n63K88J28m82
3249e3R78j456J460j310P47l07K83J2q91J470j378J005r18J024r45P28k78j146
3267i75J673j791J351q50Q58n47j13Q27r56O13q32J089j267J353j074J9R98j098
3285g22Q89j180J665j273N14k89M91j66k27R56j723K080j182L69j65J11J54o28
3303c26Q95n74R72j144J006r18N69L56j503J885j297R84p71K86k60L31p5l56O60
3322G20p18J267j784J182o23k43R86j116O08p66J429j744Q82m87N81n3j088J321
3340C54j255J396j193q8N45K29o74q1Q28q02J311j765Q28l38O6Q49j366R93j04
$$ plain form
3214 631 -1143 116 -790 165 -440 -34 63 -694 544 -609 519 -488 762 -250 -85 773 -372
3231 -372 705 -251 794 -189 869 162 151 609 72 862 -495 1342 -384 576 13 301 429 -53
3249 -53 925 -531 929 -381 366 59 342 354 -537 933 -445 560 -358 666 -279 449 171 -975
3267 -975 698 -1093 258 -592 266 -281 -394 433 -523 90 -742 347 -920 433 -641 -622 376 -722
3285 -722 167 -1013 652 -621 -107 -396 95 -71 -298 658 -1065 1015 -167 202 37 148 302 -326
3303 -326 569 -5 967 -177 829 -89 480 836 -667 1218 -79 905 134 420 160 491 416 60 720
3322 720 2 1269 -515 667 44 -199 787 -329 279 -487 942 -802 80 -407 174 121 -967 354
3340 354 -901 495 -698 -786 -241 -12 -686 -767 61 -741 570 -1195 -367 -705 -639 210 -1156 -163 -267
3359b67J08r19J353j197Q48jj006J800j625J313j230P64M83m77Q2M9L09p29J381
3378A039j728J455j20l81M98j178J517j152P12l01L40l89P44j105l17K195k368
3395e39J600j326R06K49p12K57k17N05o42M68j429J921j207n8N97j115J649j136
3413b29J98l14O20m44j63m95L68J013j877J767j269R55l1j056O69Q8qp74R62q44
3433h64J551j669O71P26j607J948j686L81N62Q8n75L94j51J43R12j706J724j423
3451e81J489r67o54J525q58M99m12M39o03J059j272N98M15q35J450k118J658l35
3469D97l59PR7m4J56J21j505J973j281R38q78l94J381j013K26k92M16m47Q59j815
3489a357J515J58j012J155j645J537j010R5K2K05M29n75k33k86J701j950R48j05
$$ plain form
3359 -267 -159 -1078 275 -922 -74 -75 -1081 719 -906 407 -823 -59 424 -53 29 78 387 -342 1039
3378 1039 -689 766 646 265 763 -415 1102 -50 662 361 701 312 1056 -49 -366 1829 -539
3395 -539 1061 -265 641 890 178 435 218 723 81 549 -880 1041 -166 -224 373 -742 907 -229
3413 -229 -31 -345 275 -169 -332 -827 -459 554 -1323 444 -825 130 99 -957 -288 -200 -208 -982 -20 -864
3433 -864 687 -982 -311 415 -1192 756 -930 -549 13 101 -474 -80 -231 -88 824 -882 842 -581
3451 -581 908 -59 -713 812 -46 453 41 480 -123 936 -336 262 677 -158 1292 -826 832 497
3469 497 138 145 242 198 354 475 -1030 943 -338 600 -278 -672 709 -304 -78 -370 46 -401 458 -1357
3489 -1357 158 316 -696 459 -1186 351 -659 -564 -542 -337 92 -483 -716 -1002 699 -1251 -303 -408
3507d08k49R36r30N03n87J145r74N18p27Q83j38m69J039j634J882r47M08j47J74
3526B78M12o17J26PJ028j309J194j153M70O44j761J509o09P96p33K71k27K40j97
3545C69j24K71o08J526j586L28L47m59L40m12M78o63R09j245R01n64K42j43q73
3564i66J642j396P30o47O37k94J60k55k97R45j121Q33r33O51R4n01R77j179Q53
3583f7n97M82q53J180q26K50K66n30Q52r12J219j055N25K17j31k49L94K13j002
3602f24J232j031Q71l43J16P3m54R73j040Q08m93N27n35M06M9p10J216j280J072
3621H33p21N55o30K1P08n02M71j119J181j190J029p20o6N70p59O75j017J100j088
3640f69O99l41J0l6l19J003j119J001p77K13N2K30k50k73Q62j170R24q72O19l54
$$ plain form
3507 -408 -657 279 -651 -148 -735 410 -564 -46 -773 110 -28 -497 542 -1092 790 -157 251 104 278
3526 278 690 73 199 206 1234 -75 1119 -34 436 1080 -681 828 219 1015 282 553 326 566 369
3545 369 245 516 -92 1434 -152 176 523 64 404 -8 470 -193 716 -529 372 -192 50 -93 -966
3564 -966 676 -720 10 -637 0 -294 -134 -389 -686 259 -862 -29 -962 -311 -217 -718 259 -920 -67
3583 -67 -664 -182 -1035 145 -681 -431 -165 -695 157 -755 464 -591 -66 151 20 -229 165 378 -624
3602 -624 608 -423 448 105 221 294 -160 813 -227 581 88 615 80 486 535 -175 1041 -239 833
3621 833 112 667 37 58 766 264 735 -384 797 -393 636 -84 -150 420 -339 336 -681 419 -669
3640 -669 30 -311 -301 -337 -656 347 -772 229 -548 -335 -283 -53 -303 -576 286 -884 40 -832 -213 -567
3660e67J51M57r17J194r23N22o24J123p05K36J00k76P69r05Q67o50P36k94j39
3679A55K95n86N74o89J141q80N72l57K87j11n47J027j172J233p89J20l17K08L50
3698E14m77R93j575J105o42M97n03K48K90o30O38p16M44q90R36n42Q2K77n74O66
3718A41o87P61r93J047m09l34L46l87M10r80J464j098O47k80j10M16o71R45r67
3737g39J125r29N24k93L87J64n11Q16j244R36l04N25l48oJ88j57M27o19P52q80
3757a86R84n30l19P42q50P62m11L57m83O35m99J60J13k45O03j180J174o66J43
3776C04J14k77J85l29N14p38J103j185P55q40O47jr06J243j144O78p5r0p22L85
3796c79M61o49P19j113J063r31P70j06m50P54q03N70n36R86j191J081r80N45M25
$$ plain form
3660 -567 -416 41 -876 318 -605 -83 -707 416 -289 -53 47 -229 540 -365 502 -148 588 294 155
3679 155 450 -136 438 -251 890 10 582 225 512 401 -146 881 -291 942 153 273 -44 164 514
3698 514 37 1030 -545 560 -82 415 -88 160 450 -180 458 -258 186 -704 232 -310 -228 49 -525 141
3718 141 -546 215 -778 269 -140 -474 -128 -515 -105 -1085 379 -719 -72 -352 -462 -46 -717 228 -739
3737 -739 386 -543 -19 -312 75 239 -272 544 -700 236 -68 457 109 103 291 134 561 -58 694 -186
3757 -186 798 268 -51 691 -159 603 192 549 66 701 202 362 475 230 833 -347 827 161 304
3776 304 418 141 326 -3 511 -227 876 -309 446 -394 253 252 -654 589 -555 123 48 -42 -764 -379
3796 -379 82 -567 152 -961 102 -829 -59 -165 -615 139 -664 -94 -630 356 -835 246 -734 -189 236
3815B36r36R26j005R38l33n0K2M54j5p1K91j234J739j251P42k09J8N71j165P59
3835D27l63L54l36P18q72P38L53j620J430j112J341r60l7L98j42r7N8J37o12J341
3855A144j903J160j68k49N89j316Q58kJ24n95J63l49R74m53q65J122j377J610
3873D67j211K48N91m15j16k4J3L14L60j500J562q33K09Q32j842J651j93m04l26
3892f17P33k52M62n76l36J192j169J626j698L27J026r30L13m28P87m56P41j446
3910g01J443n05J82k8r99K022j194j78L31j00m0K98q72M56R15j312J022j315J209
3929F34K4j149O48m23M84k38J24q17J472j087Q8L65r04J253j136L72k07L76J65
3948D4m50k30O00L36j309J092j122J130m6q81O68m51P32m74J04m17J358j353P38
$$ plain form
3815 236 -700 226 -779 159 -174 -224 -202 252 237 166 457 -777 962 -289 453 244 262 833 -332 427
3835 427 64 418 82 800 -72 666 1019 -601 829 -283 1058 98 61 459 317 220 278 415 -197 1144
3855 1144 -759 401 233 -16 573 -743 115 113 237 -358 -195 -544 430 -23 -888 234 -1143 467
3873 467 -744 -496 95 -320 -436 -460 -447 -133 227 -1273 289 -544 -335 497 -1345 306 113 -291 -617
3892 -617 116 -136 326 -250 -586 606 -563 1063 -635 -308 718 -212 101 -327 460 4 745 -701
3910 -701 742 237 419 391 -608 1414 220 42 373 273 233 531 -341 115 1030 -282 740 -575 634
3929 634 658 -491 157 -266 218 -20 104 -713 759 -328 -240 125 -779 474 -662 -290 -497 -121 44
3948 44 -406 -636 -36 300 -1009 83 -1039 91 45 -836 -168 -619 113 -361 -257 -674 684 -669 69
3967F9j06o30J383j380N47J16R3j61j72M01J14J09o85J017r75R15m01n06J096
3986H44r40O08n42M76j75K28p00N15J66m36Q68j567J561p13q9J60l01K74O6p4
4006B29n43J059j165J017q35J65O54j139R90q39L37nJ55n60N50q9o66Q76j419
4025a228J734j214N71k56k53O81l10j20l58J128j247R51p02K63L08p88J116q89
4043f13O27j18j15M2M97j56m89R33j105J154r10M34j0k46P24n96O98m78L91p93
4063a29N85m85K91L83p43P77r14J032p35L34j29NL04n86N63p75Q80j142N50O9
4083A35k25M09o56Q40q68N76o42N70n66K13J99m02P47q68O08n95M63m22J0L84
4103i0m74P40r74Q97r04J076o68j18O59p34O72o63R10q34O45k25j26K18j19L15
$$ plain form
3967 69 -37 -667 716 -664 -117 -1 92 -69 -241 160 274 383 -302 715 -260 655 254 -252 844
3986 844 -96 512 -30 446 271 499 -201 314 480 44 912 -655 906 193 104 264 -37 237 303 229
4006 229 -314 745 -420 597 -238 -73 581 -558 432 -407 -70 -75 80 -480 70 -19 -685 191 -1228
4025 -1228 506 -708 -137 -393 -646 35 -275 -395 -753 375 -872 79 -623 -360 -52 -840 276 -613
4043 -613 14 -104 -219 -177 320 164 -325 608 -497 657 -253 181 171 -75 649 53 751 273 664 -129
4063 -129 456 -29 262 645 -98 679 -235 797 62 396 267 272 576 -10 553 -222 658 -484 66 135
4083 135 -90 319 -337 503 -365 211 -431 139 -427 -214 -15 -417 330 -538 70 -525 -62 -484 -474 -90
4103 -90 -564 176 -798 99 -805 271 -397 -515 144 -590 82 -581 329 -505 140 -85 -211 7 -112 203
4123B03p24R16n45M94j9m63L88k03L16n16P62n79K26k05k8L54k39N11m91M48o25
4144a9N97n34jM31n67P52o45P98q03N63m07q8R8l94N17n50P51n86K76l57NL18
4166A55p28O02q16Q96n37N45k85O2J34n88Q12q58P53n20O3n4O6K04p07O32l67
4187e36M42n71N86m33L83K18q50J103p88R96j056O44m2l3J41n95R64r35R23p89
4207b28N33p7l01L41j67L28m45N50n96L18nj67J55m24Q98j047J072n74K68k51
4227A81N8J38l99P16r13R99r25N83l96j13J77o87P24m29P10r58O90k94k47N29
4247A44p43Q24r76R30p39N74J6l33J55l21N17m92N84o88Q67n55j59O10r15P78
4267G8p68O94p1L21k77M2m2j79P47j022R22p49N63j7l95N16m34M40k21M93n77
$$ plain form
4123 203 -521 395 -150 344 325 -138 250 47 363 -153 609 30 256 51 23 377 138 649 158 606 -19
4144 -19 578 44 43 474 -93 659 14 812 9 572 165 77 175 -219 298 -252 499 -87 189 -168 -163 155
4166 155 -573 29 -787 109 -428 117 -168 -106 28 -560 252 -606 147 -373 -310 -364 -298 -94 -801 -169 -536
4187 -536 -94 -665 -79 -512 -129 89 -761 342 -446 550 -506 138 96 63 204 -391 573 -362 561 -228
4207 -228 305 228 -73 268 101 429 -16 534 -62 256 251 84 239 -185 713 -334 738 164 432 181
4227 181 239 377 -22 694 -219 780 -145 438 42 -71 106 -581 143 -286 424 -534 156 -138 -385 144
4247 144 -599 225 -751 179 -560 14 30 -303 -148 -469 48 -444 140 -548 319 -236 -395 215 -700 78
4267 78 -690 4 -67 254 -23 19 -23 -202 545 -477 445 -304 259 242 -153 363 -71 369 148 641 64
4288F4P71q82J83M00o50J119j163N36j18K47j90j93M6l8L79r23J043o78K61K20
4308D34o78N41n26L20m80L04l05Q42j083K94N50r05J507j708R53k1l22j88R1J89
4328a91j30j08j37Q90j102Q85m45j84R58r24K46k87O65k96K62o11P23j0p26J126
4348F04j383J341l83l71L75NJ4J9P0m31P62q55P29n14Q5J104j474P72k80Q3j2
4369B60J71p78R51j78p72N64p10J306n88k30P15o04J08k75j71K58P25j386J019
4388C85m12K11N09j632J345q35N33j90k00rN02p13k66J058j128J207r00L51K74
4407I0m51N6k18L2P59j33j199J309p77L01L33q68J394q74L79l15R3K22R6m87K86
4428B8K21m58Q06j269Q91L26m62J01k50K74jO5o28J187r17L78K02p52J197j225
$$ plain form
4288 64 835 -47 136 536 -114 1005 -158 378 260 507 317 124 170 132 511 -412 631 -47 214 434
4308 434 -244 297 -229 91 -389 -85 -390 452 -631 -337 213 -692 815 -893 60 39 -283 -471 -380 -191
4328 -191 -321 -429 -566 324 -778 107 -338 -522 436 -488 -242 -529 136 -160 102 -509 214 204 -522 604
4348 604 -779 562 179 -192 183 188 202 221 291 -140 622 -233 496 -18 67 1171 -303 469 189 272 260
4369 260 431 -347 604 426 -346 218 -492 814 226 -4 711 107 215 -60 -231 27 752 -634 385
4388 385 -27 184 693 -939 406 -429 104 -86 -286 -295 207 -506 -772 286 -842 365 -535 -184 90
4407 90 -361 -305 -523 -491 268 135 -1064 245 -532 -231 102 -766 628 -246 133 -182 -89 133 229 -258 28
4428 28 249 -209 597 -672 219 545 83 184 -66 208 207 272 -356 831 -86 292 494 -258 939 -286
4448b86P47j81k9n0k17n1M75J10q38Q27r01Q96k38j030J154p68N59l16q2q4M42
4469A39n86M98l99K6Q34j426J167l92k11J09k61j43O51Q7o53P96r51Q50m76o9
4489d10P34q41P45p61K06j05O78n10K97J24m88Q08j132Q34l19L31M7l67N57r8
4509C30m1m09O11o02N39l46j68P17p98P34n56M61j97j12o8N16j97j42M47j310
4529e91J185o95L53j04j36M84m92K54n24Q09o50M80o10J2L34p74Q79o04M09m57
4549d38J38j26K29J04l88N82q56J015p10L30j10l96N70j31K50n53P22n95N55k95
4569a03J54J9n72O20o25O25k25J70J0j91M01m39N85m14O75q35M21k10R7K46o19
4590b10L91l95R29q88P07m60pJ09m21J009r01L09k76L74k26J17J89m40L98j60
$$ plain form
4448 -286 461 280 251 201 -16 -67 408 518 -320 507 -394 502 264 -766 388 -380 179 -137 -219 -303 139
4469 139 -447 51 -348 -322 512 -914 253 -139 -350 -241 -502 -645 6 93 -560 236 -715 135 -341 -410
4489 -410 324 -517 228 -533 -327 -432 246 -264 33 157 -331 477 -655 179 -140 191 238 -129 428 330
4509 330 289 -120 491 -111 428 82 -86 631 -167 567 11 472 275 163 95 611 414 272 719 -591
4529 -591 594 -101 252 148 12 496 4 258 -266 543 -107 373 -237 -225 109 -665 214 -390 19 -438
4549 -438 -300 -426 -197 -93 -481 101 -755 260 -450 -120 -230 -626 -56 -187 63 -490 232 -363 192 -103
4569 -103 51 70 -502 118 -507 118 -107 63 73 -118 283 -156 429 15 690 -145 276 66 163 409 -210
4590 -210 181 -214 715 -173 534 74 67 176 -245 764 -137 172 -104 270 44 161 350 -90 308 148
4610A48J69p63O86l08j62N77n95P39o42K99l54J63k0k87M44m63M46n25M24m70
4630d94M81k34j98L19o27Q66m94N59n84N17k71k42M23l29K99m50P18m27K59pp4
4651A0O4k90P49q14O15o03O37j31j58L34k14K99m29M54l29Q9r5m0K43m91M85m63
4673g8M40m70L95j31q7K7k32O52p59O74o72K88J75m31K56l07L88m17M13n08M19
4694C5k70OK80o32Q09o69O02p75N65k57k59N27n31N35o14Q05n65M13n07K84J53
4715f5m59N16m64L40m10O75n84N70r4l64P61n86N36m37K98j01k16L77k84K29l86
4736a48M75n15O51j03l54O43p27N46o96P40m20L70j5l0l9l71P83j073Q89q46N60
4757C20M9l53K63j57L85m28L51p72P48p29K27M43o51Q43o85J80l29K95j94j49
$$ plain form
4610 148 317 -446 240 -68 -230 347 -248 491 -151 148 -206 -43 -63 -350 94 -369 77 -448 -24 -494
4630 -494 -13 -247 -445 -126 -753 113 -381 178 -406 111 -160 -402 21 -308 -9 -459 259 -168 91 84 10
4651 10 74 -216 533 -281 334 -269 368 237 79 413 199 498 69 523 194 283 188 148 391 -100 385 -78
4673 -78 362 -108 287 156 69 96 -136 516 -243 431 -241 47 222 -209 47 -260 128 -289 124 -384 35
4694 35 -235 -229 51 -581 228 -441 161 -614 -49 -306 -565 -38 -569 -34 -648 157 -408 5 -502 -218 -65
4715 -65 -524 -8 -472 -132 -542 133 -451 119 25 -339 422 -164 372 -65 233 132 -84 293 9 238 -148
4736 -148 327 -188 463 360 6 649 -78 468 -228 512 92 462 447 417 378 7 790 -283 606 -240 320
4757 320 369 16 279 122 507 79 430 -342 406 -323 -96 347 -304 539 -146 34 -295 0 -194 -343
4777c43J14Q9K77p16R97q52M29K17p50M13k36L51m61L59l79N91l61J9K31m17Q12
4798C84q36L73j8K20j95K2lM29p7o87Q69n62N23k25l25M07l95L33k42K18M2K00
$$ plain form
4777 -343 -229 -140 137 -579 418 -434 -5 212 -538 -125 -361 -10 -471 -112 -491 100 -261 -242 -11 -428 384
4798 384 -452 -79 -97 123 -72 -50 -53 376 299 -388 481 -81 442 217 -108 299 -96 237 -5 213 255 455
$$ [...]
8191C56
##END NTUPLES=NMR FID
##END=
