##TITLE=1H_TG-2304
 CDCl3, 8 sc, 
 20.10.2020
##JCAMPDX= 6.0         $$ Bruker NMR JCAMP-DX V2.0
##DATA TYPE= NMR FID
##DATA CLASS= NTUPLES
##ORIGIN= UXNMR, Bruker Analytische Messtechnik GmbH
##OWNER= root
$$ XWIN-NMR		Version 3.5
$$ Tue Oct 20 12:06:18 2020 Russian Standard Time (UT+4h)  she@DPX200
##.OBSERVE FREQUENCY= 200.1315066352
##.OBSERVE NUCLEUS= ^1H
##.DELAY= (6, 6)
##.ACQUISITION MODE= SIMULTANEOUS
##.ACQUISITION SCHEME= undefined
##.AVERAGES= 8
##.DIGITISER RES= 18
##SPECTROMETER/DATA SYSTEM= spect
##.PULSE SEQUENCE= zg30
##.SOLVENT NAME= CDCl3
##.SHIFT REFERENCE= (INTERNAL, CDCl3, 0, 15.7039)
##AUDIT TRAIL= $$ (NUMBER, WHEN, WHO, WHERE, WHAT)
$$ ##TITLE= Audit trail, XWIN-NMR		Version 3.5
$$ ##JCAMPDX= 5.01
$$ ##ORIGIN= Bruker BioSpin GmbH
$$ ##OWNER= she
$$ F:/spectra/data/she/nmr/H-F/1/audita.txt
$$ ##AUDIT TRAIL=  $$ (NUMBER, WHEN, WHO, WHERE, WHAT)
(   1,<2020-10-20 12:05:06.35 +0400>,<she>,<DPX200>,
      <created by zg, POWCHK disabled, PULCHK disabled
       configuration hash MD5:
       00 E9 B6 7A A2 85 ED C7 34 08 36 98 17 FE 4E 26
       data hash MD5: 16K
       C6 D0 4A 3E BF DB 3B 57 42 20 35 18 40 AB 43 4E>)
$$ ##END=
$$ 
$$ hash MD5
$$ 1C 6E F3 DD 59 24 29 E4 A8 35 8E 06 DC C9 1C 13
##$RELAX= 
##$RELAX= 
##$RELAX= 
##$RELAX= 
##$RELAX= 
##$RELAX= 
$$ Bruker specific parameters
$$ --------------------------
##$DU= <F:/spectra>
##$EXPNO= 1
##$NAME= <H-F>
##$PROCNO= 1
##$TYPE= <nmr>
##$USER= <she>
##$AMP= (0..31)
100 100 100 100 100 100 100 100 100 100 100 100 100 100 100 100 100 100 
100 100 100 100 100 100 100 100 100 100 100 100 100 100 
##$AQSEQ= 0
##$AQ_mod= 1
##$AUNM= <au_zg>
##$AUTOPOS= <>
##$BF1= 200.13
##$BF2= 200.13
##$BF3= 200.13
##$BF4= 200.13
##$BF5= 200.13
##$BF6= 200.13
##$BF7= 200.13
##$BF8= 200.13
##$BYTORDA= 1
##$CFDGTYP= 0
##$CFRGTYP= 5
##$CHEMSTR= <none>
##$CNST= (0..31)
1 1 145 1 1 1 1 1 1 1 1 1 1 1 1 1 1 1 1 1 1 1 1 1 1 1 1 1 1 1 1 1 
##$CPDPRG= <>
##$CPDPRG1= <>
##$CPDPRG2= <>
##$CPDPRG3= <>
##$CPDPRG4= <mlev>
##$CPDPRG5= <mlev>
##$CPDPRG6= <mlev>
##$CPDPRG7= <mlev>
##$CPDPRG8= <mlev>
##$CPDPRGB= <>
##$CPDPRGT= <>
##$D= (0..31)
0 1.2 0 0 0 0 0 0 0 0.06 0 0.03 0 0 0 0 0.0002 0 0 0 0 0 0 0 0 0 0 0 0 
0 0 0 
##$DATE= 1603181105
##$DBL= (0..7)
120 120 120 120 120 120 120 120 
##$DBP= (0..7)
150 150 150 150 150 150 150 150 
##$DBP07= 0
##$DBPNAM0= <>
##$DBPNAM1= <>
##$DBPNAM2= <>
##$DBPNAM3= <>
##$DBPNAM4= <>
##$DBPNAM5= <>
##$DBPNAM6= <>
##$DBPNAM7= <>
##$DBPOAL= (0..7)
0.5 0.5 0.5 0.5 0.5 0.5 0.5 0.5 
##$DBPOFFS= (0..7)
0 0 0 0 0 0 0 0 
##$DE= 6
##$DECBNUC= <off>
##$DECIM= 32
##$DECNUC= <off>
##$DECSTAT= 4
##$DIGMOD= 1
##$DIGTYP= 9
##$DL= (0..7)
0 120 120 120 120 120 120 120 
##$DP= (0..7)
150 150 150 150 150 150 150 150 
##$DP07= 0
##$DPNAME0= <>
##$DPNAME1= <>
##$DPNAME2= <>
##$DPNAME3= <>
##$DPNAME4= <>
##$DPNAME5= <>
##$DPNAME6= <>
##$DPNAME7= <>
##$DPOAL= (0..7)
0.5 0.5 0.5 0.5 0.5 0.5 0.5 0.5 
##$DPOFFS= (0..7)
0 0 0 0 0 0 0 0 
##$DQDMODE= 0
##$DR= 18
##$DS= 0
##$DSLIST= <SSSSSSSSSSSSSSS>
$$ [...]
##$SUBNAM2= <"">
##$SUBNAM3= <"">
##$SUBNAM4= <"">
##$SUBNAM5= <"">
##$SUBNAM6= <"">
##$SUBNAM7= <"">
##$SUBNAM8= <"">
##$SUBNAM9= <"">
##$SW= 16.880792210976
##$SWIBOX= (0..15)
0 0 2 0 0 0 0 0 0 0 0 0 0 0 0 0 
##$SW_h= 3378.37837837838
##$TD= 16384
##$TD0= 1
##$TE= 0
##$TE2= 300
##$TE3= 300
##$TEG= 300
##$TL= (0..7)
0 120 120 120 120 120 120 120 
##$TP= (0..7)
150 150 150 150 150 150 150 150 
##$TP07= 0
##$TPNAME0= <>
##$TPNAME1= <>
##$TPNAME2= <>
##$TPNAME3= <>
##$TPNAME4= <>
##$TPNAME5= <>
##$TPNAME6= <>
##$TPNAME7= <>
##$TPOAL= (0..7)
0.5 0.5 0.5 0.5 0.5 0.5 0.5 0.5 
##$TPOFFS= (0..7)
0 0 0 0 0 0 0 0 
##$TUNHIN= 0
##$TUNHOUT= 0
##$TUNXOUT= 0
##$USERA1= <user>
##$USERA2= <user>
##$USERA3= <user>
##$USERA4= <user>
##$USERA5= <user>
##$V9= 5
##$VALIST= <valist>
##$VCLIST= <CCCCCCCCCCCCCCC>
##$VD= 0
##$VDLIST= <DDDDDDDDDDDDDDD>
##$VPLIST= <PPPPPPPPPPPPPPP>
##$VTLIST= <TTTTTTTTTTTTTTT>
##$WBST= 1024
##$WBSW= 4
##$XGAIN= (0..3)
0 0 0 0 
##$XL= 0
##$YL= 0
##$YMAX_a= 94119
##$YMIN_a= -93622
##$ZGOPTNS= <>
##$ZL1= 120
##$ZL2= 120
##$ZL3= 120
##$ZL4= 120
##$ABSF1= 10
##$ABSF2= 0
##$ABSG= 5
##$ABSL= 3
##$ALPHA= 0
##$AQORDER= 0
##$ASSFAC= 0
##$ASSFACI= 0
##$ASSFACX= 0
##$ASSWID= 0
##$AUNMP= <proc_1d>
##$AZFE= 0.1
##$AZFW= 0.1
##$BCFW= 1
##$BC_mod= 2
##$BYTORDP= 1
##$COROFFS= 0
##$CY= 11.3945322036743
##$DATMOD= 1
##$DC= 2
##$DFILT= <>
##$DTYPP= 0
##$F1P= 16.9975609425685
##$F2P= -3.02152046262296
##$FCOR= 0.5
##$FTSIZE= 0
##$FT_mod= 4
##$GAMMA= 1
##$GB= 0.15
##$INTBC= 1
##$INTSCL= 1
##$ISEN= 128
##$LB= 0.24
##$LEV0= 0
##$LPBIN= 0
##$MAXI= 10000
##$MC2= 0
##$MEAN= 0
##$ME_mod= 0
##$MI= 1.114404
##$NCOEF= 0
##$NC_proc= 0
##$NLEV= 6
##$NOISF1= 3.799351
##$NOISF2= 2.8
##$NSP= 1
##$NTH_PI= 0
##$NZP= 0
##$OFFSET= 15.70392
##$PC= 1
##$PHC0= -10485.08
##$PHC1= 9.800892
##$PH_mod= 1
##$PKNL= yes
##$PPARMOD= 0
##$PSCAL= 0
##$PSIGN= 0
##$REVERSE= no
##$SF= 200.130013532006
##$SI= 16384
##$SIGF1= 3
##$SIGF2= 2
##$SINO= 400
##$SIOLD= 16384
##$SREGLST= <1H.CDCl3>
##$SSB= 0
##$STSI= 0
##$STSR= 0
##$SW_p= 3612.71676300578
##$SYMM= 0
##$S_DEV= 0
##$TDeff= 0
##$TDoff= 0
##$TI= <>
##$TILT= no
##$TM1= 0
##$TM2= 0
##$TOPLEV= 0
##$USERP1= <user>
##$USERP2= <user>
##$USERP3= <user>
##$USERP4= <user>
##$USERP5= <user>
##$WDW= 1
##$XDIM= 8192
##$YMAX_p= 0
##$YMIN_p= 0
$$ End of Bruker specific parameters
$$ ---------------------------------
##NTUPLES= NMR FID
##VAR_NAME=  TIME,          FID/REAL,        FID/IMAG
##SYMBOL=    X,             R,               I
##VAR_TYPE=  INDEPENDENT,   DEPENDENT,       DEPENDENT
##VAR_FORM=  AFFN,          ASDF,            ASDF
##VAR_DIM=   8192,          8192,            8192
##UNITS=     SECONDS,       ARBITRARY UNITS, ARBITRARY UNITS
##FACTOR=    0.000296,      1,               1
##FIRST=     0,             0,               0
##LAST=      2.424536,      0,               0
##MIN=       0,             -93622,          0
##MAX=       2.424536,      94119,           0
$$ Real data points
##PAGE= N=1
##DATA TABLE= (X++(R..R)), XYDATA
$$ [...]
1248A790l867L312m98j249J620K57q33q27J967j351m35J103P54k283K552l45k761
$$ 1790 -2077 1235 737 -512 1108 1365 532 -295 1672 321 -114 989 1743 -540 2012 1667 -1094
1265a094K631j121M50r01J996j188j184K472j962l08N87R61j901J587J91j897
$$ -1094 1537 416 866 -35 1961 773 -411 2061 99 -209 378 1339 -562 1025 1216 -681
1281f81P85P83j457o13L097k741Q87K78n62l41q54K782l318J639J255k455J038
$$ -681 104 887 -570 -1183 1914 -827 60 338 -224 -565 -1419 1363 -1955 -316 939 -1516 -478
1298d78R48k102K26J704j020K18o47J981k645Q43J781l457K725k47l03k85Q95
$$ -478 470 -1632 -1406 298 -722 -504 -1151 830 -1815 -972 809 -2648 77 -170 -473 -758 137
1315A37n46j393K384n78j237J112J461k501J323r7o05M66O10M30k437L658k143
$$ 137 -409 -1802 582 4 -1233 -121 1340 -1161 162 65 -540 -74 536 966 -1471 2187 44
1332D4p83K036j485L94j6J643j567o03J615o47j578K735j728p12L372l183R77
$$ 44 -739 1297 -188 206 190 1833 266 -337 1278 631 -947 1788 60 -652 2720 -463 514
1349E14o39R61o16j414L309k716L79J400j411p83J547j052q8J069n04o47m94K564
$$ 514 -125 836 220 -1194 2115 -601 -222 1178 -233 -1016 531 -521 -609 460 -44 -691 -1185 1379
1367A379l474J149J264j512J063p94J249k221J359M52k027K119R9j938J535O66
$$ 1379 -2095 -946 318 -1194 -131 -925 324 -1897 -538 -86 -2113 6 105 -1833 -298 368
1383C68k254J237m24J414j667Q94J512l470L405j533q67J603j12r2m06J367r70
$$ 368 -1886 -649 -1073 341 -1326 -432 1080 -2390 1015 -518 -1385 218 106 14 -392 975 5
1400Eq94J529L79k351K817q22p68J653j781R72j276K446j394r29K858k219J6R29
$$ 5 -889 640 1019 -1332 1485 663 -105 1548 -233 739 -537 1909 515 -414 2444 225 241 1170
1418A170m89q92J194J11l56o63J370j291q19K931l457J676N95o71j04r85J929
$$ 1170 681 -211 983 1094 738 75 1445 154 -665 2266 -1191 485 1080 409 305 -680 1249
1435A249k274Q90J101j761N73J363k117N10P32j378R58m89J756k638J140J335
$$ 1249 -1025 -135 966 -795 -222 1141 -976 -466 266 -1112 -154 -643 1113 -1525 -385 950
1451I50k994K197p14J12m6P66l28j178J432j92j385J503P65k407K555j037l64
$$ 950 -2044 153 -561 -449 -495 271 -57 -1235 197 5 -1380 123 888 -1519 1036 -1 -365
1468c65J63j25J350k268K694j118j082K074j058o64Q50M95q92O95J63r5j374J974
$$ -365 -202 -327 1023 -1245 1449 331 -751 1323 265 -399 451 946 54 749 912 817 -557 1417
1486A417j006r71K488j956R60m44N80j110l40K045k011O40R91j048m90J350j449
$$ 1417 411 -560 1928 -28 932 488 1068 -42 -382 1663 -348 292 1283 235 -255 1095 -354
1503c54M6O39P1l07p94K189k919J225P74j800J131j50N54j217Q24j42j022O32
$$ -354 -308 331 402 95 -699 1490 -1429 -204 570 -1230 -99 -249 305 -912 -88 -230 -1252 -620
1521f20R23j644Q43J196k275J491o95K28n46O60Q44k041K014p79n17L51N50q68
$$ -620 303 -1341 -498 698 -1577 -86 -781 -553 -1099 -439 405 -1636 378 -401 -918 -567 -17 -885
1539h85K32J389j180n4N18N0j359K036q47n16J344p55M16j308J901j345j06J759
$$ -885 -653 736 -444 -498 20 70 -1289 747 -100 -616 728 -27 389 -919 982 -363 -469 1290
1557A290j304J7P40k28j170J445o07QJ6P36o73q22K070k111O63M62j59l83L73
$$ 1290 -14 3 743 515 -655 790 183 191 207 943 270 -552 1518 -593 70 532 373 -10 363
1576C63M86j760J220j76l88o6J067j052k22J162j278Q8J13Q05j498J368o0j277
$$ 363 849 -911 309 133 -255 -321 746 -306 -528 634 -644 -556 -443 362 -1136 232 172 -1105
1594a105J049o23L86r87J535o75o10J376q83o52Q71L03j339J614o63R8j84L18
$$ -1105 -56 -679 -293 -1280 255 -420 -1030 346 -537 -1189 -318 -15 -1354 260 -403 -305 -489 -171
1612a71J56j450K303j235K0P87j91p10M73P05j445J213M2r4l99R68p88m08J205
$$ -171 -15 -1465 838 -397 -377 410 219 -491 -18 687 -758 455 497 403 4 972 184 -224 981
1631I81o62K36l28J366j742P57O88j772J482l01J12n23P44k31o83M95K41j027
$$ 981 319 555 227 1593 -149 608 1296 -476 1006 705 817 294 1038 807 124 619 860 -167
1649a67M96J339k308J613o62m27M85m52R03j596J526l03j089O74J64j083P26N30
$$ -167 329 1668 -640 973 311 -116 369 -83 820 -776 750 447 -642 32 196 -887 -161 369
1667C69j262R93n32K32r90R73o3r79J612j036J97m72J016r48k09J414j304N54
$$ 369 -893 100 -432 -200 -1190 -217 -280 -1259 353 -683 -486 -958 58 -890 -1099 315 -989 -435
1685d35N94o25n79J164p90M29j45M06K58j395K420k237N22J250j393Q93N1o9l34
$$ -435 159 -466 -1045 119 -671 -242 -387 19 277 -1118 1302 -935 -413 837 -556 337 388 319 -15
1704a5M79j04j56m06J491j081j89J524k032J247l53J86m59K89P61j453J151m49
$$ -15 464 360 204 -202 1289 208 19 1543 -489 758 405 591 132 421 1182 -271 880 431
1722D31m22J27P11q20L6O09n68k37J15O08j747J888o86n98R80j058Q11j296J266
$$ 431 9 136 847 27 63 672 104 -133 -18 590 -1157 731 45 -553 427 -631 180 -1116 150
1741A50l29q50J365m92r66J110l98q95J536j239R63p36M94M11j741K151j397L3
$$ 150 -179 -1029 336 -156 -1122 -12 -410 -1305 231 -1008 -45 -781 -287 124 -1617 534 -863 -830
1759h30R87l50m26N23J20p02O59n4J52o22J394r26k38R88q41M57m62J298j361
$$ -830 157 -193 -619 -96 24 -678 -19 -73 79 -543 851 -75 -313 675 -166 291 -171 1127 -234
1778b34O45O83j385Q98n2q9j42O40n28R6j03N49q77%J403k052J709n40m43L39
$$ -234 411 1094 -291 607 555 466 324 964 436 532 429 978 101 101 1504 -548 1161 621 178 517
1798E17l94O25j059R24q4n91L32N43j492Q11L09j096J116o97N67r61P01n9j072
$$ 517 123 748 -311 613 529 -62 270 813 -679 132 441 -655 461 -236 331 -630 71 12 -1060
1817a060J233n09L0k01O62j023K59O38q69K46M20M0q59J184r60J44J30J39J85
$$ -1060 173 -336 -306 -507 155 -868 -609 29 -840 -594 -174 -134 -993 191 -769 -625 -495 -356 -171
1836a71q74J644j486M21O10q11J93N40j01n10P81m50K55n96R98p34p4J366j488
$$ -171 -1045 599 -887 -466 144 -667 -474 66 -35 -545 236 -214 41 -555 443 -291 -365 1001 -487
1855d87Q82l21K17n36N50J64p62P83q4j43m44R01r60L84N28o14J33ON00j264J093
$$ -487 395 74 291 -245 305 469 -293 490 406 263 -181 720 -240 144 672 58 191 197 697 -567 526
1876E26l09l61M55j43J67r42J288r53K7N02l05k13M98l4r92J019o03L96n87P40
$$ 526 217 -144 311 168 335 -607 681 -272 -245 257 -48 -261 237 203 -789 230 -373 23 -564 176
1896A76j14r31J401j168L01N0K04n48N37J59p72O12k56K35o83J107o00j45N97
$$ 176 62 -869 532 -636 -335 -285 -81 -629 -92 67 -705 -93 -349 -114 -797 310 -290 -435 162
1915A62m24N5k17R51j282R56J18p16N92r5R4o52J075n11r6K19L40n91K15N48j275
$$ 162 -262 -207 -424 527 -755 201 319 -397 195 100 194 -458 617 106 10 229 569 -22 193 741 -534
1936e34J213m03J93l07L51J75j115J261o40j8J74L16o52L18K63q12N90j92L21
$$ -534 679 276 469 162 513 688 -427 834 194 176 350 666 14 332 595 -217 373 181 502
1955E02r49J203o01m93O74m74L01n75J051j080L14M26q31L11J77j00m72Q76o78
$$ 502 -447 756 155 -338 336 -138 163 -412 639 -441 -127 299 -532 -221 -44 -144 -616 260 -418
1974d18K32k91M49l53m19J365j491Q71k4l78P7J77J59o61Q43k47j42p2P52r78
$$ -418 -186 -477 -28 -381 -800 565 -926 -55 -79 -457 -380 -203 -44 -705 138 -109 -251 -323 429 -549
1994e49L57N05p15O84l99P64j152Q91M3r33J225n77O3oM07n19J47J26R8l15J84
$$ -549 -192 313 -402 282 -117 647 -505 386 429 -504 721 144 207 201 608 89 236 362 460 145 329
2015C29N03j236J350q06K2K17n0K02p98J191r79L2L74k75k35L92J4n50O06n23
$$ 329 832 -404 946 140 162 379 329 531 -267 924 -55 -23 351 76 -159 233 247 -303 303 -220
2035b20L32p04R90p07l23J173j352P56m04L12m50J80M47p07M58P1l67k66R37j001
$$ -220 112 -592 398 -309 -632 541 -811 -55 -459 -147 -597 -417 30 -677 -219 -148 -515 -781 156 -845
2055h45O56j01n0J66o18J251j454Q98J69p23O92o9n6k72O35n72K84n8N67p10L18
$$ -845 -189 -290 -340 -174 -792 459 -995 -97 72 -651 41 -28 -84 -356 279 -293 -9 -67 500 -210 108
2076A08N38j096J055n98M46m47N21Q2q79J161q19J17K32P5m11M84j43j96P1o6
$$ 108 646 -450 605 7 453 6 527 609 -270 891 72 189 421 496 85 569 426 230 301 235
2096B35N28j294J477q17j71P63q73L99m18N80n66J22L11l07l50O08l43n84J172
$$ 235 763 -531 946 129 -42 721 -152 247 -171 409 -157 -35 276 -31 -381 227 -116 -700 472
2115D72j053N70k99K11j25n54J060j169O82J6k20j28L85j47l73N52k64J21l04
$$ 472 -581 -11 -310 -99 -224 -778 282 -887 -205 -189 -409 -537 -152 -299 -672 -120 -384 -263 -567
2134e67P96q97M34K21n87N82m26Q28r43P10Qp12Q37k23k02K12L79o48O35l78K77
$$ -567 229 -668 -234 -13 -600 -18 -444 384 -559 151 159 -553 284 61 -141 71 450 -198 437 59 336
2155C36k39J2P80j359J328n63j32L01p9r8j05O08o23L01j83K69o36N64O8p17Q98
$$ 336 97 109 889 -470 858 295 163 464 385 287 182 790 167 468 285 554 -82 482 550 -167 731
2176G31n73K95n46O76o25j32P57q96N08l23L47o64M77p3l60K37P5n3n18R51j038
$$ 731 158 453 -93 583 -42 -174 583 -313 195 -128 219 -445 32 -41 -401 -164 -89 -142 -660 291 -747
2197g47M92j02j61K85l59P58j070O52J2k77jM16l12j69P71q92O01l84M07k22L3
$$ -747 -255 -357 -518 -233 -592 166 -904 -252 -240 -517 -518 -102 -414 -583 188 -704 -103 -487 -80 -302 -269
2218b69N38q89P17j65M7l78P64m67kO10p13M65k52M45n31L99Q9k50J52P2J56q14
$$ -269 269 -620 97 -68 -21 -399 365 -102 -104 506 -207 258 6 451 -80 319 408 158 310 382 538 -276
2240b76J130p51J72K74l36K02k16M98q02N00m6m0k03K78m4n97Q24p65L23n1J80
$$ -276 854 103 275 549 213 415 199 697 -105 395 349 309 106 384 340 -257 567 -198 125 74 254
2261B54l45qL68p32M90k50L24o20O25j84m87P04n99J98p8L32n12L68k5j93N0l6
$$ 254 -91 -99 269 -463 27 -223 101 -519 106 -78 -565 139 -460 -262 -340 -8 -520 -152 -177 -370 -320 -356
2283c56M31r36J158m92k65N61m24J66j85M92m40L79j55J75l48L17J81p35R72n31
$$ -356 75 -861 297 -195 -460 101 -323 -157 -342 150 -290 89 -66 109 -239 78 259 -476 496 -35
2303c5K19j11K96l19l3N98p98O35k74K09l07K41P4l91L81j52O7k97P29r10M64
$$ -35 184 73 369 50 17 615 -183 452 178 387 80 321 395 4 385 233 300 3 732 -178 286
2324B86R7m90M97m55O39q14M56M8n13L58k5j73p1M85p26N00l94K84k99l3N96j037
$$ 286 383 -107 390 -65 574 -240 216 264 -249 109 84 -89 -160 325 -401 99 -295 -11 -310 -343 253 -784
2346g84Q59m09j39R2J22j02j35L90m39K92j86K90n32M29N6l52M84l40L82o28Q03
$$ -784 75 -334 -473 -381 -259 -361 -496 -106 -545 -253 -439 -149 -681 -252 -196 -548 -64 -404 -22 -650 153
2367A53m55q0O54o53M86k48K33k77K70l1O9k09L39N1n83J028r62M93J04k52K58
$$ 153 -302 -382 272 -381 105 -143 90 -187 83 52 121 -88 251 302 -281 747 -215 278 382 130 388
2388C88l63O22o73L29Rp6j32M42k80j30M32o16M65m27M79n30K11L44p56N48k73
$$ 388 25 647 -26 303 312 236 104 546 266 136 568 -48 417 -10 469 -61 150 494 -262 286 13
2409A3J59l52M10k20j96L64k15j01j13M40o57N82l02l7Q9k47N52r22R60m54j48
$$ 13 172 -180 230 10 -186 178 -37 -138 -251 189 -468 114 -188 -225 -136 -383 169 -753 207 -247 -395
2430c95N00l44Ok3J61k65L17k52M42n48M23P9o25R10o60L89j05J46j05q2L77n13
$$ -395 105 -239 -233 -256 -95 -360 -43 -295 147 -401 22 101 -524 386 -274 115 10 156 51 -31 346 -167
2452a67L41k1J79m02N12k62j08K63j40J94m97P98p49L73J26m23L25k59K81l75
$$ -167 174 153 332 -70 442 180 72 335 195 389 -108 690 -59 314 440 17 342 83 364 -11
2472a1L80j55j26j2J40j42j22M45p15N95m39K58j84r9L93o97O84l78j5m6K33l53
$$ -11 369 214 88 76 216 74 -48 397 -318 277 -162 96 -88 -187 206 -491 193 -185 -200 -246 -13 -366
2494c66R8K47m07L09l08M85o32M37m7l36M61l21K97l92M32l24L6J80j45J65o9
$$ -366 -268 -21 -428 -119 -427 58 -574 -137 -184 -520 -59 -380 -83 -475 -43 -367 -331 -151 -296 -131 -200
2515b00L20n12N34l17J72p5J28J50m71P97o39K46R0k6q6R0K31m63M61k87J55k36
$$ -200 120 -392 142 -175 -3 -78 50 200 -271 526 -113 133 223 197 111 201 432 -31 430 143 298 62
2537F2L90j47j97M37m61L68l11L44m31J81K25n11L90k44J49l54M34l92Q5J02r1
$$ 62 452 305 108 545 84 452 141 485 54 235 460 -51 339 95 244 -110 324 -68 17 119 28
2558B8O2l47N23o54M04j57n1Q0p9R4m28O09n53K46q1J54j91m7L48n53M88k67J99
$$ 28 90 -257 266 -388 16 -141 -192 -112 -191 -97 -525 84 -469 -223 -304 -150 -341 -388 -40 -593 -105 -372 -173
2581a73k15K13%k78M17l72K54j87L98l06J51K23m19M08k88L29l44M16j71J1R8
$$ -173 -388 -175 -175 -453 -36 -408 -154 -341 57 -249 -98 125 -294 114 -174 155 -189 227 56 67 165
2602A65o4J02k98N96n11L27q8J3P4j32K37n03O35m40J83l6K5j4k03L96m56K80
$$ 165 101 203 -95 501 -10 317 229 242 316 184 421 -82 553 113 296 260 285 271 68 464 8 288
2624B88j56K22m17L06n4k88M46n09L67l90L45k25j58L23l69J96q9J97m19M23k94
$$ 288 132 354 -63 243 189 -99 347 -162 205 -185 160 -65 -223 100 -269 -73 -162 35 -384 39 -255
2645b55j3J04j15J94m03N54m81J87J5j48J81j53L07l81L92k47J43j59J65m5r7
$$ -255 -268 -164 -279 -85 -488 66 -415 -228 -213 -361 -180 -333 -26 -407 -15 -262 -119 -278 -113 -158 -255
2666b55M28m70L95k14K20k63J64K56n01O07m40K55j52J93n9o2K18j23Q1j73M27
$$ -255 173 -297 98 -116 104 -159 5 261 -240 367 -73 182 30 223 164 102 320 197 278 105 532
2687E32o59N82j80k48M03m25L89l64L08j96j6R8J6j31q3L10n08L82l16K02j20
$$ 532 -127 455 275 27 430 5 394 30 338 142 126 224 240 109 26 336 -172 210 -106 96 -24
2708b4J7J40m81N94n22K21j26R4j35l3K67m21L04j49J21k76L52k32r2L24l66L21
$$ -24 -7 133 -348 246 -276 -55 -181 -87 -222 -255 12 -409 -105 -254 -133 -409 -57 -289 -381 -57 -423 -102
2730a02l93N42m84K08K48l95L34j38R9j48L09k82K38j42J90k4l03P24p46N16j22
$$ -102 -495 47 -437 -229 19 -376 -42 -180 -81 -229 80 -202 36 -106 84 60 -243 481 -265 251 129
2751A29n4J96j76K53k74L00k09K01j91K38j72n0L29m33L01k39L26l48K67j1l19
$$ 129 75 271 95 348 74 374 165 366 175 413 241 191 520 87 388 149 475 127 394 383 64
2772F4M70m75L08k89K30j25n2Q2j18j8n1J85m62N83m63J44Rl31L64m21M58m45
$$ 64 534 59 367 78 308 183 131 213 95 77 26 211 -251 332 -131 13 22 -309 55 -366 92 -353
2794c53J96J3jj21L1P4k71M35l83L05l30K64j07j41M66n26L41r7J90k77J50Mj84
$$ -353 -157 -144 -145 -266 -235 -161 -432 3 -380 -75 -405 -141 -248 -389 77 -449 -108 -205 -15 -292 -142 -138 -322
2817c22L48k22K72k64L06k72J27O9q3J66l02M87n55N05j00k47L23k13K37k59K84
$$ -322 26 -196 76 -188 118 -154 -27 42 -41 125 -177 310 -245 260 160 -87 236 23 260 1 285
2838B85k34J49p7N7j43N8K91n90N97m04J50k0k8O2k36L71l36J37j84L20l82J73
$$ 285 51 200 123 180 37 95 386 -204 393 -11 139 119 91 153 -83 288 -48 89 -95 225 -157 16
2860A6J35k97K78k97J95l04L37k77JK37l23K86k98M22n06L12l7j54K18j32J65
$$ 16 151 -146 132 -165 30 -274 63 -214 -213 24 -299 -13 -311 111 -395 -83 -120 -274 -56 -188 -23
2881b3l15M03l36J99l4N8K1k00M41n52M42k09O8PR3J3j89L48l49L72l35L12j91
$$ -23 -338 65 -271 -72 -106 -48 -27 -227 214 -338 104 -105 -37 -30 63 76 -113 235 -114 258 -77 235 44
2904D4j5K56l16K90j84J82k04K87k12L6R3j90K77l27M03l81J48M4j24O7j04J98
$$ 44 29 285 -31 259 75 257 53 340 128 164 257 67 344 17 420 39 187 231 107 174 70 268
2926B68l55L82k49J09q8k0K6k89M35m56K66j69J62j40m7J96l80L77k93J84k16
$$ 268 -87 295 46 155 67 47 73 -216 219 -237 29 -140 22 -118 -165 31 -349 28 -265 -81 -297
2947b97K45j91l9K33k86K04j78L11l79L18j02j84L61l21L33l60L51k31Q9L7O7
$$ -297 -52 -243 -282 -49 -335 -131 -309 2 -377 -59 -161 -345 16 -305 28 -332 19 -212 -123 -86 -19
2968a9p3n4L37m44N35l93J37O1n9J74k84L78l12K06j04R9o4nJ66k83L33k66K11
$$ -19 -92 -146 191 -253 282 -111 26 87 28 202 -82 296 -16 190 86 185 121 116 282 -1 332 66 277
2991B77k38K39j17o4K98l68L14l83L32k50M9J26l05K54j47J47k85K81k74J18j9
$$ 277 39 278 161 97 395 27 341 -42 290 40 89 215 -90 164 17 164 -121 160 -114 4 -15
3012a5p4J27l33M99n38L06j29p6J90j99J87k34K78k46J81k21K26j82j7L53n04
$$ -15 -89 38 -295 204 -334 -28 -157 -233 -43 -242 -55 -289 -11 -257 -76 -297 -71 -253 -270 83 -421
3033d21M48l48L10k04M6J31k11L26k82K25k19L02k09J28P9j75K11j34K61l98M30
$$ -421 27 -321 -11 -215 -169 -38 -249 77 -205 20 -199 103 -106 22 101 -74 137 3 264 -134 296
3054B96k66J24J14k81L08l14L61l37K16n6K9p2K3J27l28L97l63K17j60J08N8k55
$$ 296 30 154 268 -13 295 -19 342 5 221 165 194 122 145 272 -56 341 -22 195 35 143 201 -54
3076e4M26m38K42j84J01r5K4N8j50J58j99K05l35L97l09O0J39l14K84k71L28l05
$$ -54 372 -66 176 -8 93 -2 22 80 -70 88 -111 94 -241 156 -153 -93 46 -268 16 -255 73 -232
3098b32J92j00j02J14q0R4j92L56l65K84j06j1Ln7K78m37N21l12J16Qk6J01j54
$$ -232 -40 -140 -242 -128 -208 -114 -306 50 -315 -31 -137 -148 -145 -202 76 -361 160 -152 -36 -28 -54 47 -107
3121a07K58k51J85j10J95j71J57M6k29L33l13K79k86K63q9j13K63k92K57j86K33
$$ -107 151 -100 85 -25 170 -1 156 202 -27 306 -7 272 -14 249 160 47 310 18 275 89 322
3142C22k78J91j02J2K6o0J60l67M74m50J69J7j20K00l00K84l09K40k22J22j12
$$ 322 44 235 133 145 171 111 271 -96 378 -72 97 114 -6 194 -106 178 -131 109 -113 9 -103
3163a03O2j1k38L66l80K76k59J78j56M7J35l24L77k31J47k13J62p0m9K09k13K14
$$ -103 -41 -52 -290 76 -304 -28 -287 -109 -265 -218 -83 -407 -30 -261 -114 -327 -165 -235 -284 -75 -288 -74
3185g4k53L70l77K21Nj22K62k08J90k25L31k40J36j3%P5q7K37l15L11k29J74l8
$$ -74 -327 43 -334 -113 -108 -230 32 -176 14 -211 120 -120 16 3 3 78 -9 228 -87 224 -5 169 131
3208A31k0J91l47M41l51J91j15J07p5M5Q9k61L12l15K99k60J77J2k21K09k15J60
$$ 131 111 302 -45 396 45 236 121 228 153 198 287 26 338 23 322 62 239 251 30 239 24 184
3230A84k44K88k39J26rj60K03k55K35l09K35j23K5M0j17J02k27L49l84K23j22
$$ 184 -60 228 -11 115 106 -54 149 -106 129 -180 55 -68 -43 -3 -120 -18 -245 104 -280 -57 -179
3251a79J1P7r0J12k07L23k93J92j34J47j46m1K31k98L57k61K64j90K8J19j94K03
$$ -179 -168 -91 -181 -69 -276 47 -246 -54 -188 -41 -187 -228 3 -295 62 -199 65 -125 -97 22 -172 31
3273C1j51K22j66K84k69J28N2j48K52l01L62l11K35p1l7Q3l2J02k78L66k98J72
$$ 31 -120 102 -64 220 -49 79 131 -17 235 -66 296 -15 220 149 112 195 163 265 -13 353 55 227
3295B27r2RM9j06J62k20K21l03K02j10L7J39l12K60k59J46j59J68k04J11Lj45
$$ 227 135 144 193 87 249 29 250 -53 149 39 76 215 -97 163 -96 50 -109 59 -145 -34 -31 -176
3317a76K01k45K72l25K54p2j38K43k74J66j39K36k74J93q9l3Q0k4J22k53L91l21
$$ -176 25 -220 52 -273 -19 -91 -229 14 -260 -94 -233 3 -271 -78 -167 -200 -120 -144 -22 -275 116 -205
3339b05K19j57N4J21j82K07k49K81j97J30l7O2O4j29K12j87J46j44K66j97N1O5
$$ -205 14 -143 -89 32 -150 57 -192 89 -108 22 -15 47 111 -18 194 7 153 9 275 78 129 194
3361A94j61K92l00K18j82J66l8r6J28q2P6j15J81l22K72j00k6Q3k38K67l28L01
$$ 194 33 325 25 243 61 227 189 93 221 139 215 100 281 -41 231 131 105 188 -50 217 -111 190
3383A90k54J6RpQ0j54J55k49K31j73J39j48O7J00k76L76l71K34j42K9Oo6J57j95
$$ 190 -64 -48 -39 -46 34 -120 35 -214 17 -156 -17 -165 -98 2 -274 102 -269 -35 -177 -148 -142 -208 -51 -246
3407b46J15j13K43k27J77p2rP9j14K35l21L90k91J75P9j57J89k10K26j90K18j27
$$ -246 -131 -244 -1 -228 -51 -123 -132 -53 -167 68 -253 137 -154 21 100 -57 132 -78 148 -42 176 49
3429D9L3q9R3O4j07K92m17L11j45J07J5j02J45k39K88k51J35p8J31j36l7J48j66
$$ 49 82 -7 86 150 43 335 -82 229 84 191 206 104 249 10 298 47 182 104 235 99 62 210 44
3452D4R2j39J71j78R3kj26J71k39J93j97J33o8n3J38k14J36j61J82k36J62j40
$$ 44 136 -3 168 -10 83 81 -45 126 -113 80 -117 16 -52 -105 33 -181 -45 -206 -24 -260 -98 -238
3474b38J39n7m5J72l36L24k56J63m5pJ4k7J03j33K35j84J82j79J47Mj00J70j75
$$ -238 -99 -156 -201 -29 -365 -41 -297 -134 -179 -186 -172 -199 -96 -229 6 -178 4 -175 -28 -24 -124 46 -129
3497a29J91j54J32q7P9K3q2J53j42J79j85J95j11LJ21j02Q2j33K80l16K48p5o5
$$ -129 62 -92 40 -47 32 55 -27 126 -16 163 -22 173 62 65 186 84 166 33 313 -3 245 170 105
3520A05O2j29J62j72J26j32R1r4J23m3m3J13k86K53k08J30j06R4p6j42K29k02
$$ 105 167 38 200 28 154 22 113 19 142 99 56 169 -117 136 -72 58 -48 46 -30 -172 57 -145
3542a45J70j91J76j49QQ0j16J05j47K19k40K00j57L3M6p8J76k38K60j51J41r2
$$ -145 25 -166 10 -139 -131 -51 -167 -62 -209 10 -230 -30 -187 -154 -108 -186 -10 -248 12 -139 2 -90
3564i0J2L1n7J83k44K44j47P5%L4Mj41L28k69K54j80R5l2M2kj07K01j67J36j74
$$ -90 -78 -47 -104 79 -165 79 -68 7 7 41 45 -96 232 -37 217 37 132 100 142 140 33 234 67 203 29
3589B9J79r7L6N5j32J35j58J78j07L5m5k5J10j53K5j11K76l34J91p0n3O3j54K43
$$ 29 208 111 147 202 70 205 47 225 118 153 108 83 193 40 65 -46 230 -104 87 17 -36 27 -127 116
3613A16k38J55j36QjL1mo2J11j65J01n8J07j03l9J42k32K47j89J38j12N6l2j8
$$ 116 -122 33 -103 -95 -96 -65 -69 -131 -20 -185 -84 -142 -35 -138 -177 -35 -267 -20 -209 -71 -183 -127 -159 -177
3637a77J35r6J31j48J83j77J74q1o9K03j62J77j93K06n6j0M6p3J20j11J05j05
$$ -177 -42 -138 -7 -155 28 -149 25 -56 -125 78 -84 93 -100 106 50 40 86 13 133 22 127 22
3659B2K01j83J00m2k8J31j57K19k60J90j09O1r4kJ71k03R6q0J02r4J03j10m0R4
$$ 22 223 40 140 98 70 201 44 263 3 193 84 145 51 49 220 17 113 33 135 41 144 34 -6 88
3683H8j62K33k97K41j64MQ8j67J56j48J76j95J61j45J1o6J03K2j00J52k40K36
$$ 88 -74 159 -138 103 -61 -57 31 -136 20 -128 48 -147 14 -131 -120 -186 -83 -61 -161 -9 -249 -13
3705a3j53N1%q1J66j53J79j77J34p4L5okQ6j34J87j53J70j00Q5qo5J35j38J99
$$ -13 -166 -115 -115 -196 -30 -183 -4 -181 -47 -121 -86 -92 -94 -8 -142 45 -108 62 -38 47 39 -26 109 -29 170
3730A70j70J60n2m9R0o4P9j53K18k23J88r6l2Q3r6J83k48J93j55P3n0J9M2j45
$$ 170 0 160 108 59 149 85 164 11 229 6 194 98 66 149 53 236 -12 181 26 99 49 68 110 -35
3754c5J25j49J77j55J00j10N9J6r2J38j86J55j81Q7n7r3J25o3J49j25R2j55J57
$$ -35 90 -59 118 -37 63 -47 12 28 -64 74 -112 43 -138 -51 -108 -201 -76 -139 10 -115 -23 -178 -21
3777b1j47N5J5o1J64k29J84j47J62j6j00Q2r7J36j55K18j41J39o9K5M8j25J59
$$ -21 -168 -113 -98 -159 5 -224 -40 -187 -25 -41 -141 -59 -156 -20 -175 43 -98 41 -28 -3 45 -80 79
3800G9j85K08r4N5lj1P0n2P5j13J21r3R6r0L1N9j37K01j55J34j79J62j24J2J24
$$ 79 -106 102 8 63 60 49 119 67 142 29 150 57 153 63 94 153 16 217 62 196 17 179 55 67 191
3825A91j29J27k08K06j38nMPl7m2J24j69J86k15J64j35MQ4j83J69k32K29j11Q0
$$ 191 62 189 -19 187 49 44 48 55 18 -24 100 -69 117 -98 66 -69 -65 19 -164 5 -227 2 -109 -29
3849b9j27L4N0j14J73k08K06j53P1j9o9J37j19J72j60J58j07P1Om2Q2j03J06q1
$$ -29 -156 -122 -72 -186 -13 -221 -15 -168 -97 -116 -185 -48 -167 5 -155 3 -104 -33 -27 -69 13 -90 16 -65
3873f5J57j34Q9l4k4J22j28J78j67J67j54R9M8j31Q7r1K12j46J07r3Q0m8j1P2
$$ -65 92 -42 47 13 -11 111 -17 161 -6 161 7 106 154 23 110 19 231 85 192 99 179 131 120 192
3897A92j33J31j89J57r4M0mp5R3j29J35j86J62j01L7n6n8J19j60J73j80J44j45
$$ 192 59 190 1 158 64 104 100 25 118 -11 124 -62 100 -1 36 -20 -78 41 -119 54 -126 18 -127
3920a27P3l2j10J98j46R8j26J46j46Q2jm1O4r8J72k07J44j11R9L6p1J30j04J15
$$ -127 -54 -86 -196 2 -144 -46 -172 -26 -172 -90 -91 -132 -68 -166 6 -201 -57 -168 -69 -33 -104 26 -78 37
3944C7j08P4q3J03k7j6J18j17J30j19J36j45Q1L0l4Q8j31J47n5M3l4L5j4r3J86
$$ 37 -71 3 -80 23 -4 -20 98 -19 111 -8 128 -17 64 94 60 148 17 164 109 152 118 153 139 46 232
3969B32k12J47j08J36q3l7R1j31R7j08J25j49R0o8j8O4o2P7j96J56j81J39q6m2
$$ 232 20 167 59 195 112 75 166 35 132 24 149 0 90 22 4 68 6 83 -113 43 -138 1 -85 -127
3993a27J17j44J78k20J78j00P6q8L1Q2j24J12j05J30k29K40j08rP7j35K09k12
$$ -127 -10 -154 24 -196 -18 -118 -42 -130 -99 -17 -141 -29 -134 -4 -233 7 -101 -110 -33 -168 41 -171
4015a71J89j26M0M7j8L0l4J21j59J80j53J12p4J8J02j59K48j58N3k9L7m3QL3o1
$$ -171 18 -108 -68 -21 -39 -9 -43 78 -81 99 -54 58 -16 2 104 -55 193 35 88 59 96 53 61 94 33
4040C3J53k09K32j61J31j04K7N0j25K05k11J41j32P3o0o1J02q5M6o4O8j19P6O
$$ 33 186 -23 209 48 179 75 102 152 27 232 21 162 30 103 43 -18 84 -1 45 -19 49 -70 6 12
4064A2o9J03k12K02j74J52j42L3J2m2J04j93K09j71J30n3Rk9K8K9p5J32j99J99
$$ 12 -57 46 -166 36 -138 14 -128 -95 -83 -125 -21 -214 -5 -176 -46 -99 -90 -119 -91 -62 -137 -5 -204 -5
4088ej21P9k6j7J52j65J17j21J23o3R1l4k3J23j45J53j53J40j05J06m2q6J40j08
$$ -5 -126 -47 -73 -90 62 -103 14 -107 16 -47 44 10 -13 110 -35 118 -35 105 0 106 64 -22 118 10
4112A0K22k16J53p4M5Nn5P4j33J10j52K36j99Q6J2r1J08j40J04j25J31j51R1R
$$ 10 232 16 169 95 140 145 90 164 31 141 -11 225 26 112 124 33 141 1 105 -20 111 -40 51 60
4136F0p7L9r2J70j52Q1j57J27p1o6J42k16J99j33R1m7oL1L6J3j46J57j90J57r3
$$ 60 -17 22 -70 100 -52 29 -128 -1 -72 -138 4 -212 -13 -146 -55 -102 -108 -77 -41 -28 -174 -17 -207 -50 -143
4161a43Q5ll8J53j73J50j44P1J8J3J8m0J02j29J34j06J43o6O5l8k8P7j39J67j49
$$ -143 -58 -61 -99 54 -119 31 -113 -42 -24 -11 7 -33 69 -60 74 -32 111 45 110 72 44 121 -18 149 0
4186@J55r3K0Q4q2J00j43J77j40J20j01kN1q7R8j38J80k22J17r4Q0j9j36J68j49
$$ 0 155 62 82 166 84 184 41 218 78 198 97 95 146 59 157 19 199 -23 94 0 80 61 -75 93 -56
4211e6J34q2M9p3j0om4J31j76J70j73P5J4m1N5j03J27j56J97j66P2o7J9L4j7Q1
$$ -56 78 -4 45 -28 -38 -44 -88 43 -133 37 -136 -61 -47 -88 -33 -136 -9 -165 32 -134 -62 -129 -110 -76 -93 -12
4237a2j00J26j25Q5l2j5J26j87J60j21J36l2L4Jo4O1p7J59j21J56j61P4nJ4K8
$$ -12 -112 14 -111 -26 -58 -73 53 -134 26 -95 41 9 43 44 -20 41 -36 123 2 158 -3 71 66 80 108
4262A08j07J18j27J80j03J8m6NO9q4J12j16Q7j13R2o9n3J32j74K14k01J45j12
$$ 108 1 119 -8 172 69 87 41 46 115 31 143 27 114 1 93 24 -29 103 -71 143 -58 87 -25
4285b5O8qj02J07j09R8j00J24j38K0Pm5Q1j27J32j40J55q4o7Q2o1O5j01J47r1
$$ -25 43 35 -67 40 -69 29 -71 53 -85 -65 -58 -103 -22 -149 -17 -157 -2 -86 -153 -71 -132 -67 -168 -21 -112
4310a12N6l0M7n7JN8n8J68j61J10q9R2n7m5J24q6J24r7J52j52R9p8N9K5q9J42
$$ -112 -56 -86 -39 -96 -95 -37 -95 73 -88 22 -67 25 -32 -77 47 -39 85 -12 140 -12 87 9 68 93 4 146
4336A46j44J59j20M1R7j07J06j18M9j17J21o1N2Mj13J14m2Q7j87J44q5k2P1j47
$$ 146 2 161 41 82 179 72 178 60 109 -8 113 52 104 108 -5 109 67 154 -33 111 26 4 75 -72
4360g2J71q7M7j09R3r4N3l8k2N8j20J65j92J25n8k%p2J59j07P0p3O8l2n0J9j6
$$ -72 99 12 59 -50 43 -51 2 -36 -58 0 -120 45 -147 -22 -80 -82 -82 -154 5 -102 -32 -105 -37 -69 -119 -100 -116
4387a16P2p7J60j80J61q9R0m5o7J93j77J04n2R2p2N2j1m1J15j34J32j10J64l4
$$ -116 -44 -121 39 -141 20 -69 21 -24 -91 102 -75 29 -23 69 -3 49 38 -3 112 -22 110 0 164 130
4411A30p9M3n6J19j49J21q9J25o2n0J7k3J07j37J33j60J24o8j9J6l6R6j24J19
$$ 130 51 94 38 157 8 129 40 165 103 53 70 47 154 17 150 -10 114 46 27 43 7 103 -21 98
4435I8j84R4rk6N4j07J60k05O2l0K9o6P9L2r4J08j02R2j21M3Q0n5O2r9J05j17
$$ 98 -86 8 -1 -27 27 -80 80 -125 -63 -93 -64 -130 -51 -19 -113 -5 -107 -15 -136 -93 -13 -68 -6 -105 0 -117
4461a17O1q2J42q5QO4r2J35j28J05p3N4J8k3O2m4L1o1J35r2Q1m6pM4o3J30j49
$$ -117 -56 -138 4 -81 -73 -9 -101 34 -94 11 -62 -8 10 -13 49 5 36 -25 110 18 99 53 46 90 27 157 8
4488HJ66j26J19n5m4P8r1R5j16O6k9P2l8o5K4l9J00j42Q3q5R7p3oK6m9P7j20J21
$$ 8 174 48 167 112 68 146 55 150 34 100 71 143 105 40 64 25 125 -17 66 -19 78 5 -1 25 -24 53 -67 54
4516E4n8k1pj1L8r2Q1j52J84j23P4l7m1J35k24J14l1P3n2J6K8QM2j21J28j29J47
$$ 54 -4 -25 -32 -43 -5 -97 -16 -168 16 -107 -33 -70 -111 24 -200 -86 -117 -44 -96 -80 -52 -44 -2 -123 5 -124 23
4543B3j07KQmJ50j12O4m3J04j20M6K0k6Q6r2R6p0Q3l9O9k3k6O8j34J14j69J60
$$ 23 -84 -82 -74 -78 72 -40 24 -19 85 -35 11 31 5 91 -1 95 25 108 69 138 115 89 157 23 137 -32 128
4570A28m6N6qj01O8j14J32q0O5p5J1k1j6M0q4R5r2J42j53N0oo9O4o7K6m8P2n9
$$ 128 82 138 130 29 97 -17 115 35 100 25 36 15 -1 39 -45 50 -42 100 -53 -3 -9 -78 -14 -81 -55 -103 -31 -90
4598i0O8q7K3P1j05P5j23J66j14M8K6r9J35j76J44r7J11o4P8l1j6K5o2J26j07
$$ -90 -22 -109 -86 -15 -120 -45 -168 -2 -116 -68 -42 -141 -6 -182 -38 -135 -24 -88 -10 -41 -57 -32 -94 32 -75
4623g5R5o9K6N7J2J1j04J33j20R5k0k4kLJ15j35J36q5O8l4m0M7l2P3j27R2m4L1
$$ -75 20 -49 -23 34 46 57 -47 86 -34 61 41 17 15 18 133 -2 134 49 117 83 43 90 58 131 4 96 52 83
4651H3r9J12j6l8R4j20J00j66J00p0PM5j07Q1m3Q2j34M8lk9M4l4L9j04J41j27
$$ 83 -16 96 80 42 136 16 116 -50 50 -20 -13 32 -75 6 -37 45 -89 -41 -44 -73 -29 -63 -24 -128 13 -114
4677a14J19l3m4K7p5R8j34J49j09J01o2L1L8n2N6q8J13p1P1n9L7qj0Q6j32J52
$$ -114 5 -28 -72 -45 -120 -22 -156 -7 -116 -15 -77 -46 -8 -60 -4 -92 21 -50 21 -38 -1 -9 -19 67 -65 87
4703H7j29Q6k5L0K4r6J22r9J07m9K1k5J1O8m6N6j48J21r1O9j8l5P1j11N5o8J38
$$ 87 -42 44 19 49 73 -23 99 0 107 58 79 54 65 133 87 143 -5 116 25 94 76 41 112 1 56 -12 126
4730A26r6Ql1N6J6j28R5o8P3p4L9m0o0J26j17L9j2N5q7N0m2l5Q7r6O6p7J28r7
$$ 126 30 38 7 63 79 -49 46 -22 51 -23 16 -24 -84 42 -75 -36 -48 7 -80 -30 -72 -107 -20 -116 -50 -127 1 -96
4758i6L2J1q7R9p6J68j33N7moRk2L1p7R6m4J31p2k8k9P3M6j31J33p7J01o6O9j6
$$ -96 -64 -53 -140 -41 -117 51 -82 -25 -29 -35 -26 -48 -17 -94 2 -42 89 17 -11 -40 33 79 -52 81 4 105 39 108 92
4787I2m6%l5N4m6J24j03M3rj7Q5p4Q7j39J32j35PJ7oL1o9N1m8P0p6J8l0PJ3n1
$$ 92 46 46 11 65 19 143 40 83 74 57 142 68 155 16 148 13 20 37 31 62 -7 44 -4 66 -10 8 -22 -15 -2 -53
4817e3P2q4J7jQO3j19O6q4J00q5J5j4p2J04l2Q1n0K3m7O1m8O2m6k0P4m9Q8p6L0
$$ -53 19 -65 -48 -49 -41 22 -97 -31 -115 -15 -100 -85 -99 -171 -67 -99 -18 -68 -45 -92 -31 -79 -17 -63 -83 -9 -58 30 -46 -16
4847a6j1pQ5m8Oq5J78j14M8k9pM7k9J17j19R3j20J11n9P0rk5k2m6Q1n1Q7o4Po
$$ -16 -27 -34 51 3 9 -76 102 -12 36 7 0 47 18 135 16 109 -11 100 41 111 102 77 55 9 90 39 126 62 69 63
4877F3n2Q2n9P3r7L4n0J2j1n0J20j52J23j06P6pl8L1j14J15p4O8o7N1L4m8l1o8
$$ 63 11 93 34 107 10 44 -6 6 -5 -55 65 -87 36 -70 6 -1 -39 -8 -122 -7 -81 -13 -80 -29 5 -43 -74 -142
4905a42J00l9N7n8P3j02P8Ko9R7p9R8o8L1J1k1P7p6L6m6J32j54J19m0l5R4o6P8
$$ -142 -42 -81 -24 -82 -9 -111 -33 -31 -100 -3 -82 16 -52 -21 -10 -31 46 -30 6 -40 92 -62 57 17 -18 76 10 88
4933H8r3J22q0K8mP3o9l5Q4j20J24r1L6K0n5O9p3Q5j06J05r5Q1n1j9L2p3J02j41
$$ 88 -5 117 37 65 61 134 65 30 114 -6 118 27 63 83 28 97 24 109 3 108 13 94 43 24 56 -17 85 -56
4961e6J34p1jj7JM3p1J7PL2o6Mk2m5P3l9L5n4L9l6L5l0oO0o9J08j05R1p1L5K8
$$ -56 78 7 6 -11 -10 33 -38 -21 -14 18 -48 -44 -66 -111 -38 -77 -42 -96 -57 -93 -58 -88 -94 -34 -103 5 -100 -9 -80 -45 -17
4992a7j08J66j00P9m5k4oR1j8l0J7J6Q7j22Q3m6J2O1r4O3l0P3r7R1m4J4PK3Ln3
$$ -17 -125 41 -59 20 -25 -49 -55 36 18 -12 5 21 108 -14 69 23 35 96 2 65 35 108 11 102 58 72 79 102 105 52
5022E2L0r0J35q1j7pJ5K7q0R7p5P6k5ll9l1O1o6R1j11Q4r6J1N0j9j3j05Q6p4R8
$$ 52 82 -8 127 46 29 22 37 64 -16 81 6 82 57 54 15 -16 45 -21 70 -41 43 -53 -42 8 -11 -24 -129 -43 -117 -19
5052a9j9njo7J07j27J27q7pL1N2l7l8M7p5J13o3O4nk7lm2P8m5R4n0P5q4N8K8q2
$$ -19 -38 -43 -44 -111 -4 -131 -4 -91 -98 -67 -15 -52 -90 -43 -118 -5 -68 -4 -9 -36 -39 -81 -3 -48 46 -4 71 -13 45 73 -9
5083iJ13r4O0l8O4k7pJ9l1O2j02J00p6P7j05N7J5l7K2r8J02l4JK9J2p0%O5j24
$$ -9 104 10 70 32 96 69 62 81 50 112 10 110 34 111 6 63 78 41 63 -35 67 33 34 63 75 5 5 70 -54
5112e4R9n6j5M3o1K8j53J67j31R7n5M5K2k8J1l7J06j09O8r1Q2r2N1K5kKj9O9j24
$$ -54 45 -11 -26 17 -44 -16 -169 -2 -133 -36 -91 -46 -24 -52 -41 -78 28 -81 -13 -104 -22 -114 -63 -38 -40 -38 -57 12 -112
5141a12J15n3j5R8j28O4m4N6p4J20j0l3O5q3O4n3N8k9N9J8q0O7k0Q6j37Q7m1R4
$$ -112 3 -50 -65 33 -95 -31 -75 -19 -93 27 17 -16 49 -34 30 -23 35 6 65 83 3 70 50 136 -1 86 45 139
5169A39j25J6M2k4Q3j10N6p6N5J3nj9j02J36j44J20j04Q0O3j13J2n2R9j10P9m4
$$ 139 14 30 72 48 131 21 77 1 56 69 64 45 -57 79 -65 55 -49 31 94 -19 -7 -59 40 -70 9 -35
5195c5K8m3%J3k6Q5j42J03m1Nm9M7l7J6M2l9M7k3M8k4m5M8m3O3o6P4o6L2J9j7
$$ -35 -7 -50 -50 -37 -63 22 -120 -17 -58 -53 -102 -55 -92 -76 -34 -73 -26 -49 -1 -25 -70 -22 -65 -2 -68 6 -60 -28 -9 -26
5225b6nm3J62j25P9nnjo7J18o8M3r6J48j03P5rj6L7j13J20q7Q7l5j5N2p0N3r6
$$ -26 -31 -74 88 -37 42 37 32 31 -36 82 14 57 -39 109 6 81 72 56 93 -20 100 13 100 65 50 102 32 85 -11
5254a1R0r3N4j6k7R2j31R6j14N7p4Q0q2P7l8rM7l3J0j41J34k0P1l6p3J02o1K1
$$ -11 79 -14 40 24 -3 89 -42 54 -60 -3 -77 3 -79 -2 -40 -49 -2 -35 -25 -166 -32 -52 19 -17 -90 12 -49 -28
5282b8q2P4m8O4Q3r1nm4O9k2N0q9O1Ol2Q4j26J23p3L9m7pP5m7N7p8P9j7Q0j43
$$ -28 -110 -36 -84 -20 63 -28 -33 -77 -8 -30 20 -69 -8 -2 -34 50 -76 47 -26 13 -34 -41 34 -13 44 -34 45 28 108 -35
5312c5J03j2k2M3o4O3l6j5P8q0J06n8L7j13Q4o8N9qK1Qq3N2j18J10n0K0j1k4J0
$$ -35 68 56 34 77 13 76 40 25 103 23 129 71 108 -5 79 11 70 62 83 91 8 60 -58 52 2 22 11 -13 -3
5341cj3N2l2k9rL8n5n6J53j65J49q5Q7j33L8K9k0L4n8L4k1Q0q4N2j6k0Q8n7Lp
$$ -3 -16 36 4 -25 -34 4 -51 -107 46 -119 30 -55 32 -101 -63 -34 -54 -20 -78 -44 -65 15 -69 -17 -33 -53 35 -22 -19 -26
5371b6N7r0J8L3L0%o6J16j03O0n0O0J8l5K0l3Q2o0O1o1%J2oN6o7M3k3L9p9P4k0
$$ -26 31 -59 -41 -8 22 22 -44 72 -31 29 -21 39 57 22 42 9 91 31 92 31 31 43 37 93 26 69 46 85 6 80 60
5402F0nLm4O6l4Po4j0P9o4N7r0Q0j05O2n5O7Kl6kJ9p0LN1m4N8J3m6K4j7Qp2P4
$$ 60 55 58 14 80 46 53 -11 -21 58 -6 51 -39 41 -64 -2 -57 10 12 -24 -26 -7 -77 -74 -23 -67 -9 4 -42 -18 -35 -27 -99 -25
5435b5q8Q5L7o8K6l4Q1j04J11r6K3R4o7L1k1N1j25J11n8R3l6K2J6j13J20o0Q6
$$ -25 -113 -28 9 -59 -33 -67 14 -90 21 -75 -52 42 -25 6 -15 36 -89 22 -36 57 21 43 59 -54 66 6 92
5462I2n6%L4n1J37j27Q1r8N3l5L2j9k0O6q9J12p3M6j3m8L7p1P7p8M6n6P0k0l3
$$ 92 36 36 70 19 156 29 110 12 65 30 62 43 23 89 0 112 39 85 72 24 61 -10 67 -11 35 -21 49 29 -4
5491dK2n7R3p7R8k07Q7KM1m9j6O4j09J18p9jl1Q1Jq1R8n0K7rM2j07O2k9J1P3p1
$$ -4 18 -39 54 -23 75 -132 -45 -43 -2 -51 -67 -3 -112 6 -73 -74 -105 -24 -23 -104 -6 -56 -29 -38 4 -103 -41 -70 -59 14 -57
5522e7N1m4R0l9K9l6rM3n6P6o5R7q1L5j4k1P0p8Q0k6J9L3o6O8j07J03k4L4n6M3
$$ -57 -6 -50 40 1 30 -6 -15 28 -28 48 -17 80 -1 34 20 -1 69 -9 71 45 64 97 31 99 -8 95 71 105 49 92
5552I2m5Ln3K7Q4o4om8L4oK4k7l1Q3j17M6J4nn0k7J4l5Q0n7P6q6Q1q1J8L5j07
$$ 92 47 50 -3 24 108 44 38 -10 24 18 42 15 -16 67 -50 -4 10 5 -45 -72 -58 -93 -13 -70 6 -80 1 -80 -62 -27 -134
5583a34J31p0J8l8L8L3m8O1j13J45j07R2p5P2k2pO2o7M7m3J31j66N5L2k1M7k3
$$ -134 -3 -73 -55 -93 -55 -22 -70 -9 -122 23 -84 8 -67 5 -17 -24 38 -29 18 -25 106 -60 -5 27 6 53 30
5610C0L5n3L2rN0m2l6K4j4O8j31J96p6k7l0m4N1j2L6m9O7r4N7L2n1N5p4Q5p4J04
$$ 30 65 12 44 35 85 43 7 31 17 85 -46 150 74 47 17 -27 24 12 48 -1 66 -28 29 61 10 65 -9 76 2 106
5640A06j52L1L7j8N6j17P9p0M2l6qM6m6M1l8n2L0J9j0J7J8m4N9j23J39p0N9m1
$$ 106 -46 -15 22 4 60 -57 22 -48 -6 -42 -50 -4 -50 -9 -47 -99 -69 -50 -60 -43 -25 -69 -10 -133 6 -64 -5 -46
5668d6QqKP2p6K6m2N3m2N6j3m1Q1n7R5p1L2k9M5J6p1J34j65J43j25J22n0J1j9
$$ -46 -38 -46 -44 28 -48 -22 -64 -11 -53 3 -10 -51 30 -27 68 -3 29 0 45 61 -10 124 -41 102 -23 99 49 60 41
5697D1j9N1k5j0m9Q2k5n9M4L7L2j32R7o9O1o8JN1n5N3p1J7m8M8m2P9pn2L8q2Q6
$$ 41 22 73 48 38 -11 71 46 -13 31 68 100 -32 65 -4 57 -11 -10 41 -14 39 -32 -15 -63 -15 -57 22 15 -37 1 -81 5
5728Em6L4n6L9j9n2R2j37R6l2O8p2L7kK2k7m8J01p6L0M4k6O7o2J5lP7n4M5o9J7
$$ 5 -41 -7 -63 -24 -43 -95 -3 -140 -44 -76 -8 -80 -43 -45 -23 -50 -98 3 -73 -43 1 -25 42 -20 -5 -8 69 15 60 -9 8
5759HRJ4N5j06J48r5oj2Q7k2o7J17o1K4j07P6kj2K6q4R9o8N2m2K9p1L9k8NL0m5
$$ 8 17 31 86 -20 128 33 27 15 102 80 13 130 69 93 -14 62 60 48 74 -10 89 21 73 31 60 -11 28 0 5 35 -10
5790a0M7r2M6J5k6J6L0l3k9P6j19QL3L8ll0Q2j50J32j05K7l4jL6o6Q7j8M0o7N7
$$ -10 37 -55 -9 6 -20 -4 26 -7 -36 40 -79 -71 -38 0 -3 -33 49 -101 31 -74 -47 -81 -82 -46 -112 -25 -43 -3 -70 -13
5820a3oj8M8q1J24m6j5o0J16l6k7M2r3J55q4K7pN0n2lK5k6R4o6O3j04P0k7k0J9
$$ -13 -19 -37 11 -70 54 8 -7 -67 49 13 -14 28 -65 90 6 33 26 76 24 21 46 20 114 48 111 7 77 50 30 49
5850D9m2P6j7R0j05j%l6nj0J1k3J9l9J05q4p2J36o6J8m7L5l4j5N5l3J8j9K3p4
$$ 49 7 83 66 156 51 50 50 14 9 -1 10 -13 6 -33 72 -12 -84 52 -14 4 -43 -8 -42 -57 -2 -35 -17 -36 -13 -87
5880h7J6J4jJ7l8M5J4K0o1J3K3M5n1M2J4l5M0p4P2p9k0O7k5M9m0N3m6L9n2L4M
$$ -87 -71 -57 -58 -41 -79 -34 -20 0 -61 -48 -25 20 -31 11 25 -10 30 -44 28 -51 -71 -4 -29 20 -20 33 -13 26 -26 8 12
5911A2K0Lj6J5J5J4K1m2M4K1k3j19J71j05N9n1N5l0k3N7r4J14j47O9m2O1l2j2
$$ 12 32 35 19 34 49 63 84 42 86 107 84 -35 136 31 90 39 94 64 41 98 4 118 -29 40 -2 59 27 15
5939A5qj5Mm5N2p2R1m4m5K0MJ10j13M4J0o5O8o5O3p0N5q5M5l4o4J18k2N4m2k6
$$ 15 7 -8 -4 -49 3 -69 22 -22 -67 -47 -43 67 -46 -2 8 -57 11 -54 9 -61 -6 -91 -46 -80 -144 -26 -48 6 -36 -62
5969f2J3M5j7LK3l8P5l8j2k5N3l2RJ07j47J43r9O9qrK1l6O6l1N7j25Q9o0J8JQ
$$ -62 -49 -4 -21 -18 5 -33 42 4 -8 -33 20 -12 -3 104 -43 100 1 70 62 53 74 38 104 73 130 5 94 34 52 53 61
6000F1rn1J05j05K8Rj7l9Q5j4o0R8l9k2k8O3Qm7L5q9M2o4J00m1m0j1l8P1n1L6
$$ 61 52 1 106 1 29 38 21 -18 67 53 -7 91 52 30 2 65 73 26 61 -28 14 -50 50 9 -31 -42 -80 -9 -60 -24
6030b4m4R5p6O4j0l5l1OL7p1R1o5J3J5j5O9m4N1o5P4q3O8Pn5P4m4J7o3R0l8J5
$$ -24 -68 27 -49 15 5 -30 -61 -55 -18 -89 2 -63 -50 -35 -50 19 -25 26 -39 35 -48 20 27 -28 46 2 19 -44 46 8 23
6061B3L6o2J9l0O5p0O2Rm4J7oN7o7O2o0L0m5N9n7%K2L7l6l4Q3p1J0KJ6K0k2J3
$$ 23 59 -3 16 -14 51 -19 43 52 8 25 19 76 9 71 11 41 -4 55 -2 -2 20 57 21 -13 70 -1 9 11 27 47 25 38
6093C8p0N8m0k1j9K0K9n0LNN5n5L6m6J0J2n8R6n7O3r7M3J3k7L2m9J27j31R5J6
$$ 38 -32 26 -14 -35 -54 -34 -5 -55 -52 -47 8 -47 -11 -57 -47 -35 -93 3 -54 9 -88 -45 -32 -59 -27 -76 51 -80 15 31
6123C1k2k4NM9p6J11j12R0o3k5R0q7P0k8%O3q7P2k5Jl6J2O8k7m4K4n5M9M3n4O6
$$ 31 9 -15 -10 39 -37 74 -38 52 -11 -36 54 -33 37 9 9 72 -15 57 32 33 -3 9 77 50 6 30 -25 24 67 13 79
6154G9o2M1j0K7j1j03N1j4N3o6N3q7L3j0N6Nj01O7l4Q3q3J4k8J3M7q7L8k7P6o2
$$ 79 17 58 48 75 64 -39 12 -2 51 -15 38 -49 -16 -26 30 35 -66 1 -33 50 -33 -19 -47 -34 13 -74 -36 -63 13 -49
6184d9K0k5nJ5K0k5m9J35j21R4l9l5J15n6K1p7O3j7O1mo7M2j6M6m6J38j21K7m2
$$ -49 -29 -54 -59 -44 -24 -49 -98 37 -84 10 -29 -64 51 -5 16 -61 2 -15 46 42 -25 17 1 47 1 139 18 45 3
6213CL0K3n4L7o5O6k9J8K4k4M5j9j3j5O3n8K3j1n0Q7p2N2n5J7M6j3k9m5J8j9N5
$$ 3 33 56 2 39 -26 40 11 29 53 29 74 55 42 27 90 32 55 44 -6 81 9 61 6 23 69 56 27 -18 0 -19 36
6244C6n8N5m4j6J1l9L7l0QoJ10j08rNK4j8p3J34n6J1kQK0n6N2j27j6Q5J01j6j7
$$ 36 -22 33 -11 -27 -16 -55 -18 -48 -40 -46 64 -44 -53 -48 -24 -42 -115 19 -37 -26 -28 -20 0 -56 -4 -131 -147 -62 39 23 6
6275Fj5k1P3m0K3k0k0M2jj0o5R9o2M5j35K19j38N9oj5O8n8jm1R2n9J0L8p2Q8p1
$$ 6 -9 -30 43 3 26 6 -14 28 27 17 -48 51 -11 34 -101 118 -20 39 33 18 86 28 27 -14 78 19 29 67 -5 83 12
6306A2M6l1Q2r2p2L3J4M6o3O7m2K9k3j3k5L5ml1L1n3mk3pJ13p4K6l4kqP3q7R4
$$ 12 58 27 109 17 -55 -22 -8 38 -25 42 0 29 6 -7 -32 3 -1 -32 -1 -54 -58 -81 -88 25 -49 -23 -57 -59 -67 6 -81 13
6338A3j5r8J15j30J22r9O2K7mk6M2j3l3M2n6P1k5Jj8L9ml5R9j02Q7l3l7oM3P6
$$ 13 -2 -100 15 -115 7 -92 -30 -3 -7 -33 9 -4 -37 5 -51 20 -5 -4 -22 17 13 -22 77 -25 62 29 -8 -14 29 105
6368A05j13O7k2L7o5N8k5J0Ok7jm2R2k4n1L6j7J5j4L5o3L0k9mN4m2lPlk6k4K3
$$ 105 -8 59 37 74 9 67 42 52 58 31 30 -12 80 56 5 41 24 39 25 60 -3 27 -2 -6 48 6 3 10 7 -19 -43 -20
6400b0j8K1rM9j06P9m9J0QL8m4l7N6p0R1j01P1J9l8L3j9O9q2M8k7K7n5L8M2k7
$$ -20 -38 -17 -26 23 -83 -4 -53 -43 -35 3 -41 -78 -22 -92 -1 -102 -31 -12 -50 -17 -36 33 -49 -1 -28 -1 -56 -18 24 -3
6430cl3lQ5m6M2rMNrK3p0Q8m8L0m6N5k0j2M2j05J13q4KM1K0k2ML2q1O8k8J6l5
$$ -3 -36 -39 46 0 42 33 37 42 33 56 -14 74 26 56 10 65 45 33 75 -30 83 -1 1 42 62 40 44 76 -5 63 35 51 16
6463A6o3J13j17N4q2J24q0K6Mj9lK0L7k6k3r7R2L6o8j4L8j7lK9n2L3LJ3L2r6P8
$$ 16 -47 66 -51 3 -79 45 -35 -9 -5 -24 -27 -7 30 4 -19 -116 -24 12 -56 -70 -32 -49 -52 -23 -75 -42 -39 -26 6 -90 -12
6494a2j6J9m3N2j9l0P9l8N6n8k0k9L8j8j6R1j6k0j1Q2j4k7L7n5N4o7M9p7R2l4
$$ -12 -28 -9 -52 0 -19 -49 30 -8 48 -10 -30 -59 -21 -39 -55 36 20 0 -11 71 57 30 67 12 66 -1 48 -29 63 29
6524B9RN7p6PKQ2j17O4m9qL1jK4n3N9m7K3l6J5j5m4L6l4P7k1K7k7k5K5k1L9q8
$$ 29 38 95 19 26 28 110 -7 57 8 0 31 30 54 1 60 13 36 0 15 0 -44 -8 -42 35 14 41 14 -11 14 -7 32 -56
6556e6M6k7J2j9lM9n0M2j0J0j2N9l0m9M8nl4JLj5M4Mk3NJ7K6l0l6K0RN2Nn1LN0
$$ -56 -10 -37 -25 -44 -47 2 -48 -6 -16 -6 -18 41 11 -38 10 5 -29 -28 -25 -40 4 8 -15 -10 7 33 3 -33 -13 -4 48 53 2 5 55
6591E5l1P9j49Q2O2loq9P4m1M3lkq4KK1N3J1p0J5m7O0J2q1O6j7K3j0j8J2m9k7
$$ 55 24 103 -46 36 98 95 89 0 74 33 76 73 71 -13 -11 10 63 74 4 19 -28 32 44 -37 29 12 35 25 7 19 -30 -57
6623e7O4On2M0q5K1OL9j1j7K5o9J02r9M3l5L1K0Mk0j8M7J4j2o2O2Pl1J8k6Q5j08
$$ -57 7 13 -39 1 -84 -63 -57 -18 -29 -46 -21 -90 12 -87 -44 -79 -48 -28 -24 -44 -62 -15 -1 -13 -75 -13 -6 -37 -19 -45 40 -68
6655f8R4m5K7K8o0L9p5R4l1J8K5j9m7P9n0l9P7j7O2n5J4mM5n8K3L6o9K1K3l1M3
$$ -68 26 -19 8 36 -24 15 -60 34 3 21 46 27 -20 59 9 -30 47 30 92 37 51 47 92 34 57 93 24 45 68 37 80
6686H0p7O0o0O0k7L5m7ml2l7P7n8O0j02Q0Ok9K7o9Q7r9K4j3J3Qj8M1J1l4l5P3
$$ 80 3 63 3 63 36 71 24 20 -12 -49 28 -30 30 -72 8 14 -15 12 -57 30 -69 -45 -58 -45 -37 -55 -14 -3 -37 -72 1
6717An3L8k4k7R7n8Rn5O8j3J1N4q8M0mJ1l9Q0m7L5m8N8k8m0P7l7J3l6J3K8j04
$$ 1 -52 -14 -38 -65 32 -26 -17 -72 -4 -17 -6 48 -40 0 -4 7 -32 48 1 36 -12 46 18 -22 55 18 31 -5 8 36 -68
6748f8J30l7NJQj6K4j7J7K7m4J8k2M7j2k0J0Rk3o6N9o6O7o2M5Nn1KL5Mk1nl1P4
$$ -68 62 25 30 31 39 23 47 30 47 74 30 48 26 73 61 41 51 60 37 -29 30 -36 31 -31 14 19 -32 -30 5 9 -12 -17 -48 26
6782B6n4Ml7J6J9m0N0j4k9L9k0Qq5J59p5L9m8O3j4m4L1j2R2q8K2Ooj8J1K1l2L5
$$ 26 -28 -24 -61 -45 -26 -66 -16 -30 -59 -20 -40 -32 -117 42 -33 6 -42 21 7 -37 -6 -18 74 -14 8 14 8 -10 1 22 -10 25
6814B5k0M7l6J2mJ6lL2m0l9J9j4O3k0rN3o9J2mom7O1k0O3J6m8K9n5N6j01N7m8
$$ 25 5 52 16 28 24 40 37 69 29 -10 9 -5 58 38 29 82 13 25 21 15 -32 29 9 72 88 40 69 14 70 -31 26 -22
6846b2J9Lj9J04m5l0rl1J9L4m9m2MK0nqK2m8N5J8r7J15p4O0r4J20m2l9M9J2O6
$$ -22 -3 0 -19 85 40 10 1 -30 -11 23 -26 -68 -64 -44 -49 -57 -35 -83 -28 -10 -107 8 -66 -6 -100 20 -22 -61 -12 0 66
6877F6q1L4m4O1l9L0jn3L7J6n4N4K0j1n6K8L6mj7K8l6M8q6N5Oj5nRN3k4l2j1Q
$$ 66 -15 19 -25 36 -3 27 26 -27 10 26 -28 26 46 35 -21 7 43 39 22 50 14 62 -24 31 37 22 17 26 79 55 23 12 20
6910B0Ln7J14r0O2j5j8L9q7N6j9N5k4qk2JMp7M0KOj9L1l8O5n3K6n3J3P8r8M2O
$$ 20 23 -34 80 -10 52 37 19 58 -29 27 8 63 39 31 9 10 14 -63 -23 -21 -15 -34 -3 -41 24 -29 -3 -56 -43 35 -63 -21 -15
6943a5J5l7J5K5j04J06l2M6o6N4k4k3R0r7O8r7J13k6j3L7Km6RN9q9P4k6K4j2K4
$$ -15 0 -37 -22 3 -101 5 -27 19 -47 7 -17 -40 50 -47 21 -76 37 11 -2 35 37 -9 0 59 -30 44 18 42 30 54
6973E4mJ9Qq2N1n1O1J0p5Q3p0L3q6M8L9m2N1j%n5N0o2K5k5N9l0m3O4q2M1K1Rn6
$$ 54 50 69 77 -5 46 -5 56 66 -9 74 4 37 -49 -1 38 -4 47 46 46 -9 41 -21 4 -21 38 8 -35 29 -53 -12 9 18 -38
7006c8JK5k2O1q9O1r0N3J3J9K2l3k1l1P9l4J1K9n5m2N4M6m6M9n7K5K4j0%o2J17
$$ -38 -37 -12 -34 27 -62 -1 -91 -38 -25 -6 16 -17 -38 -69 10 -24 -13 16 -39 -81 -27 19 -27 22 -35 -10 14 4 4 -58 59
7037E9l7L7n0K3JK0kr5J32j01P4n7O8l2M0j2o4M7l2K9n1N7p8L1M6o6N3m9NK8j
$$ 59 22 59 9 32 33 53 51 -44 88 -13 61 4 72 40 80 68 4 51 19 48 -3 54 -24 7 53 -13 40 -9 -4 24 23
7068B3j0j1M8q0O5p8K5l7K6J7oM3o2Q8p8J1llK3n7O4r0P9j6JNn4M4j8J3K5m7k5
$$ 23 13 2 50 -30 35 -43 -18 -55 -29 -12 -18 25 -37 51 -27 -16 -19 -22 1 -56 8 -82 -3 -19 -18 -13 -67 -23 -41 -28 -3 -50 -75
7101g5P1n4N0k5mQ0q9P3m8M7l1L%MJ5l0M4q9J07o0QM1l6N4Ll4jL8j1K4n9l0Q6
$$ -75 -4 -58 -8 -33 -37 43 -46 27 -21 26 -5 -2 -2 2 17 -13 31 -58 49 -11 -3 38 2 56 59 25 24 62 51 75 16 -14 72
7134G2r0R6j17P4k4L1j6k0N5o4Nm0L0k5L6L1p7M0l1%RL2J0m6K1l2J3K2M4j39Q5
$$ 72 -18 78 -39 35 11 42 26 6 61 -3 2 -38 -8 -33 3 34 -43 -3 -34 -34 -25 7 17 -29 -8 -40 -27 -5 39 -100 -15
7165a5l2jK6l6O4o5M2k3L5m3K7Mk5Q7o9J4mJ8K3m7L4nRm7O5n3L2O4n3KOK5l2K
$$ -15 -47 -48 -22 -58 6 -59 -17 -40 -5 -48 -21 -17 -42 45 -24 -10 -14 4 27 -20 14 9 18 -29 36 -17 15 79 26 28 34 59 27 29
7199B9N5J9j25R0mn9O4j7J4m9k7K9Mn2P1Ln9L9J1j7J1p3Q4q8L9m6N6k5J5J2QJ4
$$ 29 84 103 -22 68 64 5 69 52 66 17 -10 19 23 -29 42 45 -14 25 36 19 30 -43 41 -47 -8 -54 2 -23 -8 4 12 26
7231B6r9R1p9O3n7QNJ3m3M1L7n4k9LL8j0pN6p3Q1l9J1qK7Pk8J4l1O4l6O2k4l9
$$ 26 -73 18 -61 2 -55 -47 -42 -29 -72 -31 6 -48 -77 -74 -36 -46 -53 3 -70 11 -28 -17 -25 2 9 -19 -5 -36 28 -8 54 30 -9
7264iK2j4N0Rk2l1L2OJ0j5j4J2k1J0n0M7j2K8J6k4L8o5P9p7M5l2M4No7N5j14O6
$$ -9 13 -1 49 58 36 5 37 43 53 38 24 36 15 25 -25 22 10 38 54 30 68 3 82 5 50 18 62 67 0 55 -59 7
7296Gq6N3M6k6j1l6L6rN3j00J05k5qj8k6L7n0M1k2P9l7n0L6j2j2mJ4j7P4pl4q
$$ 7 -79 -26 20 -6 -17 -53 -17 -26 27 -73 32 7 -1 -19 -45 -8 -58 -17 -39 40 3 -47 -11 -23 -35 -39 -25 -42 32 25 -9 -17
7328a7k6M4j8M2l1J1m5L3K3qj0lN4LK7l6n7N8n7M5n5N0k3O9n0J0J3m7R3j22N8
$$ -17 -43 1 -17 25 -6 5 -40 -7 16 8 -2 -5 49 52 79 43 -14 44 -13 32 -23 27 4 73 23 33 46 -1 92 -30 28
7359B8J4n2K5LL6n9O4l7Mm7L1k9L5rJJ9k4M3o0j0QMo2J14k9l6Ql6NO5n1K7o4M5
$$ 28 42 -10 15 18 54 -5 59 22 26 -21 10 -19 16 7 8 27 3 46 -14 -24 -16 -12 -74 40 11 -25 -17 -53 -48 17 -34 -7 -71 -26
7393b6o3O5l6OM9m5M9l4P8n5nKL4m6LJ7J2K7j01P2%L2k6km6K0N4j4k1K5M0k0j3
$$ -26 -89 -24 -60 -54 -5 -50 -1 -35 43 -12 -17 -15 19 -27 -24 -7 5 32 -69 3 3 35 9 7 -39 -19 35 21 0 25 65 45 32
7426C2K3m1j7K0N3j15P9J0jl8k0J5Kl3M5O7r3l0K7M1q0J01Ml9L2k7n6R5j32J27
$$ 32 55 14 -3 17 70 -45 34 44 43 5 -15 0 2 -31 14 81 -12 -42 -15 26 -54 47 51 12 44 17 -39 56 -76 51
7456E1n8k6J0L3m4pM4mJn2M7j9J8Nn9J05o4K7l3pPL2J2Lj7k3K8Kp0L0K9n8N6L1
$$ 51 -7 -33 -23 10 -34 -41 3 -1 0 -52 -5 -24 -6 -1 -60 45 -19 8 -25 -32 -25 7 19 22 5 -18 10 12 -58 -28 1 -57 -1 30
7490C0m8RK5oMj1Mk0Q9j03Q2p0M5j0k9N0m0L9m5M3m4K6ML5rk2Kp3K8nL8k6k0L2
$$ 30 -18 -9 16 10 14 3 7 -13 76 -27 55 -15 30 20 -9 41 1 40 -5 38 -6 20 24 59 50 28 30 -43 -15 -20 18 -8 -28 4
7524DpM8q0M7l8jJ9nMl8M9j9rk9R2j10O6j2LoK4k6J7j3j8P0m7n8Q5l3rl6Q4n4
$$ 4 -3 45 -35 12 -26 -27 -8 -13 -9 -47 2 -17 -26 -55 37 -73 -7 -19 -16 -22 2 -24 -7 -20 -38 32 -15 -73 12 -21 -30 -66 18 -36
7558c6M4P5q6PlN1o7K0QOj7O3k5r9P9n7M4J8n1P8k9K5k7M4m7K8p5O1k0pL8p9N3
$$ -36 8 83 -3 4 1 52 -15 5 13 19 2 65 40 -59 20 -37 7 25 -26 52 23 48 21 65 18 46 -29 32 12 5 43 -36 17
7591A7n8O9jk8%lJ6o5O6K8k6j5L5Jr0P9n4NOK1n0L0J4o0K9OJ4l1M5Ml3J1m9O5
$$ 17 -41 28 27 -1 -1 -4 12 -53 13 41 15 0 35 36 -54 25 -29 -24 -18 3 -47 -17 -3 -63 -34 -28 -14 -45 0 4 -29 -18 -67 -2
7625bm5L1n8O7Qn0N3jPk7R1o4l9L4Qk8J7M2oK0o5j2O1j3mk1L3%J7n7P0p0RK3m2
$$ -2 -47 -16 -74 -7 1 -49 4 3 10 -17 74 10 -29 5 13 -15 2 44 38 58 -7 -19 42 29 25 4 37 37 54 -3 67 -3 6 29 -13
7660a3J5j7mL6j9J2k1MK0N8l9l9oMJ6qpl3O4l4l4P1j6l1L1j0k1k8N4n4Rok0N4
$$ -13 2 -15 -19 17 -2 10 -11 -7 13 71 32 -7 -13 -9 7 -1 -8 -41 23 -11 -45 26 10 -21 10 0 -21 -49 5 -49 -40 -46 -66 -12
7694a2l0QJ9m5Q4q9P0j9J5o0M7K2kJ9Rm4K3k4oL6K8l7Rj3J0K3l1M0o3M8K8m2j4
$$ -12 -42 -34 -15 -60 24 -65 5 -14 1 -59 -12 10 8 27 36 -8 15 -9 -15 21 49 12 21 8 18 41 10 50 -13 35 63 21 7
7727GM5k2pjk5L3k7J1J9l6M1o7P5p1O7o1N1l0K2m1L1jo6M7m5Q0n1J8On5P9l3K9
$$ 7 52 30 23 22 -3 30 3 14 33 -3 38 -29 46 -25 42 -19 32 2 24 -17 14 13 -53 -6 -51 29 -22 -4 2 -53 26 -7 22
7760B2n7M8l8mkqM5n6Q6m4O4q3m8K9K0M3J4qk5M0o3J7J3m8L2mQ8r6K2k7M3qRJ1
$$ 22 -35 13 -25 -29 -31 -39 6 -50 36 -8 56 -27 -75 -46 -26 17 31 23 -2 38 -25 -8 5 -43 -11 -15 73 -23 -1 -28 15 7 16 27
7794B7l3O8q5M3l8R1o3J4nL8Ml8N7n5L8Ll6l6m5J18k2J1n4k2L0K4l0k3L7l6N7
$$ 27 -6 62 -23 20 -18 73 10 24 19 57 61 23 80 25 63 66 30 -6 -51 67 45 56 2 -20 10 34 4 -19 18 -18 39
7825C9om3M7o5N5n9J8K5Pr2J6N7jK5n1K9n1J8Pk1K7k8L7qlJ6L0l9K3J5r1P1j4
$$ 39 33 -10 37 -28 27 -32 -14 11 18 -74 -58 -1 -2 23 -28 1 -50 -32 -25 -46 -19 -47 -10 -18 -21 -5 25 -14 9 24 -67 4 -10
7858a0N9k0K6l7K1nn2Q3n7lj6L2j0M7m4n3N1Pmk6J05r0OL1kk3rk6Q3p3MOJ0J4
$$ -10 49 29 55 18 39 34 -18 65 8 5 -11 21 11 58 14 -39 12 19 15 -11 94 4 10 41 39 16 7 -19 64 -9 -5 1 11 25
7892B5%K2k6l7L1j2j2N1n2O2j05O7p%p1J6P4o1J8qRKn0M3jj5N6pJk5p4P2L6j2
$$ 25 25 47 21 -16 15 3 -9 42 -10 52 -53 14 7 7 -64 -48 26 -35 -17 -25 -16 -14 -64 -21 -22 -37 19 12 13 -12 -86 -14 22 10
7926A0k6m8P8n7K0J8k2PqK3Lj4l5N9N8m8l3K9%%L8k4Pl0L7l6PQm9K4J5Jj3N1j5
$$ 10 -16 -64 14 -43 -23 -5 -27 -20 -28 -5 -2 -16 -51 8 66 18 -15 14 14 14 52 28 35 5 42 6 13 21 -28 -4 11 12 -1 50 35
7961C5M5o4KL4n9K8mqM9o0K8m6M1k8N0o0P8l8p7P1o4M5j3k9rK8Ll8K4NM0l7K7
$$ 35 80 16 18 52 -7 21 17 9 58 -2 26 -20 21 -7 43 -17 61 23 -54 17 -47 -2 -15 -44 -53 -25 -22 -60 -36 -31 9 -28 -1
7994ak2j8L4J2K1k1j0p4R9m9K3M7o3N1j09M9K2L4k1n1O9j1J5N3Jr8Q0q4K7K5k9
$$ -1 -23 -41 -7 5 26 5 -5 -79 20 -29 -6 41 -22 29 -80 -31 -9 25 4 -47 22 11 26 79 80 -18 62 -22 5 30 1
8025AL0l5M7p5O2ll5M5%l9ML7p6M5K1K9l5l2kj1P2m2o5O3Mo3O3pl2N7l8L9jo5
$$ 1 31 -4 43 -32 30 27 -8 37 37 -2 2 39 -37 8 29 58 23 -9 -11 -22 50 8 -57 6 10 -53 10 3 -29 28 -10 29 28 -37
8059c7N7m8j0L9K8n0N8p1L9K6q2N4m5L1j2j3K2l5M8N%kjl6J0l5M5qJN6k1JnN0
$$ -37 20 -28 -38 1 29 -21 37 -34 5 31 -51 3 -42 -11 -23 -36 -14 -49 -1 4 4 2 1 -35 -25 -60 -15 -23 -22 34 13 14 9 59
8093E9q4J0L6k8R1q7L0mj6k4LO2j3N6p8j2K5k6M2mj7J5k1J3on1J3J7k6M7m5R0
$$ 59 -25 -15 21 -7 84 -3 27 23 7 -17 -14 48 35 91 13 1 26 0 42 38 21 36 15 28 22 -29 -16 1 -25 22 -23 67
8125F7o9KJ6m6K8j6POM7l6j4j0Qm4NrK9M2m6JM8n5R0q4K0k6O1r6P1k2N5m4n%M
$$ 67 -2 0 16 -30 -2 -18 -11 -5 42 6 -8 -18 -10 -54 -49 -58 -29 13 -33 -32 16 -39 51 -33 -13 -39 22 -74 -3 -25 30 -14 -19 -19 -15
8160a5P5q9L5rL6k8l0Q0q0j4K2O7k1j5%L7K5n6j0QKj5K7n2K3lK7Pm1K6l0
$$ -15 60 -29 6 -3 33 5 -25 55 -25 -39 -17 50 29 14 14 51 76 20 10 18 20 5 32 -20 3 0 27 34 -7 19 -11
8191a1
$$ Imaginary data points
##PAGE= N=2
##DATA TABLE= (X++(I..I)), XYDATA
0@%%%%%%%%%%%%%qJ6j6J6j6K4l2L2m0M8n6P2q3R1j04J20j41J65j87K11k40K72
$$ 0 0 0 0 0 0 0 0 0 0 0 0 0 0 -8 8 -8 8 -8 16 -16 16 -24 24 -32 40 -43 48 -56 64 -77 88 -99 112 -128 144
35A44l04L39l79M21m69N23n82O46p12P86q69R60j056J160j277J408j551J708j886
$$ 144 -160 179 -200 221 -248 275 -307 339 -373 413 -456 504 -552 608 -669 739 -812 896 -990
54i90K086k308K560k855L199l606M092m691N449o435P779r712J2735j8099L0209
$$ -990 1096 -1212 1348 -1507 1692 -1914 2178 -2513 2936 -3499 4280 -5432 7303 -10796 19413
69A9413r9542j3493J83000j66842R7059l5798n7710J22407q1704P503K5664p6294
$$ 19413 -80129 -93622 89378 -77464 19595 -16203 -73913 48494 -33210 -25707 -43 -76337
81g6337J13152m1836m7464Q0770o3810J4521L6626m2959K746L3328j2074j6768
$$ -76337 36815 -5021 -52485 28285 -35525 -21004 15622 -27337 -24591 8737 -3337 -20105
93b0105M4683m6422M903K4927k1060L2794l6019J4239L3723o5168O2727j3572
$$ -20105 24578 -21844 -16941 7986 -13074 19720 -16299 -2060 31663 -33505 29222 15650
105A5650p5159J10737m5146j3656M4508p4784P3436k3744k6496M0810n6927O6552
$$ 15650 -59509 51228 6082 -7574 36934 -37850 35586 11842 -14654 26156 -30771 35781
117C5781j181p1380O4737k2221j8921M3120m4107J8750Q677r857R923k4914J6920
$$ 35781 34600 -36780 27957 5736 -13185 29935 -14172 4578 13255 3398 13321 -11593 5327
130E327p867J25N320N457j0339j2695L7418l8603K727L1761n0658L6934J6998
$$ 5327 -2540 -2415 2905 8362 -1977 -14672 22746 -15857 -13130 18631 -32027 4907 21905
143B1905n1085M1089k5669j561L5826n6440N0808k2082j8840O9806p4421P324
$$ 21905 -29180 11909 -13760 -15321 20505 -35935 14873 -7209 -26049 43757 -30664 -23340
155b3340M3932m1620K4069J65k2732L0843j2224k631p01j3618L1236j3992o376
$$ -23340 20592 -21028 3041 3206 -19526 11317 -907 -3538 -4239 -17857 13379 -613 -6989
168f989J6245q727j0493K0635o695k6096M2593j8816r651L0709k7461K346O389
$$ -6989 9256 529 -9964 10671 3976 -22120 20473 1657 -7994 22715 -4746 -2400 3989
181C989k858J1422k1299J5980J4851l9598L8901j5673k9040N0129k7114K002R889
$$ 3989 1131 12553 -8746 7234 22085 -17513 21388 5715 -23325 26804 -310 1692 11581
194A1581j2861J1688r908M148k393j1286K4522k639k4925K4424q039j3172J7812
$$ 11581 -1280 10408 500 4648 2255 -9031 15491 12852 -12073 12351 4312 -8860 8952
207H952o146j1483J3452J0506k4095J1782j431o659O716p920J7638j8931M460
$$ 8952 2806 -8677 4775 15281 -8814 2968 1537 -5122 1594 -6326 11312 -7619 -3159
220c159K0025l3310J2434J5566l2458K6133M805k5513K4232j5301M635Q74j0186
$$ -3159 16866 -16444 -4010 11556 -20902 5231 10036 -15477 8755 -6546 -1911 -1037 -11223
233a1223J7820j6172J0010J0522k2198K864J7640j8491J983J6789j7956O901J1592
$$ -11223 6597 -9575 435 10957 -11241 -8377 9263 -9228 -7245 9544 -8412 -1511 10081
246A0081j4551l566R818n042P372p955N192Q384k3560K8953j7917j3589L4572
$$ 10081 -4470 -8036 1782 -3260 4112 -3843 1349 9733 -13827 15126 -2791 -16380 18192
259A8192k3287M894J3032j9322R735j0n475Q504j6426K2194l995j9280K9689k4462
$$ 18192 -5095 -201 12831 -6491 3244 3234 -2241 6263 -10163 12031 8036 -11244 18445 -6017
273f017j209J8411j2362K24M406J764m576P53o74l043k373J1503k861j0427J0231
$$ -6017 -7226 11185 -1177 -953 3453 5217 641 1394 720 -2323 -4696 6807 3946 -6481 3750
288C750J546j3280P622O154k2872K5748j777j8535J8339j3794P266l109m236J3892
$$ 3750 5296 -7984 -362 5792 -17080 8668 6891 -11644 6695 -7099 167 -2942 -7178 6714
302F714j7399J0334J3155k8892J4293P251k1618K3363q497m909Q466l597L609
$$ 6714 -10685 -351 12804 -16088 -1795 5456 -16162 7201 -1296 -6205 2261 -1336 2273
315B273j1736R761o53m879R153j02q313J075J0839j0725l814J4480p497m705K0178
$$ 2273 -9463 298 -355 -5234 3919 3817 -4496 -3421 7418 -3307 -7121 7359 -138 -4843 15335
330A5335j9172j328J3091j1553J0502j0520R361Q09j0940J8549j7494k565J8654
$$ 15335 -3837 -5165 7926 -3627 6875 -3645 5716 6525 -4415 14134 -3360 -5925 12729
343A2729j3693J520J0545j2256N119p38J553m489n669J9980j5663K146Q232j1902
$$ 12729 -964 556 11101 -1155 3964 3226 4779 290 -5379 14601 -1062 1084 9316 -2586
357b586K960L195J36q625Q536L209q987M838j13r129P630J746m372R93j139Q812
$$ -2586 374 3569 3705 -4920 3616 6825 -2162 2676 2563 -6566 1064 2810 -1562 -569 -1708 7104
373G104j6113J0141K385k0466K5437p317r194J0615o031J789k229j116O146r710
$$ 7104 -9009 1132 3517 -16949 8488 1171 -8023 2592 -3439 -1650 -3879 -4995 1151 -8559
387h559Q846O372j9885J5058l193p444R813l603k24j896J0179r116k907Q445p542
$$ -8559 287 6659 -13226 1832 -1361 -8805 1008 -2595 -2819 -4715 5464 -3652 -6559 1886 -5656
402e656L374L735j249k897L15O696o354p426J7724j2796L54J6439k0235R410n19
$$ -5656 -2282 1453 204 -2693 -2378 4318 -2036 -9462 8262 -4534 -4180 12259 -7976 1434 915
417I15k541L458p440J1840p141o22J0346j4508J545J1787j2787N596K342l517
$$ 915 -1626 1832 -5608 6232 -909 -1531 8815 -5693 -4148 7639 -5148 448 2790 -727
431g27K506l593P491j4061O736Q010j2039P768n51l002j464M174j791o738Q742
$$ -727 1779 -1814 5677 -8384 -1648 6362 -5677 2091 1540 -1462 -2926 1248 -543 -7281 1461
446A461K228r558Q194j733q375R854n135K658m475N764M376j5327J5120p791o042
$$ 1461 3689 -5869 2325 592 -7783 2071 -3064 -406 -4881 883 5259 -10068 5052 -2739 -8781
461h781J4303o816k293N024j130K08m035L100J788q923J5379o938n783J0866q001
$$ -8781 5522 -1294 -3587 1437 307 515 -3520 -420 1368 -7555 7824 886 -4897 5969 -2032
476b032K196j271M006m032O17R767j1153J02O997o079L12M940l759J732q25N390
$$ -2032 164 -1107 2899 -1133 -516 9251 -1902 -1800 5197 -882 -570 4370 611 2343 1518 6908
492F908q308k577J3371j4410Q034L888r170M751l29R89n657K006M937n206K614
$$ 6908 -1400 -3977 9394 -5016 3018 6906 -2264 2487 2158 3147 -2510 -504 4433 -773 1841
507A841M194j0791N593L295p887L996J56L398p064O426k96j0911J1094k596k571
$$ 1841 6035 -4756 837 4132 -3755 241 397 3795 -3269 3157 2861 -8050 3044 448 -2123
522b123K412J140j483j572L611k791n980R685Q86r850J1014n608j699L653k333
$$ -2123 289 1429 -54 -1626 1985 -806 -6786 2899 3785 -6065 4949 -659 -2358 1295 -1038
537a038J256m134Q917m277k637O116n746j963P067j449n402N688J729l099k586
$$ -1038 218 -3916 5001 724 -1913 4203 -1543 -3506 3561 2112 -3290 2398 4127 1028 -1558
552a558N570o357J245Q282q290K557P12J917n115J043M930r068O697M439p358
$$ -1558 4012 -2345 -1100 7182 -1108 1449 2161 4078 -1037 6 4936 -4132 2565 7004 -354
567c54J64L672m319K355j45p01p44K055N255j2746O235K416o911N578K17k388
$$ -354 -190 3482 -837 1518 1373 672 -72 1983 7238 -5508 727 3143 -3768 1810 2027 -361
583c61j507N775l982l687K984N98k115L761N28p269M221K736l709n013Q903l174
$$ -361 -1868 3907 -75 -3762 -778 -180 -2295 1466 1994 -5275 -1054 1682 -2027 -7040 1863 -1311
599a311k953R104j0228K241J565p36K87k509N993l718j938P741p866m075J2552
$$ -1311 -4264 4840 -5388 -3147 -1582 -2318 -2031 -4540 1453 -2265 -4203 3538 -4328 -8403 4149
614D149p993J788L127m718M575m073M244n701R44Q165o779R11M471m691k215O643
$$ 4149 -3844 -2056 1071 -3647 928 -3145 1099 -4602 -3658 4507 -2272 -1361 3110 -1581 -3796 2847
630B847k824k442K714L558m033J016J896p013O139M60j69l752M419K963j0136
$$ 2847 23 -2419 295 3853 -180 836 2732 -4281 1858 2318 2149 -1603 2816 5779 -4357
645d357Q709l073m971Q001j239k495K031k378J756k191Q72K838r954J3840l210
$$ -4357 4352 1279 -3692 4309 3070 575 2606 228 1984 -207 665 3503 -6451 7389 4179
660D179r602R854o357J619J060n71K28k146N004k011o295O241j745m219Q934m943
$$ 4179 -5423 4431 -1926 -307 753 182 410 -1736 3268 1257 -5038 1203 -542 -4761 4173 -770
676g70j337P53K842k824m690Q708o469L299L081n652J390M41J142l142P46N060
$$ -770 -2107 -1354 1488 -1336 -6026 2682 -3787 -488 2593 -3059 -1669 -1228 -86 -3228 -2482 2578
692B578m774r2Q139j1355K994N021o322N958l651L630l010K68M681r540N619L752
$$ 2578 -2196 -2288 5851 -5504 -2510 2511 -3811 2147 -1504 2126 -884 -616 4065 -5475 144 3896
708C896o101L474K733n081J214K67J742l848K371M707q692Q285l489m239M651
$$ 3896 -2205 1269 4002 -1079 135 402 2144 -1704 667 5374 -3318 4967 1478 -2761 1890
723A890j362J682m015N370p46n725O042j814n879P427j757j951L604l834K426
$$ 1890 528 2210 -1805 3565 2819 -2906 3136 1322 -4557 2870 1113 -838 2766 -1068 1358
738A358m774N696k404n681J0987o117o88K705k720p43O75K331k131j440N619l641
$$ 1358 -3416 2280 -124 -5805 5182 -935 -1623 1082 -1638 -2381 -1706 625 -1506 -2946 2673 -968
754i68l672P529p954K894L441k785J179l019O629o858L17N459o523L794L273m563
$$ -968 -4640 2889 -5065 -2171 1270 -1515 -336 -3355 3274 -3584 -3267 2192 -4331 -537 2736 -1827
770a827O91J831j879o5n15N078n902K515N430r390N200o46r50M76J123K004m567
$$ -1827 -1136 695 -1184 -1249 -1764 3314 -2588 -73 5357 -4033 1167 521 -429 47 1170 3174 -1393
787a393M448j121m455M169J273m543M124N20j635j369Q92K300p197Q469k746l658
$$ -1393 3055 1934 -2521 1648 2921 -1622 2502 3022 1387 18 910 3210 -3987 4482 1736 -1922
803a922P298n524L59n7O36k55j729M226r20n492O680k635n241P889n317J809J360
$$ -1922 5376 -148 211 154 790 535 -1194 3032 2112 -3380 3300 665 -4576 3313 -2004 -195 1165
820A165o64q97k712N461n243M42M205k034j895K797k07l982K177J610k387N63
$$ 1165 501 -396 -3108 2353 -2890 -2448 1757 -277 -2172 625 418 -3564 -1387 223 -2164 -1601
836a601M718o673L037J804m968L067j314L984m210J986L081o854L960J433m391
$$ -1601 3117 -3556 -519 1285 -3683 -616 -1930 2054 -2156 -170 2911 -3943 17 1450 -2941
851b941L014K510l925K536m31J28l152K230L897p110O395r89k903K122m66n87
$$ -2941 73 2583 -1342 1194 763 891 -2261 -31 3866 -3244 3151 2162 -741 1381 915 328
867C28j626M625k019j527L246j162m115M524o10k966L185K0O61m081M547l282
$$ 328 -1298 3327 1308 -219 3027 1865 -2250 2274 1664 -1302 1883 1903 2564 -1517 3030 -252
883b52k086O502n124J222J700n37k057M78J158k242Q8L919k457k519N619n591
$$ -252 -2338 4164 -960 262 1962 1425 -632 -154 1004 -1238 -1150 2769 312 -2207 3412 -2179
899b179R18J975j685j53P51L560o332K605J325l287J247J416k12j662K770o89
$$ -2179 -1261 714 -971 -1124 -373 3187 -3145 -540 785 -2502 -1255 161 -51 -1713 1057 368
915C68k826J059K645n037M610J235n586N183k380M28j719J495J698l600M507j037
$$ 368 -2458 -1399 1246 -3791 819 2054 -3532 1651 -729 -301 -2020 -525 1173 -2427 2080 1043
931A043l422K721J097m411L523R16j699K66J345k82m390N607k655m70K644j392
$$ 1043 -2379 342 1439 -2972 551 1467 -232 34 1379 1097 -3293 2314 -341 -811 1833 441
947D41L10j624L498m372K2M598l108n84L669l305j000L003k777J266j611L927
$$ 441 751 -873 2625 -1747 -1725 2873 -235 -819 2850 -455 -1455 1548 -1229 37 -1574 2353
963B353k716j402N106o969K721J854k324J25J696L4k258J007O76k501O70M107
$$ 2353 -363 -1765 3341 -3628 -907 947 -1377 -1252 444 478 -1780 -773 -97 -2598 -1928 2179
979B179n336K736J170k822P74l88K229m626M779M77m251L663j316j158P97J199
$$ 2179 -3157 -421 749 -2073 -1299 -1687 542 -4084 695 1172 -3079 584 -732 -1890 -1093 106
995A06r47l7J565Q12m568M078Om629O893l693O37R38l86N02l264M440j983j294
$$ 106 -841 -878 687 1499 -3069 1009 1015 -3614 3279 -414 223 1161 775 1277 -1987 2453 470 -824
1013h24M164j651k715L818j805j173J357R9R12k759N066m492p01M158m405K207
$$ -824 3340 1689 -1026 2792 987 -186 1171 1270 2182 -577 4489 -3 -704 3454 -951 1256
1029A256j85Q94j440M9J862l355p5L727l519K03L805m834K410j074J75j049m64
$$ 1256 1071 1965 525 574 2436 -919 -994 2733 -786 -583 3222 -1612 798 -276 -101 -1150 -1614
1046a614M519n762L259O25l557J899K37q57m83J683M83k346P24K375n663M614
$$ -1614 2905 -2857 402 1027 -2530 -631 -394 -1251 -1734 -51 432 -1914 -1190 1185 -4478 136
1062A36K62l643M610k873J926k477J428J186m162N006n77l125L594n73l147L421
$$ 136 398 -3245 1365 -1508 418 -2059 -631 555 -3607 1399 822 -2303 1291 718 -2429 992
1078I92j515O29l93J471R23m752N567l146r94L249j508K20m19K418k826k14K376
$$ 992 -523 106 -287 1184 2107 -2645 2922 -224 -1218 2031 523 743 324 2742 -84 -298 2078
1095B078k063n35L718k970j12K264k626J167k140M000l176l18M899o259K730O54
$$ 2078 15 -520 3198 228 116 2380 -246 921 -1219 2781 -395 -713 4186 -2073 657 1311
1111A311k560J236M75l12k05k35J786l007o36M834n994L448J046l274K519j423
$$ 1311 -1249 -13 462 150 -55 -290 1496 -1511 -2147 2687 -3307 141 1187 -2087 432 -991
1127i91J031k418K007N42k187K150N29k686P53K039k716R47Q68P49k471K696o70
$$ -991 40 -2378 -371 171 -2016 134 663 -2023 -1270 769 -1947 -1000 -132 617 -1854 842 172
1144A72l055M617l082J191J35M78M54k488L310j911j751L856q39k532M288k948
$$ 172 -2883 1734 -1348 -157 -22 456 910 -1578 1732 -179 -1930 1926 1087 -1445 2843 -105
1160a05k2J590j711J646k623M141k042j624L513k842l02J641n6j741K145l26j016
$$ -105 -127 1463 -248 1398 -1225 2916 874 -750 2763 -79 -381 1260 1204 -537 1608 1282 266
1177B66k31J323j724n06L407l266R88M40K19j913L54K120l814L107J05j960P08
$$ 266 35 1358 -366 -872 2535 -731 257 697 916 -997 -643 1477 -2337 770 875 -1085 -377
1194c77O28j371l27J515m46q64O43K047m520L053R9k947L249j188N26j070J586
$$ -377 251 -1120 -1447 68 -378 -1242 -599 1448 -3072 -19 80 -2867 382 -806 -280 -1350 236
1211B36p70j750K407j90j893J926J258l444K579l91r48K75J082m3j719L406k391
$$ 236 -534 -2284 123 -67 -1960 -34 1224 -2220 359 -32 -980 -705 377 334 -1385 2021 -370
1228c70j73Q88M1p75M29K160l090J482J079j745n59K306j517j57K145j643L8o84
$$ -370 -543 345 386 -389 40 2200 -890 592 1671 -74 -633 1673 156 -1 2144 501 539 -145
1246a45K295k954J001K155l083K015p3p52j143J751m00j196J300M80j601L77J764
$$ -145 2150 -804 197 2352 -731 1284 1211 459 -684 1067 667 -529 771 1251 -350 27 1791
1263A791l827K348K32r07L72J10N37k604K649j085j085J234O09j177mJ497k464
$$ 1791 -2036 312 544 -363 9 119 656 -1948 701 -384 -1469 -235 374 -803 -807 690 -1774
1280a774Q31Q79o34j225K757j235j430K265j797P50j057K381j415r92L145k836
$$ -1774 -943 -64 -698 -1923 834 -401 -1831 434 -1363 -613 -1670 711 -704 -1696 1449 -1387
1296a387L06J540j447n66K527j052l86Q8O60m49j503L534l120J109J658j869N09
$$ -1387 -1081 459 -988 -1554 973 -79 -465 -377 283 -166 -1669 1865 -1255 -146 1512 -357 152
1313A52m1N11j779K142J48j652P96J472k005j30J613j693J176j71P77k188J667
$$ 152 111 622 -1157 985 1133 -519 277 1749 -256 -386 1227 -466 710 539 1316 -872 795
1330G95O36l258L249j315k41N15N83o10j521J748j10j519J484M02k581L537k087
$$ 795 1431 -1827 1422 107 -134 381 964 354 -1167 581 471 -1048 436 838 -1743 1794 -293
1347b93j143J755r49J193k289K826j056j675K421j347q79J482P6j167J622p54
$$ -293 -1436 319 -630 563 -1726 1100 44 -1631 790 -557 -1436 46 122 -1045 577 -177
1363a77l35n18J879j368j147L410k455J013l45L22n64m17K267k491J462R66j951
$$ -177 -512 -1030 849 -519 -1666 1744 -711 302 -43 279 -285 -702 1565 -926 536 1502 -449
1380d49N07J700k353O85R21j43J50j300K802l246J426J141k770K459l56l38m29
$$ -449 58 1758 -595 90 1011 868 1018 -282 2520 -726 700 1841 -929 1530 1174 836 407
1397D07Q10m17j125J117Q84k215J172J291k809K268j604K01R2M11P10k833L037
$$ 407 1217 800 -325 792 1676 -539 633 1924 -885 1383 -221 -20 72 483 1193 -1640 1397
1414A397j383j277J567m54q07P89N54j012k53L72L72k077K955j704q05K808k339
$$ 1397 14 -1263 304 -150 -957 -168 386 -626 -879 -507 -135 -2212 743 -961 -1766 1042 -1297
1431a297O53j061J642q16p36K256j798lJ508j272p15J978j453P79J59M13o67j066
$$ -1297 -644 -1705 -63 -879 -1615 641 -1157 -1160 348 -924 -1639 339 -1114 -335 -176 237 -430 -1496
1449a496L088l106J302R17j127Q89k00L91j441J223M30j267P13J626k467J141
$$ -1496 1592 -1514 -212 705 -422 467 267 658 -783 440 870 -397 316 1942 -525 616
1465F16R02k183J572r34J578j563P10J015k729K388n92j140Q13P66j058K13L52
$$ 616 1518 -665 907 -27 1551 -12 698 1713 -1016 1372 780 -360 453 1219 161 374 726
1482G26m06p99O98Q70k455K652j193o36R41q43L60j290K291j345o61J679j015
$$ 726 320 -479 219 1089 -1366 1286 93 -543 398 -445 -85 -1375 916 -429 -1090 589 -426
1499d26q12J126m10r05J550o05J58j040J589j072j005K682k375R68L79n0m97j29
$$ -426 -1238 -112 -522 -1427 123 -482 -324 -1364 225 -847 -1852 830 -1545 -577 -198 -248 -745 -874
1517h74R16j245O61R10q66m80K019k059M35Q98r57P60m71J530k004J003N88j527
$$ -874 42 -1203 -542 368 -498 -978 1041 -1018 -583 315 -642 118 -353 1177 -827 176 764 -763
1535g63R50K47p8n84J520j040m98P24K29j012R10O51j873J822q44J9o12P23M06
$$ -763 187 434 356 -228 1292 252 -246 478 707 -305 605 1256 -617 1205 361 380 -232 491 897
1554H97j604K208j172o23Q16J2j139Q71L19q57O11k16K71j546J867r13p93J693
$$ 897 -707 1501 329 -294 522 534 -605 266 585 -272 339 123 394 -1152 715 -198 -991 702
1572G02r30L2k70Q89j538M94R03r53K51N34j72j234J701j017k59N93M31o61m1
$$ 702 -228 -196 -466 423 -1115 -621 282 -671 -420 114 -58 -1292 409 -608 -867 -274 157 -504 -545
1591e45J303k112J320j75L5k28N18O23j727J595m17q52P64P50j238Q55M82j117
$$ -545 758 -1354 -34 -209 -174 -402 116 739 -988 607 190 -662 102 852 -386 469 951 -166
1609a66P39n28Q62j342J489J28j427J450o41k99n1J079j253N18P19q35m0K40R1
$$ -166 573 45 907 -435 1054 1182 -245 1205 564 265 214 1293 40 558 1277 442 402 642 733
1628G33j213J522n21k39K0N08n11r46J976k063Q96N26p69rj3L26j100O48J97m39
$$ 733 -480 1042 521 282 302 810 299 -647 1329 -734 162 688 -81 -90 -103 223 -877 -229 -32 -471
1648d71l18J631j856J37J172j763J325p14P55q88K95R45j827Q99L78o11rJ265
$$ -471 -789 842 -1014 -877 295 -1468 -143 -857 -102 -990 -695 250 -1577 -678 -300 -911 -920 345
1666C45j459M98L58m06l7k9J201j629J487l64n75L90J66K96j179J841q95k52R42
$$ 345 -1114 -616 -258 -664 -701 -730 471 -1158 329 -35 -610 -220 -54 242 -937 904 9 -243 699
1685F99o26n15J034n8n86Q55o79R39j500J475l74j497K581j663L09N03m47k18
$$ 699 73 -442 592 534 -52 803 124 1063 -437 1038 664 -833 1748 85 394 897 450 232
1703B32K32R0l52q5O78Qj451J920j535N6R22q37M28o02J159j414M17L95r11M58
$$ 232 464 554 202 117 795 803 -648 1272 -263 -207 715 -122 306 -296 863 -551 -134 261 -650 -192
1723a92L81k08o88J013n68j97n9P21j041N38R49j893J510q03L31l40J00R75j631
$$ -192 189 -19 -707 306 -262 -459 -518 203 -838 -300 649 -1244 266 -537 -206 -546 -446 529 -1102
1742a102J418m1j143P72N44j371J402l46m04P44r21J369j773J277J94j272J646
$$ -1102 316 275 -868 -96 448 -923 479 133 -271 473 -448 921 -852 425 619 -653 993
1759I93n88l88J65M65q44N59J14o9k45M28J41j325J496q38J64m9M56l05q62J674
$$ 993 405 17 182 647 -197 362 476 407 162 590 731 -594 902 64 228 179 635 330 -532 1142
1779A142j682M56M67m64OK69p6n22L45q6k0q17J739j511J94J121j767J093n56
$$ 1142 -540 -84 383 -81 -75 194 118 -404 -59 -145 -165 -982 757 -754 -560 561 -1206 -113 -669
1798f69O15o69J64O06r53L48M53p80j06J409j588R55l3k42R3l45J024j494J188
$$ -669 -54 -723 -559 47 -906 -558 -105 -885 -991 418 -1170 -215 -248 -490 -397 -742 282 -1212 -24
1817b4O7m44J68K46j87n09J261r84K71M28J92q42O35P8p67J061o09O87r92J049
$$ -24 43 -401 -233 13 -174 -683 578 -406 -135 293 485 -357 278 356 -411 650 41 728 -264 785
1837G85k61r09J517j129K42L85J42p46N64q8k77J7J12M01j173J670j185l3O19
$$ 785 524 -385 1132 3 245 630 772 26 590 502 225 242 354 755 -418 1252 67 34 653
1856F53o38K26l10Q81j162O02P9m31k05M88j50n74J054q65J38j14M08p49K40P67
$$ 653 15 241 -69 812 -350 252 331 -100 -305 183 33 -541 513 -352 -214 -328 80 -669 -429 338
1876C38j216R56m16K16p40P13J7q85J203n03j14Q7M33j106Q74L1l54L46k47P50
$$ 338 -878 78 -338 -122 -862 -149 -132 -1017 186 -317 -431 -344 89 -1017 -143 -112 -466 -120 -367 383
1896C83j342J284m35n10Q75j98p0r4O92j046O18J04j17j78M20K61r60J156o72
$$ 383 -959 325 -110 -620 255 57 -13 -107 585 -461 157 261 144 -34 386 647 -313 843 171
1915A71P5j41P17n46j27J084j423Q37j92Jl73M64K01p00N70k10k4m04Q65j090
$$ 171 246 105 822 276 149 1233 -190 647 455 456 83 547 748 48 618 408 384 -20 845 -245
1935b45N36L55p65M43m41P35j313R67Q7p96N20K5k49l14P27r30M81J0Pl68K81
$$ -245 291 646 -119 324 -117 618 -695 272 359 -437 83 108 -141 -455 272 -658 -177 -167 -160 -528 -247
1956b47M42j325J249n74R0j03L57p8p38J228j003K92K96m2m26O96j26n33M97k39
$$ -247 195 -1130 119 -455 -365 -468 -111 -189 -927 301 -702 -410 -114 -156 -582 114 -12 -545 -48 -287
1976b87N50j024J421p94k38J075j057N12j50M83o39M65K40m45J03K73k28m66J141
$$ -287 263 -761 660 -134 -372 703 -354 158 8 491 -148 317 557 112 215 488 260 -206 935
1995I35r71N52j73J32k04k74J090j492J032n0n56K66M9j66l76N95l39J07l38P37
$$ 935 -36 516 343 475 271 -3 1087 -405 627 577 21 287 336 170 -206 389 50 157 -181 556
2015E56j117N72L58j187J113o58M36p38N69k0q11R53m66j24K05K76p34N47k66
$$ 556 -561 11 369 -818 295 -363 73 -665 -96 -116 -927 26 -440 -564 -359 -83 -817 -270 -536
2034e36J0j18K18M22j190J509r38k0N06m26L06m06R05p51J91L19k54k97Q36l92
$$ -536 -526 -644 -426 -4 -1194 315 -623 -643 -137 -563 -257 -663 242 -509 -318 1 -253 -550 286 -106
2054a06k79R50q88O87p21R05m91k95J267j225O02O0j73k11N44l38l3K72m0J2m78
$$ -106 -385 565 -323 364 -357 548 57 -238 1029 -196 406 466 293 82 626 288 255 527 487 499 21
2075B1J070j243N82J72m51L98l84P21j219R47k15n29O24j57l03J1M01o75M24l77
$$ 21 1091 -152 430 602 151 549 165 886 -333 614 399 -130 494 337 34 45 446 -229 195 -182
2095a82O23q87M49M67j425J520r55J45P2M9J9l77O07m67j44K32L56r20J018m44
$$ -182 441 -446 3 470 -955 565 -390 -245 -173 -124 -105 -482 125 -342 -486 -254 102 -818 200 -244
2115b44k52N95n87N77q73J091n89j29P67o74J49k3L90o59O95j59n7o9L48k12m23
$$ -244 -496 99 -488 89 -784 307 -282 -411 356 -318 -169 -192 198 -461 234 75 18 -51 297 85 -338
2136c38J011j004O54k12K05j07l18Q83j210Q42m1l03J32L04m44R2K54m96M60o41
$$ -338 673 -331 323 111 316 209 -109 774 -436 406 365 62 194 498 54 146 400 -96 364 -277
2156b77J084j103L78M50j087Q89m11J13k50N06m36p8J77j27j04j36P04j009P23
$$ -277 807 -296 82 532 -555 334 -77 36 -214 292 -144 -222 -45 -172 -276 -412 292 -717 6
2175Fj69k09J7j1K41o54J004p74J57J07N6j85p5N96p73N68q5R3m95O79k81l08
$$ 6 -163 -372 -355 -366 -125 -779 225 -549 -392 -285 -229 -414 -489 107 -666 -98 -183 -90 -585 94 -187 -495
2197d95Q26p63O65m83N56m72j01Q05p52L53J47J8m96Q64o09K2L65l05M45n70P76
$$ -495 331 -432 233 -250 306 -166 -267 538 -214 139 286 304 -192 672 63 85 450 145 590 20 796
2218G96p89K73K60k98J4J54K37p88R33o63J20P3q6O6l73O46o18L45k26J94n39
$$ 796 7 280 540 242 256 410 647 -141 792 129 249 322 236 302 -71 575 -43 302 76 270 -269
2239b69N09M7p77Q89p11L56l21L47m00J0M66n13J26j41M43q48Q09k40k85M49k79
$$ -269 240 287 -490 399 -312 44 -277 70 -330 -320 146 -367 -241 -382 61 -787 22 -218 -503 -54 -333
2260c33J98n03O75o19K58J85j40Nl0N25r51Q20k79n8K57J2q5k13N84n25L24k45
$$ -333 -135 -638 37 -582 -324 -139 -279 -274 -304 221 -730 90 -189 -247 10 22 -63 -276 308 -217 107 -138
2282a38N05n40L26M23j015R52m98J73k1K23k16j6K89k32J12k66N92q26O75j27
$$ -138 367 -173 153 576 -439 513 15 188 167 390 174 158 447 215 327 61 653 -173 502 375
2302C75m08M09k72J84m87P14n36J07K25l54J14k62N49p18M21n8p3k16L49k45l87
$$ 375 -33 376 104 288 -199 515 -21 86 311 -43 71 -191 358 -360 61 3 -70 -286 63 -182 -569
2323e69Q41q95N74l30J86j44k15O62q28M33O7m8k33M83m58R8K16l49M13n73R29
$$ -569 272 -623 -49 -379 -193 -337 -552 110 -718 -285 -218 -266 -499 -16 -474 -376 -160 -509 -96 -669 260
2344B60p33K13L91p25O21j52J67l03N16l11Q4N8l2P5j87O86q00N76k18J31j84
$$ 260 -473 -260 131 -594 27 -125 42 -261 255 -56 28 86 54 129 -58 628 -172 404 186 317 133
2365A33J13K98p45J040o97J39J49j03Nj12K43k37R3p2L59q40P53k55m58Q13q05
$$ 133 246 544 -201 839 142 281 430 327 332 220 463 226 319 247 606 -234 519 264 -194 619 -186
2386a86N05m25L28k12j79L87l44O3O6J38o48O45m93J25Pr1K08n23Q42q60L37J57
$$ -186 319 -106 222 10 -169 218 -126 -63 3 141 -507 138 -355 -230 -223 -314 -106 -629 213 -647 -310 -153
2408a53k16P7m7K99o04N35k13j6kL63k94JL85n75N58l93N34n31K19M62q17Q52
$$ -153 -369 -292 -339 -40 -644 -109 -322 -338 -340 23 -271 -270 115 -460 98 -295 239 -292 -73 389 -428 424
2430D24l73qO1K18k90K67J8l2J5k46O57q94P61j21l07L76k85K77m09M41l98J59
$$ 424 51 43 104 322 32 299 317 285 300 54 711 -183 578 457 150 526 241 518 109 550 152 311
2452C11J07o2j91P4K13o30O16l96K42l22L29j09m64P50q16M13r1J9j58lJ52l83
$$ 311 418 356 165 239 452 -178 438 42 284 -38 291 182 -282 468 -348 65 -26 -7 -165 -168 -16 -399
2474c99K39j23J52m26O28n20P7K00m02M02m28O12o07K99J96m57K73p9J11k83N13
$$ -399 -160 -283 -131 -557 71 -449 -372 -172 -574 -172 -600 12 -595 -296 -100 -557 -284 -363 -252 -535 -22
2495b2l98K08j00J59l7k26O54p49O68k52J08q4J6J89m16O26l54J63n2K15l42J61
$$ -22 -420 -212 -312 -153 -190 -416 238 -511 157 -95 13 -71 -55 134 -282 344 -10 153 101 316 -26 135
2517A35K31l66L58k77M69o01M22j17l27N70m34K80k98M01m57K01k1j05L2q1L11
$$ 135 366 0 358 81 550 -51 371 254 -73 497 63 343 45 446 -11 190 169 64 96 15 326
2538C26n50N71m24K5O1m8M6l33O00o32L02m6q8n8Q4O3l49N24m34K36k64L16j30
$$ 326 -224 347 -77 -52 9 -39 7 -326 274 -358 -56 -102 -190 -248 -164 -101 -450 74 -360 -124 -388 -72 -202
2561b02j69M75n16L40k12K54m02M65o2k30L40k47K95m36N81m54K22J28j40J25
$$ -202 -371 104 -412 -72 -284 -30 -432 33 -29 -259 81 -166 129 -307 274 -180 42 170 30 155
2581A55j54M34n69N20k39K3R4J4Q2l39N75n98L81j04K7q4K9K41n23M60l37K47
$$ 155 1 435 -134 386 147 170 264 278 360 21 596 -2 379 275 302 218 247 488 -35 425 88 335
2603C35l06L33j77j85M51m54K30k85L16m28L32n7l03L60l92K90m14M44k40j06
$$ 335 29 362 185 0 451 -3 227 -58 258 -170 162 105 -198 162 -230 60 -354 90 -150 -256
2623b56K02j56N4j91L67o25N84k82n9J80j64K51m68N56l01L7O9L3j35O6K04m35
$$ -256 -54 -210 -156 -347 20 -605 -21 -303 -362 -182 -346 -95 -563 -7 -308 -271 -202 -169 -304 -238 -34 -469
2645d69N47l78L33k50K89n9l48O04m99L26j67K52k40J66J50l00K57j82L06m37
$$ -469 78 -300 33 -217 72 13 -335 269 -230 96 -71 181 -59 107 257 -43 214 32 338 -99
2665i9N39l44j0K12j88J94k99N39o05L90l6k56K64k39K82l42L15j84N7k15K92
$$ -99 440 96 86 298 110 304 5 544 -61 329 293 37 301 62 344 2 317 133 190 -25 267
2686B67l03k1M48p25O22m38J21l9p7J93l53L38j89Q0k22L04l47J56J03l17M01
$$ 267 -36 -57 391 -334 288 -150 -29 -68 -145 48 -305 33 -156 -76 -298 6 -341 -185 -82 -399 2
2707Bl72L89m58M28k37j77L92k84K52l12M64l49Q6M4N9n4K1J91m05N21l98L71
$$ 2 -370 19 -439 -11 -248 -425 -33 -317 -65 -377 87 -262 -176 -132 -73 -127 -106 85 -320 201 -197 174
2729A74k25J55Q4m22O51n15K76M5q7K5O1Jn5J83k42K98m50N58l39j33N04o01L91
$$ 174 -51 104 188 -234 417 -98 178 223 136 161 222 223 168 351 109 407 -43 515 176 43 547 -54 337
2752C37k66J74j92J17No4J8r2J32l42M40m14J85Lm3kk41L82n66N07k39M1L0j14
$$ 337 71 245 53 170 175 111 129 37 169 -173 267 -147 38 41 -2 -4 -245 137 -429 78 -161 -120 -90 -204
2776b04J93l03K69k50J28j42K87k99J72Q9l89N62n51L83k25K09L9l76M84k19Q5
$$ -204 -11 -314 -45 -295 -167 -309 -22 -321 -149 -60 -449 113 -438 -55 -280 -71 -32 -408 76 -143 -58
2797e8p0K67l10L33j28o0J33j48L52m68N56l38nK31k12J72k18L29l88L58j90O5
$$ -58 -128 139 -171 162 34 -26 107 -41 311 -157 399 61 56 287 75 247 29 358 -30 328 138 203
2819B03L0p9J24l04L77l11K16k50K76k36n9L57o00M72k52J20n1k0j8j62J38j10
$$ 203 233 154 278 -26 351 40 256 6 282 46 -13 344 -256 216 -36 84 33 13 -5 -167 -29 -139
2841a39J87l64M73n18K39O1l47L93l66L39k96J87j31OO8k3K8j95M20m69L07j16
$$ -139 48 -316 157 -361 -122 -61 -408 -15 -381 -42 -338 -151 -282 -276 -208 -231 -203 -398 22 -447 -140 -256
2863b56J9j2m6K26l72M77k89J41o5J55n3j07L42l72L36k19K05j45J56J0j42K86
$$ -256 -237 -249 -295 -69 -441 36 -253 -112 -177 -22 -75 -182 160 -212 124 -95 110 -35 121 131 -11 275
2885B75k31K95l69M10k77J5L07l54K93k16K28l21L07j79O4Qj32K60m21N03l96
$$ 275 44 339 -30 380 103 118 425 71 364 148 376 55 362 183 247 255 123 383 -38 465 69
2906F9R4Q7q9p0k4J96m15M29l82K75k61J24P0k75L76l64J14j70K06k93J98O3k39
$$ 69 163 250 161 91 67 263 -152 277 -105 170 -91 33 103 -172 204 -160 -46 -216 -10 -303 -105 -42 -281
2929b81K79k69K81m22L51j17r1K12k02J87k54L50l94K78o7RJ60j97J96l44M61
$$ -281 -2 -271 10 -412 -61 -178 -269 -57 -259 -72 -326 24 -370 -92 -159 -150 10 -187 9 -335 126
2950A26k70J31m8O7M1j31L46m70M90k79J71k0k3J01k86K71r0Q1j11K55l25J64
$$ 126 -144 -13 -61 6 47 -84 262 -208 282 3 174 154 131 232 -54 217 127 208 97 352 27 191
2972A91J38l91M31l79L18k50J32Lk10K14j59J13j92L24l96K14r3p0J01k03K14
$$ 191 329 -62 369 -10 308 58 190 193 -17 197 38 151 -41 283 -113 101 8 -62 39 -164 50
2993E0l37M31l33J55n3j07J83l23M19m39K84o3L7j44J21n6j91L53l41L58k99K64
$$ 50 -287 144 -189 -34 -87 -194 -11 -334 85 -354 -70 -133 -96 -240 -119 -175 -366 -13 -354 4 -295 -31
3015c1j61j08L84m35L63k47K59j92J26L1j11J30n9J93k64M40m73K92o5l6K32l13
$$ -31 -192 -300 84 -351 12 -235 24 -168 -42 -11 -122 8 -51 142 -122 318 -155 137 72 36 268 -45
3037d5L36l42L19j36k1R3m3N1j52L33l54K35j84K12j63j8K09l95M62m46K99k08
$$ -45 291 -51 268 132 111 204 161 212 60 393 39 274 90 302 139 121 330 -65 397 -49 250 42
3059D2M4L1j58K64k89J96k16J88l03K42p3j34J71k94L67m37M48k82l1J65j80J44
$$ 42 86 117 -41 223 -66 130 -86 102 -201 41 -32 -166 5 -289 78 -359 89 -193 -224 -59 -239 -95
3081i5k04K49k69K51k16J23j10Q7J66l92M91m07K61j13M1P7j98L35l31L04j35
$$ -95 -299 -50 -319 -68 -284 -161 -271 -184 -18 -410 81 -326 -65 -178 -137 -60 -258 77 -254 50 -85
3102h5J24j07R1m4q4K66k69K49k06L38l09J57J05l09M57m00L24k27J48m3l4R4
$$ -85 39 -68 23 -21 -105 161 -108 141 -65 273 -36 121 226 -83 374 -26 298 71 219 176 142 236
3124B36q8R5k83L93l77K97j60oJ25j98K36l96L71k68J21o2k7N1j24J44k63K59
$$ 236 148 243 -40 353 -24 273 113 107 232 34 270 -126 245 -23 98 36 9 60 -64 80 -183 76
3146G6k65K63k62J17O3k41L00l33K03j58J62r2j9J31j85J67j63K39l19L23j74
$$ 76 -189 74 -188 -71 -8 -249 51 -282 -79 -237 -75 -167 -186 -55 -240 -73 -236 3 -316 7 -167
3167a67K6J08k01K62l06L64k59J52K2j46J97j19K50k98L26k68J64r3N6K7j44L74
$$ -167 -141 -33 -234 28 -278 86 -173 -21 1 -145 52 -67 183 -115 211 -57 107 14 70 97 -47 327
3189C27l35K78k48J83j25M1J54k99K81j97J82k24K14j41K5N5j97K45l07L24l55
$$ 327 -8 270 22 205 80 121 275 -24 257 60 242 18 232 91 116 171 -26 219 -88 236 -119
3210a19J81L4j75K20j75J13j82J81j69J33q2n2L4j58K84l91K87j59N6N3j06J24
$$ -119 62 96 -79 141 -34 79 -103 78 -91 42 -40 -92 -58 -216 68 -323 -36 -195 -139 -86 -192 -68
3232f8k75L72l12K55j84J59j05m5J72k29K70j97J85k20K41o2o9J90k18K68k42
$$ -68 -343 29 -283 -28 -212 -53 -158 -203 -31 -260 10 -187 -2 -222 19 -43 -112 78 -140 128 -114
3253a14K57k10J44Nm5R8j16J97k87L50k62J09L8j37K37k72L30k52J73p2J5n1O9
$$ -114 143 -67 77 82 37 135 19 216 -71 279 17 126 164 27 264 -8 322 70 243 171 186 135 204
3276B04K1k09K99l12K20j78J54l0j51J88k16J94j82J11j71J37j09o6J62k59K06
$$ 204 225 16 315 3 223 45 199 169 18 206 -10 184 2 113 -58 79 -30 -96 66 -193 13
3297A3k22K40k54J37J5j32J36k21K70l12K48j12o8J64p4J8j19K66k90K72k21J25
$$ 13 -209 31 -223 -86 -71 -203 -67 -288 -18 -330 -82 -194 -262 -98 -172 -154 -273 -7 -297 -25 -246 -121
3319a21J2j07K60l48L52k43J97j4Kk9q1J90j48K14j63K35k80J97J4j61K59k39
$$ -121 -109 -216 44 -304 48 -195 2 -12 -10 -39 -120 70 -78 136 -27 208 -72 125 139 -22 237 -2
3341bK37j95J94j48kJ87k02J40j98L11k64J77j22j9O6r2J38k72L51l43J74j17
$$ -2 235 40 234 86 84 271 69 209 11 322 58 235 113 94 160 68 206 -66 285 -58 116 -1
3363aL4K4j38K19k76J81j06jr9J46j34m3J75k96L32k75K06n2o1R7k62K61j41J16
$$ -1 33 57 -81 138 -138 43 -63 -64 -163 -17 -151 -194 -19 -315 17 -258 -52 -104 -165 -68 -330 -69 -210 -94
3387i4j45J86j03PJ56j81J07k13L28l51L07j00L9J21j93J98j77K53j65O7L5m6
$$ -94 -239 -53 -156 -149 7 -174 -67 -280 48 -303 4 -96 -57 64 -129 69 -108 145 -20 47 82 36
3409C6L3l1J57k26K51k04J56r4O7M9j91L26l45K29j28Q0n7m7J28r4N5r3J69k51
$$ 36 69 38 195 -31 220 16 172 78 145 194 3 329 -16 213 85 165 108 61 189 95 150 57 226 -25
3433b5K12j41nJ33k92K43k18K09k12O3K4r4Q1j14R5j78K45k43J32p1J0Rj18K21
$$ -25 187 46 41 174 -118 125 -93 116 -96 -33 -9 -103 -22 -136 -41 -219 26 -217 -85 -156 -146 -137 -255 -34
3457c4k45K92k46J84q5o7J77k12K07j90J13q0J46j26L2J17j68K38k16K68k23K37
$$ -34 -279 13 -233 -49 -134 -201 -24 -236 -29 -219 -106 -186 -40 -166 -134 -17 -185 53 -163 105 -118 119
3479A19j1k08L21k94J42j11J79j13J35Jn7P3j42K14l24L49j52K8M2j33J39j41
$$ 119 108 -100 221 -73 69 -42 137 24 159 160 103 176 34 248 -76 273 121 149 191 58 197 56
3501E6K63k95J69j06O3m5K1L6j79J83k51K27j73J26r8m9J51k63K41k17J36j16
$$ 56 319 24 193 87 150 105 126 162 -17 166 -85 142 -31 95 -3 -52 99 -164 77 -140 -4 -120
3523a20J19m4q6J08j60J63k19K80k76J05L7j44J62j72J99j73J58j15J4M0PJ03
$$ -120 -1 -45 -131 -23 -183 -20 -239 41 -235 -130 -93 -237 -75 -247 -48 -221 -63 -178 -164 -124 -117 -14
3545a4k00K33k29K49j16P6jn9J86k54K33j47J69r3Q1m1r6K42j98J49j38J54j09
$$ -14 -214 19 -210 39 -77 -1 -2 -61 125 -129 104 -43 126 33 114 73 -23 219 21 170 32 186 77
3568G7L9L8p4J87k14J92j93K20k01j0J51j42J08j12J68k16J17j22L2Q1j68J75
$$ 77 116 154 80 267 53 245 52 272 71 61 212 70 178 66 234 18 135 13 45 126 -42 133
3590A33k50K63k79J51k6o2Q0j44J45k31J99j32R7j11J6M3r4J41j92K09j75J62
$$ 133 -117 146 -133 18 -8 -70 10 -134 11 -220 -21 -153 -56 -167 -151 -108 -202 -61 -253 -44 -219 -57
3612e7j04J2N7j32J40j08J70j19J08j44J05M4j01J58j96K20j85J69J3n8Q0p5J14
$$ -57 -161 -149 -92 -224 -84 -192 -22 -141 -33 -177 -72 -28 -129 29 -167 53 -132 37 50 -8 72 -3 111
3635A11j36J41j41R8jJ9k5j0J53j92K10j64N9q6N6J24k13K05j69J34l4o3l3K2
$$ 111 -25 116 -25 73 72 91 66 56 209 17 227 63 122 36 92 216 3 208 39 173 139 76 43 65
3659F5J7j71J97j83K68k40J05j4j18R9j39J55k38K11r2J3l4k2O9j20J25j26J18
$$ 65 82 -89 108 -75 193 -47 58 44 -74 25 -114 41 -197 14 -78 -65 -99 -121 -52 -172 -47 -173 -55
3682e5j61J45r2l8R9j34K59k28J13m9J11p9J4N4j17R8n2J74j78J45n3l0J44j43
$$ -55 -216 -71 -163 -201 -102 -236 23 -205 -92 -141 -30 -109 -95 -41 -158 -60 -112 62 -116 29 -24 -54 90 -53
3706e3J93k04J86j27P0K4l5Q0q4J04j66K29k26J69l1l8J53k20K15k70K28j08N2
$$ -53 140 -64 122 -5 65 89 54 134 50 154 -12 217 -9 160 129 91 244 24 239 -31 197 89 141
3729A41n6k2O7j02J36j20N6p3M5q9L4R2k19K13k00J57j77N7M4r0R1j82J55j46
$$ 141 85 63 130 28 164 44 100 27 72 -17 17 109 -110 103 -97 60 -117 -60 -16 -106 -15 -197 -42 -188
3753a88J53r9P1k2p9J01j69J92j61J48j45N6M9q4J27j47K11k29J56j9L5k5LP8
$$ -188 -35 -134 -63 -85 -164 -63 -232 -40 -201 -53 -198 -142 -93 -177 -50 -197 14 -215 -59 -78 -43 -68 -65 13
3777A3j10J76j76J82j56J07Q7j20J54j59J71j15Q0o0QN3k7N1j16J71j16J75k27
$$ 13 -97 79 -97 85 -71 36 123 3 157 -2 169 54 134 74 82 135 108 159 43 214 98 273 46
3800D6O9L9r0J84k04J84j96J69j32L4Kr1P1j39J88j58Q0p2k1O7q9J16k06K24k10
$$ 46 115 154 64 248 44 228 32 201 69 103 105 14 85 -54 134 -24 56 -16 -37 30 -59 57 -149 75 -135
3825a35J13j4n2Q5j40O9j52J81j14O5r9J18j8j14K08j92J82j56J06n2PR6j60J45
$$ -135 -22 -36 -88 -3 -143 -74 -226 -45 -159 -94 -193 -75 -93 -207 1 -191 -9 -165 -59 -111 -104 -8 -168 -23
3849b3o5J39j55J45j24NJ73j20Q5j52K25j27J31p8kJ02j33J80k56K15j02J00p2
$$ -23 -88 51 -104 41 -83 -78 95 -25 60 -92 133 6 137 59 57 159 26 206 -50 165 63 163 91
3872I1J6K3q3J26j71J88j47J08n4j9O0j31J68j46R2r8P7n2l1Kr5J76k65K32k13
$$ 91 107 130 47 173 2 190 43 151 97 78 138 7 175 29 121 23 100 48 17 19 -76 100 -165 67 -146
3897a46J20m4p9J23j12J21j88J63j47J53q2j7Q6j24J24j35J30j48R7kNN6p1R8
$$ -146 -26 -70 -149 -26 -138 -17 -205 -42 -189 -36 -118 -135 -49 -173 -49 -184 -54 -202 -105 -107 -102 -46 -117 -19
3921a9j17J39j51P8L3l2J54j99K00j08J30j58R4L8n6J46k27K28j83J59j40R3K8
$$ -19 -136 3 -148 -70 -37 -69 85 -114 86 -22 108 -50 44 82 26 172 -55 173 -10 149 9 102 130
3944A30q8J33q6O0r0R0j13R3l4n4J24j35J75j47Q1r7mK1q0J18j26Q6j38J04j09
$$ 130 42 175 89 149 59 149 36 129 95 41 165 30 205 58 139 42 38 59 -21 97 -29 57 -81 23 -86
3969h6P9Rj11J16j86J55j39J28j00O6L3q6P6j41J13q7J32j35R3k9n2J18j73J42
$$ -86 -7 2 -109 7 -179 -24 -163 -35 -135 -69 -36 -122 -46 -187 -74 -161 -29 -164 -71 -100 -152 -34 -207 -65
3993f5j18J57o2QM5m9P7j07J38j69K38j71J37n3n7K04j87J78k45J96m0J9M7j14
$$ -65 -183 -26 -88 -80 -35 -84 -7 -114 24 -145 93 -78 59 6 -51 153 -34 144 -101 95 55 74 121 7
4017GJ36p3N7n6Q4q6L9J5l1J12k55K75j73N7k9n2Q8p7O7j50J76j67J36j51N9J6
$$ 7 143 70 127 71 155 69 108 123 92 204 -51 224 51 108 79 27 115 38 105 -45 131 -36 100 -51 8 24
4043B4OL0j37J27j67J65k23R9K5r2J08j18J28j30K3L5J0o3J8Q9j34J37j32J42
$$ 24 30 60 -77 50 -117 48 -175 -76 -51 -143 -35 -153 -25 -155 -132 -97 -87 -150 -132 -43 -177 -40 -172 -30
4067c0j39O0P6r2J09j16K12j50Q0j15O8O1r6J37j30J96j53J44j20J9J09j35J66
$$ -30 -169 -109 -33 -125 -16 -132 80 -70 10 -105 -37 24 -72 65 -65 131 -22 122 2 21 130 -5 161
4090A61j88K02j19M8L6n8N3o1M2j22J57j52J31m1J4K8j56K52k45J10o1M8K2j03
$$ 161 -27 175 56 104 140 82 135 74 116 -6 151 -1 130 89 103 131 -25 227 -18 92 31 79 101 -2
4114bO6r2J28j50J72j88P5l7K2K7j70J99k21J59j44P8l0J7M5j35J18r8R7p6Q7
$$ -2 64 -28 100 -50 122 -66 9 -28 -6 21 -149 50 -171 -12 -156 -78 -108 -91 -46 -181 -63 -161 -64 -140 -53
4139e3m3l0L3r0J78j64J83j50J18k3q8J89j37J02r9J21o7M5JJ5J5r9J82j80J75
$$ -53 -96 -126 -93 -183 -5 -169 14 -136 -18 -41 -129 60 -77 25 -74 47 -20 25 26 41 56 -43 139 -41 134
4164A34q0Q5o2k0R6j28J34j10P4m0K6j0qK5p4J62j30J09j75J35l6r7J35j92J75
$$ 134 54 139 77 57 153 25 159 49 123 83 109 99 91 116 42 204 74 183 8 143 107 10 145 -47 128
4189A28j83J30r6N5p1L2J5j19J69j58J24j30Q6r7k1J45j47P5o3P9o9L1k0m5P5
$$ 128 -55 75 -21 34 -37 -5 10 -109 60 -98 26 -104 -18 -115 -136 9 -138 -63 -126 -47 -116 -85 -105 -150 -75
4214g5o6J43j47J34j57J7P5r4J51r6J29j19P8o4O8mk2J58j80J30p6J05m2J5Lk0
$$ -75 -141 2 -145 -11 -168 -151 -76 -170 -19 -115 14 -105 -27 -91 -23 -27 -49 109 -71 59 -17 88 46 61 64 44
4240D4J53j80J64j00O4m7J4rr3J46j62J57p0P9p4L9n9PR5j64J86k24J07n0J5L5
$$ 44 197 17 181 81 145 98 112 103 10 156 -6 151 81 160 86 125 66 73 168 4 190 -34 73 23 38 73
4266G3j16Q8j39J29j24J14j32N3M3j20J89j88J68j80Q6j5m1K3o4J44j37O8j08
$$ 73 -43 45 -94 35 -89 25 -107 -54 -11 -131 58 -130 38 -142 -56 -71 -112 -89 -153 -9 -146 -78 -186
4289a86J42n4j5O4j09J40j10J48j42J00rk6J07j23J37q7R6j20P7l1O5qo4J53j80
$$ -186 -44 -98 -113 -49 -158 -18 -128 20 -122 -22 -31 -57 50 -73 64 -23 73 -47 30 -1 64 56 -8 145 -35
4314c5J68j03J5J2N1M6j27J65j62J49r9K7m1rM7m1M9r0J31j13O3q3L8N8j35J44
$$ -35 133 30 45 57 108 154 27 192 30 179 80 107 66 57 104 63 112 22 153 40 103 20 58 116 -19 125
4340A25j27R2j16O1o9j8K1p0J10j30R8p3Q0p3OP9j41R8r8P9o5O6K9q6J38j42J08
$$ 125 -2 90 -26 35 -34 -52 -31 -101 9 -121 -23 -96 -16 -89 -83 -4 -145 -47 -145 -66 -131 -65 -36 -122 16 -126 -18
4367a8o8M3r1J30l9p0Q7j21K34k01R6oO4j9j16J69j29J19r2J43q8P3p9K8O2j32
$$ -18 -86 -43 -134 -4 -43 -113 -26 -147 87 -114 -18 -24 40 21 -95 74 -55 64 -28 115 27 100 21 49 111 -21
4393b1J87j61J27q2P7K7j08R5j05N2n0O7p6M2j9RM0j24J77k12J23r3O8rn2N7r3
$$ -21 166 5 132 50 127 154 46 141 36 88 38 105 29 71 52 61 101 -23 154 -58 65 -28 40 31 -21 36 -57
4420e7R7q3J9o9M0k1j5R3j72J47j25J02o5K8M2j25J22q9N5n3J39j26K2kJ7J03
$$ -57 40 -43 -24 -93 -53 -74 -89 4 -168 -21 -146 -44 -109 -81 -39 -164 -42 -131 -76 -129 10 -116 -94 -96 -79 24
4446B4j79J57j20R7k2M9k8PO8o8R9j17P9L4k3J3m8P6j23J83j48J57j25M7Nj7R8
$$ 24 -155 2 -118 -21 -43 6 -22 -15 53 -15 84 -33 46 80 57 70 22 98 -25 158 10 167 42 89 94 77 175
4473A75j64J39j00R2j44P7K5p6R7j19P9p5J23j37O1%m6Q5j21Q9q7m1L1K7N2j09
$$ 175 11 150 50 142 -2 75 100 24 121 2 81 6 129 -8 53 53 7 92 -29 60 -27 -68 -37 -10 42 -67
4499f7J32j71J17j12R4q6K8k4p5J37j20J29j07nK4rO6o1L3l0J36j05K4m7K6Q5
$$ -67 65 -106 11 -101 -7 -93 -65 -89 -164 -27 -147 -18 -125 -130 -106 -115 -49 -110 -77 -107 29 -76 -52 -99 -73 12
4525A2o7P0p8R3j11J03k2l9Q1q0J22r0O3m9N7K4j3K2l9R8j17P5q6Q5m7j7J00j27
$$ 12 -55 15 -63 30 -81 22 0 -39 42 -38 84 -6 57 8 65 89 76 98 59 157 40 115 29 114 67 50 150 23
4553B3J22j41O1m1N0Oo3P5r8J16j54J68j24L0m1KJ4q6J48j23O0n3joK2k1o1R9
$$ 23 145 4 65 24 74 80 17 92 -6 110 -44 124 0 30 -11 -9 5 -81 67 -56 4 -49 -50 -56 -34 -55 -116 -17
4581a7j22P4KJ3n1o5J49j32J39j39J35p4L4Jo5J01q5J10p5M8m8J8L4m3J3j2R5
$$ -17 -139 -65 -63 -50 -101 -166 -17 -149 -10 -149 -14 -88 -54 -53 -118 -17 -102 8 -67 -19 -67 -49 -15 -58 -45 -57 38
4608C8p4J04m7j6P5j20J34q7J43j11P6r1K0O7m7J47j27O3r6P0m8Ro5L3K5l3M5
$$ 38 -36 68 21 5 80 -40 94 7 150 39 115 24 44 111 64 211 84 147 51 121 73 82 17 50 75 42 87
4635H7p3Q7k0l9K7n7P1j21L8j9N4n4K3m1M2l0p7J61j46P6p4L0O0j04pl2J20r7
$$ 87 14 101 81 42 69 12 83 -38 0 -19 35 -19 4 -37 5 -25 -102 59 -87 -11 -85 -55 5 -99 -106 -138 -18 -115
4663a15O1j1oL0j13J14o0N4p5O3K5mJ4l8Q4p2N4o5J54j09M4K0ojn7R8j23J38l0
$$ -115 -54 -65 -71 -41 -154 -40 -100 -46 -121 -58 -33 -37 -23 -61 23 -49 5 -60 94 -15 29 49 43 42 -15 83 -40 98 68
4692F8L2m9k2P7j10J37o1M6m3JK4p3J03q4Q5q7K1j1Nnn6N0p5R6j13J06n4j5J5
$$ 68 100 51 29 106 -4 133 72 118 75 76 100 27 130 46 131 44 65 54 59 54 -2 48 -27 69 -44 62 8 -7 8
4721Hj0P2j52R2q2P9k9m9k9J6J00j40R7j08R6j2o0P7r6J18j34J24p9R1o7K7N3
$$ 8 -2 70 -82 10 -72 7 -22 -71 -100 -84 16 -124 -27 -135 -39 -51 -111 -34 -130 -12 -146 -22 -101 -10 -77 -50 3
4748Cq6J32j34O5m6L1k1K8P1m6R7r5O4j17R3Lk7J07j29J07o6R9o8O5p4JP5j07
$$ 3 -83 49 -85 -20 -66 -35 -56 -28 43 -3 94 -1 63 -54 39 42 15 122 -7 100 34 133 65 130 56 57 132 25
4776B5J39j68J68j08P4m1n4K9o4O7r3J67j25K9j3m4M8n2J7p2R6p9K4rm5M8q9Q1
$$ 25 164 -4 164 56 130 89 35 64 0 67 -26 141 16 45 32 -12 36 -16 1 -71 25 -54 -30 -39 -84 -36 -125 -44
4804d4j14J51j01O0l9M4J2j04J45j58J29l4m3L9J4J20k06Q9p5J15o9L2qk9R9q6
$$ -44 -158 -7 -108 -48 -87 -43 -31 -135 10 -148 -19 -53 -96 -57 -43 77 -129 -40 -115 0 -69 -37 -45 -74 25 -61
4830f1J47j82J44o0J6J8n3J11j13J33q7P6m0J4L1l5O7j35J55j01J05j39O4rLL5
$$ -61 86 -96 48 -12 4 22 -31 80 -33 100 13 89 49 63 94 59 126 -9 146 45 150 11 75 66 69 104
4856A04p2P1r6J9k0J6N1m1J1n6R9j12O8k0Ln1l8P6r5J19j46R9q6J3J0K1J9q4P7
$$ 104 32 103 7 26 6 22 73 32 43 -13 86 -26 42 22 25 -26 -64 12 -83 36 -110 -11 -97 -84 -74 -53 -34 -118 -41
4885d1j05R8j7J0nj12J44l7M7l9j0l4L6N6j02J12n8P0p8J26p8JO8j02R6j11N1
$$ -41 -146 -48 -65 -55 -60 -172 -28 -65 -18 -57 -67 -101 -65 -9 -111 1 -57 13 -65 61 -17 -16 52 -50 46 -65 -14
4912a4n5R9L5m9R1l1N8j07M0n4P3n6N7qo0Q1p2Q9p4K3L2m0M9n1k0n0P4n3M2l7
$$ -14 -69 30 65 16 107 76 134 27 67 13 86 30 87 79 19 100 28 117 43 66 98 58 107 56 36 -14 60 7 49 12
4942A2PMk3O2j47J30r7L7j26J05K8n4L2l5N6k9J5q7K6kl0J28j26J05r7M8pJ2J0
$$ 12 19 23 0 62 -85 45 -52 -15 -141 -36 -8 -62 -30 -65 -9 -38 -23 -110 -84 -86 -116 12 -114 -9 -106 -58 -65 -53 -43
4971d3m0J16p2Qk3N0k4k7N1nP0j34K07k01J16l9K9J3r5J23p3M2n9J44p9%L3kL0
$$ -43 -83 33 -39 -31 -54 -4 -28 -55 -4 -9 61 -73 134 -67 49 10 39 52 -43 80 7 49 -10 134 55 55 88 86 116
5000A16p8K3l3M8j9j2L5l4L2r0Q2o3M2m8L0K4p7K2n5J03p8pPJ7K5r8J08j59J57
$$ 116 38 61 28 76 57 45 80 46 78 -12 70 7 49 1 31 55 -22 0 -55 48 -30 -37 -30 -13 12 -86 22 -137 20
5029B0o4Kl1J9j2k9O4j17J36q3JK0j9K6n1J18r1R0n6K9l4OL1rN6j07J33o9O2l9
$$ 20 -44 -42 -73 -54 -66 -95 -31 -148 -12 -95 -94 -74 -93 -67 -118 0 -91 -1 -57 -28 -62 -56 -25 -34 22 -85 48 -21 41 2
5059BNN0n8J05j09O0m6M4kM0jj08J69j38P4k7P1o3k1Q4j29J24j08J14j01L3l6
$$ 2 7 57 -1 104 -5 55 9 53 51 91 90 -18 151 13 87 60 131 68 47 131 2 126 18 132 31 64 28
5086B8j8O5j10J02p8O1m6oO3r5R4j01R8j66J41n8k9P4j46J31p5K1l1N7l6RoL1
$$ 28 10 75 -35 67 -11 50 4 -2 61 -34 60 -41 57 -109 32 -26 -55 19 -127 4 -71 -50 -81 -24 -60 -51 -57 -26
5114b6k5m3L1j0L4j4j9K3%Jl2O9l0OK0j0Nl0J37j56J65j04Q3r0O4qm5J00j63J06
$$ -26 -51 -94 -63 -73 -39 -53 -72 -49 -49 -48 -80 -11 -41 -35 -15 -25 -20 -50 87 -69 96 -8 75 -15 49 41 -4 96 -67 39
5144C9n7Q8n4M9P1j42R0m2P9j48Q3n5L7L4j7J9o2J02j35J08n6k8O8o3K3j45J63
$$ 39 -18 70 16 65 136 -6 84 42 121 -27 56 1 38 72 55 74 12 114 -21 87 31 3 71 8 31 -114 49
5171D9p5Pn6N5Ql9M8j15R7o4N3q5P5l2nL5n5J1KP9q1jL8m9J58j45R5q0K6L3MM3
$$ 49 -26 -19 -75 -20 -12 -51 -3 -118 -21 -85 -32 -117 -42 -74 -79 -44 -99 -88 -86 -7 -88 -89 -51 -100 58 -87 8 -72 -46 -13 -9 34
5203C4j24J11l2K1o6N4J6K3np0J01p4J11j02O0l1JL7o5M5n5J09p1Q3n7NN5r9J25
$$ 34 -90 21 -11 10 -56 -2 14 37 32 -38 63 -11 100 -2 58 27 28 65 0 45 -10 99 28 111 54 59 114 15 140
5232A40r9L4k5L8n7kN3o2K6o1O5r2L1K9J0k9m1N8p8L9m2J11p9ll7k2R1p6Q9j12
$$ 140 41 75 50 88 31 29 82 20 46 -15 50 -42 -11 18 28 -1 -42 16 -62 -23 -65 46 -33 -36 -73 -95 -4 -80 9 -103
5262a03L2K0l2O5n2P8j06K5NL4qM3pq2J11j22J19q2N1jm0J06r9J33j41Q9k6j3
$$ -103 -71 -51 -83 -18 -70 8 -98 -73 -68 -34 -42 1 -6 -88 23 -99 20 -62 -11 -12 -52 54 -45 88 -53 36 10 -3
5290cK0N3rp9Q5l8O4m3Q6o1m7R5r9M3p0J21o7R3j43J9L9m8J21j45O4l6Rk2k7Q4
$$ -3 17 70 61 -18 67 29 93 50 136 75 28 123 24 67 -3 118 51 144 1 20 59 11 132 -13 51 15 24 2 -25 59
5320E9r4O9j12P3J0l0%nM9j03Q7r5R8k9J3k7n9Q9j24O7p7R4o8Q9k7QL5o1N1m0
$$ 59 -35 34 -78 -5 5 -25 -25 -30 19 -84 3 -92 6 -23 -10 -37 -96 -7 -131 -64 -141 -47 -115 -26 -53 -45 -10 -71 -20 -60
5350f0N0k4m4N7k5P3n4N4j04P2k3M6M4k4O5j45P3o2J01l8nP0p6J07j20R1o6N2
$$ -60 -10 -34 -78 -21 -46 27 -27 27 -77 -5 -28 18 62 38 103 -42 31 -31 70 32 27 97 21 128 8 99 33 85
5378H5m5M1k2k5J9m9P3q7N7%jK1n8O3q5K1k0J6pKm0L9J2q1M7k5J04r1OM4q8P9
$$ 85 40 81 59 34 53 4 77 -10 47 47 46 67 9 72 -13 8 -12 4 -3 -1 -41 -2 10 -71 -24 -49 55 -36 -30 14 -74 5
5410Er6J35j34N7j09Q9nk8M6j7P6j37P1Jj1Q3j07R8r7M9k7J10p8RK7j6Pm9J53
$$ 5 -91 44 -90 -33 -142 -53 -58 -86 -40 -57 19 -118 -47 -46 -57 26 -81 17 -80 -31 -58 52 -26 -17 10 -6 1 -48 105
5439A05q6K4k9OK5m8Q2j01J47p1%K4j3K1l4M9p2N9p7J09l4J7%n3N9j43L4j3J7
$$ 105 19 43 14 20 45 -3 79 -22 125 54 54 78 65 86 52 101 29 88 11 120 86 103 103 50 109 -34 0 -13 4
5468DL0n5N6q9Q7r2O8k6M0k7l9J6n4J03j16R7n3jnK3j7p0R6m6M0o6PR2n4QL2M1
$$ 4 34 -21 35 -54 33 -59 9 -17 23 -4 -43 -27 -81 22 -94 3 -50 -51 -56 -33 -50 -120 -24 -70 -30 -96 -89 3 -51 -43 -11 30
5500C0j69J16o8R6j5rK6r6J12n0M4JK7l7M4Jm3K2k2L7k0O3m3k3J35j72J12j04
$$ 30 -139 -23 -91 5 -10 -19 7 -89 23 -27 17 18 45 8 52 53 10 32 10 47 27 90 47 24 159 -13 99 -5
5528eQ9n5K4l7KJ13j52O8p3R0q9J6J4k6M9n0N4j06J85j01o2N0j2M1j37P6n2Q8
$$ -5 84 29 53 16 18 131 -21 47 -26 64 -25 -9 5 -21 28 -22 32 -74 111 10 -52 -2 -14 27 -110 -34 -86 2
5556Bo1O1qj07Q1o1QN8kn4%Q3q6K0K3L1p3P4k8K0L2m1Rm3J18p4O3j7n7R2q2J42
$$ 2 -59 2 -6 -113 -32 -93 -85 -27 -29 -83 -83 0 -86 -66 -43 -12 -85 -11 -39 -19 13 -28 -19 -62 56 -18 45 28 -29 63 -19 123
5588A23r3K6l4L6k7J3Pl1N7o5J29n9K2n5K3rp9J28j03Q4j1n3K0nO8r1O1r1L8k4
$$ 123 30 56 22 58 31 44 51 20 77 12 141 82 104 49 72 63 -16 112 9 93 82 29 49 44 112 21 82 -9 29 5
5618EM2m5KP3j11O4m6K8q7N6Rl0M1m6O6j37Q1m1O2n5j4P2q5R1p3L2Rl7K2qO1p2
$$ 5 47 2 4 77 -34 30 -16 12 -75 -19 -10 -40 1 -45 21 -116 -35 -76 -14 -69 -83 -11 -96 -5 -78 -46 -37 -74 -52 -60 1 -71
5650g1P9p6R4n0l5L6k5QqR6k3Kk3J3pJ7J3qO1r7R9m2m4Q1p2R8q3O1l1L2n6K7n1
$$ -71 8 -68 26 -24 -59 -23 -48 -40 -48 48 25 27 4 17 10 27 40 32 93 -4 95 53 9 90 18 116 33 94 63 95 39 66 15
5683A5J2K4m0M8m4K9k1pJ2m0J0k1Q1r8O9j8n3M7q9M1l2P2r1J15n3Ql5K6j0o1O7
$$ 15 27 51 11 59 15 44 23 16 28 -12 -2 -23 58 -40 29 11 -42 5 -84 -43 -75 -3 -94 21 -32 -24 -59 -33 -43 -104 -37
5714c7l7M3o1jN8j1K2n8J03j22Q9j00M1L1l8O5m1P1n1N1m0K9JKn5O1j1P5l2l9
$$ -37 -74 -31 -92 -93 -35 -46 -24 -82 21 -101 -12 -112 -71 -40 -78 -13 -54 17 -34 17 -23 6 7 9 -46 15 4 79 47 8
5744HJ4mk4M0k5J06j4k0o2L6l8m1J39j27N8j8j3J0K3j0n8Q2n6O8l9jo0k0O1l9
$$ 8 22 18 -6 34 9 115 101 81 19 55 17 -24 115 -12 46 28 15 25 48 38 -20 62 6 74 35 34 -26 -46 15 -24
5774b4L5p5O3k6J4Oj4J5o1P9q5J3K7J6p4L4QJ5K8q6J30o8M2o5rpJ1R0j08O9r1
$$ -24 11 -64 -1 -27 -13 -7 -21 -6 -67 12 -73 -60 -33 -17 -91 -57 -49 -34 -6 -92 38 -30 12 -53 -62 -69 -58 32 -76 -7 -98
5805i8J44q6NL4j8J20j65J31p9N9m8M8Rq3O0n7J01o6O8l4K2k8k7O7q2Q8p5N8n8
$$ -98 46 -40 -35 -1 -19 101 -64 67 -12 47 -1 47 56 -27 33 -24 77 11 79 45 67 39 12 79 -3 85 10 68 10
5834A0Q2p6J3Q1j36J10p2P2r4M4j3J7nl8K9q4O1K6o0k5j8R8j04J06j12O5l1l7
$$ 10 92 16 29 110 -26 84 12 84 -10 34 21 38 33 -5 24 -60 1 27 -33 -58 -76 22 -82 24 -88 -23 -54 -91
5862i1P7l3Q7j32R2m6ML7j02P5m1N3n4N4l7Q6o7l3Q3l6L4p2R9q6L9L7k7K2o1R2
$$ -91 -14 -47 40 -92 0 -46 -42 -5 -107 -32 -73 -20 -74 -20 -57 29 -38 -71 12 -24 10 -62 37 -49 -10 27 0 22 -39 53
5892E3j21R4l1M9j5k2M7p9P2JK7k8L0n3l8P7qL4j36P6po3M7k9J31q3M4o3O1q9
$$ 53 -68 26 -5 44 29 7 54 -25 47 48 75 47 77 24 -14 63 55 89 -47 29 22 -41 6 -23 108 25 69 6 67 -22
5922b2N8l4m0PK3N7j12K3M5p6pkJ3M2K9m7K2p0j0R8p8M0n6P4j9O1r2M1OMjq6J24
$$ -22 36 2 -38 -31 -8 49 -63 -40 5 -71 -78 -80 -67 -25 4 -43 -21 -91 -101 -3 -81 -41 -97 -23 -42 19 -73 -32 -26 -22 -23 -109 15
5955A5o4N7m5N9n3J0K9l9Q6o1L7l9KqJM4K3M9r8R1j14N6K6n2N4n7J02p0pk6j1
$$ 15 -49 8 -37 22 -31 -21 8 -31 55 -6 31 -8 -6 -14 -13 31 54 103 5 96 -18 38 64 12 66 9 111 41 34 8 -3
5986cN0m5M3j32J69o0j2k9M5Po4P5r6R9r3O3j0k8M1j09R1p2J10p4Ljp2O1j4M0
$$ -3 47 2 45 -87 82 22 10 -19 26 33 -31 44 -52 47 -46 17 7 -21 20 -89 2 -70 40 -34 -31 -32 -104 -43 -57 -17
6016a7m1P0r9M8j7N6Qm9N2n6L0m5N0j2J2l5kO9n5O1n5L3ojQ7j17P0l8O0QK8n4
$$ -17 -58 12 -87 -39 -56 0 8 -41 11 -45 -15 -60 -10 -22 -10 -45 -47 22 -33 28 -27 6 0 -1 86 -31 39 1 61 69 97 43
$$ [...]
8191e3
##END NTUPLES=NMR FID
##END=
