##TITLE=1H_TG-2304-3
 CDCl3, 8 sc, 
 21.10.2020
##JCAMPDX= 6.0         $$ Bruker NMR JCAMP-DX V2.0
##DATA TYPE= NMR FID
##DATA CLASS= NTUPLES
##ORIGIN= UXNMR, Bruker Analytische Messtechnik GmbH
##OWNER= root
$$ XWIN-NMR		Version 3.5
$$ Wed Oct 21 13:54:30 2020 Russian Standard Time (UT+4h)  she@DPX200
##.OBSERVE FREQUENCY= 200.1315066352
##.OBSERVE NUCLEUS= ^1H
##.DELAY= (6, 6)
##.ACQUISITION MODE= SIMULTANEOUS
##.ACQUISITION SCHEME= undefined
##.AVERAGES= 8
##.DIGITISER RES= 18
##SPECTROMETER/DATA SYSTEM= spect
##.PULSE SEQUENCE= zg30
##.SOLVENT NAME= CDCl3
##.SHIFT REFERENCE= (INTERNAL, CDCl3, 0, 15.7039)
##AUDIT TRAIL= $$ (NUMBER, WHEN, WHO, WHERE, WHAT)
$$ ##TITLE= Audit trail, XWIN-NMR		Version 3.5
$$ ##JCAMPDX= 5.01
$$ ##ORIGIN= Bruker BioSpin GmbH
$$ ##OWNER= she
$$ F:/spectra/data/she/nmr/H-F/1/audita.txt
$$ ##AUDIT TRAIL=  $$ (NUMBER, WHEN, WHO, WHERE, WHAT)
(   1,<2020-10-21 13:53:31.75 +0400>,<she>,<DPX200>,
      <created by zg, POWCHK disabled, PULCHK disabled
       configuration hash MD5:
       00 E9 B6 7A A2 85 ED C7 34 08 36 98 17 FE 4E 26
       data hash MD5: 16K
       1F 3D 61 2F C1 DE F6 E4 4C B9 72 85 A1 EB ED A2>)
$$ ##END=
$$ 
$$ hash MD5
$$ 8D A1 3A 12 7C 20 DE 62 C6 34 44 9D 5D 2D 9B BA
##$RELAX= 
##$RELAX= 
##$RELAX= 
##$RELAX= 
##$RELAX= 
##$RELAX= 
$$ Bruker specific parameters
$$ --------------------------
##$DU= <F:/spectra>
##$EXPNO= 1
##$NAME= <H-F>
##$PROCNO= 1
##$TYPE= <nmr>
##$USER= <she>
##$AMP= (0..31)
100 100 100 100 100 100 100 100 100 100 100 100 100 100 100 100 100 100 
100 100 100 100 100 100 100 100 100 100 100 100 100 100 
##$AQSEQ= 0
##$AQ_mod= 1
##$AUNM= <au_zg>
##$AUTOPOS= <>
##$BF1= 200.13
##$BF2= 200.13
##$BF3= 200.13
##$BF4= 200.13
##$BF5= 200.13
##$BF6= 200.13
##$BF7= 200.13
##$BF8= 200.13
##$BYTORDA= 1
##$CFDGTYP= 0
##$CFRGTYP= 5
##$CHEMSTR= <none>
##$CNST= (0..31)
1 1 145 1 1 1 1 1 1 1 1 1 1 1 1 1 1 1 1 1 1 1 1 1 1 1 1 1 1 1 1 1 
##$CPDPRG= <>
##$CPDPRG1= <>
##$CPDPRG2= <>
##$CPDPRG3= <>
##$CPDPRG4= <mlev>
##$CPDPRG5= <mlev>
##$CPDPRG6= <mlev>
##$CPDPRG7= <mlev>
##$CPDPRG8= <mlev>
##$CPDPRGB= <>
##$CPDPRGT= <>
##$D= (0..31)
0 1.2 0 0 0 0 0 0 0 0.06 0 0.03 0 0 0 0 0.0002 0 0 0 0 0 0 0 0 0 0 0 0 
0 0 0 
##$DATE= 1603274011
##$DBL= (0..7)
120 120 120 120 120 120 120 120 
##$DBP= (0..7)
150 150 150 150 150 150 150 150 
##$DBP07= 0
##$DBPNAM0= <>
##$DBPNAM1= <>
##$DBPNAM2= <>
##$DBPNAM3= <>
##$DBPNAM4= <>
##$DBPNAM5= <>
##$DBPNAM6= <>
##$DBPNAM7= <>
##$DBPOAL= (0..7)
0.5 0.5 0.5 0.5 0.5 0.5 0.5 0.5 
##$DBPOFFS= (0..7)
0 0 0 0 0 0 0 0 
##$DE= 6
##$DECBNUC= <off>
##$DECIM= 32
##$DECNUC= <off>
##$DECSTAT= 4
##$DIGMOD= 1
##$DIGTYP= 9
##$DL= (0..7)
0 120 120 120 120 120 120 120 
##$DP= (0..7)
150 150 150 150 150 150 150 150 
##$DP07= 0
##$DPNAME0= <>
##$DPNAME1= <>
##$DPNAME2= <>
##$DPNAME3= <>
##$DPNAME4= <>
##$DPNAME5= <>
##$DPNAME6= <>
##$DPNAME7= <>
##$DPOAL= (0..7)
0.5 0.5 0.5 0.5 0.5 0.5 0.5 0.5 
##$DPOFFS= (0..7)
0 0 0 0 0 0 0 0 
##$DQDMODE= 0
##$DR= 18
##$DS= 0
##$DSLIST= <SSSSSSSSSSSSSSS>
$$ [...]
##$SUBNAM2= <"">
##$SUBNAM3= <"">
##$SUBNAM4= <"">
##$SUBNAM5= <"">
##$SUBNAM6= <"">
##$SUBNAM7= <"">
##$SUBNAM8= <"">
##$SUBNAM9= <"">
##$SW= 16.880792210976
##$SWIBOX= (0..15)
0 0 2 0 0 0 0 0 0 0 0 0 0 0 0 0 
##$SW_h= 3378.37837837838
##$TD= 16384
##$TD0= 1
##$TE= 0
##$TE2= 300
##$TE3= 300
##$TEG= 300
##$TL= (0..7)
0 120 120 120 120 120 120 120 
##$TP= (0..7)
150 150 150 150 150 150 150 150 
##$TP07= 0
##$TPNAME0= <>
##$TPNAME1= <>
##$TPNAME2= <>
##$TPNAME3= <>
##$TPNAME4= <>
##$TPNAME5= <>
##$TPNAME6= <>
##$TPNAME7= <>
##$TPOAL= (0..7)
0.5 0.5 0.5 0.5 0.5 0.5 0.5 0.5 
##$TPOFFS= (0..7)
0 0 0 0 0 0 0 0 
##$TUNHIN= 0
##$TUNHOUT= 0
##$TUNXOUT= 0
##$USERA1= <user>
##$USERA2= <user>
##$USERA3= <user>
##$USERA4= <user>
##$USERA5= <user>
##$V9= 5
##$VALIST= <valist>
##$VCLIST= <CCCCCCCCCCCCCCC>
##$VD= 0
##$VDLIST= <DDDDDDDDDDDDDDD>
##$VPLIST= <PPPPPPPPPPPPPPP>
##$VTLIST= <TTTTTTTTTTTTTTT>
##$WBST= 1024
##$WBSW= 4
##$XGAIN= (0..3)
0 0 0 0 
##$XL= 0
##$YL= 0
##$YMAX_a= 637095
##$YMIN_a= -371378
##$ZGOPTNS= <>
##$ZL1= 120
##$ZL2= 120
##$ZL3= 120
##$ZL4= 120
##$ABSF1= 10
##$ABSF2= 0
##$ABSG= 5
##$ABSL= 3
##$ALPHA= 0
##$AQORDER= 0
##$ASSFAC= 0
##$ASSFACI= 0
##$ASSFACX= 0
##$ASSWID= 0
##$AUNMP= <proc_1d>
##$AZFE= 0.1
##$AZFW= 0.1
##$BCFW= 1
##$BC_mod= 2
##$BYTORDP= 1
##$COROFFS= 0
##$CY= 11.3945322036743
##$DATMOD= 1
##$DC= 2
##$DFILT= <>
##$DTYPP= 0
##$F1P= 16.9975609425685
##$F2P= -3.02152046262296
##$FCOR= 0.5
##$FTSIZE= 0
##$FT_mod= 4
##$GAMMA= 1
##$GB= 0.15
##$INTBC= 1
##$INTSCL= 1
##$ISEN= 128
##$LB= 0.24
##$LEV0= 0
##$LPBIN= 0
##$MAXI= 10000
##$MC2= 0
##$MEAN= 0
##$ME_mod= 0
##$MI= 1.114404
##$NCOEF= 0
##$NC_proc= 0
##$NLEV= 6
##$NOISF1= 3.799351
##$NOISF2= 2.8
##$NSP= 1
##$NTH_PI= 0
##$NZP= 0
##$OFFSET= 15.70392
##$PC= 1
##$PHC0= -10687.05
##$PHC1= 10.40089
##$PH_mod= 1
##$PKNL= yes
##$PPARMOD= 0
##$PSCAL= 0
##$PSIGN= 0
##$REVERSE= no
##$SF= 200.130013532006
##$SI= 16384
##$SIGF1= 3
##$SIGF2= 2
##$SINO= 400
##$SIOLD= 16384
##$SREGLST= <1H.CDCl3>
##$SSB= 0
##$STSI= 0
##$STSR= 0
##$SW_p= 3612.71676300578
##$SYMM= 0
##$S_DEV= 0
##$TDeff= 0
##$TDoff= 0
##$TI= <>
##$TILT= no
##$TM1= 0
##$TM2= 0
##$TOPLEV= 0
##$USERP1= <user>
##$USERP2= <user>
##$USERP3= <user>
##$USERP4= <user>
##$USERP5= <user>
##$WDW= 1
##$XDIM= 8192
##$YMAX_p= 0
##$YMIN_p= 0
$$ End of Bruker specific parameters
$$ ---------------------------------
##NTUPLES= NMR FID
##VAR_NAME=  TIME,          FID/REAL,        FID/IMAG
##SYMBOL=    X,             R,               I
##VAR_TYPE=  INDEPENDENT,   DEPENDENT,       DEPENDENT
##VAR_FORM=  AFFN,          ASDF,            ASDF
##VAR_DIM=   8192,          8192,            8192
##UNITS=     SECONDS,       ARBITRARY UNITS, ARBITRARY UNITS
##FACTOR=    0.000296,      1,               1
##FIRST=     0,             0,               0
##LAST=      2.424536,      0,               0
##MIN=       0,             -371378,         0
##MAX=       2.424536,      637095,          0
$$ Real data points
##PAGE= N=1
##DATA TABLE= (X++(R..R)), XYDATA
0 0 0 0 0 0 0 0 0 0 0 0 8 -8 8 -16 16 -24 28 -35 44 -55 64 -77 92 -109 132 -152 179 -206 240 -276 317 -362
32 -362 414 -471 533 -603 677 -761 854 -954 1066 -1185 1316 -1459 1616 -1788 1976 -2180
48 -2180 2405 -2650 2917 -3215 3541 -3902 4305 -4753 5260 -5837 6496 -7262 8162 -9239
62 -9239 10556 -12205 14348 -17257 21467 -28204 41410 -133237 429364 44385 -371378 -93087
74 -93087 -220945 12932 -41000 -135537 -243228 -113025 238245 -24235 -196889 84181 -245836
85 -245836 -91066 277485 -83200 -217395 171745 175734 -149203 -56216 -7736 -43068 122732
96 122732 81513 -39443 -21646 143852 -53807 -169390 165037 6020 -157240 243096
106 243096 77836 -193649 -738 11842 -14272 -60123 54172 19492 -68650 145466 -122808
117 -122808 -184608 125881 -40082 -107367 124857 48806 -149428 -39336 101399 -92001
127 -92001 -136557 104881 15624 23562 80580 -126892 -105349 109151 77587 -156311 57149
138 57149 157947 -82141 46134 61781 -133425 -28330 153652 72469 -43601 40151 57073
149 57073 -59042 84891 12016 -162639 170966 161914 -90857 -23965 68267 -24841 -59393
160 -59393 104509 -2433 -70126 126941 48106 -113018 3777 -7565 -79811 85088 92648
171 92648 -114331 -50945 135642 -85355 -119419 68554 -29822 -28832 70956 22701 -119244
182 -119244 -23598 44111 -101600 12828 80207 -89940 7166 114697 -106335 -110990 63558
193 63558 40832 -41984 45484 43849 -86964 57243 43101 -106725 3347 99569 16335
204 16335 7637 85386 -63470 -69474 129516 37105 -90254 78657 105258 -17413 23172
215 23172 13492 -48867 23038 132443 -12353 -28761 126539 -3791 -44874 59795 6092
226 6092 -50480 101097 113125 -62874 -11067 65872 -28113 -4955 74268 -32762 11356 118918
238 118918 -1994 -84123 28930 40977 -62455 70736 71594 -64466 17872 66056 -50174
249 -50174 -58460 63984 8459 -8476 78964 -10046 -77858 50933 20429 -84921 36160
260 36160 66063 -19059 -2785 50825 -60198 -64953 78219 -2811 -27180 60895 6348 -53802
272 -53802 38557 8630 -95506 27120 89444 -26930 -20507 60342 -43306 -49700 51587
283 51587 -5617 -37869 64081 50471 -67560 19198 13869 -70849 32899 64270 -29798 -12921
295 -12921 78768 -17094 -64988 33545 4140 -34641 75785 43804 -64739 24212 24200 -50544
307 -50544 -2062 59646 -19905 -7591 93456 -31921 -66697 40985 11221 -41307 43968
318 43968 47740 -38397 18891 28821 -64779 -21285 69840 -17917 -9583 67037 -21053 -49949 29483
331 29483 11114 -67887 38492 58056 -39863 15693 23306 -59120 -26907 55699 -15275 -24719
343 -24719 62097 6066 -59470 19512 6665 -64726 37544 44574 -32652 1352 40734 -39035
355 -39035 -48023 46056 -18519 -18820 65443 8633 -55676 14051 16873 -56767 15403 48898 -26747
368 -26747 3195 57271 -46722 -40469 43104 -15362 -17685 50176 29265 -49794 19866 23833
380 23833 -71346 13482 56194 -22389 1912 50337 -33174 -35839 34984 -9642 -40979 47708
392 47708 39775 -51037 18155 9084 -62259 -2245 40125 -23133 -17540 53096 -32238 -53236 17786
405 17786 -21583 -47216 29640 18023 -55434 -908 8762 -68003 -41371 25408 -41116 -24632
417 -24632 40848 -46996 -64666 -7382 -19108 -65334 -1884 11708 -63332 -6624 3216 -83268
429 -83268 -50745 14939 -44691 -35313 22319 -31131 -66545 -7084 -18570 -84093 3521 16957
441 16957 -49092 -10502 1043 -60138 -45584 24512 -40216 -41614 40767 -5918 -52698 3106
453 3106 -13535 -63266 11375 31131 -29213 -12831 32095 -37880 -35605 30835 -34392 -17384
465 -17384 49457 9775 -42443 10313 15663 -51158 6170 36906 -21577 7720 48862 -31789
477 -31789 -30026 27605 -6597 -10504 43077 21810 -37399 36555 26958 -50493 7351 43537 3093
490 3093 13151 52943 -10974 -18758 43829 8545 -12722 54115 40043 -7320 47160 30129
502 30129 -24267 17632 69200 13777 10772 75513 16139 8366 48463 14420 1346 65150
514 65150 63998 3876 42929 50140 -8336 25373 71971 3732 18829 81368 31079 596
526 596 31557 28446 -7266 54825 50571 -13127 42201 47743 -18083 -2441 43990 -1226 4859
539 4859 59040 9432 -31861 28288 19767 -36376 18512 18575 -12035 23460 24667 -41425 -28365
552 -28365 39407 -18201 -21603 33281 -3221 -29450 15446 -2012 -51683 1194 23943 -19176
564 -19176 -4129 20056 -38870 -18590 24039 -35573 -26252 29096 14396 -36233 564 2728
576 2728 -46749 4076 18561 -28406 -7053 24794 -23470 -21292 7794 -27719 -29993 30388 13470
589 13470 -47482 6662 4890 -41590 -9385 8614 -24850 -13648 29523 -23624 -35436 5395
601 5395 -22467 -30410 20016 -3048 -43726 13198 13132 -47711 -33257 16187 -17073 -11382 22352
614 22352 -32301 -25330 14466 -10871 -41132 5329 11400 -25603 16798 10119 -49645 -15833 34676
627 34676 -18067 -21435 22008 2763 -10493 7800 -11319 -36174 29403 21118 -28580 11496
639 11496 20775 -21776 -8558 26111 -23839 -15634 42335 12588 -23983 6557 1424 -21467 21372
652 21372 7081 -22890 14193 32698 -25356 -19161 26853 -20611 -13855 32059 7349 -25616
664 -25616 8901 10349 -26858 1952 6045 -17070 14586 28456 -33683 -18830 25132 -12473
676 -12473 -20350 17275 9362 -24988 19277 12166 -37883 -6375 13489 -4302 5725 16312 -26308
689 -26308 -5974 30692 -17749 -35738 24576 23973 -22033 10765 5817 -23800 1810 18635 -17012
702 -17012 -7838 32174 -7092 -6151 13269 -20677 -20307 34640 16052 -34290 9970 26245 -16234
715 -16234 -12753 11948 -15945 3366 30831 -11751 -11188 13655 -4741 -24454 20343 9918 -27163
728 -27163 18881 23630 -25608 -16682 18713 -9693 -5854 18736 -5122 -10319 16986 -3283 -31176
741 -31176 15306 6952 -18948 16208 20808 -26649 -18066 26311 -9946 -15843 15025 1708 -6963
754 -6963 16812 -4949 -31421 13460 12976 -16599 5872 22561 -19926 -7273 24278 -19981 -17442
767 -17442 23154 14840 -14249 8257 3006 -18753 16365 7942 -23915 7937 34922 -12536 -10602
780 -10602 16102 -11125 -10291 24001 10532 -20386 18713 13362 -16825 4546 7036 -12422 10922
793 10922 31014 -16548 -7913 24329 -4518 -16897 17873 10110 -11779 22773 11166 -19473
805 -19473 187 17141 -9292 4141 24963 -12861 415 24039 -4944 -21952 16147 14174
817 14174 -10501 18095 11143 -17442 1487 19444 -14638 -2152 23245 -3190 -1415 16083
829 16083 -4902 -22553 20112 11839 -17427 10607 15632 -9820 -3258 11098 -18978 -1914 24890
842 24890 -2711 -12100 12561 -480 -19172 14019 1419 -18667 10636 20256 -15508 -10976 12669
855 12669 -15665 -4109 15751 -5361 -11654 16884 531 -24983 6570 4714 -12660 7063
867 7063 15924 -18976 -5104 16587 -14186 -10677 11653 2043 -8662 17564 -1205 -23234 8456
880 8456 8519 -12209 2756 17929 -12610 -1873 14721 -12082 -12047 14495 6047 -10615 15459 1624
894 1624 -14968 6617 7376 -14092 1964 22222 -9901 -3572 11040 -8459 -10675 15226 3734
907 3734 -13582 14336 6682 -12219 317 7164 -14860 2527 20930 -9397 -5435 10933 -3717
920 -3717 -14236 12112 2681 -11789 14258 7178 -13132 -1760 10840 -13280 -572 16327 -6787
933 -6787 -4299 13585 -3038 -19014 10974 3660 -9208 9137 6769 -12735 -2020 11906 -15294
946 -15294 -4929 12635 -3994 -6489 10795 -5021 -19686 8506 447 -13070 3473 7661 -14237
959 -14237 -5263 6143 -18012 -7007 8547 -5467 -13514 7472 -4564 -19836 3143 -4169 -15672
972 -15672 480 8384 -15439 -7910 3403 -14869 -9319 5867 -4570 -14467 9312 -2811 -17153
985 -17153 867 -131 -12291 -948 10847 -11678 -3537 7054 -9773 -9909 8251 1642 -9645
998 -9645 11006 1299 -11529 2624 7310 -10129 42 14489 -6765 626 9722 -4616 -9590
1011 -9590 11009 3815 -8350 12546 5124 -9006 2191 9196 -10545 1073 14014 -5421 -1265
1024 -1265 9398 -1821 -10569 10189 545 -8879 10760 5965 -8805 -881 8488 -11040 -351
1037 -351 11332 -4900 -3907 9852 -721 -11159 8914 -110 -7354 7181 7977 -6971 -351 9841
1051 9841 -10207 -611 11039 -562 -3577 10870 1427 -9182 9356 2975 -5565 5391 11492
1064 11492 -4630 1951 10873 -7619 -1257 10650 2513 -4595 12226 2484 -8173 8267 3876
1077 3876 -5707 3624 11808 -5819 787 9349 -5153 -4462 8442 1007 -7414 12342 1623 -9060
1091 -9060 3758 3507 -7138 826 10577 -7649 -1292 8195 -4108 -7473 6923 7 -8017 10401
1105 10401 1404 -7901 1936 5139 -9034 50 10514 -6211 -585 7148 -2604 -7941 8684 1139
1119 1139 -7695 8781 3701 -5321 2520 6530 -9542 897 10661 -3426 -1396 7453 -192 -7881
1133 -7881 9156 579 -6948 7086 5134 -5142 1295 6869 -8693 159 8162 -3090 -3646 8626
1147 8626 220 -9883 6190 -544 -5609 4269 5053 -7401 -611 7244 -8169 -2514 5191 -2527
1161 -2527 -5147 9165 -425 -10227 5040 1010 -6120 1540 6774 -7258 159 6981 -7654 -2782
1175 -2782 6228 -115 -5905 8843 456 -7348 5722 2365 -7046 1659 9535 -5250 948 5883
1189 5883 -4863 -2325 7765 274 -6600 9763 1649 -5266 3824 3316 -6867 1522 9041 -5400
1203 -5400 262 6163 -2596 -4997 6497 -635 -5982 8976 963 -5864 1423 4464 -7085 -126
1217 -126 6853 -5713 -432 6259 -1850 -7612 5308 -947 -5505 6326 1089 -6515 764 5651
1231 5651 -8345 -851 5582 -3995 -1951 5545 -1416 -8291 5900 -1012 -6206 3740 2949 -5560 191
1246 191 4229 -9511 -933 5699 -3104 -5048 5167 -1342 -7771 5021 -2794 -7083 2124 4122
1260 4122 -6951 -1552 3072 -8672 -2177 3296 -4114 -6413 5840 -2426 -8610 2469 -2173 -6787
1274 -6787 -25 3248 -8229 -310 3189 -7589 -3806 2584 -3079 -5372 6768 -2673 -7744 2477
1288 2477 967 -5920 -56 4391 -6161 1686 3847 -4562 -3456 4513 -535 -4241 7473 -610
1302 -610 -4536 3375 3346 -5699 1173 6745 -3406 990 3748 -1737 -2570 6374 -1096 -4296 7102
1317 7102 1705 -3114 1701 3468 -6419 2027 6688 -4071 -978 4450 -603 -4229 4884 -2078 -3455
1332 -3455 5419 1153 -5008 1234 4407 -7182 483 4633 -3367 -1544 4761 -1581 -5624 4933
1346 4933 -998 -2880 3645 1409 -4609 2305 4331 -6664 659 4511 -1383 -1812 6030 -879 -4706
1361 -4706 5122 254 -1959 2839 3451 -3544 2762 3777 -5227 901 5422 -903 -3102 6906 -315
1376 -315 -3284 4267 234 -2971 2541 4822 -3852 1543 2524 -3468 605 4431 -1879 -3940 6923
1391 6923 -290 -3963 2116 1050 -3317 1805 3894 -4812 1506 2659 -2873 -1865 4080 -1229 -2963
1406 -2963 5833 -1045 -4052 2629 3334 -4608 1116 3922 -2887 1960 2864 -2043 -2354 5569 -439 -2270
1422 -2270 5431 320 -2757 3130 4038 -4622 2576 4613 -1862 1288 3852 -714 -1618 5723 -1015
1437 -1015 -1385 5076 1717 -2826 2329 3635 -4411 3033 4005 -1924 -365 3972 -442 -2242 4174
1452 4174 -1807 -1430 3580 2085 -4055 1325 2882 -4513 1335 2398 -1926 -1729 4032 -2034 -3284
1467 -3284 3028 -870 -2240 1248 1654 -4486 1457 2081 -5076 -373 2771 -1367 -2808 3700 -2740
1482 -2740 -2737 2781 -464 -3232 1150 2513 -4143 1480 1551 -3818 -602 3554 -1979 -2561 4588 -1962
1498 -1962 -2391 1685 325 -2874 1944 2543 -4564 1170 1590 -2409 -1402 3206 -2427 -2280 4414 -1510
1514 -1510 -2921 1009 938 -3865 2009 1489 -4056 677 1321 -2443 -2426 3210 -2389 -2277 2991 -1663 -3201
1531 -3201 877 843 -4677 1260 1088 -2263 -150 1166 -2574 -2835 3582 -2220 -1951 2177 -270 -2751
1547 -2751 1252 1109 -4548 1355 1597 -1733 -923 2062 -2362 -2066 3090 -1779 -1614 1970 985 -3740
1563 -3740 1376 1153 -3539 1377 1319 -1651 -1124 3113 -2001 -2189 2269 -960 -1473 2098 1247 -4144 1702
1580 1702 1246 -2817 577 1818 -1304 -834 4025 -2344 -1709 2044 -247 -1757 1980 1962 -2985 2344
1596 2344 1138 -2125 264 3028 -951 -350 3834 -1637 -150 2244 627 -2132 2595 2467 -2136
1611 -2136 2457 1331 -1470 38 3725 -1193 42 3456 -873 -489 1547 981 -2627 2673 1437
1626 1437 -2190 1572 1215 -1611 -1461 2528 -2082 -767 2078 -1119 -2150 562 178 -3473 1389 -49
1642 -49 -2332 -272 1214 -2728 -2509 1834 -2765 -931 899 -898 -3071 384 -102 -3925 830 157
1658 157 -2172 -681 1686 -3031 -1621 1761 -2263 -1255 1311 766 -2514 1555 -182 -2990 1553
1673 1553 1066 -1201 -528 2514 -2034 -484 1947 -1193 -844 1887 1362 -2352 2051 123 -1835 695
1689 695 1520 -655 93 2960 -2028 -454 1677 -391 -960 1824 1091 -2001 2046 627 -1398 -120
1705 -120 1974 -848 529 2857 -1390 -106 1318 491 -1461 2548 1341 -1299 2104 933 -1143
1720 -1143 104 2930 -935 464 2918 -216 17 1188 710 -1488 2988 1670 -690 1774 1327 -802
1736 -802 32 3070 -1188 620 2866 393 -708 1052 685 -1750 2416 571 -534 1106 1358 -1911
1752 -1911 -875 2173 -1613 143 1310 65 -2036 997 -181 -2406 705 -190 -532 186 914 -2850
1768 -2850 -1051 1068 -2109 -804 785 193 -2366 899 -685 -2195 199 261 -787 -335 1409 -2402
1784 -2402 -76 677 -1436 -825 1826 1020 -2230 1078 -300 -1329 131 1003 -862 4 2154 -1464
1800 -1464 0 228 -735 -915 2372 605 -2215 1851 305 -1090 -738 1490 -810 439 1678 -1518
1816 -1518 -256 629 -334 -1808 1954 86 -1092 1639 140 -2122 -981 1953 -1140 338 1093 -851
1832 -851 -246 612 -485 -2052 1870 104 -781 981 539 -1773 -354 1830 -1551 133 1141 469
1848 469 -616 510 -645 -1741 2217 -130 -863 752 1351 -1548 -535 1139 -1681 340 1507 484
1864 484 -2033 586 -330 -1217 1248 -611 -954 609 1656 -2449 -687 880 -1426 -166 783 84
1880 84 -1807 1402 -648 -1866 -29 358 -486 647 1209 -2904 354 1059 -1137 -1486 1080 982 -1019
1897 -1019 1672 -529 -1273 597 1373 -532 775 1683 -1359 1078 910 -697 -916 2761 1135 -858
1913 -858 1750 205 -306 290 1371 -1037 1263 2066 -696 451 339 -542 -726 2821 -32 -1424 1085
1930 1085 842 -767 -869 544 -1331 1345 1206 -1060 -475 700 -617 -1581 1580 -574 -899 1163
1946 1163 996 -2265 -988 1264 -933 217 53 -360 38 1372 -1353 -1993 1812 102 -232 753 958
1963 958 -1962 232 1614 -1079 -442 981 1065 -178 1042 -1546 -632 2143 -95 -827 1056 2029 -1710
1980 -1710 42 901 -969 -261 1535 673 -932 978 -1163 -136 886 -636 -1177 1428 1527 -2321
1996 -2321 -235 295 -711 -854 955 -298 -1138 937 -1108 -861 -253 -770 -1220 1601 639 -2811 -35
2013 -35 795 -1146 -2112 991 -454 -619 603 -1134 -1205 -338 110 -1360 787 -184 -1657 847 612 -1705
2031 -1705 -2011 1844 244 -999 113 -320 -797 257 171 -1788 1155 646 -712 -192 734 -1319 -1247
2048 -1247 2092 -681 -912 828 1364 -1121 -275 -14 -1244 1784 689 -481 -141 1586 -833 -727
2064 -727 1401 -688 -237 1131 1365 -1499 200 182 -690 796 222 -200 279 1885 -1404 -992 1367
2081 1367 -87 -180 1151 1138 -1292 1148 426 -825 27 755 427 518 1732 -1694 -5 1234 446 -640
2099 -640 1174 1549 -634 1136 338 -776 318 1872 215 325 1607 -540 469 804 333 -911
2115 -911 1902 1686 -847 661 393 -122 13 1634 -464 238 1522 -48 -373 82 297 -834 1914
2132 1914 613 -964 340 1018 -935 -1067 1005 -921 456 1004 -528 -1295 239 74 -1605 670
2148 670 -131 -607 -164 388 -1712 -1395 1005 -978 -63 322 -665 -1463 378 -668 -2167 353 202 -402
2166 -402 -577 245 -1852 -613 547 -1135 -237 508 514 -1250 277 -705 -1198 713 590 -516 -308 1235
2184 1235 -1130 -220 256 -504 211 1480 594 -1275 696 -222 -636 248 698 -536 210 1699 -1179
2201 -1179 -419 266 -36 -510 1135 695 -848 1056 -167 -858 -213 979 -433 515 1225 -865 -391
2218 -391 558 150 -984 1075 478 -539 629 -411 -1049 -243 1244 -757 82 785 -570 -206 442
2235 442 -264 -1010 1455 187 -439 286 -82 -1198 -346 720 -1223 411 845 -168 -802 110 -161 -901
2253 -901 1125 92 -193 223 799 -931 -153 598 -1013 500 836 326 -887 749 -302 -1116 593
2270 593 238 -59 145 784 -1280 289 494 -619 157 575 328 -678 1020 -548 -973 109 787 104
2288 104 88 858 -1266 80 9 -491 -445 764 237 -795 763 -614 -840 -182 445 -716 152 1085 -954
2307 -954 -171 -103 -508 -432 969 -135 -746 1031 -250 -738 -467 608 -646 655 1011 -682 -219 18
2325 18 -11 -645 1321 5 -37 955 -37 -535 -61 838 -793 890 810 19 -194 446 -130 -819 1194 185
2345 185 29 642 246 -764 89 709 -900 569 540 58 -605 271 -788 -1051 688 -195 -415 -59 258
2364 258 -907 -175 -23 -1052 175 262 -213 -1126 556 -612 -813 41 -251 -360 112 908 -1115 -184
2382 -184 -5 -206 202 527 -152 -507 1021 -669 -585 258 604 -132 402 1109 -1031 194 -17 -79 -130 877
2402 877 404 63 783 -435 -246 458 826 -597 545 1183 -18 369 67 62 -284 1310 101 246 816
2421 816 -195 -93 241 751 -824 722 994 -169 -138 266 242 -347 689 -76 462 706 173 -495 3
2440 3 667 -519 1034 868 -216 -217 863 216 -657 562 94 718 667 510 -589 380 476 -546 538
2459 538 764 81 -156 1115 -342 -663 659 509 323 337 525 -180 594 -9 -513 239 909 383 -564
2478 -564 1039 -593 -452 589 -8 -246 190 827 -299 235 -434 -586 177 749 -75 -472 859 -322
2496 -322 -589 -250 -82 -566 359 707 -1010 -212 -493 -170 -583 170 -519 -220 824 -652 -1128 -700 364
2515 364 -770 141 196 -544 -231 -275 -472 -1100 401 -437 -105 264 -839 -1111 -173 264 -1401 97 401
2534 401 -169 -421 -305 -827 -1019 622 -568 -578 137 -199 -667 2 -25 -1478 151 452 -209 -653 -15
2553 -15 -356 -642 311 -628 -171 264 198 -1006 -131 -97 -1119 179 433 -326 -752 959 -268 -608 -90
2572 -90 -202 24 166 308 -986 162 -46 -696 -31 490 7 -209 1095 -480 -538 -144 322 -232 80
2591 80 513 -363 668 130 -607 61 1313 69 -153 815 -47 -326 157 890 -504 287 923 135 493
2610 493 -58 -189 -58 1432 -220 -181 1147 101 -154 27 582 -677 677 665 -338 -63 150 -168
2628 -168 -336 649 -591 17 1046 -45 -845 -200 250 -842 253 312 -257 41 377 -651 -792 375
2646 375 -330 235 503 139 -1022 126 487 -1081 125 269 295 -493 363 -657 -408 506 -424 -38 444
2665 444 545 -574 663 213 -658 111 998 70 -583 623 -271 -266 205 -378 -188 757 821 -907 471
2684 471 -134 -766 -107 961 -87 -528 1186 -297 -511 178 -61 24 864 304 -673 708 348 -530 -374
2703 -374 859 -321 45 1001 -181 -291 187 447 -201 601 196 -159 720 385 -596 14 1133 -115
2721 -115 55 969 234 -91 511 496 -709 715 670 -59 420 470 -267 -162 1258 -353 159 1136 575 -387
2741 -387 411 312 -573 932 823 6 262 655 -276 -161 902 -365 107 967 386 -682 570 288 -466
2760 -466 531 211 -13 251 989 -837 -604 564 -441 -197 344 -45 -1091 415 -109 -972 -189 163
2778 163 -361 -206 602 -1031 -426 135 -589 -928 189 -22 -981 -137 -686 -1104 -346 319 -1021 -303 387
2797 387 -912 -401 -70 -538 -945 491 2 -722 318 -75 -618 -25 612 -656 -240 561 -206 -44 90
2816 90 -78 -672 705 282 -320 408 200 -621 -429 672 -570 209 578 -325 -390 371 90 -779 517
2835 517 -240 -477 129 304 -1102 -704 406 -897 -149 194 -259 -725 303 -326 -1188 235 -195 -349
2853 -349 -30 267 -798 -360 129 -858 -205 580 156 -589 644 -442 -640 593 197 -500 -132 1014
2871 1014 -680 28 325 -169 79 731 362 -315 644 -32 -331 281 432 -380 479 1055 -478 -16 250
2890 250 -57 -624 564 232 -369 561 -334 -630 -242 417 -588 118 409 -931 -185 151 -286 -862 397
2909 397 -249 -324 398 -275 -645 -273 207 -808 23 442 -482 1 277 -276 -715 538 128 -135 188 131
2929 131 -246 -44 437 -785 373 838 -70 -133 444 -23 -325 914 -129 -40 391 594 -470 434 554
2948 554 -432 583 528 47 -74 841 -112 -333 497 171 80 291 581 -474 222 502 -249 58 542 82
2968 82 -6 867 -270 -387 321 190 -62 228 457 -591 160 135 -311 -127 384 28 -270 730 -228 -192
2988 -192 252 150 -429 126 456 -342 114 -19 -175 -75 495 -190 -575 345 -35 -307 -105 234 -579 324
3008 324 450 -311 143 242 -219 -446 593 -19 55 359 95 -343 -27 482 -481 551 560 -12 338 619 -140
3029 -140 -463 604 88 108 439 189 -469 120 324 -444 384 344 -32 -72 475 -224 -279 754 -220 175 216
3050 216 492 -408 49 136 -456 369 411 65 -330 521 -368 -151 453 -11 -227 234 449 -465 182 241 -107
3071 -107 156 250 44 -169 426 56 -217 202 308 -225 290 398 -391 506 563 29 -198 466 327 38 665
3092 665 -202 -269 337 523 -178 300 465 -227 299 183 -200 -262 639 -98 -248 382 69 -251 51 57 -506
3113 -506 442 346 -564 -183 58 -339 -594 146 -349 -317 -122 -119 -645 -352 -256 -841 -37 -194 -374 -564 34 -445
3135 -445 -557 100 -609 -441 -299 -243 -711 -160 -116 -927 -45 -5 -126 -464 242 -412 -830 150 -238 -258 -311 -26
3157 -26 -453 -176 43 -511 -307 -80 -32 -367 452 -450 -512 3 -62 -308 -20 488 -698 157 -86 -347 -101
3178 -101 323 -140 -245 549 -76 -210 -116 -43 -341 286 157 -394 -61 -106 -50 -221 193 -282 -246 334 -213 -346
3200 -346 -105 -264 -422 198 254 -204 -21 -41 18 -380 380 -13 86 259 48 -93 128 184 -353 216 200 142
3222 142 195 489 -125 -313 523 187 96 478 282 -124 402 402 -196 574 545 411 77 667 -124 -96 552 78
3244 78 195 428 783 -139 274 574 -124 545 525 412 61 1064 159 -82 399 226 260 387 632 -135 382
3265 382 200 -85 275 405 172 -26 564 8 -204 175 269 -225 143 210 -277 139 102 -147 -64 402 21
3286 21 -296 358 -262 -154 172 327 -243 -32 308 -336 253 11 -64 -127 193 74 -199 358 35 -173 91
3307 91 362 -311 126 125 -323 -136 268 143 -363 -21 -121 -62 213 316 -406 -213 100 -513 -21 -26 -361 -365 248
3330 248 -202 -413 -111 -467 -419 -59 -164 -476 -202 -19 -649 -141 -34 -193 -296 142 -276 -431 190 -276
3350 -276 -64 -114 350 -341 -58 -43 -672 -95 337 -206 -346 202 -239 -352 -23 -22 -150 29 336 -370 166
3371 166 75 -469 -112 350 -234 -143 612 -266 -186 31 335 -245 189 406 -514 44 84 -199 -415 302 -145
3392 -145 -228 368 -255 -172 154 106 -528 32 307 -267 -137 65 -345 -404 343 -165 -315 393 -213 -312 -11 275
3414 275 -712 95 63 -372 -69 22 -239 -283 354 -163 -386 88 40 -371 84 165 -577 300 161 -106 56 449
3436 449 -498 -312 238 -147 -169 222 199 -473 244 332 -170 159 279 -69 -83 501 -179 -124 93 81 23 309
3458 309 205 -202 308 277 -153 136 281 8 -97 582 -142 76 453 283 -343 232 433 -215 367 215
3478 215 49 -140 548 -164 -45 559 -279 -284 313 265 -447 257 230 -405 32 240 -292 -221 483 -355 72 488
3500 488 -299 -118 184 180 -386 213 75 -216 216 297 -322 -341 405 -348 16 470 39 -137 311 17 -544
3521 -544 222 -84 -114 190 265 -131 -124 409 -349 -32 173 147 -301 226 183 -413 238 54 -108 -200 354 -144
3543 -144 -40 410 -370 1 290 137 -277 300 109 -350 40 67 24 -68 453 -314 42 335 95 -202 209
3564 209 120 -312 388 115 -501 82 194 -262 -20 569 -189 -47 254 14 -536 203 55 -235 533 160
3584 160 29 116 371 -55 -106 310 -191 -41 355 39 -479 523 71 -483 311 69 -138 -14 373 -431
3604 -431 48 161 -116 2 232 -39 -395 301 113 -334 31 0 -118 61 278 -282 -62 303 32 -230
3624 -230 257 203 -247 350 65 28 222 374 -263 -75 205 -299 71 230 -23 -383 279 20 -217 333 262
3645 262 -114 113 343 -3 -23 367 -16 207 115 -162 -317 372 -45 -176 100 89 -99 -99 354 -386 93 212
3667 212 -349 2 195 -122 -310 219 -71 -170 49 17 -203 -198 169 -229 23 -7 -212 -137 380 -16 -179 344
3689 344 -80 -130 18 221 -380 -171 204 -224 2 177 -168 -37 98 -108 -164 170 16 -341 99 105 -256
3710 -256 62 139 -68 -92 -26 -183 -146 23 -76 -242 6 -42 -71 -301 24 -448 50 -51 -111 -358 -76 -48 -377
3733 -377 -38 -174 -141 -286 -8 -464 118 139 -330 -117 66 83 -294 24 -87 21 242 -149 -121 119 36 -211
3755 -211 39 201 -181 77 63 -29 -166 493 37 -33 182 297 49 210 262 65 225 109 71 5 326 67
3777 67 141 345 -60 266 173 223 165 259 316 -153 36 131 188 62 247 225 -26 241 19 20 -50 401 -63 143
3801 143 160 -114 60 254 182 35 407 14 -236 40 177 77 286 181 -98 136 -45 6 206 253 177 -51
3823 -51 244 200 243 59 149 -139 41 494 -23 43 147 286 -110 212 37 37 350 -22 -24 -122 74 -352 68
3846 68 25 -65 -54 111 -151 -294 3 -233 -152 23 -171 25 6 231 -335 -190 -290 -352 -201 25 -36 -448 324
3869 324 -78 -77 -12 -88 -234 -207 44 -314 -95 -143 -155 -246 -140 3 -289 -1 -116 -242 -149 82 -219 -86 14
3892 14 -25 13 -106 -11 -137 115 -242 -144 54 -187 -19 -229 214 43 -28 68 -285 -187 -50 3 -158 105 -126
3915 -126 16 -164 230 -72 128 17 -136 61 4 96 -96 177 -67 12 286 -51 -11 1 327 -110 187 266
3937 266 -66 198 96 15 -166 340 114 37 273 147 62 -99 264 -238 77 96 7 27 65 118 -281 172 -71
3960 -71 -18 92 28 -137 0 178 -198 181 -29 -26 -162 -31 -26 -107 168 136 -6 -216 92 -99 102 390 -151
3983 -151 80 91 -53 8 96 -116 147 143 -25 -46 82 211 -118 196 -3 -43 -81 -23 180 -123 30 -59 -221
4006 -221 201 108 -141 169 345 -96 47 67 430 102 81 139 -74 64 109 -7 -55 190 155 -51 185 3
4028 3 245 -36 52 -163 310 -23 -251 182 -20 132 -93 202 -144 -67 152 -130 -1 -50 16 10 251 141 7
4051 7 269 102 100 31 110 -245 -146 54 -6 -17 163 152 -132 90 153 33 74 20 26 -112 109 36 79 104 62 -112
4077 -112 -63 4 -90 232 111 -36 -74 99 -18 164 -2 119 85 -164 -93 2 296 -86 -81 -124 -131 -30 -45 -58 -366
4102 -366 -41 -11 -211 -235 -205 -25 -287 155 -160 -186 -18 6 -84 -228 116 -258 -163 -72 -59 -160 -16 35 -280
4125 -280 -82 -122 -85 -159 240 -368 10 -43 -106 -32 37 46 -327 19 -41 -47 254 -106 -28 113 235 -188 15 108 -94
4150 -94 -29 82 -40 -440 117 -14 -80 97 76 252 58 99 -187 151 -94 205 10 40 28 -13 275 -71 -124
4173 -124 -53 -28 -87 -1 -73 -132 -78 39 -42 -384 132 -63 -9 0 56 -94 -262 272 -84 150 269 -91 95 124
4197 124 196 -119 234 -97 -30 83 -15 -134 1 222 -115 180 94 -106 -13 243 -45 5 283 61 48 50 113
4220 113 71 -54 79 -101 262 66 -63 239 243 -75 -240 148 -113 95 96 176 -51 -103 -33 -176 66 155 115
4243 115 -137 155 -5 -150 66 1 -25 110 -29 -142 223 81 227 70 95 -59 -196 282 2 -54 -142 -38
4265 -38 -8 94 61 59 12 127 -192 -8 207 -223 -20 136 -239 -1 142 28 -50 53 -102 -63 69 196 -82
4288 -82 -155 81 -262 188 354 -51 61 44 109 68 124 176 76 134 183 -67 38 344 64 161 111 -31 -167 224
4312 224 225 -159 127 332 -23 138 343 148 -15 219 53 50 112 106 -318 55 65 -14 208 -87 96 -13 162
4335 162 -66 315 188 157 -63 -78 206 70 238 107 103 58 97 -50 -220 172 80 193 302 147 -105 47
4357 47 93 -208 160 -288 -169 -147 -220 -212 -18 -39 -148 -5 137 17 -230 -57 106 -49 81 57 24 -62 -23 -124
4381 -124 46 116 -150 117 11 -95 -42 -95 -162 -165 -141 -34 -58 -124 -197 -140 25 -81 -213 -211 -142 13 -60 -121 -146 73
4407 73 -112 -40 -235 -100 43 -121 -72 53 -51 -180 69 22 11 134 -135 161 -86 -8 -14 19 -18 -68 48 -15
4431 -15 -34 -29 24 57 144 -77 194 235 -58 110 94 -47 16 -94 -43 39 119 -168 -72 -22 37 100 -46 -72 111 115 98
4458 98 -112 -11 24 106 -50 128 79 257 -134 -13 4 -2 -114 -90 197 -117 7 -150 -54 -181 -8 -247 175
4481 175 183 -128 -12 -3 34 -190 8 70 -21 -40 -66 78 3 110 148 0 -126 -117 -44 -106 -20 54 90 124 12 63 80
4508 80 143 -7 98 -36 45 92 -21 -24 152 55 -153 180 136 -52 -29 -73 24 -33 -56 -45 117 -34 -38 18 63 70 21
4535 21 -165 151 -91 -97 65 -193 43 29 -108 36 76 60 185 144 180 23 -66 14 8 326 156 -51 200 2
4559 2 155 164 144 -202 -33 263 -115 136 83 -15 79 141 3 8 109 -152 29 178 197 164 95 67 199 64 -191
4584 -191 216 46 16 172 98 -85 -11 -9 -27 277 103 56 139 48 36 96 61 -37 126 -40 32 136 -82 -97 -13
4609 -13 28 51 -49 -87 -38 -17 67 -64 13 -11 0 -19 -95 109 67 111 110 116 106 -82 97 -44 -108 -128 175 28 -136
4636 -136 131 124 -19 -107 176 197 30 207 5 -32 218 -74 -110 5 86 -20 116 83 49 -234 141 -161 123
4659 123 166 -116 82 -144 128 -207 164 -176 -51 7 -107 -93 -190 -16 -56 87 -229 -157 -4 -198 -18 -149
4681 -149 17 -171 -239 -111 49 -44 -204 65 -101 -32 81 -175 -195 98 44 164 106 24 30 -285 20 -9 -169
4704 -169 -105 -21 133 84 -110 -100 77 -39 -148 -75 245 32 -75 -33 47 -79 -179 -15 78 -246 3 -115 53
4727 53 52 -5 -1 91 -44 -367 256 89 67 53 209 -8 -86 77 70 136 -74 -131 41 47 -19 -89 175 -79 148 148 -168
4754 -168 -100 173 -124 -161 -18 -191 103 -156 184 40 -94 96 113 -272 -43 -1 -80 223 63 144 -36 178
4776 178 19 158 -51 -10 -31 53 -50 -30 -97 24 -14 -119 -15 124 43 51 -188 99 81 -222 271 -88 -10 73
4800 73 2 -25 61 3 16 3 -154 144 54 72 -80 54 72 104 -47 -146 93 63 -52 2 -12 223 0 15 45 277
4826 277 116 45 -36 10 245 -22 -24 -35 169 163 81 20 0 -16 70 279 58 57 -46 76 40 -152 174 11 32 30
4852 30 -108 -132 184 -12 38 99 -40 138 -73 81 22 144 198 -96 150 -59 14 26 15 -31 179 142 -101 72
4876 72 -54 183 -9 -25 123 192 -278 -117 96 -17 47 -282 -5 -205 -79 -53 -189 201 -188 23 -146 106
4898 106 -57 -75 -106 -24 184 -149 -214 -97 20 155 -35 8 121 154 -46 33 -31 -12 11 -71 41 36 -44 -12 135
4923 135 11 142 -153 169 -47 -28 34 45 -97 -85 -42 -23 47 43 -142 -97 1 24 -81 64 -121 230 116 -170
4947 -170 13 17 -16 -122 100 -6 -6 91 -30 76 -132 44 44 -145 33 -190 18 28 -74 -172 96 -154 60
4970 60 -223 -22 -126 48 117 -116 121 -73 57 42 -168 93 -89 108 -160 0 -9 186 107 -63 147 -48
4992 -48 10 -129 47 13 -109 -211 -204 120 -8 98 13 -169 -29 28 -96 3 -57 -298 -143 -346 -145 -225 -60
5015 -60 -152 -154 -16 -117 -5 -26 51 -198 -99 22 -249 78 -154 -86 -74 -41 80 -31 71 100 -13 -135 117 -232
5039 -232 -12 136 -108 -4 -79 63 -48 106 -103 119 51 -30 163 136 -74 -241 126 -120 -95 163 292 4
5061 4 -53 168 -29 52 -50 178 0 182 144 -77 82 9 212 85 51 -113 64 -87 -107 -32 115 -16 -106
5084 -106 110 -189 162 -68 63 161 -88 103 -88 22 -89 70 93 -19 124 -191 100 -81 10 -43 63
5105 63 -79 128 241 106 137 21 113 75 169 27 -170 55 -113 62 57 109 43 113 186 150 88 251 118 120 324
5130 324 41 56 163 120 98 135 95 -116 142 32 34 44 14 -119 -17 269 191 144 95 -52 28 -99 68 -121
5154 -121 3 -130 53 78 46 19 -32 -122 -157 19 153 224 -88 149 190 -47 141 -71 -32 16 134 1 -257
5177 -257 75 -86 -44 -121 53 -4 112 75 -57 17 150 -140 3 148 -45 107 1 19 8 -21 60 -51 -93
5200 -93 -75 -68 -184 156 -214 -165 -159 -117 132 -76 120 -113 -116 -19 -101 55 -78 52 -17 80 16 -245 -62 -72 -196
5225 -196 -119 -63 -176 21 -243 -176 -76 134 -91 -34 107 -41 51 -35 -113 -32 -62 -73 -87 65 34 -57 -170 -173 28
5250 28 -153 -35 -176 -39 5 -4 89 -7 127 -60 60 0 -44 -134 -31 40 7 109 -142 37 -94 65 -87 -65
5274 -65 -209 9 123 -112 117 -33 -32 -1 -92 162 41 -73 -38 -34 -245 114 3 -146 -43 -100 -97 -114 211 -84
5298 -84 128 -40 -57 82 44 -30 -126 112 -35 -128 -17 69 129 -119 11 -286 11 -7 85 48 32 72 -187 68
5322 68 -57 116 -13 133 32 53 -67 -44 -36 -76 58 -47 -84 -82 33 -45 57 79 104 9 -138 67 165 16 153
5347 153 10 203 45 99 3 -78 -7 127 39 193 -27 -19 27 -100 -12 -226 48 79 -16 133 65 -145 -144 91 -29
5372 -29 -11 -99 -56 28 -55 -142 -4 164 67 -115 82 -64 60 -187 -47 -122 23 -56 100 -127 233 256 -41 123
5396 123 -32 -119 -15 -88 120 -61 129 141 190 60 -175 121 18 -141 114 139 -134 227 -46 306 24 -118
5418 -118 56 -77 112 28 54 -143 237 175 208 71 148 160 -44 152 2 31 -34 104 -142 1 -68 -86 23
5441 23 -194 -36 58 -111 56 176 290 -69 230 -1 97 66 95 205 -56 -146 -92 7 108 127 -18 75 208
5464 208 -5 -46 40 -274 -114 126 93 36 -20 3 162 -47 -40 -30 29 185 -17 61 -96 -66 92 -73 -50 -53 7
5489 7 49 122 -103 109 -128 104 -164 -37 -60 -193 40 -26 79 -181 140 -222 14 -200 90 -29 33 77 -167
5512 -167 -44 -89 -90 -99 169 45 32 -113 24 27 -170 -203 -17 -219 -54 -309 82 -225 0 164 -42 161 -196
5535 -196 -95 -262 111 -168 29 -31 4 125 -48 18 -49 157 -156 6 -34 -204 156 60 17 -126 33 108 -154
5558 -154 81 104 47 -46 179 29 88 -72 -6 -62 -207 138 -149 -79 23 83 -75 99 -105 -59 95 -179 31
5581 31 -92 16 -96 38 74 -66 25 -3 168 -104 60 -54 207 -79 171 -158 -147 186 -173 60 -62 124
5603 124 -16 -32 40 8 -232 109 -132 18 -22 -180 74 133 -34 186 -61 -10 59 231 54 -35 142 97 49
5626 49 90 236 -31 102 -39 -36 1 -61 64 26 13 119 7 158 68 155 -135 128 -111 -67 -184 -148 -19 -106
5650 -106 138 -231 76 -58 -46 -29 20 129 -113 121 -22 37 120 -40 -113 -97 114 -106 -32 -215 134 29 142
5673 142 -122 -43 163 45 -32 57 185 -110 57 -60 -153 162 -23 113 -50 93 -166 196 39 -122 -97 -48
5695 -48 17 0 -110 -94 -146 -24 -30 -80 14 94 28 104 -128 -38 -53 55 182 23 101 -72 87 -24 1 146 -99
5720 -99 159 6 123 77 139 47 10 -139 -195 110 29 -146 -230 25 -107 68 0 114 -74 -99 79 -174 70
5743 70 55 69 -46 -92 186 -67 83 -69 203 -205 197 -50 -121 54 -233 133 -36 -48 2 -130 -28 1 62
5766 62 48 19 -111 68 -85 82 -65 -33 -199 58 -29 -177 212 -186 85 -161 67 51 89 -124 13 48 -67
5789 -67 -6 41 -12 -15 -74 -222 42 80 -160 -10 107 -125 77 58 147 -54 78 -2 182 -79 172 242 120 -24
5813 -24 10 -77 -67 256 90 119 -161 -92 144 85 -26 54 -29 130 -166 1 89 162 -143 119 80 -39 265 117
5837 117 91 -30 -69 -7 128 -27 -25 70 -62 26 31 -41 -185 -182 -94 22 -127 -42 -34 -143 -36 -28 16 -32 202 -204 -7
5864 -7 -140 129 45 -33 60 -122 -87 -31 -173 -158 -13 -68 118 86 -1 14 -16 -15 -47 -41 -76 -171 -107 -219 42 -68 -28
5891 -28 1 -24 -108 80 -71 40 20 42 111 -97 -16 -34 17 14 -17 100 -66 -13 138 -168 76 -7 73 103 -42 -6
5917 -6 -41 57 -56 3 -54 179 -225 144 20 7 -90 -60 -66 130 68 -71 115 39 -45 35 153 -11 3 149 275
5942 275 69 -67 11 -46 -141 41 -48 42 62 72 -106 -21 65 57 -29 -112 -17 64 244 79 12 74 -54 161 -194 124
5968 124 54 100 87 -9 57 -88 -2 -5 206 -7 84 139 -63 181 21 19 32 -27 14 -97 7 99 -76 -121 157 -244
5994 -244 -43 252 38 -154 -116 72 -234 21 -17 -53 -37 201 -49 26 214 125 71 107 141 -6 170 82 -64
6017 -64 -33 -144 -23 86 87 10 -68 107 -4 115 -53 199 36 -93 104 -111 -17 -86 27 -140 130 -120 -61
6040 -61 29 -36 127 -168 -95 30 97 -44 -93 -114 -163 169 -86 -32 -103 -149 -21 -102 -76 -69 13 -110 -82 -40 103 5
6066 5 125 237 -94 169 72 -132 -57 -27 -176 90 130 -30 94 -145 113 -307 117 34 -9 21 -123 -57 -195
6089 -195 320 -46 84 -229 102 147 20 -22 -181 76 -19 -29 -17 40 26 47 182 -34 111 -150 -61 -51 119
6112 119 93 19 41 -208 -68 -18 -1 -111 169 -79 -136 39 -166 -103 -9 128 -6 218 -197 106 40 -13 -102 -73
6136 -73 -88 -1 -45 63 28 149 190 -2 -125 -75 64 107 -18 40 140 167 52 -91 177 -54 81 263 -80
6159 -80 57 164 30 36 201 -29 -11 2 -74 94 118 62 -181 106 25 -54 -52 11 -18 152 -31 128 303 41 84
6184 84 -3 160 116 -139 178 98 81 -69 14 -55 -145 65 -78 -73 5 35 -80 51 -62 -104 -18 -154 3 -58 13
6209 13 -199 -31 -11 -129 113 -40 251 -252 -65 -71 -121 -50 16 -23 72 33 -44 -22 3 -115 -122 -56 -27 -73 114 -51
6235 -51 63 14 171 75 -182 -45 78 -103 43 103 218 48 36 77 39 20 -105 231 86 11 -47 -58 -127 252
6259 252 123 151 -29 -77 160 54 312 -60 -154 -31 264 74 -40 130 -57 -13 16 132 114 112 38 -68 -172
6282 -172 -106 2 16 101 -169 114 153 56 -114 40 83 -39 99 -45 154 -70 11 1 -33 -30 -139 31 75 14
6306 14 -93 246 82 144 211 -31 -29 47 -81 -12 36 71 186 28 119 -50 -84 17 -14 108 -29 -154 -16 34
6330 34 184 -12 -38 52 31 -65 92 75 -134 -9 -68 -138 27 47 23 -112 84 -129 -96 -117 129 -15 51 89 -80
6355 -80 1 -73 181 -174 -124 -163 85 197 -171 348 -82 -129 -79 -3 -69 -81 -28 44 -46 -207 -69 -211 49 -31 137
6380 137 -12 81 53 -184 115 -102 -56 158 156 -78 61 -36 -79 -45 -134 177 -22 5 -22 123 32 114 -21 107
6404 107 -21 -67 -14 -91 -197 -26 52 -86 -152 -63 -77 -68 -70 95 -66 -131 98 -35 -58 -39 -11 -66 -105 -152 -24 53
6430 53 -8 -35 169 -177 166 -139 -23 58 70 73 75 120 56 174 -81 88 -55 8 76 -71 -27 -157 -169 41 -72
6455 -72 -113 175 -140 94 88 -42 127 58 -1 30 9 -24 15 129 150 106 -158 -84 -141 88 26 107 57 2 143 -164
6481 -164 -41 -160 168 -255 -76 -94 90 79 -104 58 -84 -29 -96 68 26 195 -43 -119 12 -41 -127 100 101
6504 101 93 -6 138 9 -39 130 100 -93 5 -62 -140 -104 -66 -33 -160 -19 -134 71 91 -22 120 -134 149 263
6528 263 9 -47 -64 -15 -18 67 -78 260 9 -97 -28 101 -207 -37 106 -4 141 57 91 71 56 129 4 130
6552 130 -79 84 80 120 -19 79 203 19 -62 -17 148 -49 7 -104 87 40 -13 14 -126 42 51 -43 -249 -35
6576 -35 95 37 -78 -200 172 -141 -102 -53 13 18 -127 -80 -127 39 27 7 118 175 -79 33 116 48 44 48 46 94 9
6603 9 58 -63 84 -146 45 53 191 4 -26 18 197 -56 -28 68 -164 46 28 -35 -34 -77 -58 -156 102 21 74 128
6629 128 74 -43 159 41 -197 -54 -6 141 -75 56 9 -134 89 -62 -11 -8 49 -19 -124 -188 6 124 -13
6652 -13 48 91 -64 -138 -39 -42 12 100 -77 102 28 -271 -2 -350 37 71 147 -46 60 77 1 -51 -69 130 -123
6677 -123 -61 -120 158 -106 -8 109 138 24 -123 138 -276 -38 -5 78 -31 -12 253 -55 37 -39 -30 -36 125 45 183
6702 183 232 -27 -62 182 7 -77 22 9 -270 62 -62 -49 -144 94 -27 -58 91 -52 17 -60 97 -279 10
6725 10 -113 -60 106 -57 133 -4 -37 147 50 -87 -68 -114 -54 104 70 85 -52 87 74 -114 28 25 219 -124
6749 -124 53 228 -62 55 33 39 -36 -1 -78 82 44 102 -100 -108 12 -218 92 -133 -88 -310 -88 41 -121 -12
6773 -12 90 64 63 46 -68 -255 1 123 -3 -47 155 -116 228 -160 -118 -68 105 164 -129 165 30 117 -134
6796 -134 -202 -58 43 -168 -80 -32 -47 256 -152 -31 -143 -120 -48 110 -39 -18 -83 -286 -266 -63 145 16 11 97
6820 97 -122 29 -47 65 36 -38 -129 76 -235 -34 110 148 302 -33 -22 71 148 152 -113 87 10 -8 58 -58 92
6845 92 200 105 -68 -54 30 165 -178 -98 23 44 3 -183 -79 136 54 150 -199 -41 -37 -45 28 -11 -41 -56 -76 -18
6871 -18 -112 69 55 -40 122 -70 -58 -46 -192 -19 -142 39 -101 -278 -240 -190 -19 105 54 -20 5 -82 -29 -19 -101
6896 -101 -101 -44 -53 -21 -92 80 72 -114 151 -25 -56 54 -292 17 64 227 -175 -33 -76 61 146 -73 -108 90 -112
6921 -112 5 -22 175 -18 -146 -14 22 -10 -50 -40 -32 41 -115 256 -73 90 -78 -16 -48 -79 113 -76 7 43
6945 43 141 -158 115 -26 -111 131 -106 32 -131 138 40 14 59 -54 24 95 45 -34 -152 -31 48 48 -53 1 -195
6970 -195 -141 -101 -6 -170 98 -86 -283 83 122 180 -187 -110 133 31 113 -63 -109 -39 171 59 72 -127 -24
6993 -24 40 39 180 -9 -71 -13 168 -65 139 -120 64 -122 -189 -113 -89 -112 -197 -78 25 10 29 -9 -14 27 103 -118
7019 -118 -66 69 140 -5 -30 38 -5 320 37 52 172 31 -15 -106 320 179 93 -50 8 -28 133 -51 -98 -125
7043 -125 -132 -8 103 -11 -63 -78 128 -98 -14 206 54 66 -19 105 -44 -17 -9 157 47 -69 -226 -57 -69 -190
7067 -190 108 -103 52 14 232 77 -39 33 -46 -154 -106 39 25 -12 58 9 -52 254 206 -30 238 87 67 -165
7091 -165 -10 49 -35 -98 -80 -128 -4 109 -205 7 -139 -2 176 175 18 -50 28 11 -30 -26 -48 20 -267 -29 125
7116 125 21 -74 79 18 83 15 -42 38 -76 -37 -226 -151 -10 -44 17 149 2 118 216 32 -127 16 -164 -71
7140 -71 -9 -57 104 -43 38 177 85 -162 104 -122 -150 -61 123 163 95 86 -276 216 -96 -45 -150 37 -119 -226
7164 -226 244 -25 -48 -113 12 -62 64 50 79 -235 -118 28 62 140 -120 44 36 -8 -174 101 -19 -78 240 32
7188 32 83 143 27 -46 -15 84 -1 138 -159 24 52 14 16 -21 72 -168 -21 107 -50 41 101 16 -88 83 -111
7213 -111 -3 -105 8 -167 -69 167 113 143 14 -2 281 -116 7 -193 -49 39 -168 -86 131 -19 31 72 24
7236 24 -54 -46 19 -77 47 98 38 3 8 -30 94 83 -112 -98 -43 0 -140 106 40 -172 188 -110 86 -3 59 93 150
7263 150 61 19 233 104 72 123 -169 -13 -128 -134 -214 -18 -180 -29 -30 -29 26 -71 123 -95 59 62 -41 -58 70
7288 70 37 55 132 -42 140 157 45 -1 223 31 -56 2 -122 -11 36 -173 -37 62 122 -117 -70 -174 -27 -135
7312 -135 63 24 -88 258 -129 -162 108 64 -121 -85 -36 164 -5 21 -188 28 -94 -93 -62 -122 -110 -133 -225 39
7336 39 -191 -21 72 -18 10 21 112 11 149 -66 90 -17 77 -27 -74 -68 -102 4 173 47 -29 36 14 1 -21
7361 -21 28 -6 102 95 -64 134 126 36 -20 -10 42 24 31 -117 -45 75 143 224 9 117 114 1 131 -73 16 48 116
7388 116 -303 178 60 126 230 -137 108 249 155 -92 81 -137 -54 -48 -117 -132 -85 -30 -66 -114 82 151 -207 -110
7412 -110 139 -32 -118 -90 -21 -90 82 -7 25 148 -39 -4 -73 -98 -228 184 -51 172 90 241 -77 -26 118 -115
7436 -115 128 175 -63 125 -203 86 31 -63 0 191 -44 -135 -108 -111 91 -65 205 -46 -28 -69 -27 -44 -165 -18
7460 -18 -40 57 73 34 -141 -47 79 -139 -140 -174 -131 175 107 -84 -15 -21 -154 -11 -23 92 -108 -166 26 72 -68 131
7486 131 -103 28 -91 -2 -110 -73 -96 64 110 -34 -4 -47 -106 5 -104 68 -9 114 31 21 45 -227 186 13
7510 13 -98 -96 -16 1 -62 -60 -72 127 61 -32 247 54 -2 -81 -10 -52 -84 72 57 13 -292 41 7 30 23 5 117 98
7538 98 13 -33 91 -175 70 -37 54 0 94 196 -93 1 164 -21 -96 -74 -61 10 102 161 -90 -88 -63 -42 -8 -58
7564 -58 -74 -23 -89 -56 77 83 0 108 -92 129 36 -62 20 -139 32 -84 -34 69 124 224 62 -70 -84 -126 -166
7589 -166 136 -20 30 257 -39 24 -36 160 -112 286 1 -2 -10 -94 -70 -190 -42 -246 102 108 -20 176 9 24
7613 24 31 87 -193 -89 26 -141 -76 -85 -18 -54 56 10 190 68 -89 -67 130 117 42 158 107 -300 34 -2 -24
7638 -24 -4 20 -41 -77 -107 -42 -168 -61 78 -174 93 -132 -74 186 148 -66 -25 -11 66 205 -157 225 -82 -33
7662 -33 99 43 -17 -62 78 -59 -12 179 -28 -62 -62 52 -114 84 148 -6 20 25 -143 17 36 -25 6 -60 -18 113
7688 113 32 -5 2 225 -193 79 104 2 18 28 -79 -196 189 -200 96 -85 144 61 -116 47 -59 -77 -151
7711 -151 -66 20 123 -53 36 248 249 -70 15 200 -208 -76 95 149 -178 80 -36 -225 -26 -38 -183 132 27
7734 27 157 -42 -27 -6 -1 20 120 72 -253 -50 -69 122 148 -17 55 76 -11 -45 8 -112 0 -68 83 -160 -34
7759 -34 113 28 45 24 -8 -17 -158 -329 -184 -155 89 -62 -153 356 -68 166 7 -31 94 249 -66 106 163 -39
7783 -39 75 257 -5 -16 43 -92 -46 113 71 44 -76 -61 -131 140 -3 72 71 -13 13 -6 42 -45 -104 32 106 -145
7809 -145 -40 114 -37 -255 66 -33 -72 -129 8 4 226 -127 -176 251 37 41 104 132 -14 67 183 112 93 19 -76
7834 -76 26 -235 -143 14 -53 26 -89 -79 119 79 20 113 -66 -187 42 -71 -142 204 -174 -116 -34 115 1 -233
7858 -233 30 132 -66 -39 -76 54 -7 146 -58 80 101 28 -72 123 11 -6 123 218 -126 -69 -23 -82 82
7881 82 -63 -1 -66 -30 -170 -27 -3 -132 16 -176 -27 -40 -80 93 12 -77 -40 53 108 101 -191 -87 -187 46 39
7906 39 145 -196 57 30 41 -102 174 -6 3 -29 -1 -21 -51 -34 126 2 -30 105 -70 34 -40 -42 114 1 -34
7931 -34 -25 30 -111 36 -44 -96 -55 -45 148 -38 48 -63 119 -29 -136 -191 -15 -67 37 -217 -79 51 -104 239
7955 239 9 11 87 87 -131 -113 -34 -103 65 -41 -155 -105 -37 68 -61 72 -1 -4 -45 -70 -139 -1 -18 -145 -85 -187
7981 -187 -17 33 -211 -141 -111 70 -8 219 -6 80 20 61 208 117 174 100 116 -176 85 116 76 162 85 160 -153
8006 -153 -99 -129 123 170 -133 -195 167 -35 -95 125 -30 -28 113 -21 71 -243 12 -34 -72 29 134 61 -55 -188
8030 -188 0 164 56 -73 196 101 -84 -10 234 51 38 97 -10 -88 113 -35 176 135 120 83 88 152 -13 27
8054 27 -59 89 36 13 -45 44 40 37 96 55 -112 -76 178 63 108 32 46 107 -13 -200 16 -119 104 -94 -39 104
8080 104 -98 11 -60 231 -68 -8 -116 -42 -174 71 229 195 -113 -210 6 -146 20 2 -129 54 -243 43
8102 43 -8 235 204 -135 116 -84 -13 -53 -92 -63 123 21 -5 84 -85 -25 34 -180 31 -5 -185 33 33 75 8
8127 8 -42 226 42 -149 47 -100 -33 -19 6 -20 -28 77 5 34 128 58 -80 115 13 -118 91 58 -81 -71 -81
8152 -81 232 312 -56 35 23 69 94 -12 0 -53 -51 -51 123 -37 -41 26 187 -55 59 -36 -64 -47 -71 69 -18 -263 91
8179 91 -127 -94 -120 177 -89 -121 -35 1 -135 -3 164 -173
8191a73
$$ Imaginary data points
##PAGE= N=2
##DATA TABLE= (X++(I..I)), XYDATA
0 0 0 0 0 0 0 0 -8 8 -8 8 -16 16 -24 32 -40 43 -56 72 -88 104 -120 144 -173 201 -237 274 -320 370 -426 489
30 489 -557 634 -720 815 -919 1033 -1160 1300 -1452 1618 -1799 1998 -2215 2453 -2709 2993
46 2993 -3301 3638 -4008 4415 -4862 5357 -5904 6517 -7201 7978 -8860 9876 -11059
59 -11059 12461 -14148 16226 -18852 22295 -27020 33925 -44985 65524 -116381 501258 637095
71 637095 -277984 268345 217689 315753 309801 148946 133472 237239 458421 286694 -79244
82 -79244 259692 140222 63125 463295 160592 -106328 273257 314363 -65459 -31469 177044
93 177044 72180 168989 130225 -23585 -17696 109154 13543 -162846 124330 116696 -181355
104 -181355 123395 104676 -287153 -62161 49851 -52587 -61619 -27454 15166 -147724 -584
115 -584 -91556 -271296 77368 6297 -189166 25757 -982 -224964 -128733 39507 -100054
126 -100054 -203634 42363 12074 -133540 -33878 -176235 -177464 38817 24112 -202303 -93852
137 -93852 103902 -168371 -142500 -7362 -187756 -117410 76638 -23759 -178364 -106886 -35033
148 -35033 -145087 -85705 -26998 -222264 8330 96822 -237591 -174902 -20213 -85104 -150223
159 -150223 -9679 -37191 -174080 -4770 -18356 -212396 -99964 -10389 -110969 -5066
169 -5066 33178 -159281 -139508 71275 -68103 -191681 55096 4795 -78468 26586 -11237
180 -11237 -126348 -62070 72893 -57543 -26114 98962 -60242 -47996 104896 -68455 -117829
191 -117829 101997 87451 -32444 12323 64363 -63876 14738 90252 -76347 10544 131993
202 131993 34831 -29654 52324 -18220 -69717 125944 81410 -89365 48144 126259 -40901
213 -40901 -24511 28187 -21051 26163 115206 11210 -77413 92140 18893 -84867 49081
224 49081 37904 -37287 63500 102372 -81164 -60447 72113 -3888 -29668 70000 -1113
235 -1113 -27350 90705 -9437 -102542 14733 75603 -39058 24265 86007 -74298 -22243
246 -22243 65263 -33951 -61126 69290 47589 -33725 45345 324 -83995 30843 59987 -68103
258 -68103 22082 88503 -24738 -31205 32381 -24581 -63895 86190 42267 -48825 44730 18641
270 18641 -58798 14789 40024 -65986 21451 107942 -20277 -53283 47248 -10096 -58752
281 -58752 61237 29730 -34309 43149 54111 -69144 -19083 51547 -48943 23070 79013
292 79013 -23620 -34843 57313 -562 -78430 32933 42999 -27036 44643 50229 -78108 -9648
304 -9648 47082 -39948 -5108 62057 3025 -36112 64079 -14224 -88784 43342 41923 -34306
316 -34306 23299 54741 -44450 -15753 34809 -43585 -22945 78943 12008 -39681 52964 -9050
328 -9050 -59763 27357 37776 -41655 21568 81107 -40627 -15936 34948 -36560 -19282 70735
340 70735 20642 -32284 52602 21994 -58259 11678 47665 -34843 32929 75437 -26615 -8009
352 -8009 43978 -8139 -38649 63000 34675 -18718 65123 26158 -50491 12680 54464 -22212
364 -22212 19278 76931 -3913 -8921 57743 -12719 -42327 68402 28253 -10583 52575 38878
376 38878 -38853 21 54672 -39906 10852 84184 -6374 -16914 46018 -13067 -42313 44012
388 44012 20355 -29058 36011 50626 -53583 -13430 32217 -48503 -1913 52876 -7784 -34898
400 -34898 35368 -15824 -69695 20649 7214 -39058 19802 27960 -57582 -24198 18035 -51207
412 -51207 -39437 38122 -7547 -42283 33440 -32434 -73640 4503 6433 -40246 -6079 32595
424 32595 -49573 -26328 18194 -59357 -43873 39898 -7211 -38516 25628 -15048 -61608 -5871
436 -5871 13675 -52482 1386 48003 -42719 -23976 9900 -39314 -38819 34345 -3657 -45391 36602
449 36602 5264 -62675 -10357 8655 -47498 5549 42038 -31175 -34409 16799 -25179 -54286
461 -54286 28763 -10594 -34886 37453 24 -59314 -17073 19206 -45492 -13542 40714 -22911
473 -22911 -24685 26848 -32805 -54957 26033 4240 -21687 21240 14579 -48356 -1189 32052
485 32052 -53731 -7652 50169 869 -13684 26440 -12396 -40646 32758 18053 -22721 31242
497 31242 36666 -29379 8587 23406 -34218 1811 55490 10770 -25483 41965 6082 -34513
509 -34513 23956 6141 -15917 32346 41323 -29166 -9883 24995 -27558 -12582 45377 -7440
521 -7440 -28314 44033 531 -45453 -5625 10889 -21907 9899 33491 -43006 -8418 24622
533 24622 -39920 -32382 28249 -1157 -24454 29730 -3680 -53583 2483 24479 -39376 -103
545 -103 31308 -18343 4334 15191 -33299 -30923 46053 10576 -28248 36113 12650 -27807 13051
558 13051 20679 -29455 11797 51156 203 -4790 29955 -8642 -14858 46899 656 -11692 47693
571 47693 32474 -21972 -641 32861 -17670 13450 47707 -5862 -2081 37482 -880 -18990
583 -18990 25342 3644 -8744 38413 33319 -35437 998 33769 -24350 1384 31340 767
595 767 -6551 34344 -1127 -34173 20524 9636 -12973 27411 21704 -30291 12135 31749 -29902
608 -29902 -20014 37754 16577 -11659 29372 -9011 -22928 28829 10054 -22708 12401 36417
620 36417 -12901 6904 21771 -33069 -10942 48292 4012 -25652 27842 12826 -14956 1866
632 1866 1612 -22345 22515 35723 -31619 -2657 23210 -19003 -18451 23698 -7901 -23478 35847
645 35847 11359 -38115 -8733 9996 -21061 8351 13503 -27559 769 22597 -24809 -36313
657 -36313 24018 -6250 -25281 26167 4951 -34278 -6714 14519 -26287 -7814 15399 -12999
669 -12999 1171 20054 -29434 -32084 28845 -1339 -24211 13887 14315 -23896 819 18791 -35960
682 -35960 -9347 26346 1367 -4346 10538 -17575 -15986 29167 -7930 -33812 22047 33704
694 33704 -25933 -7411 13617 -22027 -1590 20853 -7423 -15311 27960 -1185 -23930 10007
706 10007 -10413 -17139 27810 20787 -37729 -4172 29224 -17435 -22547 13306 -1853 -7293 26469
719 26469 -11821 -24631 9463 -54 -21589 10072 19605 -28383 3841 22930 -27327 -24648 20502
732 20502 2137 -15251 15507 -3106 -17805 6759 1714 -29604 7439 20486 -21110 5004
744 5004 16449 -24675 -25077 25881 2397 -23994 14478 6648 -13100 4346 -342 -29405 8355
757 8355 22942 -16424 -3855 18160 -14679 -20898 23254 -9727 -21999 23127 15641 -20261 -6970
770 -6970 8584 -19024 6007 13316 -21397 -405 29886 -12136 -27901 14277 -3723 -13855
782 -13855 17303 11183 -25289 1900 16698 -24046 -5031 10437 -8865 345 22769 -15808
794 -15808 -24370 19967 -2099 -22308 10105 15271 -17675 5691 9847 -26056 -7237 16735 -4533
807 -4533 -9240 19510 -11193 -15073 17682 -6020 -24738 9062 20540 -16007 2171 9242 -21165
820 -21165 -7040 17667 -8244 -12881 21452 -2973 -13535 7490 -3177 -21614 11672 19888
832 19888 -21450 859 15647 -11854 -12149 10627 -8111 -7398 25553 -744 -18599 6513 6676
845 6676 -17933 8692 13012 -16147 8001 20860 -11692 -16975 17860 -957 -6183 21324 2049
858 2049 -10498 13289 10371 -20777 7689 19944 -5584 6572 19742 -8694 -8886 24351 -1864
871 -1864 -8062 19409 12839 -4860 12288 9980 -18907 11565 21927 -4235 2805 21802 -2460
884 -2460 -6832 20496 -1932 -7617 19078 16380 -8467 10279 11631 -13596 8326 15540 -4448
897 -4448 1313 25218 -2337 -10250 15320 -419 -6620 15902 13537 -12051 10330 13965 -11877
910 -11877 -5 12690 -3395 -61 23992 -4312 -11122 12807 2146 -10692 10084 12931 -11558
923 -11558 9431 10286 -13463 -4435 13254 -4669 -6070 18395 -3937 -10120 8926 17 -18701
936 -18701 6719 12221 -12880 3168 5475 -13450 -8822 10938 -9631 -11941 13547 -3572 -12556
949 -12556 2865 -2362 -21603 3897 7242 -15475 -1111 5991 -13327 -13195 7198 -12057 -10329
962 -10329 10802 -3133 -14894 1868 1823 -20393 1823 4749 -12438 358 9801 -10525 -12822
975 -12822 8219 -7375 -7302 9198 2053 -11785 5573 5732 -16594 2384 7333 -6030 -709 13004
989 13004 -5651 -8920 10524 -4442 -7894 9352 8056 -9638 5664 5853 -13094 1525 9115
1002 9115 -5340 -4697 14467 -4299 -7774 8124 -4508 -10144 6759 8174 -11999 4441 5566
1015 5566 -12990 -2870 7579 -7311 -6341 13359 -5870 -9069 5654 -2190 -12744 4461 6207
1028 6207 -12233 5539 5702 -11187 -5707 7912 -5955 -6065 12931 -3716 -7570 6191 1642
1041 1642 -12292 5059 6417 -8814 5376 7279 -6128 -5644 9849 -5107 -5085 12794 203
1054 203 -6086 5629 3718 -11376 5426 6505 -7326 2232 8735 -4434 -6534 9044 -6197
1067 -6197 -5898 9294 1923 -8033 3795 3797 -13487 2991 4693 -7927 -1034 8420 -5876 -8118
1081 -8118 7646 -5830 -7963 5122 2805 -10082 4772 3725 -14050 899 4510 -5899 -2868
1094 -2868 9329 -5495 -7316 7991 -3412 -8320 4496 4718 -8867 6484 4586 -10536 655
1107 655 6336 -4865 -3554 11930 -3725 -5482 7188 -1083 -7331 5630 6426 -9076 5747 5724
1121 5724 -6905 -570 6285 -5920 -3203 12557 -3183 -5194 5305 816 -8633 4850 5326 -9312
1135 -9312 4932 5142 -6394 -2908 6264 -5913 -4015 9572 -2582 -5674 4863 2600 -11086
1148 -11086 3372 5103 -6726 3427 5145 -5016 -3856 8765 -4184 -4356 7953 577 -3966
1161 -3966 6356 3835 -10555 4794 6581 -4040 2003 8179 -2578 -2960 10075 -3687 -3009 8742
1175 8742 3602 -4493 6333 5784 -8021 5435 5981 -4235 1132 11008 -2044 -3531 8043 -2741
1189 -2741 -2411 7424 3712 -6923 6689 5695 -7849 2926 4408 -3922 -496 10105 -3166 -3960
1203 -3960 6660 -1550 -4972 4660 3959 -6831 6431 3729 -7461 924 5416 -3468 -2437 9124
1217 9124 -3152 -2736 6412 -431 -6914 3935 5153 -5586 5425 3137 -5887 -243 6875 -4075
1231 -4075 -3587 8827 -1736 -2591 4709 736 -7720 4127 4615 -6889 3921 4301 -4222 -1978 5709
1246 5709 -5699 -2557 8421 -1434 -5248 3673 2765 -8170 3823 2185 -6382 3172 5456 -4229
1260 -4229 -3979 5815 -4645 -2484 6590 -735 -4879 5110 2969 -8718 3601 3043 -4078 1503 5798
1275 5798 -3127 -2145 7173 -4184 -2071 5686 1928 -3499 6089 2731 -7520 4106 4798 -2981 -58
1290 -58 6978 -2694 -906 6375 -3366 -2945 4731 2799 -4889 4972 2145 -6940 2305 3493 -4278 -2218
1306 -2218 7008 -3433 -3436 3107 -2804 -4248 2633 478 -7911 3679 1153 -6993 -1962 1390 -5788
1321 -5788 -3362 5895 -5863 -5545 1739 -1954 -6788 767 -372 -6938 2623 -294 -7063 -2455 3278
1336 3278 -6285 -4172 5029 -4396 -4088 1908 -1296 -7971 2339 1231 -5905 1821 625 -5029 -1517
1351 -1517 4310 -6366 -3032 5253 -2065 -3906 2294 59 -7406 3133 1538 -4544 982 1973 -3927
1366 -3927 -1790 3916 -5608 -1710 4201 -1563 -4882 2754 1172 -6744 2215 529 -3908 517 3761
1381 3761 -3995 -2776 3400 -3845 -802 3379 -1103 -4870 4319 1701 -6276 1763 2136 -2396 170
1396 170 4840 -3450 -987 4459 -2305 -1478 3878 2063 -3399 5262 1705 -4250 3115 4517 -2069
1411 -2069 -33 6843 -1253 471 4122 -690 -1023 5162 3225 -2891 5341 2286 -2608 2802 5176
1426 5176 -2528 370 6930 -1737 159 3890 552 -2007 4487 1819 -2901 4648 1915 -2860 499
1441 499 4566 -2974 542 5276 -2532 -1209 3375 837 -3487 3359 597 -2626 3313 1776 -3169
1456 -3169 -777 4539 -3526 -163 4067 -1551 -1876 2909 523 -4325 3480 1125 -2255 1252 2414
1471 2414 -2589 -418 4101 -3949 -706 4035 181 -2838 2868 678 -3955 3595 841 -2544 543
1486 543 3331 -3119 -773 3466 -3297 -895 3304 -256 -3781 3569 -27 -4154 2010 542 -2381
1501 -2381 28 3004 -4570 -955 2742 -2774 -1954 2102 -861 -3897 3342 -977 -4332 482 904
1516 904 -2887 -488 2631 -4365 -517 1679 -2202 -2760 2323 9 -3712 2917 -698 -3367 438
1531 438 1895 -3175 -168 3080 -2671 -307 1342 -1202 -2627 3597 301 -3241 2581 599 -1856
1546 -1856 319 2513 -3168 672 3919 -1772 -517 2061 -165 -2262 3877 210 -1811 2601 1742
1561 1742 -2244 19 3762 -2737 1090 3015 -1032 -536 2846 471 -2785 3333 908 -671 2242
1576 2242 2240 -2601 684 4108 -2229 881 2689 237 -895 3474 124 -2413 3597 1084 -910 1876
1592 1876 2923 -2163 943 3110 -2174 531 3344 489 -1671 3414 -399 -1665 2609 585 -1465
1607 -1465 964 3357 -2556 333 1861 -2286 -560 2557 -471 -2498 2547 -1122 -2189 564 245
1622 245 -2752 175 1927 -3597 -428 301 -2107 -2415 1317 -802 -2867 1774 -1644 -3072 -526 730
1638 730 -3173 -215 1239 -2992 -519 777 -1535 -3294 2052 -622 -2168 1746 -851 -2240 -272
1653 -272 1169 -3126 775 1805 -2125 -701 1488 -1302 -2442 2683 -678 -1618 1751 777 -1904 -462
1669 -462 1320 -2921 1227 1699 -1375 -790 1640 -1173 -2328 2251 -1007 -1159 1107 1109 -2573 104 1070
1686 1070 -2609 544 1200 -629 -1285 2062 -1604 -2055 1785 -637 -1135 469 1362 -2611 429 1173
1702 1173 -2194 -166 1658 -32 -1366 2517 -1252 -1383 1206 418 -1144 787 2106 -2435 1031
1717 1031 1108 -1456 -167 2095 -27 -1208 2760 -770 -1043 539 596 -1214 1623 2050 -2238 600
1733 600 742 -807 -1012 2199 -895 -1274 2382 -567 -1543 -336 758 -1913 914 1209 -1875 361
1749 361 371 -1448 -1743 2357 -655 -790 1562 -397 -1383 -20 1245 -2265 1057 1379 -454 239 789
1766 789 -1286 -1318 2921 -416 -363 1661 1130 -1269 614 1660 -1462 1549 1790 640 154 2053 -277
1783 -277 -605 2708 -272 417 2140 2159 -1680 691 1657 -1070 1198 1793 592 -290 2580 -624 -638
1800 -638 1621 72 225 1818 1712 -2477 1088 1441 -1298 -176 1610 485 -590 1906 -1275 -853
1816 -853 1040 114 -935 1139 1373 -2201 1198 305 -1811 -835 2336 25 -1461 1386 -963 -637
1832 -637 216 31 -1649 1182 1286 -2074 378 28 -1562 -1308 1850 -949 -1436 1274 -602 -1366 -862
1849 -862 113 -1950 1163 173 -2215 -188 159 -1741 -2116 933 -1873 -1091 950 -560 -2372 -1058
1865 -1058 94 -2154 502 -685 -1539 -204 544 -2258 -2381 1340 -943 -787 448 34 -2165 215
1881 215 518 -2401 257 724 201 -166 953 -1924 -618 2303 -785 -719 1111 1749 -1347 713 359
1898 359 -1406 825 1399 32 -337 1683 -1426 135 1440 -704 -554 2113 1808 -2115 723 366
1914 366 -669 300 895 -319 -6 2151 -1302 -318 607 -394 -412 1972 932 -2267 1051 982 -631
1931 -631 -774 1086 -6 521 2006 -1168 -160 848 736 -1002 1819 889 -877 1732 885 -875
1947 -875 -1079 2763 531 215 1328 7 760 1244 305 -1320 2654 1544 -171 853 1092 -586 -334
1964 -334 2936 -380 -84 1506 1190 -118 290 87 -930 2804 177 -956 806 1596 -1359 -986 1433
1981 1433 -1174 -143 1094 478 -1735 97 -128 -1172 974 -1055 -1137 610 1280 -2600 -1425 838
1997 838 -943 -829 383 167 -2076 428 -457 -1539 -164 -574 -534 490 718 -3169 -633 1145 -1068
2014 -1068 -1845 601 977 -1585 437 -1018 -1262 -119 682 -892 50 725 -1848 407 378 -1465 -1972
2031 -1972 1747 1041 -1792 141 -419 -609 -413 271 -1561 396 1091 -1444 -349 -17 -770 -1542 1819
2048 1819 83 -1848 723 608 -1029 -1241 571 -908 903 804 -1327 -621 902 -269 -1600 1785
2064 1785 -174 -758 1038 953 -1518 -998 1242 -778 738 473 -434 -180 1201 -718 -1641 1954 447
2081 447 -257 565 896 -1307 115 1390 -1166 -34 1000 845 -198 1121 -855 -959 2054 356
2097 356 -361 236 1794 -818 177 736 -923 347 1481 770 -968 1131 -507 -510 730 125 -397 958
2115 958 1795 -1450 -260 472 -155 -353 903 -171 -672 1358 -410 -1097 -207 401 -588 545 1072 -1920
2133 -1920 -271 620 -346 -1352 880 -10 -530 1191 -842 -1139 -60 862 -1216 603 982 -823 304
2150 304 134 -710 -1267 1953 68 -244 744 -235 -528 188 855 -1203 1154 1352 74 4 555 -408 -464
2169 -464 1852 -65 15 1134 897 -505 292 778 -815 1363 1067 -12 -328 1175 -158 -583 1169
2186 1169 -239 169 743 801 -1270 170 597 -842 315 496 -126 -511 1299 -1116 -1254 371 -49
2203 -49 -127 233 520 -1800 211 134 -1104 -300 764 -254 -1023 1040 -1329 -794 173 94 -1051 81
2221 81 732 -1394 157 -663 -1071 -300 1081 -371 -880 974 -987 -560 28 3 -879 794 620 -976
2239 -976 174 -95 -707 -555 969 -544 -176 1255 -517 -757 -126 450 -778 867 651 -697 350
2256 350 463 -545 -799 1260 -300 281 977 -66 -827 328 754 -997 805 691 -32 -119 603 -550
2274 -550 -706 1107 -587 258 627 421 -676 413 221 -827 800 611 281 18 898 -554 -281 788
2292 788 -471 48 777 791 -872 448 170 -866 548 791 127 -102 1261 -610 -496 679 149 77
2310 77 1017 644 -866 1071 402 -560 163 928 5 130 1382 -798 -270 340 199 -148 921 364 -706
2329 -706 736 -282 -489 -263 918 -178 -29 840 -821 -633 -57 -141 -1021 746 196 -941 -32 -720
2347 -720 -950 -767 469 -1267 -390 382 -899 -985 -626 -393 -1515 386 -25 -1056 -749 -328 -994 -1005 322
2366 322 -1050 -32 302 -521 -1330 -126 94 -1247 332 0 -270 -405 485 -969 -820 451 -408 124
2384 124 289 -219 -908 492 -410 -1076 408 482 -163 -487 893 -1028 -493 387 -651 37 371 285 -579
2403 -579 347 -838 -862 334 464 -389 -239 993 -832 -296 -153 -127 -87 683 643 -598 531 -408 -172
2422 -172 244 407 -286 90 1215 -699 -219 283 447 -178 772 600 -36 772 -31 -238 -123 1070 -145
2441 -145 577 1072 -296 -57 823 773 -599 882 774 362 602 344 -87 38 1090 -318 775 913
2459 913 220 33 523 329 -876 1157 634 248 25 240 -91 350 741 -729 421 894 291 -481 514
2478 514 -9 -612 905 380 -18 -100 673 -190 -333 179 -372 598 666 148 -645 661 78 -754 408 376
2498 376 53 193 773 -851 -307 217 -8 -162 314 133 -543 747 -311 -963 -49 893 54 -119 746
2517 746 -817 -24 117 49 -449 167 388 -308 566 -395 -516 11 843 -373 -61 970 -311 -503 -355
2536 -355 -103 -654 839 244 -511 281 69 -420 -367 366 -808 330 938 -386 -709 -211 -70 -838 223
2555 223 -105 -65 136 -96 -555 -549 460 -912 197 539 -97 -749 178 157 -1217 131 24 288 211 -58
2575 -58 -678 -397 821 -597 192 338 120 -580 457 -256 -846 287 523 79 -207 561 -461 20 207
2594 207 -700 156 936 418 -874 552 -256 -558 235 438 -342 -138 890 -435 -338 -273 -218 18 581 27
2614 27 -1125 619 -34 -1036 -380 443 -448 -261 761 -610 -380 -281 -99 -498 414 -219 -291 647 -351
2633 -351 -946 -498 776 -468 -307 456 -331 -323 -41 -195 -551 613 132 -43 639 -127 -856 -11 958 -780
2653 -780 10 666 85 -317 -142 -65 -501 840 -198 -118 438 265 -692 -111 419 -898 181 732 220
2672 220 -881 293 -39 -470 411 -379 -134 469 492 -887 -104 296 -752 -136 562 -307 -947 871 -134
2691 -134 -551 168 48 -155 143 436 -906 398 375 -774 -373 669 -105 -479 617 -294 -727 64 486
2710 486 -260 -37 572 -664 495 67 -892 -495 869 169 -563 656 -220 -472 -222 298 -635 293 743
2729 743 -458 -86 8 -173 -352 903 -213 -588 694 216 -746 -240 365 -516 609 652 -477 -252 437
2748 437 -144 -453 625 -280 -283 503 369 -982 -253 648 -713 232 311 83 51 608 -138 -736 712 -255
2768 -255 -374 375 378 -715 214 509 -776 173 781 117 -147 764 -291 -363 1032 198 17 646 828 -516
2788 -516 455 545 -326 690 947 316 109 1192 192 245 883 386 72 1147 1174 -250 735 481 -78
2807 -78 706 1076 246 1 1440 78 -44 482 348 -129 843 836 -703 411 415 -177 -367 832 118 -200
2827 -200 785 -278 -540 101 228 -620 341 405 -634 -73 244 -676 -559 729 -323 -220 313 -123 -500
2846 -500 194 10 -1038 332 492 -415 41 431 -507 -551 1008 -326 -86 669 153 -637 130 237 -770
2865 -770 674 344 -228 -499 617 -577 -639 317 -549 -351 210 108 -1009 66 -41 -983 140 -192
2883 -192 -642 -688 473 -1098 -1000 69 -698 -649 -152 -114 -1011 -109 -466 -1012 -507 4 -524 -485 73 -869 -896
2904 -896 -63 -617 -826 -55 130 -806 165 -87 -663 -264 206 -561 -241 795 -712 -389 203 21 -477
2923 -477 599 511 -541 326 -105 -295 -214 387 -385 278 701 -213 -332 272 145 -466 804 252 -384 333
2943 333 321 -293 12 625 -474 45 668 211 -374 243 -24 -877 507 124 -110 158 216 -321 -266 554
2963 554 -357 -43 241 17 -175 321 -22 -873 490 401 -99 34 422 -502 -347 542 -272 -107 369 211
2983 211 -430 389 122 -408 266 194 -57 151 752 -322 -160 97 -24 -59 516 260 -470 653 257 -108
3003 -108 -83 575 5 144 948 -489 -184 142 130 -141 759 522 -161 712 192 -377 -41 618 -167 26
3023 26 687 -359 225 184 0 -530 655 280 -185 499 -44 -277 -194 874 -328 94 535 -162 1 134
3043 134 -47 -766 436 -23 -249 320 358 -432 -481 396 -433 253 540 -108 -177 378 -16 -410 492 6 -74
3064 -74 134 410 -385 -137 574 -268 221 484 463 -366 387 -43 -456 608 116 155 18 606 -379 229 425
3085 425 -198 -185 287 420 -304 329 -210 -284 363 300 -131 -12 719 -382 97 185 -256 -305 172 238 -522 216
3107 216 -160 -403 -5 123 -355 12 479 -727 -298 25 -104 -404 242 -141 -617 328 -41 -377 -266 194
3127 194 -201 38 392 -315 -159 188 200 -439 417 181 -528 353 109 -218 -25 353 -437 12 302 129
3147 129 17 173 -160 -635 432 156 -31 61 256 -366 -229 300 -423 -119 -11 221 -262 192 51 -523
3167 -523 377 74 -136 12 290 -662 -459 32 -648 -105 -30 -134 -572 232 -79 -540 73 -261 -355 -198 415
3188 415 -719 -402 21 -317 -141 -11 98 -490 248 -157 -377 -246 -254 -320 -135 426 -514 -71 -8 -354 -368
3209 -368 289 129 -273 410 35 -98 -216 244 -295 -37 431 -176 42 -14 -90 -399 585 191 -337 212 -43
3230 -43 -95 -62 437 -380 41 132 -299 -134 192 202 -603 325 -156 -129 190 195 -245 -334 243 -351 -11 108 -284
3253 -284 -247 322 64 -703 90 -162 -411 24 191 -563 -278 92 -380 71 122 -16 -230 134 -236 -555 233
3274 233 103 -162 -262 318 -206 -134 97 -327 -182 329 451 -219 389 52 -295 336 245 -253 124 779 -83
3295 -83 -147 98 39 154 218 263 -211 507 -95 -48 -22 398 7 -233 594 -251 103 189 18 -408 243 262 -169
3318 -169 299 -41 -355 -192 340 -290 106 418 -228 -134 237 -53 -585 246 -5 -261 314 266 -205 -168 444
3339 444 -250 164 599 8 -178 303 52 -298 512 219 -5 282 226 -64 168 460 -271 86 523 2
3359 2 -299 356 178 -269 554 348 87 281 371 -210 -69 391 -334 32 337 117 -44 528 -17 -527 218
3380 218 382 -78 -136 348 -264 -11 165 -108 -83 214 192 -36 441 -218 -408 157 414 -112 -99 445 -386
3401 -386 -89 98 -142 -415 292 60 -427 285 124 -215 41 30 -380 180 461 -252 -161 168 -104 -477 305
3422 305 15 -383 -6 -54 -292 -117 75 -527 64 123 -353 -82 304 -108 -567 316 -92 -282 174 -15 -396
3443 -396 -124 419 -464 -37 -54 -253 -168 359 -36 -521 138 94 -233 -34 175 -560 -94 205 -483 -247 288
3464 288 -82 -431 132 -381 -487 274 -315 -453 -34 491 -650 -251 53 -468 -128 -32 -264 -675 244 -382
3484 -382 -477 -40 -96 -599 -200 300 -484 -67 -55 -422 -447 14 -67 -495 470 -310 -424 149 21 -415 -31 214
3506 214 -489 -6 292 -408 -446 322 -124 -286 166 -207 -176 -103 239 -546 80 347 -520 -32 246 -52 -398
3527 -398 429 -108 -263 377 -8 -209 121 215 -447 83 377 -216 -73 241 -88 -156 310 -48 -243 388 275
3548 275 -390 69 243 -355 233 283 22 140 475 180 -29 584 216 -1 83 561 -194 229 295 -113 347
3569 347 134 223 -223 474 29 -237 473 40 38 150 552 -310 278 451 -74 -122 350 9 -75 755 -122 -76
3591 -76 639 60 -126 290 411 -313 299 212 -24 49 190 -184 -94 521 56 83 377 49 -164 303 311 -210
3613 -210 143 176 190 -192 364 7 68 480 29 -90 94 315 -281 254 164 -60 153 27 -120 -387 250
3634 250 -205 -88 330 -125 -109 10 139 -413 27 178 -163 83 202 -311 -275 291 -322 -278 -15 31 -324
3655 -324 174 -75 -479 108 -198 -256 -166 279 -367 -142 53 -364 -133 -24 -112 -426 54 -83 -529 -25 -14
3676 -14 -235 -187 225 -263 -179 1 -381 -109 -100 -125 -298 -5 -109 -321 -53 -1 -117 -122 -34 -270 -99 79 -141
3699 -141 -400 -78 -84 -365 185 -200 -135 -145 243 -159 -171 64 -245 -246 -173 -188 -333 117 54 -371 195 -41 -211
3722 -211 -176 160 -105 3 255 -145 12 -36 248 -219 150 3 -300 166 33 141 25 443 -146 95 156
3743 156 179 -82 136 175 -343 236 152 90 9 170 89 17 328 -34 -65 77 102 -237 285 87 -96 39 225
3766 225 71 76 407 -34 111 229 -104 166 123 188 -164 167 53 -142 -41 13 54 -174 50 -240 6 59
3788 59 73 -93 -29 112 -288 189 81 -236 -198 98 -94 -156 240 -150 -38 -93 -52 -257 -125 -4 -246 77
3810 77 -128 35 -105 55 -32 -248 192 -133 -112 59 -54 -160 70 51 -19 -108 -241 -63 -72 212 -207 -17 252
3833 252 -78 -29 -115 -91 -392 53 121 54 -120 -95 -112 -167 136 -247 7 16 49 -352 -22 76 -134 22 -112 -23
3857 -23 150 219 -96 1 101 -81 -35 -49 176 -318 25 292 -13 164 -49 -141 -109 138 -247 212 248 -258 -90
3880 -90 73 251 -201 122 98 161 106 179 10 -20 227 -123 130 112 57 30 218 156 -119 -69 38 57 45 339
3904 339 3 -299 237 -102 203 160 152 -15 127 -59 78 140 217 116 -66 139 -147 -38 186 -86 28 -239
3926 -239 231 139 190 -191 126 134 -112 63 -335 77 -112 -18 -22 -76 -209 -57 40 -295 -3 124 -35 -190 9
3949 9 -225 -234 216 -277 -216 -148 11 -253 -193 -36 -260 -73 -8 -43 -388 94 -52 -101 74 -138 -174 -229 136 -433
3973 -433 30 -232 -261 -17 3 7 -43 100 -199 -7 4 0 -167 14 28 53 154 146 119 139 27 72 -237 87 50
3998 50 58 103 29 -209 -15 97 -42 69 269 30 -103 377 -74 90 221 92 -29 -27 390 -133 102 109 40
4021 40 -125 282 150 -33 197 20 -156 12 69 96 95 260 43 108 40 -20 -9 14 -92 58 299 -84 -134 93
4045 93 153 -23 33 171 19 50 6 64 10 292 65 54 328 46 46 286 243 -72 227 12 -257 26 20 18 -61
4070 -61 168 -123 293 111 28 -49 198 22 -232 28 -304 -147 -17 -24 -24 -38 183 -65 -101 -60 -68 -139 28 -13 -213
4095 -213 -27 -29 -109 26 140 -64 -103 5 -221 -251 -28 97 -139 104 29 -195 66 -158 -51 -110 490 -123
4117 -123 198 143 69 -85 86 74 -18 74 45 -13 105 111 35 57 181 -83 -140 -16 60 -13 144 181 -96 320 -22
4142 -22 -94 31 81 189 83 75 -149 37 26 -66 -175 -56 -141 -63 173 -97 -19 -158 384 -212 -28 20 113 -93
4166 -93 100 57 -173 -88 86 44 -34 31 -138 60 61 -368 23 34 9 -88 -33 211 42 137 36 -122 -93 250 52
4191 52 100 187 -309 123 -23 51 -308 -101 -231 -139 82 -262 -293 -239 103 -164 -87 142 0 -146 -130 -78 -322
4214 -322 64 -308 -240 -162 -11 -410 8 9 -405 -132 -55 -136 -345 210 -115 -238 -71 -183 -34 -129 -113 -75 -242
4237 -242 -29 -205 61 -43 -221 -87 -39 -179 -111 148 -90 93 -54 192 -309 76 -19 -100 -11 -41 -42 -323 -2
4260 -2 78 -185 118 12 -37 17 -137 168 143 144 -78 46 36 87 -104 340 9 164 161 12 -103 -64 81 46 136
4285 136 42 19 -9 208 24 -108 229 51 185 126 57 -116 80 131 -47 39 23 112 85 423 99 1 196 -5
4309 -5 49 183 303 -90 151 66 -58 93 5 171 -38 19 155 167 195 76 -144 -116 191 -29 220 73 40
4332 40 -13 197 142 -80 279 -17 -123 165 -49 -29 -36 -63 -55 -71 93 143 -3 200 -52 25 -27 24 -149 -70 237
4357 237 -10 50 137 -244 19 -103 -21 -6 22 119 -113 -177 167 -116 36 255 35 137 77 -17 95 68 92 -85
4381 -85 226 -63 107 59 72 53 -29 65 14 136 116 184 -48 21 -38 -4 149 -183 3 40 -191 -42 117 57 -51
4406 -51 -32 111 189 -93 229 -96 5 150 -106 46 136 59 10 260 183 85 158 90 21 -226 169 -91 70 -17
4430 -17 165 -147 -65 -41 -52 274 -59 68 -44 132 -118 -300 18 -3 24 -209 -106 -123 -93 -11 -100 -30 -13 97
4454 97 -210 -56 -335 -225 -147 -65 -313 -33 21 -284 67 40 -144 -2 -83 -150 -150 -138 42 -37 -213 -99 55 -74
4478 -74 -44 -344 -79 76 -77 156 65 89 -17 29 9 -202 24 47 -150 89 -67 -194 226 -66 56 -40 61
4501 61 -8 4 129 -37 95 -109 -5 -18 -90 -71 -91 -101 55 -34 -219 183 -82 12 -168 -149 -56 103 3 -101
4525 -101 217 -72 -34 96 64 66 -104 -31 6 140 -7 68 40 66 -14 -13 87 -177 -114 -272 137 81 150 55 -31 32
4551 32 126 201 112 119 -16 9 -93 -116 117 89 325 85 200 117 -48 -4 -89 -84 2 35 -48 228 12 -175 221 -25
4577 -25 308 -370 31 5 82 -152 99 90 -9 140 -180 -36 -114 -331 -3 -8 -161 -225 -176 -161 -104 -77 -45 5 9 -21
4603 -21 12 28 -38 123 62 55 -199 -62 89 20 55 -40 203 -94 71 46 22 143 203 350 -61 290 4 88 -42
4628 -42 185 3 -99 124 85 68 -12 92 -58 -98 98 17 -50 60 36 36 -191 96 145 -156 -41 164 188 51
4652 51 76 -22 33 170 -48 34 67 20 116 12 224 -88 25 60 -11 28 17 39 8 106 185 -17 214 161 181 84
4678 84 -111 -45 67 99 -128 239 95 52 -61 151 -148 29 257 -27 99 109 226 109 224 28 121 66
4700 66 -5 65 66 63 -124 -70 -64 -36 108 50 -44 -98 64 -199 -261 86 -148 -82 54 -114 0 -55 -56 96 -155 -87 -111
4727 -111 -115 82 -239 -57 -146 42 -172 12 56 -166 81 -88 -73 6 -109 -2 -41 -63 -2 -136 -57 53 -182
4750 -182 -51 137 154 -50 95 -98 -98 39 56 -11 49 -63 -12 -129 -76 -45 -86 -105 -44 -203 -54 42 63 -201 -141
4775 -141 5 -161 -23 -89 -179 32 114 61 -216 -179 -146 -115 -159 -60 -68 -146 -27 -310 71 104 -59 -72 -199 36 -78
4800 -78 17 -201 -79 -9 -34 -91 214 18 -42 283 49 -10 -239 109 21 155 48 38 -28 -92 71 -48 52 63
4824 63 -59 62 -51 -52 37 52 -10 184 14 108 145 -219 3 28 -4 110 -201 155 6 -51 -57 -13 218 62 34
4849 34 -31 -66 172 -34 74 55 32 173 -11 42 82 35 -44 -41 94 -143 94 -38 95 168 -52 191 -165 -27
4873 -27 -225 70 -53 102 -116 -182 -27 -9 78 88 141 -114 72 -52 93 -55 -96 240 -111 18 74 -118 30
4896 30 -192 178 4 159 -78 197 262 151 112 98 48 29 282 -99 151 -14 104 153 237 -41 -12 68 105 131
4920 131 26 16 -82 80 76 149 94 55 -44 78 -177 135 -66 -32 7 2 -8 62 21 -58 7 8 -52 -169 85 -67 88
4947 88 -104 247 32 -50 107 99 192 -24 -30 219 -40 -29 -207 -2 -110 96 -165 52 -22 243 86 279 -200
4970 -200 18 3 -271 156 87 56 -42 -83 -27 -46 87 -114 63 5 48 36 -36 12 -205 -61 37 -89 17 -194
4994 -194 71 129 -91 -45 27 -188 82 68 146 3 59 -77 -196 54 40 -107 -59 63 -126 -157 -7 -15 198 -131
5018 -131 130 -53 -45 -177 -62 151 -6 6 139 -115 -113 44 297 -57 -58 -54 -27 73 -32 -7 -26 163 -264 78
5042 78 55 11 -316 118 -139 56 -52 -84 24 -29 77 -27 76 -39 82 52 129 51 -2 -3 -55 18 -70 -246 74
5067 74 -302 -71 -129 -182 -234 84 -113 -133 -176 134 115 -147 -2 -186 -41 -161 -190 -133 -124 -126 -29 -22 -90 -50 32 -176
5093 -176 64 97 18 179 -83 -200 -53 -13 -104 173 -120 -142 -132 -183 -217 -12 -85 -20 23 240 -31 -122 -109 217
5117 217 -20 -45 44 115 -42 174 -24 60 66 -94 -116 179 221 -81 11 138 -17 -49 68 -39 60 76 -27 -145
5141 -145 -222 81 -144 -72 106 -147 46 -108 -13 -131 220 -13 -23 75 -23 -124 150 188 40 -67 30 -47 -61
5164 -61 -130 56 -6 19 62 167 45 -59 -67 31 306 32 93 -39 259 -37 81 109 -282 26 10 92 60 52 221
5189 221 51 -28 -86 82 -6 1 89 -19 185 4 55 37 150 44 -27 -54 106 125 139 238 63 -71 -116 -122 -93 9
5215 9 198 119 -4 -14 -40 -30 185 55 30 8 12 -107 40 65 108 -88 39 80 -134 20 77 -198 110 0 43
5240 43 -28 220 140 142 147 -27 -55 -220 -3 -46 172 211 -117 83 -110 85 26 -109 -105 135 23 -146 20 -90
5264 -90 124 -95 183 -24 -78 -32 -5 -94 100 117 -203 29 -41 60 -16 -30 -82 -81 139 -340 -132 -76 -36 110 78
5289 78 4 -136 34 -70 -140 52 -47 -46 -73 6 -200 -56 -118 -90 -167 -25 129 -151 -3 -82 -57 -163 44 -125
5313 -125 -208 251 -59 -10 -51 -34 -76 128 -159 -39 -69 -86 106 -120 75 -176 -72 -93 -210 174 119 -10 -112
5336 -112 -78 -60 40 -119 53 8 -175 4 -129 145 21 19 -107 41 140 -79 94 -222 -54 -229 227 -140
5358 -140 -18 -155 -158 -13 126 16 -240 -133 -202 -118 58 42 -27 -37 -36 -167 -2 -62 -30 -162 -14 134 -65 -47
5382 -47 -50 68 139 -39 -80 -46 155 -5 97 -61 39 -80 -29 -6 -52 -9 -132 39 -116 -72 70 79 -148 -23
5406 -23 85 -111 137 12 40 73 -62 80 114 157 -67 -51 100 24 9 -177 11 57 74 -42 73 -66 56
5429 56 5 52 19 -189 310 -85 24 94 -181 196 139 -186 -251 111 -106 -143 -171 108 -53 88 -17 -237 -1
5452 -1 31 25 278 73 90 207 46 -183 73 -57 120 183 202 -30 171 -94 -80 62 -66 68 40 -27 163 109
5476 109 -67 -61 -22 22 20 225 101 121 40 146 -105 62 173 -52 -67 -27 158 -52 -80 38 17 -50 158 -129
5500 -129 41 117 81 116 -77 -70 63 -24 -57 84 115 101 16 39 307 2 97 -13 97 84 -20 103 95 -35 -152
5525 -152 110 137 123 34 115 -220 -46 120 -57 -115 105 -39 -35 130 353 16 -45 -62 -41 126 -12 60 -78 -148
5549 -148 -35 36 -131 103 126 -11 -97 -12 -84 -79 155 7 42 -128 -145 17 -278 42 5 23 -144 -163 -27 82
5573 82 4 -145 -42 -180 -113 -432 1 -117 -58 60 -203 58 12 52 -155 47 3 -120 24 -228 -155 -134 99
5596 99 -71 -5 -136 -32 63 -58 -61 119 -54 -47 -33 8 79 -74 -105 -44 -47 50 -104 -47 -12 -6 2 -52 -122 -135 169 9
5624 9 -106 69 76 29 120 -159 -69 -28 -174 -82 17 99 0 -149 224 -150 -122 -180 4 -163 -10 -42 -75 13 -54 39
5650 39 -127 36 143 16 18 128 -110 -5 35 -43 -35 -16 73 69 -44 108 -131 30 -94 261 -9 -94 -251 -272
5674 -272 69 -230 189 108 -126 -59 -103 127 -42 85 -30 43 249 37 -151 -52 108 -75 115 -132 118 -157
5696 -157 10 30 54 64 21 132 -160 117 -8 126 -204 -54 248 -82 86 -118 122 104 -26 112 42 7
5718 7 -66 70 -158 159 105 123 178 -79 60 64 87 167 -55 -60 196 61 -146 48 -236 -70 92 72 100 8 71
5743 71 -115 243 -32 40 -4 79 -130 -50 -1 -8 -97 -42 120 -117 111 188 -182 -14 -13 -95 -46 81 -93 -130 -70 176
5769 176 -89 50 15 13 14 -123 -4 -13 104 -130 37 -29 -76 133 79 -107 53 -52 -129 -260 -7 93 87 157 43
5794 43 -102 -129 59 -52 -185 6 -2 -213 130 -2 -99 175 27 52 -191 32 -117 18 100 -57 -68 -111 -21
5817 -21 165 210 18 -72 -14 35 -162 -40 193 -19 160 -56 7 -50 163 87 -104 159 -148 -147 47 80 -136 125
5841 125 105 -38 140 23 -184 35 -136 -61 -279 206 -64 -187 -81 88 44 -149 -127 80 -19 -128 -44 96
5863 96 25 80 -95 -74 11 21 -43 159 -152 -13 -49 -80 70 35 -130 -154 18 -95 -59 -146 -219 -32 -145 -96 -95 50
5889 50 72 -65 136 40 -89 -44 -273 -16 -125 -52 64 -115 91 -158 91 -59 53 -26 -216 71 -134 -3
5911 -3 -80 -37 148 -78 90 -163 48 -107 -9 20 28 -168 -175 104 -149 110 -82 1 43 -213 -205 -222 -116 -98 -128 -17
5937 -17 28 149 133 121 -29 -123 78 67 -114 99 95 8 49 27 -10 -112 56 206 4 13 15 -34 -26 -26 -69 -22 -82 42
5965 42 -75 -154 -19 27 108 25 -125 12 157 -131 -181 -8 -55 42 48 107 88 -47 -96 194 -15 35 110 -1 234
5990 234 -38 -6 -26 42 105 -120 111 -54 -26 3 -46 53 -157 102 -44 162 40 43 -108 -142 61 28 -128 -29
6014 -29 4 -154 -35 21 74 145 67 157 -70 -87 111 22 99 12 31 78 2 -105 -153 -161 -30 -92 151 123 -235 -41
6040 -41 39 -124 -231 -146 -21 13 190 6 47 -162 -105 -22 35 39 -192 112 5 1 31 -1 181 242 260 -43 183
6065 183 -90 109 -243 68 114 206 -91 2 17 -174 137 -145 -66 -39 -47 17 -196 140 69 -129 90 14 29 118
6089 118 -61 -142 83 57 47 -151 -30 -91 78 30 0 115 -40 40 -84 145 -131 18 121 133 19 -248 -109
6112 -109 71 1 -63 -146 -47 17 -62 -48 -11 7 52 5 107 97 -77 64 -97 -65 43 135 -107 -116 -33 26 -143 -259
6138 -259 120 174 -60 -38 -45 87 -185 92 -1 -83 51 32 -109 218 2 17 104 186 67 -16 -3 -22 82 79 -50
6163 -50 -20 44 -132 -186 -14 -62 -130 70 -215 -77 -185 65 106 116 -119 -3 6 -83 152 -114 141 -117 -84 -101
6187 -101 -132 1 -87 -274 188 54 -85 -45 -225 -16 263 -129 -42 -18 -32 -34 -63 -1 229 -19 -197 96 171 22
6211 22 46 217 -122 -123 175 64 86 -20 113 148 21 10 122 190 -272 68 -155 -72 22 36 124 129 98 -241 23
6236 23 65 50 -157 51 -155 -90 89 -109 -35 -89 64 -74 -3 -17 -52 -66 74 -27 -206 120 -23 -133 -11
6259 -11 74 -13 -148 116 9 -65 23 -85 121 -103 -191 -4 -7 -113 -41 56 65 -7 3 -65 20 6 -246 -11 -36 -97
6285 -97 19 -5 69 -110 11 10 -50 -88 30 -40 107 60 -148 50 -173 207 53 58 205 -32 27 100 86 53 -60
6310 -60 99 88 -62 -71 53 -2 49 -88 173 -131 -40 65 18 179 -62 -65 68 259 30 212 233 -198 -35 26
6334 26 144 149 -6 -224 12 3 -176 -95 -68 -33 -95 193 -116 -156 38 116 17 -113 6 -24 45 101 95 -208 76 -29
6360 -29 -115 8 87 67 -247 -46 -127 2 -135 13 32 26 48 10 128 -10 -46 99 -32 84 -68 121 -47 18
6384 18 78 51 238 -177 41 90 237 -34 -127 21 -125 9 -170 -165 68 -11 -237 -31 73 -18 173 -52 82
6407 82 -114 -147 -13 -99 67 -3 16 -8 -46 -97 -111 162 142 -57 12 168 -137 14 -101 -2 -4 35 80 -225 217
6432 217 179 -54 -258 34 -86 3 97 -9 -37 91 25 -275 56 -35 -275 -96 -71 19 99 -37 -85 15 -78 4
6456 4 -143 29 182 -83 146 75 -39 -46 31 16 149 42 -78 62 -90 -36 -135 -63 20 77 92 49 64 -67 139
6481 139 -86 15 40 -135 122 140 -99 -188 133 -7 -188 165 29 57 -33 180 57 -35 45 84 40 -66 -39
6504 -39 10 -6 57 -19 16 180 75 14 71 -78 131 14 3 142 26 44 54 -95 -137 -64 -34 -172 130 188 44
6529 44 -36 177 164 127 -107 -126 110 -132 74 -256 96 58 -63 -53 -33 57 108 105 190 -35 -91 33 -11 139 107
6554 107 -69 164 -5 257 -34 -55 66 -152 21 -130 264 53 123 93 122 4 6 -50 -143 -173 102 -171 -70
6577 -70 -129 -43 155 73 35 21 134 45 -55 -90 66 -20 -76 -60 -147 26 123 -82 68 58 -274 32 54 -45 32 13
6603 13 -9 124 2 -86 173 110 79 -202 -23 -54 8 95 161 133 -1 244 -101 -71 85 129 30 -29 -38 -105 120 -72
6629 -72 96 -141 8 -203 -17 73 -60 3 -103 -25 -125 148 -107 -64 -28 -84 -23 -281 -54 14 -8 -4 -198 49
6653 49 21 56 -108 19 -151 -55 13 -11 141 40 185 -79 133 254 233 59 97 -55 -51 124 -71 -185 62
6676 62 -31 -69 93 47 10 -133 -118 -46 -272 220 86 -74 -58 -105 -47 71 -203 108 -78 123 25 7 78 162 131
6701 131 131 -58 33 162 273 -61 -12 55 -68 85 23 -86 -187 -17 126 -120 98 -28 18 15 -54 69 94 -21
6725 -21 0 140 -70 100 -114 147 -113 -97 140 102 -22 61 23 20 256 -16 66 -83 43 -25 -25 232 -212 -115
6749 -115 -62 93 135 98 -102 -63 -17 34 -51 7 -59 31 -85 -50 -175 -68 33 -33 -123 36 169 144 -107 -127 124
6774 124 -33 147 -107 29 163 -83 -144 -88 52 -128 -34 -97 -81 92 -163 153 -128 -90 -25 -6 -18 -30 48 32
6798 32 3 -91 8 -27 -32 57 80 -42 -86 122 29 108 230 187 -51 127 91 -205 170 7 91 65 112 -93 -50 165
6824 165 218 -35 -170 12 20 206 8 50 -37 -110 -69 178 335 -19 -26 -75 -258 -48 -117 214 -91 -46 35 -110
6848 -110 153 60 -76 -81 224 23 -9 -19 40 39 -37 94 -50 -40 -111 -185 -106 -70 -94 26 -41 -31 -52 -90 -28 -70 -31
6875 -31 99 -89 -114 -123 -37 -98 0 34 59 80 74 47 -261 -28 -97 32 144 56 82 10 16 -182 122 87 -46 -55 -65 57
6903 57 6 234 -5 29 117 -76 3 71 -30 -229 13 43 95 94 37 -117 -103 132 109 -59 103 -134 -240 -62
6927 -62 -105 23 135 -85 47 -30 102 71 -128 93 -112 -67 166 86 58 47 -15 46 -87 145 15 -155 91
6950 91 -22 -133 -188 21 90 -45 71 -139 34 -38 -137 213 44 -128 -35 -97 -29 94 -44 -53 -68 -193 -81 -13
6974 -13 -74 -288 -94 -3 30 12 -4 -121 -77 190 -112 -65 23 115 -119 61 42 195 105 -190 41 -129 120 -123
6998 -123 -9 51 10 -55 -56 52 -97 -73 -15 -90 -136 -77 -45 -34 -56 -155 -51 -33 -43 40 -128 -168 -51 76 -107 25
7024 25 -47 8 -137 141 -16 -57 -150 -196 -26 41 -48 -17 -105 -204 -49 127 -10 193 -19 -206 -61 -93 36 1
7048 1 127 87 -138 -136 105 -15 -37 121 -2 103 -92 33 46 48 -15 -23 -67 109 1 -105 75 -70 139 -20
7072 -20 -65 93 -266 86 105 104 99 -22 29 129 -71 4 125 -117 -20 -132 20 148 79 152 -11 16 -147 -28
7096 -28 213 -58 69 36 270 6 87 -73 -49 70 84 2 28 79 -226 -20 -166 54 165 1 93 -84 344
7119 344 -104 31 -96 -293 205 82 106 -110 88 -153 66 -86 65 39 -206 68 -60 -69 -98 6 36 10
7141 10 92 -108 29 -97 129 -17 136 73 84 37 69 73 145 34 39 14 7 58 -108 134 48 -263 37 -29 46 -173
7167 -173 -73 5 -104 87 -87 -124 -146 72 -88 -36 149 -127 50 -20 65 -121 157 -62 -4 -13 226 28 23 -51
7191 -51 6 19 197 -37 -124 -37 -138 37 153 56 -218 -6 -113 -8 48 -1 28 -42 -42 -7 4 -157 -182 -56 113
7216 113 -174 25 -26 -21 -25 70 -35 33 18 101 -43 -62 311 34 -94 206 -6 -47 61 -54 13 41 97 84 50
7241 50 104 110 -5 -8 133 56 153 -145 61 15 40 -234 163 -19 -31 20 -117 0 8 40 -74 16 30 -106 4 -59
7267 -59 -22 -101 -17 -269 52 12 -7 81 24 209 33 12 -49 76 -243 -23 -49 -168 -139 -108 125 40 186 25 112
7292 112 -50 -30 202 54 2 -150 -178 -104 35 -39 -72 -81 31 75 -134 131 -102 111 -85 45 213 37 182
7315 182 -90 -15 -1 173 200 -17 47 -175 17 -5 -78 -46 -188 -48 166 -4 -6 -3 24 116 137 65 270 -14 -28
7340 -28 266 33 -187 -11 165 54 135 9 17 -60 -1 -1 -91 218 54 18 34 28 157 35 -279 -104 -85 15 -8
7365 -8 38 51 -124 24 -4 23 -54 -21 -48 168 -18 -60 1 87 147 127 63 86 5 173 -5 -63 -20 -9 -25 169 -35
7392 -35 8 -1 -175 -156 -37 -119 8 -87 -185 68 -29 111 159 51 71 -32 1 -67 -16 91 -62 101 -137 -180 -103
7417 -103 166 80 73 36 -36 70 21 -6 204 -49 -30 -107 86 -217 -45 26 165 -34 -117 -40 58 -104 -305 29
7441 29 -126 -180 -65 77 -105 -152 97 -185 -32 -152 67 33 -2 226 -98 -43 21 72 -172 -25 -96 124 -21
7464 -21 -231 25 -43 -144 2 -137 -234 -33 134 -43 54 8 138 14 237 76 -76 172 -175 48 -122 115
7486 115 -61 83 -19 81 -134 -143 -116 -101 -9 -106 -58 -61 -59 -69 -169 -39 -101 -196 -52 -82 187 101 139 -70 -76 89
7512 89 -28 -51 -244 -35 -60 -106 58 67 -56 -51 -230 22 20 18 162 -65 108 117 -29 -35 82 -96 126 54 -142 -37
7538 -37 -208 133 141 98 6 -19 139 77 48 37 169 -16 1 26 -99 -11 3 44 -41 5 -47 -89 107 -116 -44 -82 22
7565 22 113 -108 46 158 289 -193 -70 75 130 96 190 -41 -209 -50 -91 -105 33 168 -50 174 194 -101 112
7588 112 99 150 148 259 -94 82 47 36 121 -149 80 -277 -17 79 -51 -107 -154 262 60 27 33 62 -125 17 -213
7613 -213 -165 80 -27 56 111 -20 -41 -37 -158 24 91 13 21 -73 159 375 77 -101 -83 106 190 64 -188 -61
7637 -61 -125 289 5 -86 -150 26 -20 55 315 56 16 52 -121 -27 4 83 47 156 -59 80 86 -153 -34 113 160
7662 160 74 -13 76 -19 -98 -55 -134 -31 -153 20 -313 -75 -95 223 16 241 -87 -15 -181 -37 32 164 -163
7685 -163 -77 33 -66 79 -104 18 233 178 65 26 90 -36 -162 -95 2 20 43 126 -20 97 35 334 -81 -145
7709 -145 -5 49 116 -122 98 87 109 -152 112 -27 103 97 -64 118 22 1 -165 148 -78 -102 -49 -39 -176 -51
7733 -51 58 31 -99 30 -250 14 -80 -83 2 -39 -9 166 -81 -200 -150 -132 98 -86 89 0 105 155 99 -18
7757 -18 -92 -88 -164 -7 56 75 126 8 2 112 -184 59 87 67 126 190 -109 -1 222 -36 32 -23 -24 180 -71 66
7783 66 -132 -142 -30 -181 50 -68 -9 -12 -25 51 -33 -36 -272 37 -40 -196 128 -53 14 -8 52 -122 -160 -197 104
7808 104 -221 27 157 34 142 -65 -16 -205 77 -168 -109 42 0 -95 -136 142 87 79 -15 -83 28 -16 105 100
7832 100 74 39 44 -22 -219 -1 -83 50 -134 162 24 83 -170 13 -41 -6 13 22 -77 6 59 74 -6 -83 -30 323
7858 323 -9 -15 -242 114 -125 5 148 -186 -3 177 65 117 -31 -152 -126 -143 5 92 -2 -68 -102 86 115
7881 115 3 -89 62 -263 -225 -25 -65 70 -61 -1 118 -95 270 -61 -32 -18 75 -68 17 -180 -50 61 -85
7904 -85 31 23 157 61 -41 -9 -57 63 123 3 41 -115 -47 34 86 10 196 70 -158 -58 -78 -72 125 216 146 82
7930 82 89 -123 -4 -97 -5 -59 17 -12 0 -99 -89 -101 -133 -13 122 82 -146 256 -102 199 -45 -108 87 54 76 -211
7956 -211 188 157 40 13 83 -70 14 84 -108 37 62 6 54 124 10 243 11 100 -91 -5 -91 -106 -66 70 -99
7981 -99 83 -298 -56 84 72 -23 53 209 31 50 -73 205 -134 -19 73 51 -1 -2 130 -277 131 187 -28 -154
8005 -154 -34 -140 -57 89 -1 -15 -164 4 -132 -171 -76 -60 205 98 113 87 41 35 -58 54 -114 25 -132 -7
8029 -7 -31 -37 -18 -38 23 40 -48 100 -123 10 9 103 -23 -146 -45 152 44 18 23 115 18 25 -109 44 -54 -53 -12 90
8057 90 96 28 -29 -159 -118 93 -64 45 31 -17 -40 77 -143 -94 143 -203 22 -135 -80 -114 1 129 8 -205
8081 -205 -170 126 -182 95 -65 -100 -116 -46 65 -14 14 180 -41 28 46 163 -6 22 34 -65 44 -91 366 119
8105 119 -34 -27 48 72 100 -156 105 104 -41 68 -26 103 20 -149 162 -17 27 79 15 -30 18 -116 237 -179 34
8130 34 -190 -129 -118 85 207 -107 -186 85 -196 -14 -75 -116 -190 131 -169 -55 66 -93 153 -31 191 -17
8152 -17 23 44 2 15 -46 -74 -197 -7 -71 98 63 136 -56 87 -11 -17 20 -47 119 68 20 -82 125 -68 -33 -26 4
8179 4 92 7 -64 65 140 -14 -127 -44 -65 -81 -7 -30
8191c0
##END NTUPLES=NMR FID
##END=
