##TITLE=1H_TG-2304-2
 CDCl3, 8 sc, 
 21.10.2020
##JCAMPDX= 6.0         $$ Bruker NMR JCAMP-DX V2.0
##DATA TYPE= NMR FID
##DATA CLASS= NTUPLES
##ORIGIN= UXNMR, Bruker Analytische Messtechnik GmbH
##OWNER= root
$$ XWIN-NMR		Version 3.5
$$ Wed Oct 21 12:57:50 2020 Russian Standard Time (UT+4h)  she@DPX200
##.OBSERVE FREQUENCY= 200.1315066352
##.OBSERVE NUCLEUS= ^1H
##.DELAY= (6, 6)
##.ACQUISITION MODE= SIMULTANEOUS
##.ACQUISITION SCHEME= undefined
##.AVERAGES= 8
##.DIGITISER RES= 18
##SPECTROMETER/DATA SYSTEM= spect
##.PULSE SEQUENCE= zg30
##.SOLVENT NAME= CDCl3
##.SHIFT REFERENCE= (INTERNAL, CDCl3, 0, 15.7039)
##AUDIT TRAIL= $$ (NUMBER, WHEN, WHO, WHERE, WHAT)
$$ ##TITLE= Audit trail, XWIN-NMR		Version 3.5
$$ ##JCAMPDX= 5.01
$$ ##ORIGIN= Bruker BioSpin GmbH
$$ ##OWNER= she
$$ F:/spectra/data/she/nmr/H-F/1/audita.txt
$$ ##AUDIT TRAIL=  $$ (NUMBER, WHEN, WHO, WHERE, WHAT)
(   1,<2020-10-21 12:56:14.71 +0400>,<she>,<DPX200>,
      <created by zg, POWCHK disabled, PULCHK disabled
       configuration hash MD5:
       00 E9 B6 7A A2 85 ED C7 34 08 36 98 17 FE 4E 26
       data hash MD5: 16K
       7F 07 50 40 17 9F A7 03 15 D0 C7 AE 8B 92 BB 51>)
$$ ##END=
$$ 
$$ hash MD5
$$ 88 2E DC 96 9D 99 F4 05 65 57 97 B7 FA C3 8B 21
##$RELAX= 
##$RELAX= 
##$RELAX= 
##$RELAX= 
##$RELAX= 
##$RELAX= 
$$ Bruker specific parameters
$$ --------------------------
##$DU= <F:/spectra>
##$EXPNO= 1
##$NAME= <H-F>
##$PROCNO= 1
##$TYPE= <nmr>
##$USER= <she>
##$AMP= (0..31)
100 100 100 100 100 100 100 100 100 100 100 100 100 100 100 100 100 100 
100 100 100 100 100 100 100 100 100 100 100 100 100 100 
##$AQSEQ= 0
##$AQ_mod= 1
##$AUNM= <au_zg>
##$AUTOPOS= <>
##$BF1= 200.13
##$BF2= 200.13
##$BF3= 200.13
##$BF4= 200.13
##$BF5= 200.13
##$BF6= 200.13
##$BF7= 200.13
##$BF8= 200.13
##$BYTORDA= 1
##$CFDGTYP= 0
##$CFRGTYP= 5
##$CHEMSTR= <none>
##$CNST= (0..31)
1 1 145 1 1 1 1 1 1 1 1 1 1 1 1 1 1 1 1 1 1 1 1 1 1 1 1 1 1 1 1 1 
##$CPDPRG= <>
##$CPDPRG1= <>
##$CPDPRG2= <>
##$CPDPRG3= <>
##$CPDPRG4= <mlev>
##$CPDPRG5= <mlev>
##$CPDPRG6= <mlev>
##$CPDPRG7= <mlev>
##$CPDPRG8= <mlev>
##$CPDPRGB= <>
##$CPDPRGT= <>
##$D= (0..31)
0 1.2 0 0 0 0 0 0 0 0.06 0 0.03 0 0 0 0 0.0002 0 0 0 0 0 0 0 0 0 0 0 0 
0 0 0 
##$DATE= 1603270574
##$DBL= (0..7)
120 120 120 120 120 120 120 120 
##$DBP= (0..7)
150 150 150 150 150 150 150 150 
##$DBP07= 0
##$DBPNAM0= <>
##$DBPNAM1= <>
##$DBPNAM2= <>
##$DBPNAM3= <>
##$DBPNAM4= <>
##$DBPNAM5= <>
##$DBPNAM6= <>
##$DBPNAM7= <>
##$DBPOAL= (0..7)
0.5 0.5 0.5 0.5 0.5 0.5 0.5 0.5 
##$DBPOFFS= (0..7)
0 0 0 0 0 0 0 0 
##$DE= 6
##$DECBNUC= <off>
##$DECIM= 32
##$DECNUC= <off>
##$DECSTAT= 4
##$DIGMOD= 1
##$DIGTYP= 9
##$DL= (0..7)
0 120 120 120 120 120 120 120 
##$DP= (0..7)
150 150 150 150 150 150 150 150 
##$DP07= 0
##$DPNAME0= <>
##$DPNAME1= <>
##$DPNAME2= <>
##$DPNAME3= <>
##$DPNAME4= <>
##$DPNAME5= <>
##$DPNAME6= <>
##$DPNAME7= <>
##$DPOAL= (0..7)
0.5 0.5 0.5 0.5 0.5 0.5 0.5 0.5 
##$DPOFFS= (0..7)
0 0 0 0 0 0 0 0 
##$DQDMODE= 0
##$DR= 18
##$DS= 0
##$DSLIST= <SSSSSSSSSSSSSSS>
$$ [...]
##$SUBNAM2= <"">
##$SUBNAM3= <"">
##$SUBNAM4= <"">
##$SUBNAM5= <"">
##$SUBNAM6= <"">
##$SUBNAM7= <"">
##$SUBNAM8= <"">
##$SUBNAM9= <"">
##$SW= 16.880792210976
##$SWIBOX= (0..15)
0 0 2 0 0 0 0 0 0 0 0 0 0 0 0 0 
##$SW_h= 3378.37837837838
##$TD= 16384
##$TD0= 1
##$TE= 0
##$TE2= 300
##$TE3= 300
##$TEG= 300
##$TL= (0..7)
0 120 120 120 120 120 120 120 
##$TP= (0..7)
150 150 150 150 150 150 150 150 
##$TP07= 0
##$TPNAME0= <>
##$TPNAME1= <>
##$TPNAME2= <>
##$TPNAME3= <>
##$TPNAME4= <>
##$TPNAME5= <>
##$TPNAME6= <>
##$TPNAME7= <>
##$TPOAL= (0..7)
0.5 0.5 0.5 0.5 0.5 0.5 0.5 0.5 
##$TPOFFS= (0..7)
0 0 0 0 0 0 0 0 
##$TUNHIN= 0
##$TUNHOUT= 0
##$TUNXOUT= 0
##$USERA1= <user>
##$USERA2= <user>
##$USERA3= <user>
##$USERA4= <user>
##$USERA5= <user>
##$V9= 5
##$VALIST= <valist>
##$VCLIST= <CCCCCCCCCCCCCCC>
##$VD= 0
##$VDLIST= <DDDDDDDDDDDDDDD>
##$VPLIST= <PPPPPPPPPPPPPPP>
##$VTLIST= <TTTTTTTTTTTTTTT>
##$WBST= 1024
##$WBSW= 4
##$XGAIN= (0..3)
0 0 0 0 
##$XL= 0
##$YL= 0
##$YMAX_a= 126398
##$YMIN_a= -105129
##$ZGOPTNS= <>
##$ZL1= 120
##$ZL2= 120
##$ZL3= 120
##$ZL4= 120
##$ABSF1= 10
##$ABSF2= 0
##$ABSG= 5
##$ABSL= 3
##$ALPHA= 0
##$AQORDER= 0
##$ASSFAC= 0
##$ASSFACI= 0
##$ASSFACX= 0
##$ASSWID= 0
##$AUNMP= <proc_1d>
##$AZFE= 0.1
##$AZFW= 0.1
##$BCFW= 1
##$BC_mod= 2
##$BYTORDP= 1
##$COROFFS= 0
##$CY= 11.3945322036743
##$DATMOD= 1
##$DC= 2
##$DFILT= <>
##$DTYPP= 0
##$F1P= 16.9975609425685
##$F2P= -3.02152046262296
##$FCOR= 0.5
##$FTSIZE= 0
##$FT_mod= 4
##$GAMMA= 1
##$GB= 0.15
##$INTBC= 1
##$INTSCL= 1
##$ISEN= 128
##$LB= 0.24
##$LEV0= 0
##$LPBIN= 0
##$MAXI= 10000
##$MC2= 0
##$MEAN= 0
##$ME_mod= 0
##$MI= 1.114404
##$NCOEF= 0
##$NC_proc= 0
##$NLEV= 6
##$NOISF1= 3.799351
##$NOISF2= 2.8
##$NSP= 1
##$NTH_PI= 0
##$NZP= 0
##$OFFSET= 15.70392
##$PC= 1
##$PHC0= -10695.24
##$PHC1= 20.80089
##$PH_mod= 1
##$PKNL= yes
##$PPARMOD= 0
##$PSCAL= 0
##$PSIGN= 0
##$REVERSE= no
##$SF= 200.130013532006
##$SI= 16384
##$SIGF1= 3
##$SIGF2= 2
##$SINO= 400
##$SIOLD= 16384
##$SREGLST= <1H.CDCl3>
##$SSB= 0
##$STSI= 0
##$STSR= 0
##$SW_p= 3612.71676300578
##$SYMM= 0
##$S_DEV= 0
##$TDeff= 0
##$TDoff= 0
##$TI= <>
##$TILT= no
##$TM1= 0
##$TM2= 0
##$TOPLEV= 0
##$USERP1= <user>
##$USERP2= <user>
##$USERP3= <user>
##$USERP4= <user>
##$USERP5= <user>
##$WDW= 1
##$XDIM= 8192
##$YMAX_p= 0
##$YMIN_p= 0
$$ End of Bruker specific parameters
$$ ---------------------------------
##NTUPLES= NMR FID
##VAR_NAME=  TIME,          FID/REAL,        FID/IMAG
##SYMBOL=    X,             R,               I
##VAR_TYPE=  INDEPENDENT,   DEPENDENT,       DEPENDENT
##VAR_FORM=  AFFN,          ASDF,            ASDF
##VAR_DIM=   8192,          8192,            8192
##UNITS=     SECONDS,       ARBITRARY UNITS, ARBITRARY UNITS
##FACTOR=    0.000296,      1,               1
##FIRST=     0,             0,               0
##LAST=      2.424536,      0,               0
##MIN=       0,             -105129,         0
##MAX=       2.424536,      126398,          0
$$ Real data points
##PAGE= N=1
##DATA TABLE= (X++(R..R)), XYDATA
$$ [...]
2195E78k70j280K505j941P90j165J753p74m07M05o61J739k105J084r02J980j641
2212c12l03J090n68Q71k167K017r83O13q00Q2J099q24L39j467K545j574p2J15
2230b99N94K36j477J317j344K011j356p8K20O21q5j655J982r86O92j389J299N0
2248C53n23L42j176J999j273O08j389J861k34j148R23m61J117k134J865r77Q66
2265F19m39r37J319q22J173k131K314q59K1n84K87Q88j587J390j539J906j175
2282a56K56j86J82O12j718J716j305J342j516N23L22k73P18j693J517o56R92j763
2300a086J319K07j012M77q65J977j868Q68q57Q90N01j404O37k95J638k495J722
2317C54l16Q6l83m06J319j299J153j613J599o10J43m68J35J406k031J171p77J515
$$ plain form
2195 578 308 -972 1533 -408 382 -783 970 196 -211 194 -467 1272 -833 251 -651 1329 -312
2212 -312 -615 475 -93 778 -1389 628 -355 258 -542 -460 639 -185 154 -1313 1232 -342 -414 -299
2230 -299 295 531 -946 371 -973 1038 -318 -396 -176 445 360 -1295 687 -299 393 -996 303 353
2248 353 -170 172 -1004 995 -278 330 -1059 802 568 -580 343 -118 999 -1135 730 -247 619
2265 619 180 -757 562 -260 913 -1218 1096 237 258 -326 -39 849 -738 652 -887 1019 -156
2282 -156 100 -86 96 708 -1010 706 -599 743 -773 -250 72 -201 517 -1176 341 -315 677 -1086
2300 -1086 233 440 -572 -95 -960 1017 -851 17 -840 50 551 -853 -216 -511 1127 -1368 354
2317 354 38 124 -259 -665 654 -645 508 -1105 494 -116 27 -441 -306 1100 -931 240 -537 978
2335I78j324r9Q68n78J282k217J481m89J336j883K12J396j036K82j154K059j418
2352c04O24p89P86M80j343N00l01J716k206P64J59L00k91j018J586j064R49j769
2370a221J379J30k16l04l58K037k152N45l99J444r29p16Q77m59J163j705Q41k62
2388c05J224j551l3J165o97O12j634K083j152L70m95J00J020j141M95o65J757
2405A153j509J87J70M66M4j368J527q96Q30j228P37J22N7k42o93J993j441N48
2423D57j080J248n06m39P16p81J456j759J024p11Q90n21o40J102o02Q42j395J108
2441D09o87N15n89p2Q32r17R40j398J746q54j45L8r1R93j486J102q46J064j213
2460f59M72L0K91L8j385J910j000Q34j263P36K81n04L82q31J535j239P16q31P99
$$ plain form
2335 978 -346 -445 423 -155 1127 -1090 391 -98 1238 -645 -433 963 -73 209 -945 1114 -304
2352 -304 320 -469 317 797 -546 -46 -347 1369 -837 -73 86 386 95 -923 663 -401 548 -1221
2370 -1221 158 288 72 -232 -590 1447 -705 -160 -559 885 -44 -760 117 -342 821 -884 -43 -305
2388 -305 919 -632 -665 500 -197 415 -1219 864 -288 82 -413 -313 707 -434 61 -604 1153
2405 1153 -356 -169 1 467 511 -857 670 -226 604 -624 113 235 292 50 -643 1350 -91 457
2423 457 -623 625 119 -320 396 -385 1071 -688 336 -375 515 -6 -646 456 -146 696 -699 409
2441 409 -278 237 -352 -424 408 -509 431 -967 779 -75 -220 -182 -273 720 -766 336 -510 554 -659
2460 -659 -187 -157 134 172 -1213 697 -303 531 -732 4 285 -219 163 -668 867 -372 344 -487 312
2479C12n0p47Q19p31J307j486R45o12P11k75o34J163q07P79j438R54j13M17o73
2498a59l2R19j010Q05j086J228p41m0J34m7R53j693R12l63J074j224J88O07j88
2517B37K76j415J448p82P29j048M50R07j025L19q77J829j623N04j66M86N0r67
2535f68Q94n93J220j633Q42k87N10l26o77J590j174M04p55J206m26k37J13l47
2553c44J216j452N83n79J483q62n87R21l07P58j724J328p73P99q90j71J423r77
2571a55L18j117J860r26R9m15M68M37j009O04r19J434j047K94N0L41l43r41J478
2590E11r80O61q55Q79n0r5j40p98J537j006K78n45J431p92o75P35m89J136j563
2609h20R30m91Q21o88l29R73m00M20j540J768n12K09o10L85O09j104N56p24J587
$$ plain form
2479 312 262 -485 334 -397 910 -576 369 -243 468 193 -441 722 -85 694 -744 210 97 514 -159
2498 -159 -191 728 -282 523 -563 665 -76 -116 18 -29 924 -769 143 -220 854 -370 -182 425 237
2517 237 513 -902 546 -236 493 -555 -105 802 -223 96 -781 1048 -575 -71 -237 249 299 -668
2535 -668 226 -367 853 -780 62 -225 285 -41 -718 872 -302 102 -653 553 127 -110 3 -344
2553 -344 872 -580 3 -576 907 45 -542 379 72 830 -894 434 -339 460 -430 -601 822 -155
2571 -155 163 -954 906 -20 79 -336 132 569 -440 164 -755 679 -368 -74 -24 317 -26 -967 511
2590 511 -469 192 -663 216 166 71 -69 -867 670 -336 -58 -603 828 36 -639 96 -393 743 -820
2609 -820 110 -381 440 -248 -577 396 -4 416 -1124 644 132 341 -269 116 725 -379 177 -547 1040
2628A040j342R2J21M19J35j338J338l89L48j179R66J02n6L6r82J440j045N49j123
2647h68J475j78p85M23l48J016j389R83n86P11l84o77Q96m73O86j370J426l92
2665A66k27j17k33Q82j018R57j168J272n29o0M8m6O94j553J374o65Q00j153N57
2684a9K47k53M68j417J362m19N59j049O12M97q35M75o94J077j043Q67o56N04J07
2703C90o42O77p42R62j399Q97J37p4j76l02O97p21Q53j079J037l91m4j14j60J070
2723H76j543Q39n61R99q08J58L05l02P43j303O99l10Q95j055O4O08o66N80q67
2742f49J234r39M22l79K10M94p17M52q78J588j495O20j19J72L9o33R61p92J076
2761F67j327M02L32j21l4m87J098q22M63p88Q47m36J9L41m11Q85j192L74j30P55
$$ plain form
2628 1040 -302 -210 -89 330 465 -873 465 76 424 -755 211 313 257 293 -689 751 -294 255 -868
2647 -868 607 429 -356 67 -281 735 -654 329 -257 454 70 -607 289 -184 502 -868 558 166
2665 166 -61 -178 -411 471 -547 410 -758 514 -15 -75 -27 -73 621 -932 442 -223 577 -576 -19
2684 -19 228 -25 443 -974 388 -31 528 -521 91 588 -247 228 -466 611 -432 435 -221 283 390
2703 390 -252 425 -317 645 -754 143 280 206 30 -272 425 -296 557 -522 515 124 80 -34 -194 876
2723 876 -667 172 -389 610 -198 -40 265 -37 706 -597 102 -208 687 -368 -304 304 -362 218 -649
2742 -649 585 -354 68 -311 -101 393 -324 128 -750 838 -657 -37 -156 16 55 -578 383 -409 667
2761 667 -660 -258 74 -47 -81 -568 530 -292 171 -617 230 -206 -187 154 -257 628 -564 -190 -320 435
2781D35m53m00P97n93N56p03Q82r69O20k30mM26o81P31j026J209r03L44j42J1
2801i3N17p33P46o89P13o73K73j85K71J32q46J025q58P74p67O06p4m30N10q56
2821f37J211r50N47p41P76m0p09M38l55J035j129P67o39M46m4l83N94m29P89j063
2841e16Q49k50l2k73K2Q40r22N90p46R91n22k1o7K29L07r09Q34m89O85r41M85
2862A44Q7L3K49q36Q72p12M67r58R07K56p00K68o25J137q42P35o97O45J34q88
2882c24N15l39R44j461R41k96K44j98k38Q02r71P77j176J261l75j28k92N3Q43
2901E82j295O47k72R58r06j2K18n8M98j194R71m71O45j028N21N24o99M67q42J443
2921F97q93M09n53M34L40p53M64n06R40j240J017m00K47o7n79R81p44Q29j282
$$ plain form
2781 435 -18 -418 379 -214 342 -361 521 -448 172 -58 -62 364 -317 414 -612 597 -306 38 -104 -93
2801 -93 424 -309 437 -252 461 -212 61 -124 147 279 -567 458 -400 374 -393 213 139 -291 219 -637
2821 -637 574 -376 171 -570 206 166 -543 -105 -460 575 -554 213 -426 20 -24 -407 187 -242 547 -516
2841 -516 333 83 51 -222 -200 640 -282 308 -438 553 31 10 -57 172 479 -430 404 -85 600 -341 144
2862 144 231 264 513 -323 549 -163 304 -654 253 509 -191 77 -548 589 -253 482 -215 430 564 -324
2882 -324 191 -148 796 -665 276 -20 224 26 -212 590 -381 396 -780 481 106 -22 -314 -261 582
2901 582 -713 -66 -338 620 -286 -298 -80 -138 360 -834 137 -334 311 -717 -196 328 -371 96 -746 697
2921 697 -196 213 -340 94 434 -319 145 -361 579 -661 356 -44 203 136 -443 538 -206 623 -659
2940f59R95o3r8j73l38J089j056O78o81Q84o84j40M98n38P88j091Q74n94Q15p60
2960b54j06N67k10K87r11R74n63L46l11J43L67q06P63j002J304j123L53J00K85
2979B03j1q08R09p13O90o40M80k00L56l22l99R55q82N56p22R82k70k20K24m83
2999c15Q10p88N97m82Q23p66j27M42k67N88j067R76o04O93n96o1N50n21M36j080
3019g59J405q06J53k66M12K15p67P94o04N84n60K04qj7L38r11J002m57N02p27
3039b73M33q3q4K13p58R07o08N05q15R18j71n82M91m84Q04r37O78l51L04j36j38
3060a67M83o02P89j164J102o10J75j14M0N90j068O79n62R12p92L76r3P6M13r43
3080d80Q90n12N89q03J91L98l07J68o86J089p21M13n53O71L0o19L92m71J037j171
$$ plain form
2940 -659 336 273 175 2 -336 753 -303 375 -306 578 -106 -246 252 -286 502 -589 285 -309 506 -254
2960 -254 -360 207 -3 284 -627 347 -216 130 -181 -38 329 -477 286 -716 588 -535 -182 -82 203
2979 203 192 -616 293 -420 270 -370 110 -90 266 -56 -455 500 -382 174 -548 434 164 -56 168 -315
2999 -315 495 -293 304 -178 645 -121 -248 194 -73 515 -552 424 -180 513 -83 -144 406 -115 321 -759
3019 -759 646 -160 -7 -273 139 354 -413 381 -223 361 -199 5 -3 -20 318 -593 409 -48 454 -273
3039 -273 160 77 -7 206 -552 355 -253 252 -563 355 184 -398 93 -391 413 -524 154 -197 107 -29 -167
3060 -167 316 -286 503 -661 441 -169 6 -108 -68 522 -546 133 -429 483 -309 67 -26 50 463 -480
3080 -480 410 -102 487 -316 -125 273 -34 134 -552 537 -184 229 -324 347 377 -242 150 -321 716 -455
3100d55O22l13L86k45l07N96l42N56j079O99j72J01k50k21R79r77O30q54Q92K2
3120B68m76L1j0O83q67M03l47M79n17J60L44j49L6o35J022o37O22p81L13L22m51
3141a87K25o04J091p03K57l53M90pm15M37m73Q20q93L73J58J02k97n69J117p87
3161b18O19q55Q49k50o4j40n0O34r16L06j28M29k25k89M67j94M20p36O02k15L89
3182D35n96m7O07n88L00m73Q08q15L42l59M91K35p05L87l21Q36p84J97K5L19k34
3203F0n91Q17n05N36p83N16M7k01K22n14R77o28J31p64J001l91k93L81k22P90
3223E86q95M12n01P57k80m36O25l15K46p52R15m49K55j02j63L71m89N74n74P16
3243E01o63R6L1K01M8o10N93m32N96n98K10q2J10K43p19P24m29K72n31O40l16
$$ plain form
3100 -455 167 -146 240 -5 -312 284 -58 498 -581 118 -54 47 -203 -424 555 -422 208 -646 246 268
3120 268 -208 -177 -187 496 -371 32 -315 164 -353 -193 151 2 38 -597 425 -212 410 -371 -58 264 -187
3141 -187 38 -566 525 -178 79 -274 216 209 -206 231 -242 578 -315 58 216 318 21 -548 569 -218
3161 -218 401 -454 395 145 81 -59 -109 525 -391 -85 -213 216 -9 -298 169 -25 395 -341 261 46 435
3182 435 -161 -208 399 -189 111 -362 446 -369 -27 -386 105 340 -365 22 -299 537 -247 -50 -25 294 60
3203 60 -531 286 -219 317 -466 50 97 -104 118 -396 581 -47 84 -680 321 -70 -363 18 -204 586
3223 586 -309 103 -398 359 79 -357 268 -47 199 -553 362 -87 168 66 -97 274 -215 359 -215 501
3243 501 -162 -66 -35 166 214 -396 197 -235 361 -237 -27 -109 1 244 -475 249 -180 92 -439 201 -115
3264a15K3J51n26P65o12M90n53N13j52k99M30m20M69o43O54m01K89j51k85O41
3284B68n73N56n23N33j42o1k00J39L08p05P43m74M86n80K66j65J88K88q19Q92
3304D25n89N20o55O62j77m07O36q59P41m40M26o37M40R5l36M39m71P62r39P17
3324C53m72J99J51k98L12n66O86q10P66l81K98l25j18N93q39P76p49Q01n59K06
3344B4L5r7K68p31O19n16O22o08L09P7l43N21n25M53n20Q60n68j58N20j37O2n32
3366c65O77o39O71k66j41J44k14L29m46Q06q89M77j54J23N6k76N44q46O49l25
3386h5J64n1j14r2O0N22n69M13m52L53k28r1M08l78L41n81O78n46N26m10q1M84
3408B71l65L78n66N23l99K58j97o3L21r6L5m91O64m89J27m4OL50m57L49o02Q46
$$ plain form
3264 -115 -92 59 -467 298 -314 176 -377 136 -16 -315 115 -305 164 -479 175 -226 63 -88 -373 268
3284 268 -305 251 -272 261 119 58 -142 -3 305 -400 343 -131 355 -225 41 -124 64 352 -467 425
3304 425 -164 356 -299 363 186 -221 415 -444 297 -143 283 -354 86 181 -155 284 -187 575 -364 353
3324 353 -119 80 231 -67 245 -321 365 -445 321 -60 238 -87 -205 388 -451 325 -424 377 -182 24
3344 24 59 -38 230 -501 118 -398 224 -384 -75 2 -341 180 -345 108 -412 448 -120 -278 242 105 167 -365
3366 -365 312 -327 344 78 -63 81 -133 196 -250 556 -333 144 -10 113 169 -107 437 -409 240 -85
3386 -85 79 28 -86 -178 -118 404 -165 248 -204 149 -79 -170 238 -140 201 -380 298 -248 278 -132 -213 271
3408 271 -94 284 -282 241 -158 100 -97 -160 161 65 100 -391 273 -216 -89 -133 -127 223 -234 115 -487 359
3430C59p30N33p8j24R8n22O81o19M47m00N96k43j28O0k22O46n80M41m73L98l6
3451A04j99L61j92K83m93O03m65J28j67L6M09m69L13p05R50n25N7k40K91K18o53
3472c55N72m19N78n46K05K4LL42o73N19k15K57n44K89J3p1R6m89P33m37M46o95
3494c67N21j61j08J9m6M64p22O33l62K57k14j32L40l30M25p58P20k00O0k01J20
3515d2M26o78M01n23O40l22n7L22l55M43n34N77l52L83n62Q0M10k85L37m73M02
3536B38l56L29l58M7J12J39k2k41M77n52J46j35K71j27k55M70l33N14o05L11M1
3557A11P9k21k86O54n51M77n77O70n25L1l4O3M12p17M49k03L06m22J66K58q6P5
3579A29n63O01m04M07l84J33J98j91J07k79P30o95M07j66K6J05m28L88k17N89
$$ plain form
3430 359 -371 162 84 -40 58 -464 217 -402 45 -355 241 -2 -130 -70 -292 354 -226 215 -258 140 104
3451 104 -95 266 74 357 -136 467 2 130 -37 -1 408 -61 252 -453 497 -28 29 -211 80 298 -355
3472 -355 217 -202 376 -170 35 59 62 404 -269 250 35 292 -252 37 50 -21 75 -414 319 -118 328 -367
3494 -367 154 -7 -115 -96 -142 322 -400 233 -129 128 -86 -218 122 -208 217 -541 179 -21 39 -162 -42
3515 -42 384 -294 107 -416 224 -98 -155 167 -188 255 -279 298 -54 329 -233 -153 257 -28 309 -164 238
3536 238 -118 211 -147 -100 12 151 129 -112 365 -187 -41 -176 95 -32 -287 183 -150 364 -241 70 111
3557 111 190 -31 -317 337 -214 263 -314 356 -169 -138 -172 -109 303 -414 35 -168 138 -284 -118 140 54 129
3579 129 -434 167 -237 170 -214 -81 117 -74 33 -246 484 -211 196 30 56 161 -267 121 -96 493
3599D93n41p2J40L54k20l25N27m76N26p88N38k11J00J96m60O63p48N35n59O05
3619B77l60j4J35m5K32n85O39l57J78j74J6K76m75M54n22N62n16K83p2k55N45
3640B22m33K78l46O47o34J52o5K52J05n26N62m55M50m45R5J92j64J11k73N87o27
3661c15N79o90O14Lk90J35p2K56n36N74k95K99k59l4K36l89M17m80M71l75L46
3682A95k66j40O82o86M83l54N43m35j03p4J43L78n84L57l80O21o22K08j9k5K23
3703A45m53N32m32K95n09M39K11k61J86o08P71p09M49l28L93j04k72L44k81M11
3723B19o27O13k59J92n04j43R04n11J95l28L45J76l14rj35N53p12M91m29O29j79
3744A67j41J37j41L39m92L97l49M46p92M38K88k32j54n7M74l83L24m57L24k28
$$ plain form
3599 493 -48 -120 20 374 154 -171 356 -120 406 -382 156 -55 45 241 -219 444 -304 231 -328 277
3619 277 -83 -97 38 -7 225 -360 279 -78 100 -74 -58 218 -257 197 -325 237 -279 4 -68 -323 222
3640 222 -211 67 -279 368 -266 -114 -179 73 178 -348 214 -241 209 -236 -141 51 -113 -2 -275 312 -315
3661 -315 264 -426 188 191 -99 36 -36 220 -316 258 -37 262 3 -31 205 -184 233 -247 224 -151 195
3682 195 -71 -211 471 -215 268 -86 457 22 -81 -155 -12 366 -218 139 -241 380 -242 -34 -53 -78 145
3703 145 -308 224 -208 87 -422 17 228 -33 153 -455 316 -393 56 -272 121 17 -255 89 -192 219
3723 219 -408 205 -54 138 -366 -509 395 -116 79 -249 96 272 -42 -51 -186 367 -345 146 -283 346 167
3744 167 26 163 22 361 -131 266 -83 363 -429 9 297 65 -89 -146 328 -55 269 -188 136 -92
3764i2j68L67k86O03p76M25k19L83l03n1M91n53L22m61M19j92K49j60j10M36l68
3785d4M28p24M96k01J14mk56N78p95O31l67L16m76K33L23j97l9l13L83j54L15
3806B47l59J72J76n65N23m69O12n71L03j4P2Jk56L27k64M18o79N52k94n8J07l14
3828c33O11l22K56l13J38M7k20M38m45M72o77N14l10M59l03o4L49l16J6l84O19
3849B32m49L08j90J16m9l4K29o09P75m29J06o6P6J77m85M24m43O30o20L03j90
3870a88J24J17l90M97k98N19p24M61k09j07J85j15J77k95J97j23K94lMp9k46K98
3892I6k69M01m17M27m10M3R8k10M36m56M26k73K35k67R0J93m22N06n17L66m02
3913c26L10N4J71O9p25O00l53N14n47K62p3k75N45o02P69m99K19m64M09K8k06
$$ plain form
3764 -92 -260 107 -179 424 -352 73 -146 237 -66 -117 374 -179 143 -318 101 -91 158 -2 -112 324 -44
3785 -44 384 -340 156 -45 69 65 -191 387 -408 223 -144 172 -304 -71 252 55 16 -297 86 -68 247
3806 247 -112 60 236 -329 194 -275 337 -234 69 55 127 128 -128 199 -65 353 -326 226 -68 -126 -19 -333
3828 -333 278 -44 212 -101 37 84 -136 302 -143 329 -348 166 -144 315 12 -52 297 -19 -3 -387 232
3849 232 -217 91 -99 17 -32 -66 163 -446 329 -100 6 -60 16 193 -292 132 -311 319 -301 2 -188
3870 -188 -64 53 -337 160 -138 381 -343 118 -91 -198 -13 -128 49 -246 -49 -172 122 119 123 44 -202 96
3892 96 -173 228 -189 238 -172 -129 -31 -241 195 -261 165 -108 127 -140 -50 143 -279 227 -290 76 -326
3913 -326 -16 38 209 278 -447 153 -200 314 -233 29 -44 -319 226 -376 393 -106 113 -351 58 86 -120
3934a20J80l34M78n93L91k20K69o5k3R9l40N62m97M19l76K12O7l57N64m11J46
3955E1m98Q41l43M6k08O5K28m60M90m43O03n56K77j09M2J84m70M04l07J80r5K54
3977A76M0k18J88n26N97m57L78j18K21q6j31j06j43O53q10N30m31K99J4m5J13
3998A38l67M89m89M94l05n8r6L6M79l76K47m15L46j15j35N8j85M64l02L52n78
4019c18N31m12K67q3q0K75m40N76o75M73l27J13J18k58K70m07P05m77K81l11O6
4040a13L12n31N90l23L41n35M49j77M5m3k09N99m75K98m25L47k66K55mm19N65
4061B81n43M38l46N22m05l2L57l41J50m04N51n12L17j82j45L65k41K73m41N63
4081B25m90M22m62K72J99k55K01k67L62l30P3j1Q6Pj38N47n29K39n67O61k32j4
$$ plain form
3934 -120 60 -274 204 -389 2 -218 51 -14 -37 62 -278 284 -213 206 -170 42 109 -248 316 -95 51
3955 51 -447 394 51 97 -111 -46 182 -278 212 -231 372 -184 93 -16 26 210 -260 144 -163 17 -78 176
3977 176 216 -2 186 -340 257 -200 178 60 281 195 64 -42 -185 468 -342 188 -243 56 70 25 138
3998 138 -229 260 -229 265 -40 -98 -194 -158 321 -55 192 -223 123 8 -127 -69 -254 210 -92 260 -318
4019 -318 213 -199 68 -15 -95 180 -260 316 -359 114 -213 -100 18 -240 30 -377 328 -149 132 -179 -113
4040 -113 199 -332 258 -65 276 -259 190 13 58 15 -194 405 -70 228 -197 150 -116 139 135 -284 281
4061 281 -262 176 -170 352 -53 -85 272 -69 81 -323 228 -284 33 -149 -294 71 -170 103 -338 225
4081 225 -265 157 -305 -33 166 -89 112 -155 207 -123 -50 -61 25 32 -106 441 -88 151 -416 245 13 -1
4103aj06r6M90m93N26o66N76j18l63L37l70M87n70P07l27J89l93n6O60o56M97
4124B54n29L68k36K04k9rL14o12N12m78N81m85K43p9OJ46l10M57o66O40n76L63
4146G9p0k95K63k76O98n82L80k63J09j32o1J86m64N41k89J85k65K49J8l18P15
4167D08o40L91n69O81l18L3lj40M35n45O68p32M28m10L32J1q8L98p26O85n07M44
4189B36k43J25Jj41K00m06N74n72M96k89J14Kj49J62l75O45n34K62k50K73P9m17
4211b07L90l65M82o09L98j99J90J1j61L94n19K93l81L92k08M4J04j61N30p72N23
4232A69l81O27k42j95O8k14M77o01N35m79O28m98j17M22l55K87l54P09m40J16
4252A62k20J61Q8l69N18n34M95n19L74k51J02J46k23K08j82K31m31M52m39K44
$$ plain form
4103 -1 -107 -203 287 -206 320 -346 230 112 -251 86 -284 203 -367 340 13 202 -191 -247 413 -243 254
4124 254 -275 93 -143 61 32 23 337 -275 237 -241 340 -145 98 19 25 171 -139 318 -348 292 -284 79
4146 79 9 -286 -23 -299 399 -183 197 -66 43 -89 -150 36 -428 113 -176 9 -256 -7 11 -307 408
4167 408 -232 159 -410 271 -47 -14 -17 -157 278 -267 401 -331 97 -313 19 30 -58 340 -386 299 -208 236
4189 236 -7 118 119 -22 178 -228 346 -226 270 -19 95 97 -52 110 -265 380 -154 108 -142 131 210 -207
4211 -207 183 -182 300 -309 89 -110 80 91 -70 324 -195 98 -283 109 -99 -55 49 -112 418 -354 169
4232 169 -212 415 173 -22 46 -168 309 -292 243 -236 392 -106 -223 199 -156 131 -223 486 46 162
4252 162 -58 103 191 -178 340 -194 301 -218 156 -95 7 153 -70 138 -44 187 -244 208 -231 13
4272A3J60k85M53k48J61m79M40j61n2nj51L17m75P23o61N50q0k85N7l03O81o50
4294b80O05l38K05l56J87J69m46M64l69L17k18J84j40J56J60p76N13k62L50m19
4314b94L33k91N8K78l96M42k64L49l95K77j7j53J51l68O59n32L18l02K79q0j00
4335d8K71l65L89n02N13j75K6j62l11M56l58M71m42L54k73L89k33N4J93l72J74
4356D9j22N87o83K33R0l56K53n03Q67o29N10m32MJ68j50L98o53O57n35L36j72
4377h3J89r0n6K67m99L69k35K78m10K29J33l19N37o80O72p60M93j59J61j17k06
4398b86O28m92L22l75M96l12q0K11k69L57l77L00k22K95l93l0K86N6K17o30P02
4419D04m64K25l55K96J8k79M25m09M77n45L23j99J39K52k32J21m74O29n90M90
$$ plain form
4272 13 173 -112 341 93 254 -225 215 54 2 -3 -154 163 -312 411 -250 300 220 -65 -8 -311 370 -280
4294 -280 325 -13 192 -164 23 192 -254 210 -159 158 -60 124 -16 140 300 -476 37 -225 125 -294
4314 -294 39 -252 -194 84 -312 130 -134 215 -180 97 80 -73 78 -290 369 -163 155 -147 132 52 -48
4335 -48 223 -142 247 -255 258 83 109 -53 -364 92 -266 205 -237 117 -156 233 0 54 247 -125 49
4356 49 -73 514 -169 64 154 -202 51 -452 415 -214 296 -136 -132 36 -114 284 -369 288 -247 89 -83
4377 -83 106 16 -40 227 -272 97 -138 140 -270 -41 92 -227 310 -370 302 -458 35 -124 37 -80 -286
4398 -286 342 -150 172 -203 293 -19 -99 112 -157 200 -177 123 -99 196 -197 -227 59 115 332 -298 404
4419 404 -60 165 -190 106 124 -155 270 -139 338 -207 116 -83 56 308 76 197 -277 352 -238 252
4439B52k50J87j48j95M40m11M89l64K22l21K71k54K1L48n90N38m48L39j08j66
4459a48P3jJ79k72L87m44L24k53m6K41k20L37o97P52m91L59k63K5L28l83L65m30
4481b78P25p61L31K9J7O8m20N10l50K57r0J57j30N7l7k30L96m34M47m53J62J06
4503G9j54P2m9K16m94N04k94L31j73j86K16k58M45m89O39m56J91j19j32J26k69
4524b54M70m85N14l92Q2K4j4K53m50M29m69N72n41L49k39O0K91n74M12l10N21
4545B49k98K06r8j78O3j91M37m71L20l01O48m15l01L78k25L63m25O66l08j50J91
4566A60k06K60n6J54n66O18m60K35k05OK69k86L81m33M30k01j28q3K38j80j69
4587b22M43n89O24k85N4r2j68L93l65L27j61J22j11J2J68l81Q1p4M85m43K87k67
$$ plain form
4439 252 2 189 41 -154 286 -125 364 0 222 -99 172 -82 -61 287 -303 235 -213 126 18 -148
4459 -148 -75 -76 103 -169 218 -226 98 -155 -201 40 -180 157 -540 212 -279 80 -183 -158 170 -213 152 -278
4481 -278 447 -314 17 46 63 131 -289 221 -129 128 38 195 65 122 85 -145 251 -183 264 -189 -27 79
4503 79 -75 -3 -52 164 -330 174 -120 211 38 -148 68 -190 255 -234 405 -51 140 21 -111 15 -254
4524 -254 216 -269 245 -147 -65 -41 -55 198 -252 177 -292 280 -261 88 -151 -91 200 -374 38 -272 249
4545 249 -49 157 59 -119 -56 -247 190 -281 39 -262 386 -29 -330 48 -177 186 -239 427 119 -31 160
4566 160 -46 214 158 312 -254 364 -96 139 -66 -60 209 -77 304 -129 301 100 -28 -111 127 -53 -222
4587 -222 221 -368 256 -29 25 -67 -235 158 -207 120 -41 81 -30 -18 150 -231 -150 -224 261 -182 105 -162
4609a62L65j88j96L32l07J47l36L45o3J21l02Q8L04m03M60l35K98l42L83j21j90
4630a02J16j61K37j40L23m68K79J27l77L47m45M99m12O45l68p8O1k15M10m30N81
4651D29o57L93k59K02q5j27L52m12L56l48K40k54K47k5k83L93l28L07k47K17j17
4672fq7Q9k60L35p7K51m67L61j95J55O7k53K44n62O92k60r9M2j40L16l79M04l56
4695a85M65l66J17j33J15Nk35M14m37O35m14p0L02j69R1m84N99m03M60m68J72
4716A1m6j35K75l38O36o34M62m61M38k70r0L91n44M42l05M30l92L70j31j48J95
4737A56r3J57n86M07j39K91j70j44O29p80M02j25K11l01J95k9l2K81n53L28k79
4758a74M08l85j3K18j62O1j26L30m18M73k22L29k51k34M92n99L99l62L99l57J19
$$ plain form
4609 -162 203 15 -181 151 -156 -9 -345 0 -63 58 -244 -156 148 -255 205 -130 168 -174 209 88 -102
4630 -102 14 -147 90 -50 273 -195 84 211 -166 181 -264 235 -177 468 100 22 83 -132 278 -152 429
4651 429 -228 165 -94 108 23 -104 248 -164 192 -156 84 -170 77 52 -231 162 -166 141 -106 111 -6
4672 -6 -93 -4 -264 71 -6 245 -222 139 -56 99 166 -87 157 -405 287 27 -72 -30 -170 146 -233 171 -185
4695 -185 280 -86 31 -102 13 18 -217 197 -240 395 -19 -89 213 44 135 -349 250 -153 307 -161 11
4716 11 -35 -170 105 -233 403 -231 231 -230 208 -62 -152 239 -305 137 -168 262 -130 240 109 -39 156
4737 156 63 220 -366 41 -98 193 23 -121 508 -272 130 5 216 -85 110 81 49 330 -223 105 -174
4758 -174 234 -151 -164 54 -108 -47 -173 157 -261 212 -10 319 68 -166 326 -273 126 -236 163 -194 -75
4779g5Q5q1K35n84O24l94L39l09L39pk35L08m18M61m13J34M2K22l38l5L98m26
4801a28N25o96L95j44J30j60l1L16m50M82k92L41m68K53qk04M13o28M27l38K53
4822a2j68K69k16N7K59m41L01k31K89l41K75L4l26L36k72K88k20K75p1j37J79
4843A27l71L14j47L62n07J97l6m9L5J15K28m21N36l90K41k63r8K58m03O27o65
4864c10O05l43J77k16J73j46l0K82l37M36l99K53k98J41J80l68L05j43K54k85
4884f9J76j90j0J26l32N36l85M34m10J78l0j52K17l09M31m89N56m20O3L00l70
4905a49M18m34K86m22L34j60J22j12n5L22m02L70l76M94n48K15j7qL27n57N35
4926A83k37M47n67J24J80l9k2l18N67n74N38k78K31j56j49J99k62N59o69M48k48
$$ plain form
4779 -75 10 -71 164 -420 204 -190 149 -160 179 172 -63 245 -173 288 -125 9 51 273 -65 -100 298 -128
4801 -128 397 -299 96 -48 82 -78 -109 207 -243 239 -53 288 -180 73 65 -139 274 -354 73 -265 -12
4822 -12 -180 89 -127 -70 189 -252 49 -182 107 -234 41 75 -251 85 -187 101 -119 156 85 -52 127
4843 127 -244 70 -77 285 -222 -25 -61 -110 -75 40 268 -153 383 -7 234 -29 -127 131 -272 355 -310
4864 -310 295 -48 129 -87 86 -60 -90 192 -145 291 -108 145 -153 -12 168 -200 105 -38 216 -69
4884 -69 107 -83 -93 33 -299 237 -148 286 -124 54 24 -128 89 -220 211 -278 278 -142 -79 221 -149
4905 -149 269 -165 121 -301 33 -127 -5 -117 -172 150 -252 118 -258 236 -312 -97 -114 -122 205 -352 183
4926 183 -54 393 -174 -50 130 91 69 -249 318 -256 282 4 235 79 -70 129 -133 426 -243 205 -43
4947d3J77k02n7J98k66K46m19P13k98Kj05n7K73m44L41l85M59j86N8j43O1K38
4969A61l24M41n29K45l5R3k27Q5K47n74N51l49K52l62L39M1k98N24n69N24l39
4990a03J63k64J89J23l59J18j5M75n37M65l48L2L01n25N81m76L40m48M86k37j0
5011d9J66l00M17l64K94k90L68l68K37K1j49K94n19L61k81L82j48o7K1r7L19n20
5033b72N70n59K97p6J7J46l66K90l78N50m83M32m10L39N8m18L45m14N64m13M35
5054B54l93n8K17L8K01o52N74m16K13O6k21K32j76J58m66O76n02M29l70K06n7
5075d7o7J63k75J24M6L35m26J36J67k37L92m90K37J6J51k21RP1j67L25j69n9q4
5098g0K44j15j50J73j65K83l71L36k77K25K2j86L08o43P07n59L75k50K08l08J76
$$ plain form
4947 -43 134 -68 -125 73 -193 53 -366 347 49 51 -54 -111 162 -282 59 -326 133 -53 5 -138 -77 161
4969 161 -163 278 -251 -6 -41 52 -175 -90 157 -417 134 -215 37 -325 14 55 -243 281 -288 236 -103
4990 -103 60 -204 -15 108 -251 -133 -148 327 -210 255 -93 -61 240 -285 296 -180 160 -288 198 -39 -49
5011 -49 117 -183 234 -130 164 -126 242 -126 111 132 -17 277 -242 119 -162 220 72 5 26 -71 248 -272
5033 -272 298 -261 36 -40 -23 123 -243 47 -331 219 -264 168 -242 97 155 -263 82 -332 232 -181 254
5054 254 -139 -197 20 58 259 -393 181 -235 -22 44 -177 55 -121 37 -429 247 -255 174 -196 10 -47
5075 -47 -114 49 -226 -102 -56 279 -147 -11 156 -81 311 -179 58 74 225 4 13 84 -83 242 73 14 -70
5098 -70 174 59 -91 82 -83 200 -171 165 -112 113 135 -51 257 -386 321 -238 137 -113 95 -213 -37
5119c7L64p76O19l84M15l72M62j95m07M52k60P9k65M79j75N4N9l99L75KK10p04
5141d04N55k44L09k09J3J95m82M11n04M85j35l0no9J74j36K77n16K45p6J61J98
5163B13k86L20l93L22k31J45k41L44M0j90O9k73M03n29M47k68L34q9j15J94l05
5184h9L48o96M75Q7j71R8k63N60n56L62k67K98k74K9J20M3R8n85L66j9Q2j14K56
5207A88j91j78L91n31N18l11J49k62J91Q2l54M40k48K56m45L89k10J19m9j19K36
5228F1m52N95m60M82l21K7R0j53L30n28N70k51K70k94pK1j01L22m77N22k47J05
5250A04J01j88m9n5L89n75O72o14L47k19P0K07j00J75m46M83p20N22Kk31J93l79
5272c11L26k89N25k70P9q6q8m4Q1J99l63L45k44L09k94OK82m98M55m34N57n28
$$ plain form
5119 -37 327 -449 170 -214 201 -171 291 96 -311 141 -119 -40 -305 174 -1 53 112 -287 88 90 300 -404
5141 -404 151 -93 216 7 20 215 -267 144 -360 125 -10 -40 -45 -114 60 -76 201 -315 -70 -146 15 213
5163 213 -73 247 -146 176 -55 90 -151 193 233 43 112 -161 242 -287 160 -108 226 137 22 216 -89
5184 -89 259 -437 38 125 -46 52 -211 349 -207 155 -112 186 -88 -59 61 104 202 -383 -17 -36 46 -68 188
5207 188 -3 -181 210 -321 197 -114 35 -227 -36 46 -308 132 -116 140 -305 84 -126 -7 -56 -175 61
5228 61 -391 204 -256 226 -95 -68 22 -131 199 -329 241 -10 260 -34 -41 -20 -121 201 -276 246 -1 104
5250 104 205 17 -32 -87 302 -273 399 -215 132 -87 -17 190 90 265 -181 302 -418 104 106 -125 68 -311
5272 -311 15 -274 251 -19 60 -26 -114 -158 -77 122 -241 104 -140 169 -125 -119 163 -335 120 -314 243 -285
5294b85M15k44k03K79j68N77n52M92m93L74j77k34M14n15O64o55N93k67R2j70
5314f3j7M89n99L79l57M41k88O3k4K3K34m05L21k12K46l94Q7J22j77L37n13N60
5336B53m51K62j27J70l6p2J52r4K65n21L31k65J58L7m78N00k78K63k49L94m26
5357b12J83J30k46K95n82O31m53M63l04N4l8JN84n52J77m36M95k17J54m7P2K5
5379A77m07O22l97k0k9J98o5n9J95l43L30l46L43k49J41j01j72L69l09N87o17
5400a52K11j72Q7J36m04N11m08M84p38N42qj42J68l64L60k34L80m52K95n30N35
5421A05Q3k79L24n10O30l97N8m4j25L37m22N46p17P96o22L89q5j51K10k54L74
5442B46n51N47j79jj39Q1N8l79M75m13L92k06K63k25O0R2k37L35l75N79l83J75
$$ plain form
5294 -285 130 -114 -317 -38 -206 371 -181 311 -182 192 15 -219 195 -320 344 -311 282 15 107 -63
5314 -63 -80 409 -190 189 -168 273 -15 48 24 47 281 -124 197 -15 231 -163 -76 46 -131 206 -307 253
5336 253 -198 64 -63 107 71 -1 151 57 322 -199 132 -133 25 62 -416 84 -194 69 -180 214 -212
5357 -212 -29 101 -145 150 -432 199 -254 209 -95 -41 -79 -78 506 -46 131 -305 190 -27 127 80 152 177
5379 177 -230 392 -5 -25 -54 144 79 20 215 -128 202 -144 199 -50 91 -10 -182 187 -122 465 -152
5400 -152 59 -113 -26 110 -294 217 -191 293 -445 97 89 -53 115 -249 111 -123 257 -195 100 -430 105
5421 105 188 -91 233 -277 353 -44 14 -30 -155 182 -240 306 -411 385 -237 152 67 -84 126 -128 246
5442 246 -305 242 63 62 -77 4 62 -317 158 -255 137 -69 194 -31 29 121 -116 219 -156 423 40 215
5464B15k62J74O3l48M50n88N74l76L48k18QK7j59M95p14L42l32M82l4j80K43k93
5486h3K15m47O24m11M30k43l03L60m65M22l71N72k87K0k93O9K71l00K87k74M22
5507B15l18J9J38k21J81k27O14m65P0j24K71o9k94L56m10M59m21L34k12J52k00
5528a52r6L80k15K02k29K87q2N6j51k13M48l32J58j50M46o46L06N8k25M25l71
5549i6M40l18J2j05p6O3Q0K33k44J16k26L78l07J11m3k02K31l30N46m60J74j20
5571a43J95J87n26M99m08L97m23M35m89L21l3j98L49k52L13m73L01rk2j33k36
5592c48L91l08J51k88N01j62Q3J04m00L10l06N22n71L99j50J08jo2M05m20M73
5613D31m93L12n29L10L29o73K71k30N46k19l1K03j57j6j78K48l32M50l86K73j1
$$ plain form
5464 215 -47 127 190 -158 292 -296 278 -98 250 32 40 67 -92 403 -311 31 -301 181 147 -33 210 -83
5486 -83 132 -315 309 -102 328 85 -218 142 -323 99 -272 300 13 33 -260 -191 80 -220 67 -207 215
5507 215 -103 -84 54 -167 14 -213 401 -64 6 -118 153 84 -210 146 -264 195 -226 108 -104 48 -152
5528 -152 -248 132 -83 119 -110 177 95 151 0 -213 235 -97 61 -89 357 -289 17 75 -150 275 -96
5549 -96 344 26 38 -67 -143 -80 0 233 -11 105 -121 257 -50 61 18 -184 47 -283 263 -197 -23 -143
5571 -143 52 239 -287 212 -196 201 -222 213 -276 45 12 -186 163 -89 224 -249 52 43 21 -112 -348
5592 -348 43 -265 -114 -402 99 -63 20 124 -276 34 -272 250 -321 78 -72 36 35 -27 378 -42 431
5613 431 -62 250 -279 31 360 -313 -42 -272 274 55 24 227 70 54 -124 124 -208 242 -144 129 118
5634A18l77K32j47L37m10L74k11L6R8J73j90k21O86q54N12r1P0k79j03K36j33
5655a44L20m50L72k41j8J79n7J61j46J05m24O30o10L65j27o6J92j40K91r4L02
5676D00l97k3J94k82K05k64M16l55Qr2M68n8j64M6k10M14m50J66r8J31o0k5J39
5699A09k51L29l62L97l81L11k2PK24m63J05k60K49o9J88n7j05K26l36K40k27L31
5721A83l17J48J24k72M81p21M90j99K84l71J01J26j76K2j91M23j79J77k1o1Pr6
5743c8L33l04R6k86J68l3J99j14k40L51l12M54n33M44j16K7m6j92M49o08K83l16
5765c34M83k39J65P9q8L35m83J46k0K13k74KJ88j58j5k37J72r6M04l83K43O8k94
5788a23M36m60M13m35J46k03K15K43l15K24m08L97l10M31j96p9J83l34K67l37
$$ plain form
5634 118 -259 -27 -174 163 -247 127 -84 -48 50 223 33 -188 498 -356 156 65 135 -144 -247 -11 -144
5655 -144 176 -274 98 -143 -161 18 -39 122 -24 81 -343 287 -323 42 -85 -151 41 -99 192 98 400
5676 400 3 -20 174 -108 97 -167 249 -106 -98 -190 278 220 56 102 -108 306 -144 22 -76 55 -5 -30 109
5699 109 -142 187 -175 222 -159 152 130 137 361 -102 3 -257 -8 -77 111 54 -51 175 -161 79 -148 183
5721 183 -134 14 138 -134 347 -374 116 -83 201 -170 -69 57 -119 -97 -288 135 -44 133 112 51 58 -38
5743 -38 295 -9 87 -199 -31 -64 135 21 -219 132 -180 274 -259 185 69 96 50 -142 307 -301 -18 -334
5765 -334 149 -90 75 154 66 401 -82 64 44 257 -17 -15 173 15 0 -237 -65 -161 243 -140 103 171 -123
5788 -123 313 -147 266 -169 -23 -226 -11 232 -83 141 -267 130 -180 251 55 -24 159 -175 92 -245
5808b45K36j45K47k03j16K62j54L93o23M68r0J15j49m2J31m8M0m50N68l49K82
5829A28k36J0K52j69J23l38L20m14M87k96L4P4j7J29k53N58m78K16p7J02%j95
5851d0K72n33L15j75K03J78l21K47k81K90m68N82l37J81j12l22O43k35J61o40
5871c92M95k24k9J95q0M44p63M20l96O29m61L61l31J65Kl18N67l43L98m54K83
5892A68n0j64K55n36N23k07n1j27J5K16k59L83m59O98m50J57j77K13k8k9J33k58
5914c4K46n21M10o7N2j49M1K11l58K52l08K71j13J83j42n4K67l76M18n58L88p7
5936a8J00O6j00o9j33N95m59R2j14j5J3m9J33k97N31n26L34j07Q0j1k96L92k20
5959g8J84m65L37j38J04K16j12K81m02J87j64Jm5J47J8k7K06m55L94j64J83o6
$$ plain form
5808 -245 -9 -154 93 -110 -226 36 -118 275 -348 120 30 145 -4 -46 85 37 77 -373 195 -154 128
5829 128 -108 -98 154 -15 108 -230 90 -324 163 -133 -99 -25 -42 87 -166 392 -86 130 53 155 155 -40
5851 -40 232 -301 14 -161 42 220 -101 146 -135 155 -313 269 -68 113 1 -321 322 87 248 -392
5871 -392 103 -121 -150 45 -35 409 -354 66 -330 299 -162 199 -132 33 35 -283 284 -59 339 -115 168
5892 168 118 -46 209 -327 196 -11 -62 -189 -174 42 -217 166 -293 405 -45 112 -65 148 120 91 224 -34
5914 -34 212 -309 101 34 86 -63 -22 189 -169 83 -225 46 -67 116 -26 -80 187 -189 229 -329 59 -18
5936 -18 82 148 48 -21 -154 441 -18 74 -40 -55 -42 -91 42 -255 276 -250 84 -23 57 46 -250 142 -78
5959 -78 106 -359 -22 -160 -56 160 48 329 -73 114 -50 -49 -94 53 71 44 250 -205 189 25 208 142
5981A42k28J42K2K09n48M95l30L42l18L35j39j90J41k50J94o1J68k0j71L32l68
6002a01J72k12M96m96K01n0R6r1k32M05m32P12o45K73j47J40J4j05J97m50L74
6023A19l40J62n3N8K6j26L54m76M32k85R0j07P8K08j97L12l93J56j4P9l57L51
6045G7j4l55N00n77M40l77M22k02J8K97l81J71r5K09l84K96l2j10K93k67J37j41
6067g5K90k91K37j68L1M8l77N02l82M02l40J75j19l6L56l23M10m31J77k29N6L40
6089B53j11K2n20L56k29K98k26K98j86m6K46m45M01m17N98n01K39n1j59L13j21
6110A2L85n25L13k53jlJ71L7l14J60q1J98k7k07K49k90J35j08M68n53K76j28K85
6133A99m5m53M43n56O03k84K69j17n0J29m05L13p2L66m21K35j11j15J03j21Q8
$$ plain form
5981 142 -86 56 78 287 -261 234 -96 246 -72 263 124 -66 75 -175 19 -42 126 106 -65 267 -101
6002 -101 71 -141 355 -141 60 10 106 15 -217 188 -244 468 -177 96 -51 89 103 -2 195 -255 119
6023 119 -221 -59 -112 -54 -28 -154 200 -276 156 -129 -39 -146 -68 140 -57 255 -138 18 4 83 -274 77
6045 77 63 -292 208 -369 71 -306 116 -86 -68 229 -152 19 -76 133 -251 45 13 -97 196 -71 66 -75
6067 -75 215 -76 161 -7 24 72 -305 197 -185 217 -123 52 -67 -103 253 -70 340 -91 86 -143 -87 253
6089 253 142 164 -356 0 -229 69 -157 141 -45 -91 155 -290 111 -306 292 -209 30 -21 -180 133 12
6110 12 397 -128 185 -68 -69 -72 99 136 -178 -18 -99 99 72 -135 114 -176 -41 -149 319 -234 42 -86 199
6133 199 154 -299 144 -412 191 -93 176 59 9 138 -267 46 -26 340 -81 154 43 -72 31 -90 -2
6154bk50M70l84J38J8j89J33M5N9l3J02m13M21m05N26l11M6Q8k32M29k66k6n9
6177i5K06r0l27L15j70K94l66M38l75J76L58p18N28l53L51k19K0n4J0J86q8K40
6199B67m29N09n46N94n99L24j11l87P80n29L59m96K58J87k78J92j78J75k69J59
6219a8Q3Q8m2p0M8k50L21m03M72k83J89k50K51r6r7L91n88N04k87M10k47j61R2
6242E7j35L21l48L77l24K75J55l68K9j79L41m44K56j74J72K5j65J74m2J49j92
6263d0K09l13N3J0R1J26l53M97n52J89J20R1k23k51M50j20J10k27K70k33J28K8
6285F0k42M06l48J90j47K19k61Q2K83l17J69k29K03p8K61n02K24J05q8n4j38K38
6307C6k36M39k97J0K34k55K22l70M32l97K74k35J80J9j29J17k04L40m68L00j42
$$ plain form
6154 -2 -252 218 -166 -28 -10 -199 -66 -21 38 5 107 -306 115 -290 236 -75 -29 59 -173 256 -10 -36 -95
6177 -95 111 21 -306 9 -161 133 -233 205 -170 6 364 -354 174 -179 172 -47 -27 -81 -71 115 27 267
6199 267 -162 347 -199 395 -204 120 9 -378 402 -127 232 -264 -6 181 -97 95 -83 92 -177 -18
6219 -18 65 153 111 41 89 -161 160 -243 229 -54 135 -115 136 40 -57 334 -254 250 -37 373 126 -35 57
6242 57 -78 243 -105 272 -52 223 378 10 39 -140 201 -243 13 -161 11 36 -129 45 3 152 -40
6263 -40 169 -144 -91 -81 10 136 -217 280 -272 -83 37 128 -95 -346 104 -16 94 -133 137 -96 32 60
6285 60 -182 224 -124 66 -81 138 -123 -41 242 -75 94 -135 68 -10 251 -251 -27 78 -10 -64 -202 36
6307 36 -200 239 -58 -48 186 -69 153 -217 215 -182 92 -143 37 56 -73 44 -160 180 -288 12 -130
6328a30L23k34L6J55l87K74n09P16k26l8j93K07M7l78M56l26K57k42K75k6j05
6349d8M27o96N80n51K99N6O0J4k64%q1L73k20K53k23R0J79m59M50l32K38j67L34
6372C12m11J80M1k31Q4O6K03l03K00j74q0J70q3J15l45N66k68K22k00k60M49l06
6394e3J91n16M75k20J81j5j28J14k98L42l82L29k02L83l74J19J97m37M81j63M8
6415G2m41K33M6j8J78l15M46k34J19k49N1J37j21J63j50J02jK05l96K48O2j01
6437C6k1j69J87j83N46l10M2q3j05J53j67K83m05N29m33K15l0r2K53l50L34m15
6459a85J71l26L75m3r0K13j22J64l40L70k17p7K04q6O4k33M33n40L23Mj51J83
6481I4j07M7k98N60n40J37J05O6n5j9K39l41J29k04L59j42j6N2k33K71k45L72
$$ plain form
6328 -130 193 -41 -5 150 -237 37 -472 244 18 -20 -213 -6 41 -337 119 -207 50 -192 83 57 -48
6349 -48 379 -317 263 -288 11 67 127 141 -123 -123 -204 169 -51 202 -21 69 248 -211 239 -93 145 -22 312
6372 312 -99 81 122 -109 -25 41 244 -59 141 -33 -113 57 -26 89 -256 310 42 264 64 -196 253 -53
6394 -53 138 -378 97 -123 58 43 -85 29 -269 73 -309 20 -182 201 -173 -54 143 -294 187 24 72
6415 72 -369 -136 -90 -108 70 -245 201 -33 86 -163 -112 25 -96 67 -83 19 18 223 -173 75 137 36
6437 36 15 -154 33 -150 396 86 128 45 -60 93 -74 209 -196 333 -100 115 85 -7 246 -104 230 -185
6459 -185 -14 -340 35 -8 -98 115 -7 157 -183 187 -30 -107 97 11 75 -158 275 -265 58 62 -89 94
6481 94 -13 34 -264 296 -244 -107 -2 64 9 -10 229 -112 17 -187 172 30 14 66 -167 104 -141 231
6503B31l11L35l07J35m2J7J57l52J89j90M29m54K45K04k39p1J11L4r8R2j11j65
6525a61K23j62O0j8K61l52K24k7L0R4l98K11q8M03l89K68j91q2J49j20K73l73
6547a65K36l78M69k38k0L8k1K90m71M32m20L44j43J90Nk46K77l59M02l82K01l15
6569b74K36J06j5K95m84L33l51K34q0R4R4k79K89l00J70k35L47j67m5K28l57L87
6591B26l67L54k29J58j85j42R3l7K67m34K93k79L83j75pJ96k32K18l92M26k33
6612i8K3N3k7Rk05L39k15L12k24k5KP8j3m3K00l74K91k05J99j04j03L4M9L32m68
6637a83K52k82M01k72j08M63n11N81m65K71j94J58k05O7Q4q3J40j97J60k62M39
6658B54k03j11J13j61K65n2Mj05j93L03l44L57k29J69k69L15k31K23k40P5J93
$$ plain form
6503 231 -80 255 -52 83 41 58 215 -137 52 -138 291 -163 82 286 47 -24 87 121 23 115 4 -161
6525 -161 62 -100 -40 -58 203 -149 75 48 78 172 -226 -15 -103 300 -89 179 -12 -94 55 -65 208 -165
6547 -165 71 -307 162 -76 -96 -58 -79 211 -260 172 -248 96 -47 143 148 -98 179 -180 222 -160 41 -274
6569 -274 -38 68 53 348 -136 197 -154 80 0 94 188 -91 198 -102 68 -167 180 13 -32 196 -161 226
6591 226 -141 213 -16 142 -43 -185 -92 -129 138 -296 -3 -282 101 -74 -81 115 -117 101 -291 135 -98
6612 -98 -75 -22 -49 -40 -245 94 -121 191 -33 -58 -56 22 9 -34 166 -208 83 -122 77 -27 -130 -96 -47 285 -183
6637 -183 69 -213 188 -84 -192 271 -240 341 -124 147 -47 111 -94 -27 57 -26 114 -83 77 -185 254
6658 254 51 -60 53 -108 157 105 109 4 -189 114 -230 127 -102 67 -202 113 -118 105 -135 -60 133
6679A33l80K89j37K83l03J58M0k77L23j81J23l02L11k08O6O9n0J21JJ42m26K84
6701G9l8Orl69L55j80L03k34m6r0J17L70j64R8k26O3j1J27k57J66n9m7L13m13
6725a46K89l12K09n4Q3J46l26N0M9K91l46O3j09n9K26j07K02l41M15j30j22j38
6747a67J64r9j82N45n05L49k78M50l57N3Qj78M55l47J27r7L05l98Q1L00r2L4p5
6770I6Ok23K25M9j53J22k46K57k17K50l92M45l21J4J98k87K10j78L32j97P6j00
6792c4J39j63j72L84k89K83j91Q0j9m1j08J11L09l72J80l25L02O1k18L53l18J69
6814A21j10K06l17L01ok72N0k01L62j12J53l21J40nk27M71j78J65m63M21k32J48
6836I4r1j11J12j60M05n10L77j41QJ03n3L6l2R7j32N8k85K11l3r3K78k04K81k66
$$ plain form
6679 133 -247 42 -95 188 -115 43 83 -194 129 -52 71 -231 80 -128 -62 7 -43 78 79 221 -205 79
6701 79 41 47 38 -331 24 -156 147 -87 -133 -223 -106 264 100 198 -28 35 24 151 -106 60 1 -46 267 -146
6725 -146 143 -169 40 -14 69 215 -111 -61 -12 279 -67 -4 -113 -172 54 -53 149 -192 223 93 -29 -167
6747 -167 -3 -102 -284 261 -244 105 -173 277 -80 -27 -19 -197 258 -89 38 -59 246 -152 -71 229 137 171 96
6770 96 102 -121 104 153 0 122 -124 133 -84 166 -226 219 -102 -88 110 -177 33 -145 187 -10 66 -34
6792 -34 105 -58 -230 154 -135 148 -43 37 18 -23 -131 -20 289 -83 97 -228 74 135 -83 270 -48 121
6814 121 11 217 -100 201 195 -77 -27 -228 134 22 175 -146 -6 -11 -238 233 55 220 -243 178 -54 94
6836 94 3 -108 4 -156 249 -261 116 -25 -17 86 33 69 37 134 2 60 -225 -14 -47 -140 138 -66 215 -51
6860e1K36l50J95m0o4J27k45J50r7L46k34K6n0J23r0J28R4l19J98l13J93J53k27
6883a11K77k82M51m97J87p0j39J28j03L31j82L47o28M76n7p9j27j11L39l41K86
6904I5j73K32j19J71j50j91K22j78M6J14N4qj78R9L6L3j97K32j71N1J3j09J80
6927A04k32J86k44K25M7j04j9p2M4j11L17k34K35k82L05l86M30k42j5K92j93r6
6949d5L3K93m63P5n7P4J68k37K21N8k50L4K79l37J34K99m34K51j61L7q4J23K24
6972B35k12Q6k33J03j61K63q6J7Q1j37J43k54J89nJ1O8j78K3j10J26k0J90k85
6995a46J77j00l5P2r5K98k78Q1j26J46q6K24k32l64P25n26M77k93J49M0k1k0k35
7018a68L19k76J09n5o7L9K44J25k56K03m41L41k88K61p2n6J96o9J12k78K50k60
$$ plain form
6860 -51 185 -165 30 -10 -74 53 -192 -42 -139 207 -27 -1 -51 72 -18 110 204 -115 83 -230 -37 116 -111
6883 -111 166 -116 335 -162 25 -45 -184 -56 -159 172 -10 337 -291 185 128 49 -78 -189 150 -191 95
6904 95 -78 154 35 206 56 -135 87 -91 -45 69 123 115 -63 36 72 105 -92 140 -31 20 33 -76 104
6927 104 -128 58 -186 39 86 -18 -37 -109 -65 -176 141 -93 142 -140 165 -221 209 -33 -48 244 51 -45
6949 -45 -12 281 -182 -107 -164 -90 78 -159 62 120 -130 -96 183 -154 -20 279 -155 96 -65 -28 -112 11 235
6972 235 23 109 -124 -21 -182 81 -5 12 93 -44 99 -155 34 29 40 108 -70 -47 -157 -31 -51 139 -146
6995 -146 31 -69 -104 -32 -127 171 -107 -26 -152 -6 -92 132 -100 -464 261 -265 212 -81 68 108 87 67 -168
7018 -168 151 -125 -16 -71 -138 -99 145 270 14 217 -224 117 -171 90 18 -38 158 89 201 -77 173 -87
7040h7P6N2o0O9k23L71k48O1r8Q5k27J54J37j35J54j74J06K03q8k07k7O5Pn7k7
7065a18J48l0p0p0L8K30l00L59l87K77r5J95o3L1o0l22L16l90N01k27j19R9P7
7088B0J15m65M66j74J67j77O0K9j44K09j66L45n35L43k47K10k8j32P3m3K86k17
7110eK00l04o6K76j41KK5R6k13M11j64j20K33k61J88m40L90j09J60j77MK35k37
7133a7n4j02J87j49J55q4N4O0k49M08l98M69n63J61R1K16k37j7N5k10L93l94J79
7156d6m7j35O9J65J45j97P5R5m2k91K01O5l12L49j72K43m18N07j04j77o6J33N3
7179I3j71J30r2K08J0k06K06j40L2l10L84k50K22j06j0K9k14M13k18K27l19J55
7201G3Q8k12J71j98K06r6J01l46L89j01k6J90l16Q9l18M06m9J74m43L9kp5K28
$$ plain form
7040 -87 -11 41 -19 50 -173 198 -50 11 -87 -2 -229 -75 62 -73 81 -93 13 216 128 -79 -106 -41 -34 -91 -118
7065 -118 30 0 -70 -140 -102 128 -172 187 -200 77 -18 177 114 145 85 -237 79 -311 190 -37 -156 -57 20
7088 20 135 -330 136 -38 129 -48 12 41 -103 106 -60 285 -250 93 -154 56 28 -104 -31 -74 212 -5
7110 -5 195 -109 -175 101 -40 -38 -13 83 -130 281 117 -3 230 -31 157 -283 107 -2 158 -19 -15 220 -17
7133 -17 -71 -173 14 -135 20 -64 -10 50 -199 209 -189 280 -283 -122 -31 185 -52 -69 -14 -224 169 -225 -46
7156 -46 -93 -228 -159 6 151 -46 29 124 82 -209 -8 57 -255 94 -78 165 -253 254 150 -27 -93 40 93
7179 93 -78 52 -40 168 178 -28 178 38 70 -240 144 -106 116 10 0 29 -185 228 10 237 -82 73
7201 73 161 -51 120 -78 128 32 133 -213 176 75 49 239 -77 12 -306 100 51 225 -218 -179 -181 -256 -28
7224b8o5M4M0M3j10j33K51L2J12j85P5o2j35K59k45J08m1J07k30K5L0L4P9r4K08
7249A19k67J40N9K5k49K79j69K9L26o26N05j29J16m49L52J8K8j01j40J40k49L73
7271A30j66J37o2j9K10l56M05m51J22pJ05J28m44K58j50L74k48J87l07K16p8j19
7293a35M13m22L07m19K89j31O6J40m1l6k69L99k45K66k78J03Jj40J78J6N5k92
7315a75J46j43J56nO6R8k62J61j76K75j91Pj01K49l1j83J29K8O2k8j77J80k16
7338a31J98k29K25n0M0k41K35L4k13L47l22O0Q4O8k58R1j4J23J67l78L62l46M65
7361C17l24R1p3LJ7r6J15j57K53J9r5j6k6J02k43J98q7j10J30j70K27j79K20j78
7385f2m3p7M38j68j56K04j12J21k92K33l10K34N8O3n4q2J88j21o7j01J00M9N8
$$ plain form
7224 -28 -93 -49 -9 34 -76 -209 42 74 186 1 76 14 -121 138 -107 1 -40 67 -163 -138 -108 -74 5 -89 119
7249 119 -148 -8 51 76 -173 106 -63 -34 292 -334 171 42 158 -291 61 79 107 6 -134 6 -243 130
7271 130 -36 101 39 20 230 -126 279 -172 -50 -57 48 176 -268 -10 -160 214 -34 153 -154 62 -16 -135
7293 -135 278 -144 163 -256 33 -98 -32 108 67 31 -238 161 -84 182 -96 7 8 -132 46 62 117 -175
7315 -175 -29 -172 -16 -21 45 143 -119 42 -134 141 -50 -43 -144 105 74 -109 20 48 110 82 -95 85 -131
7338 -131 67 -162 63 13 53 -188 47 81 -132 215 -107 -47 37 105 -153 -62 -76 47 214 -164 198 -148 317
7361 317 -7 84 11 14 31 -65 50 -107 146 165 70 54 28 130 -113 85 -2 -112 18 -152 75 -104 116 -62
7385 -62 -105 -182 256 88 -68 136 24 145 -147 86 -224 10 68 131 77 -5 183 62 -5 -106 -6 43 101
7408A01Q4j70K31l94J03k15L22j5K8j3j58K60k84L88k16r4oQK25l33K97r7k34
7431a82M4J52j08k3K52j75J22k35J11m6pl3K01K25m72K32j47K35k27m5J61lm8
7454a6J8J92m78L66n1R7p5j75J99j77J45k02L25k30l9L37k73mQ9j7n1J20j89R9
7478A0J52j74j05k1J15P4mj40M8K1J05j93O7J26rR9j38j71K83l4J67k44J28l54
7502a92J77J05j06L4pJ71m47L12j46L3J1j1m7L3N0r4J21J4J09l99L63o6j47q5
7526b14O4M22l66K28j5j23O0j22J70j79O6j8Q2n0j8J58j34P4q5k32R9L6J73n1
7550B5N4j14J89k25J36M8Lk93M11k90j35M07l22J08k70M88l23j3J15l4J05r8Q0
7573E2j32j7J47j19K03n5K2j18J35k09l7J54j24K27k53J27M1j3k82K75n7o6K56
$$ plain form
7408 101 185 15 246 -148 -45 -260 62 47 75 62 -96 164 -120 268 52 -42 -48 -40 185 -148 149 52 -182
7431 -182 -138 14 -94 -117 135 -40 82 -153 -42 -88 -95 -128 73 298 -174 58 -89 146 -81 -126 35 32 -16
7454 -16 2 194 -284 82 31 128 53 -122 77 -100 45 -157 168 -62 -101 236 -37 -41 48 31 -20 100 -89 10
7478 10 162 -12 -117 -138 -23 51 47 -93 -45 -24 81 -112 -45 81 72 171 33 -138 145 111 278 34 162 -192
7502 -192 -15 90 -16 18 11 182 -265 47 -99 -66 -55 -66 -113 -80 -30 -124 -3 11 120 -279 84 18 -129 -214
7526 -214 -150 272 -94 134 119 -4 56 -66 104 -75 -9 -27 55 5 -13 145 11 85 0 -232 -133 -97 76 25
7550 25 79 -35 154 -71 65 113 116 -177 234 -56 -191 216 -106 2 -268 220 -103 -116 -1 -35 70 -28 52
7573 52 -80 -97 50 -69 134 79 101 -17 118 -91 -128 26 -98 129 -124 3 44 31 -251 24 -33 -99 157
7596A57j96K10j87J36j57J91L1k57K60k17K24l53K04j82K06pJJ4r2lp1m4m6J46
7620c2J64j21O3Pl7j55K7JJ04J36j68j3pj7j58J99j37o0J83m7k5m4K56j93J35
7645F1n8J39Jk75L44j42K9k53J61j20Q2K29j90n3Q8k3j46J37q4P4j54Q5J45k77
7669b00O23n65MM3J78j8j13J00k13R4J24M1j6K6r8PP2l14K34j34K62j44m6K17
7693A64j06N7o2J33l06J73K25j92K1q2L0l20K81q2J97j22j08L10l81J78p8K14
7715A44j78J13n5j17LR9J71k94J99k96K05N1j27RP9L05m36K94k45J71k03L23k15
7738@j96J56j3J22JL4j38Q2L8K9L14n76j5K42k9j53J31j24j13J04J15p5q0K95
7762A51j54R6K7j70R3R1J0j28j4J48j85J04M8j67j59K53J02O4n8k16J66j05R5
$$ plain form
7596 157 -39 171 -16 120 -37 154 185 -72 188 -29 195 -158 46 -136 70 63 64 78 -14 -17 -88 -132 -178 -32
7620 -32 132 11 74 81 44 -111 -84 -83 21 157 -11 -24 -31 -48 -206 -7 -144 -204 -21 -68 -93 -137 119 -74 61
7645 61 3 142 143 -132 212 70 99 -154 7 -113 -31 198 8 -45 43 20 -126 11 -73 1 -153 -68 77 -200
7669 -200 423 -142 -138 -95 83 65 -48 52 -161 -67 57 98 82 108 10 17 89 -225 9 -125 137 -7 -53 164
7693 164 58 115 53 186 -120 53 278 86 107 25 55 -265 16 -66 131 9 -99 211 -170 8 -70 144
7715 144 -34 79 24 -93 -90 9 180 -114 85 -211 -6 45 -82 -73 6 311 -125 169 -76 95 -108 215 0
7738 0 -196 -40 -53 69 70 104 -34 48 86 115 429 -147 -162 80 51 -102 29 -95 -208 -104 11 -64 -144 151
7762 151 -3 93 120 -50 43 134 144 16 2 150 -35 69 117 -50 -209 44 146 210 152 -64 102 -3 92
7785I2k17K75k43J51Q5l21J97K4J37r1j65k13L61p1K33K1j40Nk04J06KJ98l09
7808h7M2j28K31j92k4J94j50J56Q2j73K83m04K78O2k73q3J31Kj30L71j20qo3J17
7832A14r6o5J09k31L47k49K80k19R4j64N9J43k80K59k81J95l9J14j76J14j04J06
7854C0q9J40l5K9j59J71j50J36j5L8j32N3j93K02j30K50J31m99L51k46L82k29
7876C6K39n19J31J59j02p4rK47k24M9k8J13j25J92j91KL17m27J60J3j0N7k12L41
7900A35k02K73j37J09k93L7K44k42R0l3p6J05Qj78K56j89J07K98n21L24l34K07
7922a2K86j31j13p7Pj53K25j10J84K29k13N4j90K2J40L7k0j22k29K85j36j21J97
7945C9j65K63j28j18P9n7J67k16N19m57J85k20K05r2RL4p4M5q0o1J67j27J90k27
$$ plain form
7785 92 -125 150 -93 58 143 -178 19 43 180 89 -76 -289 72 1 234 255 115 120 -84 22 24 222 -87
7808 -87 -45 -173 58 -134 -158 36 -114 42 124 -49 234 -170 108 170 -103 -186 -55 -53 -183 188 68 60 -3 114
7832 114 18 -47 62 -169 178 -71 209 -10 84 -80 -21 122 -158 101 -180 15 -24 90 -86 28 -76 30
7854 30 -59 81 46 75 -84 87 -63 73 58 96 -36 17 -176 26 -104 146 277 -222 129 -117 265 36
7876 36 275 -244 -113 46 -56 -130 -139 108 -116 -67 -95 18 -107 85 -106 -104 213 -214 -54 -41 -51 6 -206 135
7900 135 -67 206 69 178 -115 -78 166 -76 14 -19 -95 10 18 -160 96 -93 14 312 -209 115 -219 -12
7922 -12 274 143 30 -47 -40 -193 32 -78 106 335 122 176 -14 8 148 185 165 43 -186 99 -37 -158 39
7945 39 -126 137 9 -109 -30 -87 80 -136 383 -74 111 -109 96 4 13 47 -27 18 -62 -123 44 -83 107 -120
7969a20J28q5J97j62K33k61J05k7K2J09k09K31l25L20j06j20J8j62J95L6J10l05
7991a78L05n0Rr7O5P4j45J98j69j06o7J99j02K00j44o3P1p0K38j32K7p2NJ34j69
8016c9P4l56L83OJ33k57J06P7j43%m6m1j39L73j15KJ24k19J24M4R6j67o9O0j14
8041a03K43j54J41l62K62p9J65k39J01J04j58K36r1o2j02j5J12m4J74l35O37o04
8063a73K83j97K75j86m5J52j93L49k87J90k39J44j92K73nj66J67j32m8l8J69q5
8085A6LR7j03J2j34Q4NN0j82K35O1k54J37qK1j11J28o1J43q9j83L43k56K00l07
8110a53J98j05O6J66l23M4k3J74q9K01n2j41J52l69K96j39M0oP4m8L0r3O6J74
8134A40k75J96j06N2J61l3p8j71K37k20J02j31O4O4L2J45k67K29j70J04j34M1
$$ plain form
7969 -120 8 -77 120 -42 191 -70 35 8 30 139 -70 161 -164 156 50 -70 -52 -214 -19 17 127 -178
7991 -178 127 77 86 -11 54 128 -17 181 12 -94 -161 38 -64 136 -8 -71 0 -70 168 36 63 -9 -4 130 -39
8016 -39 35 -321 62 68 201 -56 50 127 -16 -16 -62 -103 -242 131 16 18 142 -77 47 91 187 20 -49 11 -103
8041 -103 140 -14 127 -235 27 -52 113 -126 -25 79 -79 157 66 4 -98 -113 -1 -45 129 -206 431 -173
8063 -173 110 -87 188 2 -43 109 -84 265 -22 168 -71 73 -119 154 149 -17 150 18 -30 -68 101 16
8085 16 19 116 13 25 -109 -25 -20 30 -152 83 144 -110 27 19 40 -71 57 -4 139 50 -133 210 -46 154 -153
8110 -153 45 -60 6 172 -151 -107 -130 44 -45 156 104 -37 115 -254 42 -97 -57 -63 11 -37 -7 -100 -34 140
8134 140 -135 61 -45 7 168 135 57 -114 123 -97 5 -126 -62 2 34 179 -88 141 -29 75 -59 -18
8156a8L1q7L3j68N03o03K41K31k4k7nK1j07K16k97pK96k93N6rJ48l66K53m2k6
8181e0K8p0M37k23j61j13L21j26n7j
$$ plain form
8156 -18 13 -74 -41 -209 294 -309 -68 163 139 112 107 128 21 237 -60 -67 229 -64 -8 -17 131 -235 18 -24 -50
8181 -50 -22 -92 345 122 -39 -152 169 43 -14 -15
8191a5
$$ Imaginary data points
##PAGE= N=2
##DATA TABLE= (X++(I..I)), XYDATA
0@%%%%%%%%%%%Kj0J6j6J6k4L2m0M8n6O5p3Q8j04J22j46J69j93K24k57K91l30L75
34A99m23M77n36O00o70P46q32R25j027J138j257J387j530J687j857K044k252K481
52A300k733L013l328L683m082M539n071N692o431P332q454R899j1831J4557j8724
67a0639K5947m1904J36145j0831k03847J26432K774N0503o8039m7062O0670N3264
79G3413p0120K708k1954O0004l046r8137R0163R124l7693k7352L9837J5646l4586
92a993k037j5153O4720m2349j0277q65K2479M865m6598K5912K4176k1269k9669
105b8058N0418l1450K6094k7970l3449Q2287l7579n920k5995L9717K2537n4666
117b4034k912L8592r936k0848L0895l3698L9612k2706j3215J6682J583J4032m9924
$$ plain form
0 0 0 0 0 0 0 0 0 0 0 0 0 2 -8 8 -8 8 -16 16 -24 24 -32 33 -40 48 -56 66 -80 89 -104 120 -137 154 -176 199
34 199 -224 253 -283 317 -353 393 -439 486 -541 597 -660 727 -803 884 -973 1071 -1181 1300
52 1300 -1433 1580 -1748 1935 -2147 2392 -2679 3013 -3418 3914 -4540 5359 -6472 8085 -10639
67 -10639 15308 -26596 109549 98718 -105129 21303 24077 74580 6541 -40521 20149 73413
79 73413 3293 6001 -15953 44051 41005 -57132 33031 42155 4462 -22890 16947 32593 -1993
92 -1993 -4030 -19183 45537 3188 -7089 -7954 14525 19390 -27208 -1296 22880 1611 -28058
105 -28058 22360 -9090 17004 -10966 -44415 37872 293 -5627 -31622 8095 30632 -24034
117 -24034 -26946 11646 1710 -19138 11757 -21941 17671 -5035 -18250 -1568 15 14047 -35877
130c5877M6056P182j8818k4013K9507J3885l3317J8885j1918K0944r070k115j7554
143a6223K9420l026l1149K8869m428J9148m7081K5376J4873j7353L437j9008K6672
156I527L808m789l2718L2628M131j3094j1121O493K9894m0860K4965j3996P786
169B654L230j7409O450J1449J0038m2585L0518N595l234k7652R265L1171k3856
182d366L357j3380K1326n530L221k8897J9608L0145m3470J2105K017K1896k8488
195a0456l507J4263M187J532j8478J1254j014K4634m1337P220K4048q633n419
208a706r276K5252j9264J2093j4672P643N401o885L017p256K6812l0676L827R316
222C626Q729j8211k682J9824j0778J1249k3718J6111n201J0409j1999j1051L5589
$$ plain form
130 -35877 10179 17361 -1457 -25470 4037 17922 -15395 3490 -8428 12516 3446 1331 -16223
143 -16223 13197 10171 -20978 7891 3463 22611 -24470 906 15779 -1574 1863 -17145 9527
156 9527 13335 8546 -24172 8456 12587 -507 -11628 -5135 24759 -16101 8864 -5132 2654
169 2654 5884 -11525 -5075 6374 16412 -26173 4345 9940 6706 -20946 -11681 19490 -4366
182 -4366 -1009 -14389 6937 1407 4628 -24269 -4661 25484 -17986 -5881 -3864 18032 -10456
195 -10456 -13963 300 4487 6019 -12459 -1205 -2219 22415 -18922 -11702 12346 3713 -1706
208 -1706 -10982 14270 -4994 7099 -7573 70 5471 -1414 1603 -5653 21159 -9517 -5690 3626
222 3626 12355 -5856 -8538 11286 508 11757 -11961 4150 -1051 9358 -2641 -13692 21897
235B1897k2148m559j93J9102j9015J364J849K835J1637k1542J0670j1095K4513
248A5315k0121q568J7814J002k082j7500K4196j7657Q916n007l01O078k769J715
262A031j2743K4152j9574O13p00J7373r234j4597K1826j5454J5092j6228M062
275d381L114O322m500j2095J8725n285k069j5723K8716j4638k650P380r654J8943
289A2205j8121N885q427J7191n614j0751P260N999J625k1252K3231j3618O455
302B068l078L34N240n172N777j8566K4461j1890k072k009R244M956j8676J1575
316B192o141R393j0950P557q459J1421K987k1954J8881p471P328j5670J3070J925
330D109q314O278p035P519p267R033j6462J7430j263q716L942l471J3108k1517
$$ plain form
235 21897 -251 -4810 -5003 14099 -4916 -3552 -1703 1132 12769 -8773 1897 -9198 15315
248 15315 -4806 -13374 4440 5442 3360 -14140 10056 -7601 1315 -3692 -3993 2085 -684 1031
262 1031 -11712 12440 -7134 -6521 -7221 10152 918 -13679 8147 -7307 7785 -8443 -4381
275 -4381 -1267 5055 555 -11540 7185 1900 -169 -15892 12824 -1814 -4464 2916 -6738 12205
289 12205 -5916 -31 -8458 8733 3119 -7632 -372 5627 7252 -14000 9231 -4387 2068
302 2068 -1010 -676 4564 -608 5169 -13397 11064 -826 -2898 -4907 4337 9293 -9383 2192
316 2192 -3949 5444 -5506 2051 -6408 5013 8000 -13954 4927 -2544 4784 -10886 2184 4109
330 4109 -4205 2073 -4962 2557 -4710 4323 -12139 5291 4028 -4688 -746 -4217 8891 -12626
344a2626J6181n479J984Q48k385K941n668J1028j7924J4249j347K047q938O139
358A050P494j6537J3291j1974J3884p583L961l491k226J3554j6674N300o18J0350
372I781j4044Q213p65l225N719j0767J1541j1583J6050j3745J184R784q415J599
386A327n303J1987j2123Q445n111M244l155j05L290j1580J9281j7007N862Q89
400I41L064n346l937J1525j2196R649r802R052m352L373l377o280J2607q104L099
415h4r201J7985j3400J717M931r790J1792j0331P459o766R910n556k923K780J904
430D27J51j0866J7953j3661Q799m088j875M368m050N793j2288J4299o236J763
444D89m747O453j835p929J2426j0533R189p212N072n331N740m27j1526J3410n662
$$ plain form
344 -12626 3555 -1924 60 908 -1477 1464 -4204 6824 -11100 3149 1802 3849 -5089 1050
358 1050 8544 -7993 5298 -6676 7208 -375 3586 95 -2131 11423 -5251 49 -569 9781
372 9781 -4263 3950 3185 -40 5679 -5088 6453 -5130 10920 -2825 -1641 8143 -272 1327
386 1327 -3976 8011 -4112 4333 -778 3466 311 206 3496 -8084 11197 -5810 52 941
400 941 4005 -1341 -5278 6247 -5949 3700 -6102 2950 -1402 1971 -1406 -7686 4921 -3183 -84
415 -84 -9285 8700 -4700 -2983 1948 -7842 3950 -6381 1078 -5688 4222 -1334 -4257 -1477 427
430 427 578 -10288 7665 -5996 2803 -1285 -3160 1208 -2842 2951 -9337 4962 -1274 489
444 489 -4258 2195 360 -7569 4857 -5676 3513 -3699 1373 -3958 1782 1355 -10171 3239 -2423
459b423O264j2671J1729k835l690L963o715Q195m666O621j2941J2940l592n485
473e306L273j272Q432j4228J2338o575M463k493l058J391N56R261j7472J2179
487A489j852K613p379K194N490p877R391r159Q791m812L696p961N401P954j5267
502g288Q785j425R173j3544M177K769r98K291p791Q402l792R438j6458P494O778
517H011p860n70R8J2119j4341O898n658P177j430o146L423j907J4105j7544L174
532d51M327L935j0485J659Q210p515P541j2374J1333m180K58m522o90J5028j3572
547a498k141K361J2390j5092P18L335J731L826j2835R243l583R377j4806J059
561e915J2135m451n577l257J7548j2376j85l655Q288J714p406R71j759J5344j6205
$$ plain form
459 -2423 3841 -8830 2899 64 -3626 337 -6378 1817 -2849 3772 -9169 3771 179 -5306
473 -5306 -2033 -3305 5127 -9101 3237 -3338 1125 -1368 -4426 -3035 -2479 6782 -10690 1489
487 1489 -363 2250 -5129 -2935 2555 -5322 4069 -5090 3701 -1111 2585 -5376 25 7979 -7288
502 -7288 1497 72 9245 -4299 -122 2647 1649 3940 -3851 4551 759 10197 -6261 1233 8011
517 8011 151 -419 -321 11798 -2543 4355 -1303 5874 4444 -1702 1721 -186 13919 -3625 -451
532 -451 3876 7811 -2674 -1015 7195 -320 7221 -5153 6180 2000 2258 -2264 -2954 12074 -1498
547 -1498 -3639 -1278 11112 -3980 -3262 73 1804 5630 -7205 2038 -1545 7832 -6974 -5915
561 -5915 6220 1769 -3808 -7065 10483 -1893 -2078 -5733 2555 4269 -3137 -2166 -3925 11419 -4786
576d786O49K372Q708q198o612J5447q491M263r086P418K28K36o129L33J3751r906
592A97k651n121J8947j1311o135O925l14P675j3100L898q44R337j0184l190R688
607C817J370n007r701J8497r147l75m773N982N521q294J775o009J5321j0657l526
622e206K583Q605m583r652J2014m062K285j0182R437r52J384l089o740J6226q766
637f98k351n832J4684k687q735M166J389M865j0628N584m843J1454p312n466R408
652B998j04Kj4532J6417j457l813l644L776N652n203K91p796J4675o064k801j694
668c297Q462N60j4050J1611j832L103j0370O354L640p93k275r424J4194j311k908
683A664j1258J4080K366q114l56j348J0684j0951M454n458Q256M14r295L942K995
$$ plain form
576 -4786 -4137 -1765 6943 -1255 -7867 7580 -911 3352 -5734 1684 1912 2148 -3981 -3648 10103 197
592 197 -2454 -7575 11372 61 -6074 851 537 8212 -4888 -990 -1834 7503 -2681 -5871 3817
607 3817 5187 180 -9521 8976 -171 -546 -5319 663 6184 -2110 -335 -6344 8977 -1680 -5206
622 -5206 -2623 5982 1399 -8253 3761 -301 1984 -8198 1239 287 1671 -1418 -8158 8068 -698
637 -698 -3049 -8881 5803 3116 -5619 -1453 -64 4801 -5827 -243 -5086 6368 -944 -6410 2998
652 2998 2894 2896 -11636 4781 3324 -489 -4133 -357 5295 92 383 -7413 7262 1198 -1603 -3297
668 -3297 5165 5725 -8325 3286 1454 4557 -5813 541 4181 3388 1113 -8311 5883 4572 1664
683 1664 -9594 4486 6852 -1262 -1618 -2966 7718 -3233 1221 -4237 4019 4433 -4862 -920 2075
698B075L613j4889J0136R29J557o493p38P704m968M114j1859J1299L22k618n134
713d950M708O774j3095O049j361P045q757J515K335J392J524j1636Q869Q27M565
728E804j3104N747P449o905N60m352R462o195L563n783O189J495o813K119j214
743a978J0000j3892N626K685J025l554l462O014l483O391j1099P572N55J35m602
758b067j322J0610j0872L481j435P414o372j081Q02Q94N580j2072N644L47P904
773G455j1469r16Q564l273l98o381J0204m643L094o126K298N082o144P06k433
788d380J1427j0584Q77J491M022l430n807Q359m625P989j0155K963L480K11l976
803b138m086J1651n773K74n065J0171m254k529L36k111J1310j0367J367j235R175
$$ plain form
698 2075 5688 -9201 935 1864 3421 -3072 -3810 3894 -1074 3040 -8819 2480 2802 184 -4950
713 -4950 -242 6532 -6563 -514 -1875 5170 -3587 -2072 263 1655 3179 -8457 412 1239 5804
728 5804 -7300 -1553 5896 -1009 -449 -4801 4661 -1534 2029 -3754 2435 3930 -2883 -764 -1978
743 -1978 8022 -5870 -244 2441 3466 -88 -3550 2464 -1019 5372 -5727 1845 2400 2535 -2067
758 -2067 -3389 7221 -3651 -170 -1605 5809 -563 -1644 -842 52 5632 -6440 -796 -449 7455
773 7455 -4014 -4930 3634 361 -37 -6418 3786 -857 2237 -3889 -1591 3491 -2653 -1947 -4380
788 -4380 7047 -3537 -2660 -1169 2853 -577 -6384 1975 -2650 5339 -4816 -1853 1627 1838 -2138
803 -2138 -6224 5427 -346 -72 -5137 5034 780 -1749 -1413 -3524 7786 -2581 -1214 -2449 6726
818F726n756o432O178J370J777r023Q473l722M522n617j373O492l312J286o746
833e157J2702p036k374K04L680J954q290N752k351O715p566J65P08M514j797q996
849g173J2100m683K182p745O475J775m696J179l475Q989m842j28n935J0045j922
864B146o832L555N2O717j0737N905k605L391j637l961O020k122K660q682R302
879C172j969k619k313M029M546q047M565m736Q314n904j351J096K378L660j0722
894e901P388m22K103p635L976K480j599R41n799R038n217K609p025N444M155p185
910b649K452j488O553q048L438k134K987r11k892M444l136N165j0155O965O14
925A205j694k126K96P059p651L314n018O644k712q85n19N02O546r494L877j720
$$ plain form
818 6726 970 -5462 716 2086 3863 -5160 3313 -409 4113 -1504 -2877 3615 303 1589 -5157
833 -5157 7545 509 -1865 -1661 2019 3973 -4317 1435 -916 5799 -1767 -1602 -894 3620 1823 -7173
849 -7173 4927 244 2426 -5319 1156 2931 -1765 -586 -4061 4928 86 -42 -5977 4068 2146
864 2146 -4686 -1131 -1079 5638 -5099 806 -1799 1592 -45 -4006 2014 -108 2552 -6130 3172
879 3172 1203 -1416 -3729 300 4846 -3201 1364 -3372 4942 -962 -2313 -1217 1161 4821 -5901
894 -5901 1487 1065 3168 -4467 -491 1989 390 1331 -4468 4570 -647 1962 -5063 381 4536 -2649
910 -2649 -197 -1685 4868 -3180 258 -1876 1111 200 -2692 1752 -1384 3781 -6374 591 1205
925 1205 -489 -2615 -2319 4740 -2911 403 -4615 2029 -683 -1568 -2087 -1585 4961 -4533 -656 -2376
941b376N745p130J718L523k920L732p292O794l319L024m757J858M498l541J31
956c12k799P969q741M671j246O62K110m785M647l843N589p670L815J434P98k887
972e88k405Q608p116L438n197N204l58m15j052k739Q619p533K137l108O509l547
988D57k064L756k673L900o383M758l968N799m056k364N893l308K096o201P396
1003C038m467J913q58N7J953l242L599o109P651n311O50J057J771j21o184P667
1019C064m523L532m891K855N58J004J19o447P862l725K560n537N923n65l425L386
1035A750l914N274m856L152m229N793n02m898L385j178M192q154O653k726J997
1050A739p13k172L026l299M754p314O735j561j046r15J795K014o566N221l818
$$ plain form
941 -2376 3369 -3761 -2043 1480 -1440 2292 -5000 1794 -1525 1499 -3258 -1400 3098 -443 -312
956 -312 -3111 4858 -3883 788 -458 204 2314 -2471 2176 -1667 3922 -3748 67 1501 2299 -588
972 -588 -2993 5615 -1501 1937 -3260 1944 1586 1171 119 -2620 5999 -1534 603 -2505 4004 457
988 457 -1607 2149 -524 3376 -3007 1751 -2217 3582 -474 -2838 3055 -253 1843 -4358 3038
1003 3038 -1429 484 -374 -317 1636 -1606 1993 -4116 3535 -1776 -1126 -69 1702 1581 -4603 3064
1019 3064 -1459 2073 -2818 37 595 1599 1718 -4729 3133 -592 1968 -3569 2354 1789 -1636 1750
1035 1750 -2164 3110 -1746 1406 -2823 2970 2468 -2430 955 -223 3969 -4185 2468 -258 1739
1050 1739 1026 -1146 1880 -1419 3335 -3979 2756 1195 149 -766 1029 3043 -3523 1698 -2120
1065b120N663m308N64k16J82M147q776N427n94K537n676L652O03k548K650m695
1081c508N817m060L994n481L256K627n507K336j551N684o950M049j387J222L3
1096E74k585K403k381N523p466M957n7n23k017k20N821p147M513l352M243j524
1112G62j126q32L36N308p068K879j086M993o182J605K366l477M031n218M798k427
1128c38K608l672L74L793l380J40j854P128o924L246j662M21J869l575K749l782
1144b859P094o326J464J141N99j947k437O465m496K783m212L625p58L44j737k286
1160c543Q009o396K003k733N314k884k548L721k509L388m058L371k943M323m400
1175a885p51M844k855J477m546P377m281K41k67RK415k760K114l798O798m990
$$ plain form
1065 -2120 3543 -765 -201 -417 -235 3912 -4864 563 -31 2506 -3170 482 1085 -1463 1187 -3508
1081 -3508 2309 -1751 2243 -3238 18 2645 -2862 -526 -2077 3607 -3343 706 -681 541 574
1096 574 -2011 392 -1989 3534 -3932 1025 968 445 -1572 -1792 4029 -3118 1395 -1957 2286 762
1112 762 -364 -1196 -860 4448 -2620 259 -827 4166 -2016 -411 1955 -1522 2509 -2709 2089 -338
1128 -338 2270 -1402 -1028 2765 -615 -475 -2329 4799 -2125 1121 -541 -120 1749 -1826 923 -2859
1144 -2859 4235 -2091 -627 514 1113 -834 -3271 3194 -1302 1481 -2731 894 136 480 -1257 -3543
1160 -3543 4466 -1930 73 -2660 2654 -230 -2778 943 -1566 1822 -2236 1135 -1808 2515 -1885
1175 -1885 -2636 2208 -647 830 -3716 3661 -620 -379 -646 -637 1778 -982 1132 -2666 4132 -858
1191h58k69J045J660k65m793O456l611L342m827J917J131J30p3m647P248k744
1207H42J25m199N691j124k893K637k715N412n419K591k730L844j450l660M293
1222A245m05J582o466O021k139M94q91p83L177k821K558n160O016k606j194K91
1238a081J732J677n872N297k652K811l464P60N74R87J404o337O255j635J042m651
1254c153L661J512l276K248k833M524l769J834l122L993O18m695L161n73L775
1269C905p402M018K5L88l66k254L715k244K698n996N293n91j164j015O48M030
1285C688o573L968k392L138k433J01O72j25K887o243L838j098K573m757J784L056
1301B084k948J753l955M716k948K028l215K038L186m539Q15q26N122n954J800
$$ plain form
1191 -858 -1127 -82 1578 1313 -3480 2976 -635 2707 -2120 -203 928 1058 985 -3662 3586 842
1207 842 967 -3232 2459 1335 -1558 1079 -1636 3776 -1643 948 -1782 2062 612 -3048 1245
1222 1245 840 2422 -4044 1977 -162 332 -559 -1342 1835 -986 1572 -3588 2428 -178 -1372 -1081
1238 -1081 651 2328 -3544 1753 -899 1912 -1552 -792 -218 769 2173 -4164 2091 456 1498 -3153
1254 -3153 508 2020 -1256 992 -1841 2683 -1086 748 -2374 1619 2237 -2458 703 130 3905
1269 3905 -3497 521 546 934 568 -1686 2029 -215 2483 -3513 1780 1189 25 -990 -342 3688
1285 3688 -2885 1083 -1309 1829 -604 -503 169 44 2931 -3312 526 -572 2001 -2756 -972 2084
1301 2084 -864 889 -3066 1650 -1298 730 -2485 -447 2739 -1800 -985 -1811 3311 -2643 -843
1316h43K17J586k42l183L517k381L948o244L158J997p72j781j256N526m720J437
1332c6k401M045j203l33o03j169N657o227K099j114L847k776j331L051j857K051
1348A700l902L438j729K622l194j44L795k723M05l067O166m063N08o6N52J684
1364A982l829K258j746M374m676O53J509J137j882l131O006l458J790l556L384
1379H15O27k162L53k241N542l919J87r75M196k343k247K457r73K690m911L601
1395F97j642K945k012k573M175j735R42l791N158j988l98o67M85K111l649K496
1411E54k584M912l471o23J358R42M16n357N548j335J074l287J831J327r66m20
1427h1k446N582l178N95k732M013O18m864K332m57L446m457J606p16K140q30k998
$$ plain form
1316 -843 -626 960 718 -2465 1052 -1329 2619 -3625 -467 1530 758 -1023 -2279 3247 -1473 -36
1332 -36 -2437 1608 405 72 -531 -1700 3957 -2270 -171 -1285 2562 -214 -1545 1506 -351 1700
1348 1700 -2202 1236 -493 2129 -1065 -1209 2586 -137 268 -2799 3367 -696 -188 -254 298 1982
1364 1982 -1847 411 -1335 3039 -1637 -984 525 1662 -220 -3351 2655 -803 987 -2569 815
1379 815 1442 -720 -367 -2608 2934 -985 -798 -1773 2423 80 -2167 290 -683 2007 -2904 697
1395 697 -945 2000 -12 -2585 1590 -145 797 -2994 2164 176 -222 -889 -404 1707 -1942 554
1411 554 -2030 2882 -589 -1212 146 1088 1504 -3853 1695 360 1434 -1853 -22 1305 339 -81
1427 -81 -2527 3055 -123 472 -2260 1753 2371 -2493 -161 -618 2828 -1629 -23 -739 1401 571 -2427
1444b427L017n38J902n195M592n74r07j009p7L382l562J776k289L639j136j865
1460a271j42J670K155n645L539l63K072l469K90J912j098J488m184M492j106N89
1476I29l122J787K798l649R86j182M395l790J460j493J486Q22l568L158j508L251
1492B760m850K328Q20k22j563n27L747k968K046l672L573k19j457p02q0M479m797
1509a304J347m78K778k577p51J492n43K134m198K834o71J890l595K87L475k487
1525c67P15k481M234k570O61j318O24K150k784J469j563M279m702Q60J120M12
1541G39p20k287M288k546J867l379J927J250p45j293j278N449l647J65j501L637
1557A926j368j808J808j303L388l974J233m18K533k512j562L628q64M23l310L972
$$ plain form
1444 -2427 590 52 1954 -3241 1351 777 -130 -1139 -1216 2166 -1396 380 -1909 1730 594 -1271
1460 -1271 -1413 257 2412 -3233 306 -57 2015 -1454 -1164 748 -350 1138 -3046 1446 340 929
1476 929 -2193 -406 2392 -1257 -271 -1453 2942 -848 612 -881 605 1427 -2141 1017 -491 2760
1492 2760 -2090 238 1058 836 -727 -1254 2493 -475 1571 -2101 1472 1253 -204 -906 -986 3493 -1304
1509 -1304 43 -435 2343 -234 -985 507 -36 2098 -2100 734 63 1953 -1642 -1355 2120 -367
1525 -367 348 -2133 2101 -469 192 -1126 -502 1648 -1136 333 -1230 3049 -1653 -793 327 739
1541 739 19 -2268 2020 -526 1341 -2038 -111 1139 394 -899 -2177 3272 -375 -210 -1711 1926
1557 1926 558 -1250 558 -745 2643 -1331 -98 -516 2017 -495 -2057 1571 707 1130 -2180 1792
1573A792j949O71j029k94K961k384J066k591M337k696j116J309J097k84k933L594
1589A551j907K220l383P72J665j0k56l458N015j881m84j736K983k23k045J399
1605B22j506L710l741J019j218L121j059k940L047n50J072l970L347q27L01k40
1621b12j261K652j686P22k579L976j721r27L27J080J506m643L378j265J894j752
1637e11m90J154N13N91l944L654r09O78k524K095J153k372J691k491L459k382
1653f35Q01j372K061Q70l451J766j01J787l868K748o38N11J31j916K488j787J829
1670A224l504K688M73j526J27K30K229l684J902j402K474j267o59K85k13K596
1686A973m079K335r57J580j626K53J593j670J525k463K512j203J081k092J259
$$ plain form
1573 1792 -157 514 -515 -809 2152 -232 834 -1757 2580 -116 -1232 77 1174 890 -2043 1551
1589 1551 -356 1864 -1519 -747 918 908 652 -2806 2209 328 -156 -1892 1091 868 -1177 222
1605 222 -1284 2426 -1315 -296 -1514 1607 548 -2392 655 105 1177 -2793 554 -273 28 -212
1621 -212 -1473 1179 -507 215 -2364 1612 -109 -1036 -709 371 1877 -2766 612 -653 1241 -511
1637 -511 -1001 153 666 1257 -2687 967 58 736 -1788 307 1460 -912 779 -1712 1747 -635
1653 -635 166 -1206 855 1725 -1726 40 -61 1726 -2142 606 -32 479 610 -1306 1182 -605 1224
1670 1224 -2280 408 881 -645 -518 -288 1941 -1743 159 -1243 1231 -36 -695 -410 -623 1973
1686 1973 -2106 229 -728 852 -774 -521 1072 -598 927 -1536 976 -227 854 -1238 21
1701B1J689k910J518j426L268l243J479J5n18R15j727J663j260K306l260J987
1717E17P42p78p53o68L459l372J806j871J746M07j265L73j275L340l405J295m93
1734a95J864j653p09J827j864K264k655J897j118J774j929o37K712j961Q15k095
1750a663L137j895L18j33k92J271j942J655j930L356l008K09J360j52k01k604
1766b514L786j823J140k000J169N30k91q8k145M075k474O76j595K443m90j874
1782a475J953j719K544k406J367r54J806j119j857K603r00J225l026L140j366
1797a84K89o0j160K160j503J025j920L135j877o01Q11K45J019l217K888j392J746
1814A404j938O1N55M7P06k915L610j636P70j738J475L08j947J894j719K502k269
$$ plain form
1701 21 1710 -1200 318 -1108 2160 -1083 396 411 -107 808 -919 744 -516 1790 -1470 517
1717 517 1259 481 -272 -940 2519 -853 953 -918 828 1235 -30 343 -932 2408 -997 298 -195
1734 -195 1669 16 -693 1134 -730 1534 -1121 776 -342 1432 -497 -1134 1578 -383 432 -1663
1750 -1663 1474 -421 -103 -236 -528 743 -1199 456 -1474 1882 -1126 -917 443 291 90 -2514
1766 -2514 1272 -551 589 -1411 -242 288 -3 -91 -2236 1839 -635 41 -1554 889 399 -1475
1782 -1475 478 -1241 1303 -1103 264 -690 1116 -3 -1860 743 -157 1068 -1958 1182 -184
1797 -184 105 45 -1115 1045 -458 567 -1353 1782 -95 -696 115 360 1379 -1838 1050 -342 1404
1814 1404 -534 -473 82 129 835 -2080 1530 -106 664 -1074 401 709 -1238 656 -1063 1439 -830
1831h30R71j188J544J44k174J976r45J703k856K217q26j04K85q31K118j840J718
1848A082l133K974l85j345O02k78K356l136J693j231J775j329j11L35J51J651
1864A671l645K783q29J117j790M77J435j777J235j747K368j748J018j577J037
1879B8J375k297J372j010K169l003J760k44j57N32j628K155j635J799k684J645
1895A77M60o33k49o20K935l230J819j991J945k16r29N80j059L154l440J215n21
1912f03J578j501l19J645j226J187k545K555j333J243j310k95K585k379J094j733
1928a357K494j718O80l6K6Q09j837J750j574K486k733O81Q75J06j14j880K974
1945A632j711Q35j595J214L90l59q6j457K814k112P71j240K302r31j298J758j360
$$ plain form
1831 -830 141 -1047 497 641 -1533 443 -502 1201 -1655 562 -264 -368 -83 -914 1204 -636 1082
1848 1082 -2051 923 538 -807 -205 -483 1873 -1263 430 -801 974 -355 -466 -131 20 1671
1864 1671 -1974 809 -20 1097 -693 -216 1219 -558 677 -1070 1298 -450 568 -1009 28
1879 28 1403 -894 478 -532 1637 -1366 394 150 -7 525 -1103 1052 -583 1216 -1468 177
1895 177 637 4 -245 -865 2070 -1160 659 -1332 613 397 -532 48 -1011 2143 -1297 -82 -603
1912 -603 975 -526 -845 800 -426 761 -1784 771 -562 681 -629 -924 1661 -718 376 -1357
1928 -1357 1137 -581 99 63 89 898 -939 811 -763 1723 -1010 -329 546 652 538 -1342 1632
1945 1632 -79 756 -839 375 765 406 320 -1137 1677 -435 336 -904 1398 467 -831 927 -433
1962d33K051k921J671n45J301j078j181K228j153P92k492L017j471K01l23P4J586
1979A324k402J594j692K451j640n11P76M60M35k739K650j175J160j891R08Q02
1995E10o62O02k296K995j444M78j387J863L21j924J134q30K305k815J107n07J418
2012H68k15k036K144p61J229k958K236M6m85l52j84J802k209J263j651K485q43
2029C79j002J82P49J415l576K161m14J327j648j94J327p46J065k714K721p34K86
2046E84j775J351J154k440J165j251K646j977M46p44J201N91k613J601l15J894
2062A518l018J333O38k40m62r84K396j793J124k088K130M59j324k12j53K728l140
2079a088R80l11J694j288p37J034n84J719k957K139l68O33j623Q8K142j728M24
$$ plain form
1962 -433 1618 -1303 368 -177 1124 46 -1135 1093 -60 732 -1760 1257 -214 -13 -336 -262 1324
1979 1324 -1078 516 -1176 1275 -365 -876 -100 360 795 -1944 706 -469 691 -1200 -292 510
1995 510 -152 450 -1846 1149 -295 183 -1204 659 980 -944 190 -640 1665 -1150 -43 -550 868
2012 868 653 -1383 761 0 1229 -1729 507 553 68 -284 -468 1334 -875 388 -1263 1222 379
2029 379 -623 -441 308 1723 -1853 308 -106 1221 -427 -621 706 -40 1025 -1689 1032 298 584
2046 584 -1191 160 1314 -1126 39 -1212 1434 -543 -97 -841 360 951 -1662 -61 -376 1518
2062 1518 -1500 -167 471 231 -231 -1215 1181 -612 512 -1576 554 1013 -311 -523 -676 2052 -1088
2079 -1088 -108 -419 1275 -13 -750 284 -300 1419 -1538 601 233 866 -757 -669 1473 -255 169
2096A69j304K611j745O19p95R4J960k829J448q01K282k350J98Q76j18l33j317
2113a335K580j709J569k379J245P04o85n96j032L523k643N83p06J577o17r27Q59
2130A1n92J905k612J345n26J340j538n47J969j699J068j599K309r81k3l85PJ362
2148H14j473R04j379K669j863j53N97J97M68k231K522j458J632k064L41J039k16
2165C46K7j634K691j582N77j258J514k4j228J274j397K294k016N95l45R79m68
2182C45j357J794p73Q05j990J807p70O26l28r76K015j481O85j647K242r25o42
2199e70N42J91P84k160J700j160J395j238l23R64j28N88k232K607j210N61j167
2216h56Q31P50j371J113j608K179j360J16n72J332Q6j764J544r00J488k034J223
$$ plain form
2096 169 -1135 1476 -269 350 -445 -351 1609 -1220 228 -573 1709 -641 -443 433 315 -18 -1335
2113 -1335 1245 -464 1105 -1274 -29 675 -10 -606 -1638 1885 -758 -175 -881 696 79 -848 11
2130 11 -581 1324 -1288 57 -469 871 -667 -1214 755 -944 124 -1475 834 -147 -170 -555 -548 814
2148 814 -659 245 -1134 1535 -328 -481 116 313 781 -1450 1072 -386 1246 -818 -477 562 346
2165 346 373 -1261 1430 -152 425 -833 681 657 -571 703 -694 1600 -416 179 -166 813 345
2182 345 -1012 782 9 814 -1176 631 -139 487 159 -817 1198 -283 402 -1245 997 72 -570
2199 -570 -28 163 947 -1213 487 -673 722 -516 -839 125 -3 585 -1647 960 -250 311 -856
2216 -856 -25 725 -646 467 -1141 1038 -322 -206 -778 554 640 -1124 420 -480 1008 -1026 197
2233A97k38J56M40j575J785r77R68j806J563rp00J14l89J875k194J429j491J595
2251G43n25o96N64j81J402k655J786q38J103j128J17Q33r87J384k226J900r61
2268c65Q04q40K67J022j882J271j142J851j884Q89l89K61R00j868J499j026J554
2285I22k175J170M52n94L76j161J869j546J124j463R79O43n42k36m92K082k355
2302i47J214r95J466n77o34R41r36J553j915J125n69J053j058n1J452j518P60
2319C64j534J841q02L83l06k93J429j541Q14o35J531j961P56J26J12K95j540J840
2337H79j173J096j482P37M85l46k11j218K279j380N29q28J104k6j109Q11p13J671
2355A105j923O83k68J345r45j241J948q15K39j264J637m37n0l69k17J512j654
$$ plain form
2233 197 -41 115 555 -1020 765 -212 756 -1050 513 504 -196 -82 -471 1404 -790 639 -852 743
2251 743 218 -478 86 -95 1307 -1348 438 -400 703 -425 -308 525 -462 922 -1304 596 -365
2268 -365 439 -401 -134 888 -994 277 -865 986 -898 -9 -398 -137 763 -1105 394 -632 922
2285 922 -1253 -83 369 -225 151 -1010 859 -687 437 -1026 -47 596 54 -182 -674 1408 -947
2302 -947 267 -728 738 161 -473 468 -468 1085 -830 295 -274 779 -279 -330 1122 -396 364
2319 364 -1170 671 -131 252 -54 -347 1082 -459 355 -280 1251 -710 46 172 284 579 -961 879
2337 879 -294 802 -680 57 542 196 -15 -1233 1046 -334 195 -633 471 445 -664 147 -566 1105
2355 1105 -818 -135 -403 942 -3 -1244 704 -111 128 -1136 501 64 14 -355 -572 940 -714
2372g14N95r44K341j445l92N08J32L73j566J640r71J304j352K67N98k52K12j447
2390a113K208j202L53o20Q17K31j146O97q05J706j563N61m15R01j43j191J389
2407F65q80J070j732J449k45m10K36n08J341j341Q29r60J341o06o97O10j27Q35
2425H70j671J293p30P14r32J94N92n35P04j680J640l73K16o75K83L76r02R25j134
2444h25J513j032L45n90N62O84j411R17q11J315j486P69J51NO0q90J357q54R63
2463G42j749J238Q6n90K33m78J489j726J177j014J035l11n38M92n09J365j904
2480i62J294m06M69n49l52J263j104P29j242J171n95P97q55n1J064j152P24p96
2498e53J244j284M93j49J35N04j338J275q92J387j649M32O42l12J99q96J484j244
$$ plain form
2372 -714 -119 -1063 1278 -167 -559 -51 81 454 -1112 528 -443 861 -491 -224 374 122 334 -1113
2390 -1113 1095 -107 246 -374 443 674 -472 225 -580 1126 -437 124 -291 610 467 -724 665
2407 665 -215 855 -877 572 327 -83 153 -355 986 -355 474 -486 855 249 -448 162 35 870
2425 870 -801 492 -238 476 -456 -262 330 -205 499 -1181 459 86 302 -373 -90 286 -616 309 -825
2444 -825 688 -344 1 -589 -27 657 -754 163 -648 667 -819 -50 101 106 166 -724 633 -221 742
2463 742 -1007 231 317 -273 -40 -518 971 -755 422 -592 443 132 -406 86 -423 942 -962
2480 -962 332 -74 395 -154 -506 757 -347 382 -860 311 -284 513 -342 -393 671 -481 243 -553
2498 -553 691 -593 -100 -249 -114 390 -948 327 -565 822 -827 -395 247 -65 134 -762 722 -522
2516e22Q14j081J115o9o31M00p57J619j449M20j76J058o48q12J374p68Q18j294
2534e89R25n15O15m16o93J459r42M50j023J507q53M2J34j46R37j283O33n71J434
2553A105j173l76P16Q1J19j491J635o84M49r60L81O68l91M0r78J725j030k1n66
2572g51J302qj149P61m04J067j634Q29k43M41j54p76J096m53L46j331J567m52
2590E4k44J05J2R36j561J037r71J390q98n5J61J78O70j855J344m76P13j025L04
2609a81P25o72N45j340J718q80L23p88Q16O24j421N66l52J089j168N23j71L62
2627C18k05j061J372l31M50j479J372j30m30j45k36J480j468P96q07J062k82n94
2645c18L43j75J167j757Q80l43K35l25p3O28o32J020j290J033n74M09p89M34Q08
$$ plain form
2516 -522 292 -789 326 257 -374 26 -731 888 -561 -141 -317 741 93 -719 655 -113 705 -589
2534 -589 336 -179 436 20 -673 786 -156 294 -729 778 -75 -33 101 -45 892 -391 242 -329 1105
2553 1105 -68 -444 272 353 472 -1019 616 -68 381 -579 -198 470 79 119 -859 866 -164 -185 -751
2572 -751 551 543 -606 155 -249 818 -816 13 -230 211 57 -719 377 -76 270 -1061 506 54
2590 54 -190 -85 -73 863 -698 339 -632 758 -140 -195 -34 144 814 -1041 303 -173 540 -485 -181
2609 -181 544 -128 417 -923 795 -85 238 -550 266 890 -531 35 -317 772 -396 127 -44 318
2627 318 113 -948 424 93 543 -936 436 306 -124 -269 -505 975 -493 303 -504 558 276 -318
2645 -318 25 -150 1017 -740 140 -203 32 -293 -366 262 -370 650 -640 393 -181 228 -561 -127 681
2664F81j242N51p13J266q47K73n9j83P67j293J011m77R18j403P78L21l12n0p39
2683g52J532j059P00j056P74L29p29L34m18J410j510O27n56P87n95r4O21q23J061
2702E83j158Q89l80M32m63j79Q75p88M11o35R41p06L22j07k14Q18j321Q76p03
2721e07J224j003n2L99k90M07q11J104q74Q89r02M24P5j22R7q67J631j275O32
2740A79m87M90Kl78M85p75J146j070N78k38N26m36n42Q34m27O32j122J202p44
2759a45M21J15o96R31q61M80j000J481m19k71L02l30L83q03J068j053R46n07k46
2778b04K34J48M43j178J269q96M26m85K18R4l35O10r40J113p60M69n40N69M5n90
2798b90O93o47O18q70O17l56K39K02r15R41n86O41r15R53n55oQ6l34J136j400
$$ plain form
2664 681 -561 -10 -723 543 -304 -31 -90 -273 494 -799 212 -265 653 -750 28 349 37 -13 -752
2683 -752 780 -279 421 -635 139 468 -261 73 -345 1065 -445 182 -374 413 -182 -276 345 -478 583
2702 583 -575 314 -66 366 -97 -276 599 -189 222 -413 528 -178 144 37 -177 641 -680 196 -507
2721 -507 717 -286 -338 61 -229 178 -633 471 -403 486 -416 8 83 -39 58 -809 822 -453 179
2740 179 -308 182 184 -194 291 -484 662 -408 170 -68 458 22 -520 314 -113 519 -603 599 -145
2759 -145 276 391 -305 626 -235 245 -755 726 307 36 338 8 391 -412 656 -397 549 42 -204
2778 -204 30 178 621 -557 712 -184 242 -243 -25 69 -266 344 -596 517 -243 226 -314 255 300 -290
2798 -290 403 -244 374 -496 121 -235 4 206 -709 232 -354 287 -628 325 -230 -236 -150 -484 652 -748
2818g48J032r60Q90l56k40K44K1P07j203R09o51O50m94N4J18l9P20j113P72n02
2838a89M52m61Q9N32p75Q92p54Q69q41L50k03K9M88o82K39k35R19j259O24L8o2
2859F0J76n57J001q93O17j032O74L91o07K24m76J098j173M57j93P44m73k86L39
2878I1l95R09j211P25l65N91n69r5R39q32M41o88R53p20J76k49J96P33j192O05
2898D3o34J471j327K53L00k76N82j047J075o85Q24q74L34M13m79n9m27J371j004
2917a46M21o93Q22j49n57M68m75Q15p42L27l99N30k76l08P08l68M30j096J248
2936E60m37k20r0j60R80j036N04n24Q74n14j25J41K6M06j072Q62n75Q69p76N4
2956b53L99n10L61p82J460q89J65n19O38L28p81N75o87R30q59M30m72N33J8n28
$$ plain form
2818 -748 284 -676 214 -142 -382 -138 -117 590 -613 296 -355 295 -199 -145 -27 -66 654 -459 313 -189
2838 -189 263 -198 -109 423 -352 540 -214 655 -186 164 -39 -10 478 -204 35 -200 719 -540 84 122 60
2859 60 236 -321 680 -213 404 -628 46 437 -170 54 -422 676 -497 -40 -233 511 38 -248 91
2878 91 -304 605 -606 119 -246 345 -224 -319 620 -212 229 -459 494 -226 -50 -299 -103 630 -562 43
2898 43 -591 880 -447 -194 106 -170 412 -635 440 -245 579 -295 39 452 -27 -86 -513 858 -146
2917 -146 275 -418 404 255 -302 166 -309 506 -236 91 -308 222 -54 -362 346 -22 408 -688 560
2936 560 123 -97 -187 -347 633 -403 101 -423 451 -63 -188 -47 -21 385 -687 175 -400 469 -307 -253
2956 -253 146 -364 -3 -785 675 -214 -49 -568 70 398 -383 192 -495 435 -424 6 -466 67 85 -443
2976d43Q35n86K86n90Q40k05j70k08j71R12p03N28j161J237k95k73M8k18P52r08
2996d93Q45p79P13k68r5K84k75O20j223J164n14M26p62K95N53q09M58p20J129
3015E49q11R7r9K25K92p91Q64l94M95q84N55k86K31Q7q69J184p01R49j375Q30
3035A48r4k60M0k18Q54q38O51q02R42m43j96K66k60Q24j051P43m46N50n11J18
3055A7K57l13K56q67Q37m24L95m87K86N69j038O80n37R25p20N5Q1O9K60r11P16
3076A06j60P78j040M12J20Km6n09Q65q21O77p92O44k3m42L11l47Q58j022N09k10
3097a30K89j70l52N19m32P39r58M79j36L10n25j13Q53n61K82o60J057o83m7J56
3117h3M5N65j027O26l29P49q14n3N35j41J57p81R85n17J16l80M11J87l53K92l68
$$ plain form
2976 -443 392 -194 92 -498 342 137 -33 -241 -412 500 -203 325 -836 401 106 -167 -119 -337 415 -493
2996 -493 352 -427 286 18 -77 207 -68 552 -671 493 -21 405 -357 -62 491 -318 140 -580 549
3015 549 -262 -165 -264 -39 253 -538 326 -68 427 -457 98 -188 43 130 -739 445 -256 693 -682 148
3035 148 54 -206 -166 -384 470 -368 283 -519 423 -20 -216 50 -210 614 -437 306 -140 410 -101 17
3055 17 274 -39 217 -650 187 -237 158 -329 -43 526 -512 168 -369 556 -164 -109 -28 41 301 -610 106
3076 106 -54 724 -316 96 216 218 172 -337 528 -293 384 -408 236 213 -229 82 -265 593 -429 80 -130
3097 -130 159 -11 -363 156 -276 463 -495 -16 -152 158 -367 -480 373 -188 94 -566 491 -192 -239 -83
3117 -83 -38 527 -500 126 -203 546 -268 -321 214 73 230 -551 434 -83 33 -347 64 251 -102 190 -178
3138a78N99q69L24k87R60l76p80O90j81M34o84L82l55N25l22k98R25p35M76p49
3158d99Q77n28N8l2J3O46q25K66n08R89o96K51m9N9J61q55R69m55L13m98K48M86
3180C91n42K96p67R62o94O89q02N15K36m83M29o77J051r24L65j94K97j92l35R17
3200E38o36M72j196R54L3j20Ml92P21o12M84o31P82k08l04J28L0M07q08N88k53
3221a9N10o48J07M82m59M03q56R37n29L21l49J60K38l96L68o45P06o68M67j59
3241b9J51km32L81l75P05q36O32L3k16R2l58O26n63L39o31O23j69j85J61j41O66
3263D72r62N99k52M75n20L44qm11P99r64O67l02K14m47J19M39o44N15m25O69o44
3284b67N40j58l5K70o56O55n71O84q05O53l59l7N0k70M60m34N69o11L80j07J27
$$ plain form
3138 -178 421 -448 -124 -411 549 173 -607 83 -98 336 -348 34 -321 204 -118 -416 509 -226 250 -499
3158 -499 378 -150 -92 -124 -111 535 -290 -24 -532 457 -239 12 -37 22 183 -672 297 -158 155 -343 -95 391
3180 391 -151 145 -622 340 -354 335 -467 48 284 -199 230 -447 604 -320 45 -149 148 -44 -379 538
3200 538 -98 374 -822 132 165 45 49 -343 378 -234 250 -381 401 193 -111 17 47 454 -354 234 -19
3221 -19 491 -157 -50 432 -27 376 -480 457 -72 249 -100 60 298 -98 270 -375 331 -337 130 -29
3241 -29 122 120 -312 69 -306 399 -437 195 228 12 104 -254 372 -191 148 -483 140 -29 -214 -53 -194 472
3263 472 -490 109 -143 332 -188 156 148 -263 536 -428 239 -63 151 -296 -177 262 -382 133 -292 377 -267
3284 -267 273 115 80 350 -306 349 -222 462 -343 310 -49 -86 -36 -306 154 -280 289 -322 58 -49 78
3305G8n9n1L10p73O82l71L33k1k76J08l66O10l20J67l96N47j21l97M98n36O59
3326C05p38O45n06L49o9k50O01o58O77o99O42n23K30L8j60K77n01M99n97P81n59
3347b16L10j22q7L17n69P65j011Q69l40K50p1k07K18l93P68p31M29k23L60j55
3367A61k85L06o47R13o65L63l49L87j1l79N92o01N41o99N32l85K53K4j57K58n90
3388d38Q20p11N57k18o7L05j96N9o30P30o07O57l89M8J72j81J80n13Q08o46K96
3409C6k25J56K87m95N49m61O75p34L91k50J71R1m88N27m37O95r78P91l00L9K0
3430F0l70O59m71L26n28P66l02l21J46j7M42p91N21l64M12l47K64J79n36N37m19
3451a54N25l54J58l56L43j10k62L48n05Q56n69K55l63R4K00l00K63k52L75o10
$$ plain form
3305 78 19 -32 278 -495 187 -184 149 128 -148 -40 -406 204 -116 51 -345 202 81 -316 182 -354 305
3326 305 -433 212 -294 55 -14 -264 337 -321 356 -343 299 -224 6 44 -116 161 -340 159 -438 343 -216
3347 -216 94 -28 -115 202 -367 398 -613 256 -84 166 95 -112 106 -287 481 -250 179 -44 316 161
3367 161 -124 182 -465 448 -217 146 -203 184 173 -206 386 -215 326 -373 159 -226 27 51 -106 152 -438
3388 -438 382 -329 228 10 -57 248 52 111 -519 211 -396 261 -128 -80 92 -89 91 -422 386 -260 36
3409 36 -189 -33 254 -241 308 -153 522 -212 179 -71 100 191 -297 230 -207 488 -490 301 1 40 60
3430 60 -310 349 -122 204 -324 442 140 -181 -35 -52 390 -401 120 -244 168 -179 85 264 -272 265 -154
3451 -154 371 17 175 -181 162 52 -210 138 -367 489 -80 175 -188 -94 106 -194 69 -183 192 -418
3471d18M36o4o1R4l08L63l07M73p22M99J80k19pj18N09o42K40p9K43k1j27m9p9
3494a84N28p52P04m26K73j90J74M3j68K86p84R44o19K80k79J46K56m47J91l23
3514c47P61o60L76J22k95M12n16L93n40M46j96J19pP0j15n09R69o51M80p18N90
3535A84l3k39K17l69N52o19K88l60N32l54M6K10j91M44o62M56k26M33l46j73O71
3556D61o49L53p10Q46l67J03j84J4L86o03M58l16L66m20J25K81j65L59o86O09
3576B61l03K86o06K31N02k72J86o14N49n08M30l40L51J16m64M11l99N90n76K35
3596F6j16J00n6j22M44m67L11p02O99k81O6J00j42M94o47L97l29N08m68j36L26
3617D5j01L57o94N40k76K73m31K52J25k30K49l86N53o91M22j39K52m3k41K57l67
$$ plain form
3471 -418 18 -46 -107 -13 -321 42 -265 208 -514 -15 165 -54 -61 -179 330 -312 -72 -151 92 71 -56 -105 -184
3494 -184 344 -408 296 -130 143 -47 127 170 2 288 -496 448 -171 109 -170 -24 232 -215 -24 -347
3514 -347 414 -246 130 252 -43 369 -147 246 -294 152 -44 75 68 138 23 -486 483 -168 312 -406 184
3535 184 151 -88 129 -240 312 -307 -19 -379 153 -201 -155 55 -136 308 -354 102 -124 309 -37 -210 461
3556 461 -188 165 -545 301 -66 37 -147 -133 253 -350 108 -208 158 -262 -137 144 -21 338 -348 261
3576 261 -42 244 -362 -131 371 99 285 -329 220 -288 142 -198 153 269 -195 216 -183 407 -169 66
3596 66 -50 50 -6 -128 316 -151 160 -542 157 -124 -58 42 -100 394 -253 144 -185 323 -145 -281 45
3617 45 -56 301 -393 147 -129 144 -287 -35 90 -140 109 -277 276 -415 7 -132 120 77 -164 93 -274
3638b74O83q32M66j52J75m7k09M78n21M77o29M54k63L01pl59O26m90L02k63M58
3659C74l00M5j99l1M02n26L14j49K69k26j20J96l6K76n68N04k56K91m71L24J39
3680B52m54L17l75P56o25K22j29J60N1m41L39k01N44m29J1m7K17M1m58O17p25
3701c57N35m06K60pm6J23k84O39q07L31m19N95n1l18K72j90L04o22N54p1J78k69
3723e6n7L40k92J17l18P70p26K73J1kL09o53O97l34L27n49J39q2J50J44n18P26
3745D16o11L80k31M2O9q6J02l17N22m91K18k13L32r7j09J24j94K08m28L42J03
3766H1N5j98j39M67m39K55n00O63m49K75j31j9J51l92N84n41N73k28k59J47MK49
3788B09m77N80m25J56l19L78j43m8J74m58Q35o60L56n62M92J5k10M24m06N22o39
$$ plain form
3638 -274 409 -423 43 -109 66 19 -190 288 -233 244 -385 69 -194 107 100 -259 367 -123 179 -84 374
3659 374 74 119 -80 -111 291 -235 79 -70 199 -27 -147 49 13 289 -279 225 -31 260 -211 113 252
3680 252 -202 115 -260 496 -129 93 -36 124 175 -266 73 -128 416 -13 -2 -49 168 209 -249 368 -357
3701 -357 178 -228 32 25 -21 102 -182 457 -350 -19 -438 157 106 -212 60 -130 174 -448 106 35 213 -56
3723 -56 -113 227 -65 52 -266 504 -222 51 62 60 369 -284 413 79 406 -143 -4 -86 64 208 -310 416
3745 416 -195 185 -46 -4 65 -21 81 -236 286 -205 13 -200 132 35 -74 50 -144 64 -364 -22 81
3766 81 136 -62 -201 266 -173 82 -418 245 -204 71 -60 -79 72 -320 264 -277 296 68 -191 -44 -40 209
3788 209 -268 312 -113 43 -276 102 -41 -89 85 -373 462 -198 158 -404 88 103 -107 317 -89 433 -206
3809b06P74n82J91j07l10L60j70K83o06P28m34J95r1Q5J32n57O24n31N57l11m3
3830a9n3J9L52n67N42m95N90o22K32O2j59L26l05L08m11L17k55P1o3O9J71l62
3852b52M14o18N55j20m8J61k47L75m39M12o20N97l74L07L7o61P65m76N19o36M54
3873A05k0j18K44m79M32m95N99o09N08j20O4J77l28J49o41P58m54M58k74j32M43
3894B67j46J28l54M71n35K91l10K28J89m94M82l68M99n49K92l67L44O9k60L82
3914B59m03N10q23M40jj12J59k65L60n37M60m01L57j80L1Q9l21O32l91K68l14
3935a83K91j39N6j9j38K20l14M46l67L31l47P0J51k08J59k13N63m17J81j84O8
3956GK32l94K75l56M69l12K11j41K9Q0k28M48m36K94k95L48Kl44K74m43N91p91
$$ plain form
3809 -206 568 -14 177 70 -240 120 -50 233 -373 355 -79 116 25 110 242 -315 309 -222 335 24 -19
3830 -19 -72 -53 299 -268 274 -221 369 -253 -21 41 -118 208 -97 211 -200 117 -138 -67 -130 -61 110 -252
3852 -252 162 -456 99 -21 -69 92 -155 220 -219 193 -427 170 -204 103 140 -521 244 -232 287 -349 105
3873 105 85 -33 211 -268 164 -331 268 -341 167 47 111 288 -40 109 -532 226 -228 230 -44 -176 267
3894 267 121 249 -105 366 -169 122 -188 40 229 -265 217 -151 348 -201 91 -276 68 137 -123 259
3914 259 -144 366 -457 -17 -18 -130 29 -236 124 -413 47 -354 3 -177 -146 -57 -378 254 -137 131 -183
3935 -183 108 -31 25 6 -132 88 -226 220 -147 184 -163 -93 58 -150 9 -204 359 -58 123 -61 7
3956 7 239 -155 120 -236 233 -79 132 -9 20 100 -128 320 -116 178 -117 231 233 -111 163 -280 311 -480
3978d80O04k54L72k88L4k2l38Q29p33M87m49L64j48nP3l1L41o80M66j24J35k15
4000f2j6J97j97K61l81M01m29J61j48K99O0n30N54m92N38l04J6J73j10L05m92
4021a96M51n04M64l81L60k8k59K66m63N19l51J90l20N41j85l25K91k87N29n03
4041a91K38j18J22mj03L26m71L82m93N63k81J10j06k80N92o63O83n22L46k93J36
4062b7K95l90M50o84M42j78K54m15J53J76l88O66p68O46k82J75l17K69K37n09
4082a95M62n61O16o14M25j40J40l1m25M75l89M67n21M94j45j83k4k72R28q56N58
4103B09m11M99l22M1J06k6K24p29N86l89L98k16q6L38l10K63m88O47n62L25k66
4124a69K05%j77K96j90K03k67K38k12L01j4m15N13m60N63q52M24j5L24k26l51
$$ plain form
3978 -480 124 -130 242 -46 -12 -34 -372 457 -276 211 -238 126 -22 -27 46 15 356 -324 142 18 153 -62
4000 -62 -78 119 -78 183 -198 203 -226 -65 -213 86 146 -384 170 -322 216 -88 -72 101 -9 296 -196
4021 -196 255 -249 215 -166 194 166 -93 173 -290 229 -122 68 -252 289 104 -221 70 -217 312 -191
4041 -191 47 -71 51 47 -56 270 -201 181 -312 251 -30 80 -26 -306 286 -377 306 -216 130 -163 -27
4062 -27 268 -122 328 -356 86 -92 162 -253 -100 76 -312 354 -414 232 -50 125 -192 77 314 -195
4082 -195 267 -294 322 -292 133 -7 133 102 -323 152 -237 230 -291 203 58 -125 -149 -421 507 -349 209
4103 209 -202 297 -25 16 122 96 320 -409 177 -212 186 -30 -116 222 -88 175 -313 334 -228 97 -169
4124 -169 36 36 -141 155 -35 168 -99 139 -73 228 214 -201 312 -148 415 -437 -13 -28 296 70 -281
4145b81M78l94K58k38L75k09no0o9N23n67K23j53L06j59k06M39k33K12o29O27
4166B38k63P1l1o8K59m90N88o85O36n30L79M8j51J37l81M92l98M58k04l8J91l55
4188i7L14m18P37q09N16k72k8L9j83J92q2M21n14L38k80J86j68r0L08l72N57o32
4210c37L37j15L00j27j88L01l39L39n26M57k73L38j82P0J83m66L23m38O70l95
4230f8j16Q4K33O4n16M97m90N73m60J27J53j10J91n97N49k74K35r3M7P4l06L66
4252A63k96N24o05M62l47J88R7k11L48n08M33k61K18j94J76l59k6M67n17M00n42
4273c90O43l27J06q6j72M29m43M86n80O59n35L5J85j72L63n46O48m76L06j91J46
4294H8l1k72K96n58N86l43K45j67J07J49n40N68m68O10n25K80k22K13K4n7K31
$$ plain form
4145 -281 197 -197 61 -177 198 -11 -16 -76 -145 378 -189 34 -119 187 28 -178 261 28 240 -389 238
4166 238 -25 46 15 -53 206 -284 304 -381 255 -275 104 152 1 138 -243 249 -149 309 105 67 258 -97
4188 -97 217 -201 536 -273 243 -29 -57 -18 -201 -9 -91 330 -184 154 -126 60 -108 -198 110 -262 295 -337
4210 -337 0 -115 185 58 -130 171 -168 171 -355 102 -171 167 -15 55 238 -228 95 -343 327 -68
4230 -68 -184 -100 133 197 -319 178 -312 261 -199 -72 81 -29 162 -435 114 -160 75 -18 29 103 -203 163
4252 163 -133 391 -214 248 -99 89 186 -25 323 -185 248 -13 205 11 187 -172 -198 269 -248 152 -390
4273 -390 253 -74 32 -54 -226 203 -240 246 -334 325 -210 -175 10 -162 201 -345 303 -173 133 -58 88
4294 88 57 -215 81 -477 109 -234 11 -156 -49 100 -440 128 -340 270 -255 25 -197 16 40 -17 214
4315B14m40L91m19M23j64j45K60m82O67n50L69l16N50k99j9P2l6J54j87K05k74
4336b6K79l98L48J69o14L06l24P02m72J03p2n1K06m36L44k91O68q35M38n1r2J4
4358h5j54M81n20O80m95J21l3l4J42n03M40l90N16n70P06j12l80K83l44M37n55
4379c69N99l76L87j81l21M63m48N46p28Q15n35J41j49k2K92k45K20k09M18k47
4399E1J44k67J03Q4l54N65k89K82l89J29k3q6K42m59M15l66K45k12J54J55m2p8
4421Dk51O44o01M87l47L90l04k74M83n07N22m62M37k24K73p3k02J17m25M22m21
4442c12P79n03J02j2j85M01j36O0k25J62k00o5J13J0J09l20K75k04N39m63J43
4463F8q1jL66n13O99o12P1j60J44J81l06K89k84M03m27K73l29M53j58l25M71m77
$$ plain form
4315 214 -226 165 -254 169 5 -140 120 -362 305 -245 124 -192 358 59 40 112 76 230 43 248 -26
4336 -26 253 -145 203 372 -242 64 -260 442 -30 73 1 -50 156 -280 64 -227 441 -394 44 -7 -99 -85
4358 -85 -239 242 -278 402 -93 28 -5 -39 103 -400 40 -350 166 -404 302 190 -190 93 -251 186 -369
4379 -369 230 -146 241 60 -261 202 -246 300 -428 387 -148 -7 -156 -178 114 -131 89 -120 298 51
4399 51 195 -72 31 115 -239 326 37 319 -70 59 36 -50 192 -267 148 -218 27 -185 -31 124 82 4
4421 4 -247 397 -204 283 -64 326 22 -252 231 -276 246 -216 221 -3 270 197 -5 112 -313 109 -312
4442 -312 467 -36 66 54 -131 270 134 194 -31 131 -69 -134 -21 -11 98 -222 53 -151 388 -75 68
4463 68 -13 -14 352 -161 538 -74 -3 -163 -19 162 -144 145 -139 264 -163 110 -219 234 76 -249 222 -255
4485b55N72m29L18k24j6jn3M81l97J39m10M32m12L02l8q1L87m60L07m97O04m27
4507a58K82P6m19K42k79N37l11R5r3j78M96m85K90l80P50n25J81k59L49j52l82
4528c23M55l53M66m42K76k06K62J7l38M99m41K81k60J66N3j84J45j38L11n17M65
4549A94k52K28k81P4K30l59L15n29O98l22J08ol4J06j84K29l81L22l39L42k11
4570e2N7K66n11L85n20N47l29M06j98n2q2k52O82m19J69m74M00o5j82L46j95N36
4592D63p55L96l18L48j45j80K90l29N33n64M86m10L40p2l28M69k37K27o73P47
4612B88m59J86r8NL72o14M53n61O33l25q3M5J45O7l87O47m69N41m74j07L16K6
4634A47P2m49M76n41N28n53L59J14j97L10m89P57m95O2k01l6K20K1r0k65O69n92
$$ plain form
4485 -255 317 -112 206 -18 -34 -35 -88 393 -4 135 -275 157 -255 47 9 -72 315 -145 162 -335 269 -158
4507 -158 124 200 -219 23 -256 281 -30 65 -28 -206 290 -195 95 -285 465 -60 121 -138 211 59 -323
4528 -323 132 -221 245 -197 79 -127 135 152 -186 313 -128 153 -107 59 112 -72 73 -65 246 -271 194
4549 194 -58 170 -111 -37 193 -166 149 -380 318 -4 104 98 64 170 -14 215 -166 156 -183 159 -52
4570 -52 5 271 -240 145 -375 172 -157 249 51 -1 -83 -335 347 -72 97 -377 23 -42 -224 122 -73 463
4592 463 -292 104 -214 134 -11 -191 99 -230 303 -261 225 -185 155 83 -245 224 -13 214 -459 288
4612 288 -171 15 -83 -78 294 -320 133 -428 205 -120 -203 -158 -13 54 -333 314 -155 386 -88 -195 121 147
4634 147 219 -230 246 -295 233 -320 39 153 -44 266 -223 534 39 101 -100 -136 84 105 15 -250 419 -173
4656a73K14Np9P9k82N44m92L06l06M16l40N7K13j69K27m18K70k49K54l22J2J54
4678g9L0L03o35O02m01K97k73J11J76l29M05m90O61m54J9o9J58J59l19K82l13
4699a59L81o12O34j42q1K6j92M58m83K47k89M12j03qQ0k72M49n06M53m45L65k21
4721ho0K23k56J19k25O02n47K69l46rK04j2Q1j48R8k24J53j76J45L02k98K51l33
4744a95L89l93K77j2kj38j99L91k50K40k73K50q0K1o2k46M67m26L78k39M96l50
4766D4k10J45k92L93j99K83k35K50k04j4L51m36L72n18M64l13L50j78k32L79k32
4787c2K07m41M16l63K33k99K40L38m77N15p35O10o30K35K40m7L53n79M73l34K94
4808B17k08K44l21j29M05l54L12l75L91m13L37j84m5L28m47L92m68O83n43K50
$$ plain form
4656 -173 41 46 -33 46 -236 308 -184 122 -184 232 -108 -51 162 -7 220 -198 72 -177 77 -245 -233 -79
4678 -79 -49 254 -381 221 -180 117 -156 -45 131 -198 207 -283 378 -76 -57 -126 32 191 -128 154 -159
4699 -159 222 -390 244 102 21 47 -145 313 -170 77 -212 200 97 89 169 -103 346 -160 293 -152 213 -8
4721 -8 -68 155 -101 18 -207 395 -152 117 -229 -238 -34 -46 35 -113 -15 -239 -86 -262 -117 185 -113 138 -195
4744 -195 194 -199 78 66 64 -74 -273 118 -132 108 -165 85 5 26 -36 -282 185 -241 137 -102 394 44
4766 44 -166 -21 -313 80 -119 164 -71 179 -25 -39 312 -124 248 -270 194 -119 231 53 -179 200 -32
4787 -32 175 -266 150 -213 20 -279 -39 299 -178 337 -398 212 -418 -183 57 10 363 -216 257 -77 217
4808 217 9 253 -68 -197 208 -146 166 -209 182 -231 106 -78 -123 205 -242 150 -318 365 -178 72
4828G2l0K8Q0l68M39p16P67m11K40q6j59K55m13Q16q19O81l16J50j40j50K09l03
4850a74N37m43L45k55j14K82l43L01k22L61m20O14n09O5L2r4P2k51N07p22M80
4871D9j94K01P3k50L88o12P80o51L35k27J16l1j73L33l24L69n84M24r7P5j4J8
4893DK71o41P21q07O11j91k67M97n3j39k13N62n75L72m04K7L57n09O30n50O76
4914C79m23L72l50P0J37l83L07r9J64k43L35k04j29J83j23K3l19M64j70K11k15
4935a3J14M2j84L62n22N60o56L19j19O7L31l80L55p35N63l52L92q5j83J40j92
4956a76L84n21M14m39K98j47J49M54p92M52k66M04l40K44j59l9L63p75N96l70
4976b66K83j69J34j96P5L13m02M57l76L84n34M45km07M14m11N91p41O35n18L61
$$ plain form
4828 72 42 70 150 -218 221 -495 272 -139 101 15 -144 111 -302 514 -305 376 60 210 70 -80 129 -174
4850 -174 363 -80 265 10 -104 178 -165 136 -86 275 -145 469 -40 25 57 -37 35 -216 291 -431 49
4871 49 -145 56 129 -121 267 -345 435 -216 119 -108 8 -23 -196 137 -187 182 -402 22 -75 0 -14 4
4893 4 275 -366 355 -452 159 -32 -299 198 145 6 -207 355 -220 152 -252 -225 132 -377 253 -297 379
4914 379 -44 328 -22 48 185 -198 109 10 174 -69 266 62 -67 116 -7 16 -303 161 -9 202 -13
4935 -13 101 143 -41 321 -201 359 -297 22 -97 -30 301 -79 276 -459 104 -248 144 59 -124 16 -176
4956 -176 208 -313 101 -338 -40 -187 -38 416 -376 76 -190 214 -126 118 -41 -80 283 -492 104 -266
4976 -266 17 -152 -18 -214 -139 174 -228 229 -147 237 -297 148 146 -261 153 -258 333 -408 227 -291 70
4997G0R8j73J72m13O37o49O01m63K26j91P7K83k83P2j62K60k29L8k0QK02l31K50
5020H0k48L04j00j30J39k15M50n73N99l95J39l20L63j7k00K78m59N47n71M51l28
5041b06K07Q5k92L62m65M86n08N31l27N4K01m35L02k04M43n81O38n40J95p0R4
5062c0K52m73M57m57M91l08qJ90k17J82l26O35n47K45j97K48K39p26N86n21N81
5083B96n82L87p4J58k9k96M01n02L44j83K72j43o5K05n01O10o54N26m15L30k52
5104a67l7L35l04K40m00O04n40L59k37q2M48m74M21m92L81k80L77k36o9L11k07
5125d9R1l95O17n49N74m08J31O8k03K29k63L79m38L77ql0p6l03M09l49O41n18
5147g3K12j18J19Q1l44M19m52L97n12M09J7j24J24k98M16l52K16l32L78j15l01
$$ plain form
4997 70 168 -5 167 -246 391 -258 343 -120 106 -85 -8 275 -8 64 -98 162 -67 -29 -49 -41 161 -170 80
5020 80 -168 136 36 -94 45 -170 280 -293 306 -89 50 -270 93 76 -124 154 -305 242 -329 122 -206
5041 -206 1 86 -206 156 -309 177 -331 200 -127 -73 128 -307 -5 -209 234 -347 291 -249 -54 -124 -30
5062 -30 222 -251 206 -251 240 -68 -76 114 -103 79 -247 388 -159 86 -111 137 376 -350 236 -285 296
5083 296 -286 101 27 185 156 -140 261 -241 103 -80 192 49 -16 189 -312 298 -356 170 -245 85 -167
5104 -167 -204 131 -173 67 -333 271 -269 90 -147 -229 219 -255 166 -326 55 -225 152 -84 -153 158 -49
5125 -49 42 -353 264 -285 289 -119 12 80 -123 106 -157 222 -216 161 153 123 47 -256 153 -196 445 -73
5147 -73 139 21 140 221 -123 296 -156 241 -271 138 155 31 155 -143 273 -79 137 -195 183 68 -233
5168b33K65l1L47l79K35k61K98l91k1K02k31L95o80P58k75R8j12r8M64n47L20
5189A23k89K51k65K11m8qJ52l26K68j04J64j75R0j06m9L45n21P64p40L76l90N07
5211B30l16J39J59o02O94o28N30m21R5K41l03N19m36L57l89K79k79J96j42J12
5231C5L16n75M46l76J97K01k19J34k3J38m71O76q08O04m14K04K5j50L91o99O62
5252B94m90L72j09j1J03l55L97n59N88m72K98k49J28O3k96N01m61J88k39L87j17
5273c9L1J13k28M38o45O24l69L87l43kK21l22L55n17N96n43M65k52PJ67k75M14
5295B83o93P63o00N69m15J51P6l19O62o52M11l07L24l99R2J21m65O95n55K99k29
5316a88K65q1j79K77l26L31l05M21l42K38k16J7O4j50L26n30M98l71M69l25K14
$$ plain form
5168 -233 32 1 348 -31 204 -57 241 -150 -171 31 -200 195 -485 273 -2 96 -16 -114 350 -197 123
5189 123 -166 85 -180 31 -17 -25 127 -199 69 -35 129 -46 44 -62 -111 234 -287 477 -263 113 -277 230
5211 230 -86 53 212 -390 304 -324 206 -215 -120 121 -182 337 -99 258 -131 148 -131 65 -77 35
5231 35 351 -224 222 -154 43 244 25 159 136 274 -197 479 -329 275 -139 65 90 -60 331 -368 294
5252 294 -196 176 67 56 159 -196 201 -358 230 -242 56 -193 -65 -2 -298 203 -258 -70 -309 78 -39
5273 -39 -8 105 -123 315 -330 294 -75 312 -31 -33 188 -134 221 -296 300 -243 222 -30 -23 144 -131 283
5295 283 -410 353 -247 322 -93 58 134 -185 477 -175 236 -71 253 -146 -54 67 -398 297 -258 41 -188
5316 -188 77 -4 -183 94 -232 99 -206 215 -127 111 -105 -88 -24 -174 152 -378 120 -251 218 -107 107
$$ [...]
8191a10
##END NTUPLES=NMR FID
##END=
