##TITLE=1H_TG-2302
 CDCl3, 8 sc, 
 28.9.2020
##JCAMPDX= 6.0         $$ Bruker NMR JCAMP-DX V2.0
##DATA TYPE= NMR FID
##DATA CLASS= NTUPLES
##ORIGIN= UXNMR, Bruker Analytische Messtechnik GmbH
##OWNER= root
$$ XWIN-NMR		Version 3.5
$$ Mon Sep 28 11:26:21 2020 Russian Standard Time (UT+4h)  she@DPX200
##.OBSERVE FREQUENCY= 200.1315066352
##.OBSERVE NUCLEUS= ^1H
##.DELAY= (6, 6)
##.ACQUISITION MODE= SIMULTANEOUS
##.ACQUISITION SCHEME= undefined
##.AVERAGES= 8
##.DIGITISER RES= 18
##SPECTROMETER/DATA SYSTEM= spect
##.PULSE SEQUENCE= zg30
##.SOLVENT NAME= CDCl3
##.SHIFT REFERENCE= (INTERNAL, CDCl3, 0, 15.7039)
##AUDIT TRAIL= $$ (NUMBER, WHEN, WHO, WHERE, WHAT)
$$ ##TITLE= Audit trail, XWIN-NMR		Version 3.5
$$ ##JCAMPDX= 5.01
$$ ##ORIGIN= Bruker BioSpin GmbH
$$ ##OWNER= she
$$ F:/spectra/data/she/nmr/H-F/1/audita.txt
$$ ##AUDIT TRAIL=  $$ (NUMBER, WHEN, WHO, WHERE, WHAT)
(   1,<2020-09-28 11:25:21.96 +0400>,<she>,<DPX200>,
      <created by zg, POWCHK disabled, PULCHK disabled
       configuration hash MD5:
       00 E9 B6 7A A2 85 ED C7 34 08 36 98 17 FE 4E 26
       data hash MD5: 16K
       40 99 12 65 5B F6 26 DB 7C 48 4C 76 C9 01 A9 AD>)
$$ ##END=
$$ 
$$ hash MD5
$$ C9 94 7C BB D9 AC 29 92 94 49 62 81 B9 1A F0 59
##$RELAX= 
##$RELAX= 
##$RELAX= 
##$RELAX= 
##$RELAX= 
##$RELAX= 
$$ Bruker specific parameters
$$ --------------------------
##$DU= <F:/spectra>
##$EXPNO= 1
##$NAME= <H-F>
##$PROCNO= 1
##$TYPE= <nmr>
##$USER= <she>
##$AMP= (0..31)
100 100 100 100 100 100 100 100 100 100 100 100 100 100 100 100 100 100 
100 100 100 100 100 100 100 100 100 100 100 100 100 100 
##$AQSEQ= 0
##$AQ_mod= 1
##$AUNM= <au_zg>
##$AUTOPOS= <>
##$BF1= 200.13
##$BF2= 200.13
##$BF3= 200.13
##$BF4= 200.13
##$BF5= 200.13
##$BF6= 200.13
##$BF7= 200.13
##$BF8= 200.13
##$BYTORDA= 1
##$CFDGTYP= 0
##$CFRGTYP= 5
##$CHEMSTR= <none>
##$CNST= (0..31)
1 1 145 1 1 1 1 1 1 1 1 1 1 1 1 1 1 1 1 1 1 1 1 1 1 1 1 1 1 1 1 1 
##$CPDPRG= <>
##$CPDPRG1= <>
##$CPDPRG2= <>
##$CPDPRG3= <>
##$CPDPRG4= <mlev>
##$CPDPRG5= <mlev>
##$CPDPRG6= <mlev>
##$CPDPRG7= <mlev>
##$CPDPRG8= <mlev>
##$CPDPRGB= <>
##$CPDPRGT= <>
##$D= (0..31)
0 1.2 0 0 0 0 0 0 0 0.06 0 0.03 0 0 0 0 0.0002 0 0 0 0 0 0 0 0 0 0 0 0 
0 0 0 
##$DATE= 1601277921
##$DBL= (0..7)
120 120 120 120 120 120 120 120 
##$DBP= (0..7)
150 150 150 150 150 150 150 150 
##$DBP07= 0
##$DBPNAM0= <>
##$DBPNAM1= <>
##$DBPNAM2= <>
##$DBPNAM3= <>
##$DBPNAM4= <>
##$DBPNAM5= <>
##$DBPNAM6= <>
##$DBPNAM7= <>
##$DBPOAL= (0..7)
0.5 0.5 0.5 0.5 0.5 0.5 0.5 0.5 
##$DBPOFFS= (0..7)
0 0 0 0 0 0 0 0 
##$DE= 6
##$DECBNUC= <off>
##$DECIM= 32
##$DECNUC= <off>
##$DECSTAT= 4
##$DIGMOD= 1
##$DIGTYP= 9
##$DL= (0..7)
0 120 120 120 120 120 120 120 
##$DP= (0..7)
150 150 150 150 150 150 150 150 
##$DP07= 0
##$DPNAME0= <>
##$DPNAME1= <>
##$DPNAME2= <>
##$DPNAME3= <>
##$DPNAME4= <>
##$DPNAME5= <>
##$DPNAME6= <>
##$DPNAME7= <>
##$DPOAL= (0..7)
0.5 0.5 0.5 0.5 0.5 0.5 0.5 0.5 
##$DPOFFS= (0..7)
0 0 0 0 0 0 0 0 
##$DQDMODE= 0
##$DR= 18
##$DS= 0
##$DSLIST= <SSSSSSSSSSSSSSS>
$$ [...]
##$SUBNAM2= <"">
##$SUBNAM3= <"">
##$SUBNAM4= <"">
##$SUBNAM5= <"">
##$SUBNAM6= <"">
##$SUBNAM7= <"">
##$SUBNAM8= <"">
##$SUBNAM9= <"">
##$SW= 16.880792210976
##$SWIBOX= (0..15)
0 0 2 0 0 0 0 0 0 0 0 0 0 0 0 0 
##$SW_h= 3378.37837837838
##$TD= 16384
##$TD0= 1
##$TE= 0
##$TE2= 300
##$TE3= 300
##$TEG= 300
##$TL= (0..7)
0 120 120 120 120 120 120 120 
##$TP= (0..7)
150 150 150 150 150 150 150 150 
##$TP07= 0
##$TPNAME0= <>
##$TPNAME1= <>
##$TPNAME2= <>
##$TPNAME3= <>
##$TPNAME4= <>
##$TPNAME5= <>
##$TPNAME6= <>
##$TPNAME7= <>
##$TPOAL= (0..7)
0.5 0.5 0.5 0.5 0.5 0.5 0.5 0.5 
##$TPOFFS= (0..7)
0 0 0 0 0 0 0 0 
##$TUNHIN= 0
##$TUNHOUT= 0
##$TUNXOUT= 0
##$USERA1= <user>
##$USERA2= <user>
##$USERA3= <user>
##$USERA4= <user>
##$USERA5= <user>
##$V9= 5
##$VALIST= <valist>
##$VCLIST= <CCCCCCCCCCCCCCC>
##$VD= 0
##$VDLIST= <DDDDDDDDDDDDDDD>
##$VPLIST= <PPPPPPPPPPPPPPP>
##$VTLIST= <TTTTTTTTTTTTTTT>
##$WBST= 1024
##$WBSW= 4
##$XGAIN= (0..3)
0 0 0 0 
##$XL= 0
##$YL= 0
##$YMAX_a= 357865
##$YMIN_a= -297205
##$ZGOPTNS= <>
##$ZL1= 120
##$ZL2= 120
##$ZL3= 120
##$ZL4= 120
##$ABSF1= 10
##$ABSF2= 0
##$ABSG= 5
##$ABSL= 3
##$ALPHA= 0
##$AQORDER= 0
##$ASSFAC= 0
##$ASSFACI= 0
##$ASSFACX= 0
##$ASSWID= 0
##$AUNMP= <proc_1d>
##$AZFE= 0.1
##$AZFW= 0.1
##$BCFW= 1
##$BC_mod= 2
##$BYTORDP= 1
##$COROFFS= 0
##$CY= 11.3945322036743
##$DATMOD= 1
##$DC= 2
##$DFILT= <>
##$DTYPP= 0
##$F1P= 16.9975609425685
##$F2P= -3.02152046262296
##$FCOR= 0.5
##$FTSIZE= 0
##$FT_mod= 4
##$GAMMA= 1
##$GB= 0.15
##$INTBC= 1
##$INTSCL= 1
##$ISEN= 128
##$LB= 0.24
##$LEV0= 0
##$LPBIN= 0
##$MAXI= 10000
##$MC2= 0
##$MEAN= 0
##$ME_mod= 0
##$MI= 1.114404
##$NCOEF= 0
##$NC_proc= 0
##$NLEV= 6
##$NOISF1= 3.799351
##$NOISF2= 2.8
##$NSP= 1
##$NTH_PI= 0
##$NZP= 0
##$OFFSET= 15.70392
##$PC= 1
##$PHC0= -9982.046
##$PHC1= 28.6009
##$PH_mod= 1
##$PKNL= yes
##$PPARMOD= 0
##$PSCAL= 0
##$PSIGN= 0
##$REVERSE= no
##$SF= 200.130013532006
##$SI= 16384
##$SIGF1= 3
##$SIGF2= 2
##$SINO= 400
##$SIOLD= 16384
##$SREGLST= <1H.CDCl3>
##$SSB= 0
##$STSI= 0
##$STSR= 0
##$SW_p= 3612.71676300578
##$SYMM= 0
##$S_DEV= 0
##$TDeff= 0
##$TDoff= 0
##$TI= <>
##$TILT= no
##$TM1= 0
##$TM2= 0
##$TOPLEV= 0
##$USERP1= <user>
##$USERP2= <user>
##$USERP3= <user>
##$USERP4= <user>
##$USERP5= <user>
##$WDW= 1
##$XDIM= 8192
##$YMAX_p= 0
##$YMIN_p= 0
$$ End of Bruker specific parameters
$$ ---------------------------------
##NTUPLES= NMR FID
##VAR_NAME=  TIME,          FID/REAL,        FID/IMAG
##SYMBOL=    X,             R,               I
##VAR_TYPE=  INDEPENDENT,   DEPENDENT,       DEPENDENT
##VAR_FORM=  AFFN,          ASDF,            ASDF
##VAR_DIM=   8192,          8192,            8192
##UNITS=     SECONDS,       ARBITRARY UNITS, ARBITRARY UNITS
##FACTOR=    0.000296,      1,               1
##FIRST=     0,             0,               0
##LAST=      2.424536,      0,               0
##MIN=       0,             -297205,         0
##MAX=       2.424536,      357865,          0
$$ Real data points
##PAGE= N=1
##DATA TABLE= (X++(R..R)), XYDATA
$$ [...]
2151B54m67p78M24J782l515J866L55m94J20P40o66k093L515j419m93J92J258j133
2169e52o0J812k907J416J54Q46j277J498o99j390K070j333J3k02J980k183R09
2186I5J520k601R26K42O63k406L106p86k022J739J70o48j170K513k318J117J228
2203A368j096j285M95J251k326K734j303o13P42J175j409j478K594j749J206O2
2219C68j30j108J109M59k244J985r30M23k38J598j864l41K317k214P0J009J195
2236A464k855J962P01k366J194N53l01j511K985j216n51L28l96J04Q1J118j908
2253f14J645q09k88Q94j93j075p38L867k479p88J303M81j642K64J704k308J288
2270E12L79J15j928J741j39j430J360m81M41n85R03j382N94L78k001K145j60k58
$$ y = [254, -213, -991, -567, 1215, -2300, -434, -79, -573, -453, 287, -379, -2472, 1043, -376, -869, -677, 581, -552, -612, 1200, -1707, -291, -137, 709, -568, 930, 231, -1159, 911, -422, -409, -611, 1369, -814, 95, 1615, -986, -60, 182, 845, -1561, 1545, 759, -1263, 476, 646, -2, -1172, 1341, -977, 140, 1368, 272, -1013, -518, 733, -1593, 1141, -162, -775, -33, 1142, -267, -1745, 849, -900, 306, 368, 238, -870, 239, 698, -1546, 439, -491, -68, -306, 1292, -572, -913, 1404, -810, -740, 269, 1464, -1391, 571, 1272, -1094, 100, 653, 352, -1159, 1826, 610, 59, 387, -9, 95, 176, 1294, -614, 1031, 222, -66, 828, 635, -440, -1178, 2689, 210, -578, 725, 1206, -436, -172, 1532, -776, 512, 891, 1006, -922, 819, 680, -750, 610, 129, 570, -15, 888, -494, 100, 478, -1523, 622, 462, 204]
2288B04j568K923j832j403K090l35o06m05K278k253L53M32p32k47M24R36j656
2305a397K105j628J2M60M05r46j17K321k578R39N74k15j478J611N11k242K002
2322C39k5l73j262J971r76p29J404r18J108j262L98q76K409j401j641K696j16
2339G46r46n95K199k468k71K395o06j368M69K177k542Q80J60o51k95J341L38j701
2357g38J347r22J092r23N6J20P02J46j834K374j128q19k45J928j285j019K709
2374A561j395q51Q9J664j652j00R17q64J281l37l25j942K194j47p17P66r58N88
2392b28O5J195k698R81J113q69N81L09k13k225K770m56j030L04O47M68j119J313
2410I08j805J268n5n34k95J517j67k161K266m81m24k49J397j488j2K250j821K5
$$ y = [204, -1364, 1559, -273, -1676, 414, 79, -527, -932, 1346, -907, -554, -122, -854, -1101, -677, 259, -1397, 708, -920, -908, -448, -43, -989, -1106, 1215, -1363, -424, 150, -65, -1543, 68, 579, -1663, 339, 314, -59, -1321, 650, -326, -1055, 349, -569, 539, -723, -325, -1201, 1208, -193, -1834, 862, 746, -200, -795, 1404, -1064, -1335, 1060, 454, -914, -445, 1732, -810, 70, 230, -421, -716, 625, 963, -738, 609, -313, 779, -144, -88, 32, 734, 880, -954, 1420, 292, -527, -772, 1156, -129, -1148, 1561, 166, -685, -596, 1068, -584, -684, 233, -631, 650, 313, -12, -1954, 240, 93, -624, 142, -816, -228, -163, 1032, -1666, -685, 428, -441, 140, 449, 236, -1989, 781, 325, -705, -401, 246, 714, -405, 908, -897, 371, 316, -218, -513, 1004, 837, -1324, 942, 461, 37, -212, 1185, -303, -315, 1935, 114, 139]
2428A39j62P94j099J385j21j703R71O48K35j886R02n65J345M75j393K4K30N15
2446G34j486K173q93j010Q97J029n31k023K424j101M20k22L51q36O81N26j817
2463f84J410j83k58p73J158P6q62J012j553P65K11M31j550R07P96j409J171k38
2481D27m19j461K391m12j371L62j72M73O3O64k132J347P65o41m82M61J22j486
2499a501J989o20k71J40J71p7k49O95j624J650j24k87n47R33k97j483J764n67
2517c05L13l45O60r26L73J264k026Q36J97O51j444J396k71j234J020J07K96j209
2535f47J245r99P81K05j525M22M83O30j791J763k97r21O37Q4k9j032J781j173
2553c83M12J32l16m12L83N50j409J084l92J53l47O82o12l30Q57j110R79J56M3
$$ y = [139, -23, 771, -328, 1057, 936, -767, 204, 852, 1087, -799, 103, -462, 883, 1358, -35, -11, 219, 734, -752, 1421, 528, -482, 415, 1444, 913, -1110, 1314, 213, 633, 411, 762, -74, 607, 1133, -684, 726, 543, 285, -488, 670, 746, -116, 896, -657, 108, 319, 750, -800, 107, 903, -506, 665, 427, 8, -1453, 938, 526, -845, -483, -655, -182, -119, 545, -1587, -240, 525, -116, -598, -137, -15, -1501, 488, -132, -403, -263, -92, -169, -418, 277, -1347, 303, 179, -108, -655, 278, -19, -1502, 262, -305, 8, -337, 323, -603, -230, 1034, -992, -156, 41, 692, -752, 644, 373, -861, 159, 266, 562, -647, 598, -401, 380, 585, -940, -518, -35, 595, -1196, 567, 270, -651, -14, 70, 41, -991, 790, -383, 29, 161, -155, -567, -184, 366, -1043, 41, -351, -198, -545, 137, -475, -805, 52, -1058, -79, 77, 120]
2572A20j247J052O37j722Q12J90K77j030J562m79p27N60n06N89j78O87j424J022
2590A95J34q57M68J38J03p65J841j356l61P50R2n49J7J177j540P63J72j5r74P08
2610A41K97q47R84q57N88j25K12q04L54O66j424J417Rl81r72J468k81j331J202
2629C16k20k88m19J743j484j04Q02l54J49k47R29j201Q57o73J97P2j35k8j54J447
2649A205j946P99J50l71k35N55K31j515J632m50Q2l82M76r4n03J261p88o6l82
2668c41P65o58N86J50j032J207m57K01j058J328r03l23J110l64j88j60J045j325
2686d17Q86j43o59M57j61N90q82R73j331O28N07o02k10QR44j269J268n27o70m6
2706f56J460m08j622J594p43O7m43J257j004m58J174p54M33o27J83k57N35L2m86
$$ y = [120, -1127, -75, 562, -1160, -348, -158, 119, -911, 651, 172, -555, 5, -501, 88, -90, 597, -827, 195, 329, -528, -60, 78, 181, -584, 1257, -99, -460, 290, 382, -167, -150, 1027, -513, 250, 422, 407, -567, 141, 438, -409, 575, -282, 306, 181, 393, -411, -57, 609, -815, 602, 611, 230, -742, 726, 445, -886, 316, 96, -192, -611, 1132, -352, -456, 346, -8, 141, -106, 823, -378, 479, -194, 3, 75, -60, -88, -242, 1205, -741, 58, 208, -163, -398, 157, 388, -1127, 505, 55, 137, -245, 231, 137, -366, 895, 107, 41, -341, 424, -234, 352, 502, -530, 677, 220, 421, -637, 691, -212, -535, 575, 211, 23, -137, 908, -417, 469, 326, -333, 124, -37, 553, -329, 644, -687, -59, 448, -154, -364, -356, 588, -681, 587, 60, -610, -656, 804, 396, -1226, 368, -375, -308, -751, 506, -498, -956, 218, -536, -103, -730, -547, -804, -269, -237, -723]
2725g23P34q59N31l63R18j521R24M59q51O23J59j50j606J930oo66J16L12Om00
2745d33J025j011J18K11N31k41j82M11q12J347r05J13k88Q03l19m2M43r68Q39
2764F40l35K89m46R16m88j255J673n77L23p23J165j151K11J063j115L6k4O36j058
2783b20J055l60n90K55N12oj248Q52l54O38k69j12j85Q6O33r07O02o16P4J35O24
2804E99q61m79J297j107M75Q9K21r09M56O60j382R68J02p6p37J378n13o42N45
2823H4k17K92n58J241j165L80O6k4K60n18O4k07Q62n16oj0o1L10m17P61j363Q95
2845A53K19k22l29K63K82r87J274n02k23j77Q61r31k42J019j116P63n4K52r15
2864f12Q33k2o08P09n77N05o94P61o13J79M83o04J22j07L05m81O26k70k12L19
$$ y = [-723, 11, -848, -317, -680, 238, -1283, -359, 100, -751, -128, 31, -119, -1725, 205, 199, -467, -351, -39, -33, -433, 592, -419, -301, -90, 441, 200, 18, 429, -383, 964, 59, 172, -116, 687, 368, 326, 769, -199, 640, 305, 594, 148, 1064, 576, -679, 994, 417, 740, 17, 1182, 31, 242, 1305, 190, 226, 202, 838, -220, 835, 475, -115, 140, 652, 646, -602, 250, -104, 534, 265, 153, -32, 54, 687, -220, 382, -234, -160, -25, 599, -262, -741, 556, -551, -76, 13, 234, -675, -219, 441, -941, 27, 129, 53, -684, 694, 181, -461, 84, -133, 159, -399, 842, -323, 57, 123, 99, 359, -159, -95, -302, 560, 44, 38, 28, -33, 277, -140, 621, -742, 153, 372, 150, -179, 84, 366, -621, 653, 151, -72, -249, 612, -319, -561, 458, -658, 105, 51, 303, -612, 221, 199, -409, 300, -277, 228, -466, 295, -318, -139, 344, -260, -138, -245, 60, -421, 205, -65, -277, 42]
2884D2L6j51o24J191r40J35M05j25m81K41O92r92Q26l29J99k54K78l8p88J106
2904D29q98N03l67N69o47M85P9p59O69j31K91n46M72o67j84P91k37K24k86O80
2924D70o68L57o0q37O75L02K13j245J218m97l71N95l02j16m3Q98j054M66j98K92
2944I5q9j57L47l84O74o11J73j52R6l56L23N16j284J201l20j37m66Q95l52o39
2964f27J117o31o3j68J016p31m30Q75m87M81o52Q78p89O49k29m35M80l17M87l25
2984I9O18j063L95L06k44j68Q4O27q76R41n51N2J59L3l85m43R79n80L45m68J91
3005E1m42N10R2n92K86mN93j007K70k0k49R13o44K3J43L37m90J99l76k60N36p5
3027b06M06j332J118k09j21L35m37K86l88J072j323P44j08L0j44K39m1n43J185
$$ y = [42, 78, -73, -697, 494, -446, -311, 94, -31, -512, -271, 421, -571, 255, -74, 125, -129, 149, 111, -677, 429, -469, 34, -333, 236, -411, 74, 153, -606, 63, -68, 223, -323, 149, -518, -702, 89, -148, 76, -210, 470, -198, 159, 99, -738, -63, 239, 452, -793, 425, -72, -443, 152, -150, -266, -309, 589, -465, 1, -197, 95, 6, -151, 196, -188, 486, -125, 48, -104, -8, -364, -41, 475, -809, 392, 72, -65, -531, 364, 12, -627, 490, -141, -204, -372, 644, -87, -517, 358, -129, 352, -300, 578, -211, 438, 209, -226, 254, -63, 424, 99, 717, -346, 49, 355, 111, -57, 27, 654, -222, 719, 168, 220, 379, 412, 27, -416, 563, -17, 328, -140, 51, -391, 119, 211, -381, -95, -99, 494, -513, -243, -263, -512, 401, -243, -220, -77, 260, -230, -31, -407, -667, -131, -206, 200, -1132, -14, -223, -344, -9, -446, -160, -548, 524, -799, -55, -163, -133, -277, -38, -79, -622, 563]
3046E63r41J77l33O15l92k9L88n21R65p03K40o42O90L0m38N40o22N11j43M87p22
3067b80J60O50n43K4N9J21m43R92m37o26M73P0k1p42Q75p40M64K32l98K50m11
3088b71O53r40O77k52L71k6k23J07l09O65r02O06j36l0j33M68k02p77P51j86L38
3109B49o59P98l77j15O44j069O02k71M48m76M72k8l76M80k48K70m86P52p10L41
3129B41J80m53J0j42Q39j085P10j11J7j38J80P9n52M96p16N74q8K17k24k08O16
3150D42p67R92p23lk86O96m11l21N66n26M17k99O84q44M09K49o49L67j01K33l35
3171b10L90j70Q7kk04L29n96J087j242L81L36m39L7J62P2o32R76l82J44p0J73
3192B27k00m58R39o60M76n89N16k49J0K65n37Q38o65N31l31L03l53K70L02o86
$$ y = [563, -378, -201, -534, 81, -311, -340, 48, -473, 492, -211, 29, -613, 77, 107, -331, 209, -413, 98, -45, 442, -280, -120, 530, -13, 11, 70, 191, -252, 740, 303, -323, 150, 220, 199, -543, 332, -408, 56, 288, -110, 140, -271, 382, -558, 119, -133, 238, 212, -11, 96, -213, 452, -450, 156, 20, -10, -143, 325, 123, -654, 97, -89, 249, -410, 388, 11, -104, 540, -529, 73, -198, 250, -226, 246, 218, -158, 322, 74, 344, -142, 610, -100, 241, 421, -32, -22, -164, 675, -410, 300, 189, 206, 68, 248, 327, -225, 271, -445, 129, 41, 258, 34, -174, 442, -325, 667, -56, -59, -345, 351, -60, -381, 185, -341, 76, -223, 461, -383, 26, 275, -374, -7, -108, 125, -210, 180, 10, 97, 95, -109, 220, -376, 711, -531, -150, 186, -253, -216, -54, 18, -614, 362, -20, 124, 54, 227, 27, -431, 508, -152, 324, -265, 251, 2, 12, 277, -260, 578, -87, 444, 113, 416, 63, 333, 635, -51]
3212e1N11j50M24j144M97M87q24M56Q8L4o08P37o52K18R8k23K81l04N47p41Q03
3233D84o81M2J61k86l4k74Q58o10K89m00K07n0M8O67r97M18k10J60k08N18p0m91
3255d59O13p71N10j10K56m30J17J03l17O21l52L95n64N53m86K73L02m29N5L8O06
3276E24q54N52j50N5M4k34O25p08N47m07rJ24n9K28n26Q07p41Q02m74M9j45R4
3298A44L86q69R28o84M20o61O87m60j45L89k33L58n50O01o92M22j36j89K79j14
3318a19m0l01Q81p40l0K65k2o0j7L03o99Q34m13k54J75J91K65q25O35n34M40J46
3340H1j43j05n3N43o54M05o23N06j86L04j58j15O86q32M86k22K04o06N05K78o31
3361c30K94j48P84q45N12l12K0P2NJ97m79N59n15L99k79r0O03o13K55l84J053
$$ y = [-51, 460, 310, 734, -410, 87, 574, -250, 206, 294, 328, -280, 457, -195, 23, 121, -102, 179, -125, 422, -319, 484, -197, -155, 6, -280, -314, -588, 270, -340, -51, -451, -244, -294, -246, 421, -576, -158, -368, -208, -416, 102, 32, -459, 154, -617, -107, -217, 39, -391, -274, -171, -488, 133, -219, 176, -388, 165, -321, -48, 254, -175, -120, -82, 524, -330, 222, 72, 127, 171, -63, 562, -146, 401, -6, -15, 109, 50, 278, -248, 559, -182, 620, 146, 195, 50, 144, 530, -339, 589, -95, 325, -336, 351, -109, -254, 135, -98, 260, -290, 311, -381, 41, -95, -284, -5, -119, -159, -460, 421, -319, -349, -84, -106, -166, -183, 120, -579, 255, -158, -412, -237, -46, 219, -606, 29, -505, -65, 81, -62, -167, -220, 323, -331, 74, -549, -43, -229, 75, -83, -198, 488, -344, 142, -80, 124, -482, 23, 301, -330, -36, -184, 600, -245, 267, -45, -25, 47, 52, 249, -230, 329, -186, 213, -66, -156, 447, -166, 89, -295, 758]
3382G58o49k84Q8K84l30N9N77p71L45k41L39n40L29K24l10L95n46L54l21M67k46
3403a9o3R0m87R23n28R7l91Q10p72j19P58j68k73j35Q53p54k4M13J6k27k12N71
3425C59l67J36k14R2mJ49j53j79L45q21R25j94n8k72J63M73j067J019k89K6m03
3446c34N04p7o66Q31k34L56q70O23p7L64l42k09K24k17O1n8N44p63J6M72j99q8
3468a39j73R74j249M61j7M3lJ0K79m55N58m91M95n22R9O08m21o5l16P80n16m0
3490a00p1O66l93m77Q18m22j47j28P51p00O6O06k00k25%L42m69J61K79l00K02
3511B59m26N49k93M86n71M81j92l11N83k12M3n22P03m37n5J05L90m69j44N12l77
3532A02N5l42O17m00j57L18l61M70n19K48j5P2j71Q6M22r19R11m95N1n09M52J67
$$ y = [758, 109, -175, -87, 197, -133, -74, 503, -268, 77, -164, 175, -365, -36, 188, -122, 273, -273, 81, -240, 227, -19, -82, 8, -479, 444, -84, 13, -378, 432, -340, -459, 299, 131, -142, -277, 576, -178, -202, 211, 227, 0, -212, 359, -8, 128, -86, 6, 2, 151, -2, -181, 164, -657, 268, 74, 16, -256, -93, 380, -687, 332, 43, 69, -334, 170, 93, -573, 258, 24, 380, -490, 133, 56, 420, 78, -131, 93, -124, -63, -121, 423, -340, -324, 148, -51, -139, -312, 662, -587, -126, -143, -100, -103, -93, 186, -269, 289, -202, 293, -229, -130, 478, 57, -8, -324, 456, -60, -100, -171, 495, 102, -375, 443, 21, -126, -254, 497, -203, -137, 469, 269, 44, 44, 386, -83, 78, 357, 57, 259, -167, 382, 89, 575, 4, 485, 293, -18, 565, 353, 396, -126, 577, 140, 85, 190, 580, 111, -33, 479, 102, 157, -185, 432, 32, -125, 193, -168, 302, -217, 31, 16, 88, -83, 3, 425, -494, 417, -78, -27, -536, -84, 83]
3554H3n04K93q7K60l98N28k40R5n6K2N1q20J041m52O08p87K8N59k65L54p51N42
3576A04l90K94j24K52j37q7N94p05J08LM79m03J87J1l66M95m27M28m30N6K0K05
3598A67P4n18Q29o24K61m30N11L8n67K93k45L63j97M07m59k4K04j04L6k67J87
3619f5k94O47j21j64j25m05N48j6j05k84N32j81N9l59K78J88n33N85l27p2J1K63
3641F0n7m07M70l19J57l52L90jN9o7o0K06n28O60l30J41j56K7J15l02L45k88L26
3664H9l81P17n53J0L93k74L5k36M83l89J41o7M1l36m7M60m77L57k94K56J63k1
3686G0J29m91M76l51L54l81K99m17K24n3p2K38k32J55o4L12l18R0J3j09J33j42
3708a37J04m26N35m3r3K68m84L06q4M07n59L84J35k35K10m71L89m00L55K5k3j96
$$ y = [83, -421, -128, -215, 45, -353, 175, -65, 30, -26, -4, 47, -773, 268, -184, 424, -363, -335, 224, -41, 313, -438, 104, -286, 8, -116, 136, -1, -88, 506, -199, -91, -88, 391, -12, 175, 186, -180, 315, -112, 316, -114, -58, -38, 167, 241, -277, 552, -72, 189, -241, 270, 308, -259, 34, -211, 152, -45, 362, -97, -121, 83, -21, 15, -252, -65, -359, 288, 167, 3, -122, -527, 21, 5, -100, -384, 148, -33, 26, -333, -55, 133, -400, 185, -142, -214, -203, 60, 3, -404, 66, -253, -96, -448, -58, -59, 0, -67, -127, 79, -449, 211, -119, 22, -134, -107, 8, -294, 51, -237, 89, -292, 425, -128, -118, 275, 1, 36, -200, 283, -106, 35, -32, 9, -327, -374, 86, -391, -34, -328, -72, 91, 70, 199, -292, 184, -167, 187, -194, 105, -312, -88, -141, -213, 25, -207, -52, -116, 196, -122, -32, -19, -128, 5, -137, -33, -459, 76, 33, -60, 208, -276, 30, -54, 353, -206, 178, 313, 78, 288, -183, 206, -194, 161, 186, 163, -33]
3730c3K8K56l98L55k34K14j03J4K30m65N43m26L38l27L02k58J70k27l81N64k95
3751a33L28n57O86m33J49K73l89rQ8L89p02L16k14K36n1j41J75k50M01m34M45
3772A73l16l4J93k3K25m49N19k34m6l03N95k86n2M79m97J75k76M86m18K1L92k95
3794B9J60j66K68n21K39j61L25J09k33K02l49M73o81Q14l11k61L22p3J24l14M46
3815D41k01j65Q0P5K2o46O05r4L98o74L20k00J13J58k87M37o41O01k85K7j94J09
3837aL04q30P21k54L14n23M97j52l68O98n89M25k99P8k00K81j34KK41m68K89m36
3859d04P90m75K45r5j87L04o28R52o10K8J15j76J93j54L78p53M75k14M14l34O6
3880g0J59j79M9m25O48n6L41q30M84J02l05L26m68J71j24K80k27q2M54m22J65
$$ y = [-33, -5, 251, -147, 208, -26, 188, 85, 99, 329, -136, 407, -19, 319, -8, 294, 36, 206, -21, -402, 162, -133, 195, -362, 324, -109, 40, 313, -76, -85, 3, 392, -310, 6, -208, 28, -23, -164, 11, -239, 162, -272, 173, -143, -177, 16, -7, 218, -231, 288, 54, 8, -295, 300, 14, -38, 441, -56, 119, -157, 329, -89, -68, 324, 29, 189, 23, 291, -230, 9, -152, 173, 282, 49, 251, -98, 375, -306, 508, 197, -64, 258, 185, 309, -5, 441, 240, 75, 155, 230, 252, -394, 211, 117, 515, -159, 161, -39, 74, 232, -55, 382, -259, 342, 57, 84, -110, -1, 303, -527, 194, -60, 254, -269, 228, 76, -292, 406, -183, 242, -57, 21, -179, 102, -32, -30, 211, -257, 32, -404, 386, -89, 156, 61, -126, 178, -450, 502, -108, -80, 35, -141, 52, -102, 276, -477, -2, -216, 198, -136, -70, 89, -90, -41, -466, 182, 126, 467, -363, 121, 223, -82, 244, -224, -53, -177, 103, -124, -206, 248, -174, -9]
3901ik33N43m53L11j77N9q6n3M84o76M37m39M31O1l94K28l81O82o12L87o3k43
3923a96L2L89k14j70N49n62L97n25N10j91l34O64o14M64p05O38r8j14k18m7K41
3944a04l50N85l94K00k68N53J30m04L3o2J95j60L99k08j50Q9j38L36l79O0l52
3965c89L60K02j17J00l93J49J36L22n09L16j54K22k67k80O06m25O8P3J97m76Q2
3986a77L52m38N38n05M62o00M37L9n28N76k16O5J17J61n25M93k52J2M06m85K32
4007A64m07L89k05k3L89l71Q9q9M01l49k1o1J92j28kKp6K46k92N53n19J41PM1
4031G1J41k94M43l55J92m24J90J16l96M89j39l4m23P76l44j28K65j20J03m07L74
4052I6j02O01p88L80l3o2J16l30J93n02L77M2q8J76k38N86q22L12p9J57k41M09
$$ y = [-9, -242, 301, -152, 159, -18, 41, -45, -98, 386, -290, 147, -292, 139, 200, -194, 34, -347, 335, -277, 110, 47, -196, -164, 225, 11, -159, 390, -172, 225, -300, 210, 19, -315, 349, -265, 199, -506, 132, 34, -80, -298, -345, -104, -454, 131, -263, -63, -331, 222, 352, -52, -19, -81, 114, -46, 353, 145, -5, 84, -54, 282, -97, -37, -389, -29, 173, 56, 156, -237, -88, 48, 370, -139, 177, 23, 245, -22, -302, 304, -121, -53, 20, 217, -259, -177, 175, -263, 275, -230, 232, -368, 69, 108, -420, 156, -60, 5, 122, 283, -242, 251, -1, 11, 417, -68, 164, -243, 146, -59, -82, 307, -64, 25, -64, 337, -12, -33, -94, 98, -30, -32, -30, -106, 140, -152, 401, -118, 23, 30, 71, 212, -82, 361, 6, 198, -226, -36, 80, -316, 173, 34, 0, -423, 353, 9, -119, 146, 26, 129, -278, 96, -6, 595, -193, 187, 154, 92, 208, -122, 71, -431, -54, -12, -100, 76, -162, 424, -398, -86, -165, -8, -249, 160]
4074A60p5l64M68j34Q3o99P50m24J91o8rN68p09P1J06K77m55J77K88k07Rl87O78
4097B95l77P4J53K4K23m64O36o01M72m70O9j04J52J41j49J59k75L37l11J68M6
4118A98k27K08m15N04n4l78j5P04l74o42P31l74M13m72L23k69J2o3J24K13m30
4139b83K45j99K93k85M36j76l68N03l46J33k83N41l13r0OL1K33o34O23j65J71
4160G3n21L89L03p59O34l12K39k54O6N3K12oj05O55q66M99m13L60k31qK87k45
4182E0L91m69L65l45L93k04J58j25k81N89n12L08l89L65k03k01M67l20J11j67
4202a9M96o35K2K17n3J53l59M57m91M86l63J6n5N8K84m73M54m30O17m51J00M4
4224G5k21L12k23L00l59K18k21J45k29m8J58m1L66n70O19j34k76J33j54L49n63
$$ y = [160, 85, -279, 189, 55, 138, -561, 189, -235, -44, -112, -121, 447, -262, -191, -85, 192, -263, -86, 202, -5, 4, -383, 295, -82, -8, 145, 169, 392, -72, 564, -37, 435, -35, 34, -70, 82, 223, 74, 233, -42, 295, -16, 152, 198, -29, 179, -236, 268, 214, -164, -179, 525, 151, -491, 240, -134, 279, -193, 130, -139, -127, -190, -66, 147, -283, -38, -237, 56, -229, 207, 31, -337, 166, -180, -47, -330, 211, -102, -192, -186, -155, 78, -556, 67, -98, 73, -448, -59, 244, -515, 119, -193, 46, -208, -142, -89, 123, 117, 12, 667, -199, 300, -113, 247, 16, 8, 295, 50, 441, -28, 337, -8, 385, 181, 339, 214, -67, 522, 10, 318, -71, 294, 91, -110, 357, 37, 148, -19, 477, -158, -136, 81, 28, 181, -178, 279, -212, 274, -89, -73, -128, -70, 214, -259, 195, -235, 382, -69, 31, 75, -146, 166, -57, 243, -116, 102, -119, 26, -203, -251, -93, -134, 232, -338, 281, 147, -129, 4, -150, 199, -364]
4245c64M62j21j5j74L15P5l83K61J05P4l42K52k49J68M7k39L81k93M03l08k6j94
4267a65Q6L41k27p6p2N04p70L74J68k75K5m6J75k35K69l08J39j02J27K90k62J44
4289A04m00M63k15NJ41j83j0j42M39n94N80l12O3k30n7L11j6J81l14K35j12K58
4311A95k71P9J49m93N30j85K98l91M32n50R6M84n37L84m10M40j97P8k04J90m1
4332G6l65O49m24P0O6J77M4l94M48m59L63k53k5M7J97k02k47N35m98M55o27M86
4354A19j11j9J86n2n2k93M35l26L24q1j83K88l61j3q7L29o40O28l84K93J07l06
4376a99N44o84K96Q8Q4j26j67K21l14M07j08K11n64K50M6J41%m05M59m14N14m53
4398a73J71J02Kj3k68M03m26N51l89J72J10j12J98l32K08j97J13j13L04k96O9
$$ y = [-364, 98, -23, -38, -212, 103, 178, -205, 56, 161, 235, -107, 145, -104, 64, 111, -128, 253, -40, 363, 55, 29, -165, -79, 262, 35, -41, -113, 391, -379, -5, 163, -112, -87, -133, 42, -193, 76, -232, -93, -195, -68, 222, -40, 104, -296, 167, -48, -43, 98, -85, -95, -237, 202, -392, 188, -124, -61, -291, -348, -37, -53, 128, -186, 49, -63, 195, -76, 3, 152, -341, 189, 4, 302, -89, 343, -207, -111, 373, -164, 220, -190, 250, 53, 131, -73, 117, 76, -289, 360, -64, 6, 72, 249, 293, -101, 347, -112, 251, -2, -27, 20, 217, 15, -232, 303, -195, 260, -367, 119, 8, -11, 175, 123, 71, -222, 213, -113, 211, 130, -53, 235, -126, -139, -226, 103, -537, 91, -293, 0, 107, -199, 345, -339, -43, 45, 129, 3, -164, 57, -257, 150, 42, 253, -311, -61, -15, 126, 126, -279, 180, -234, 280, -173, -2, 100, 102, 89, -179, 224, -202, 349, -40, 132, 242, 130, 328, -4, 204, 7, 120, 7, 311, 15, 84]
4419H4K89l09M54n97M11k79j2j64M0J45l95N56n10L33k67L46J2m58M12k37J19
4440b7l85N08l45j4J32j26M28m65N02m95L91k33L7ok04K77n8K27k88k9j61L18
4462a6N9k96N23n54N35m70J15M1J02K7K08l03q6J31n71M47O8K4k3k60O82n79L04
4485A08l86L27J0Lr4K1K71m01J93k41K02j91R2J92l86N24m37L1Q9J37j0j26K39
4508A67k61Q8j22K16l52L68L8l51K06j08K31k82K52k55L3M7J2K42m89L65m51M09
4530CK5K62k34j67L98l49J64l29M63l45K95K4m13J87j94L58j15L14k81J03O2n08
4552b77K82NJ31k43J74k06K04k2L2n2k60L39j05L1K4j80J15L9J16m66M17l10K53
4575D1m9J53o7m05N91k99Qn0L25k55J74nl34J00k31L27l20K73k7J42j92J06r7
$$ y = [84, 373, 64, 518, -79, 332, 53, 41, -123, -83, 62, -333, 223, -287, 46, -221, 125, 137, -321, 91, -146, -27, -412, 96, -249, -263, -131, -257, 171, -294, 208, -287, 104, -129, -92, -98, -302, -25, -83, 144, -144, -173, -334, -16, 43, -253, 270, -284, 251, -219, -104, -63, 39, 66, 274, -29, -115, 16, -555, -108, -40, -16, -39, -299, 383, -196, 108, -278, 49, 59, 62, -32, -11, 260, -141, 52, -189, 13, -178, -86, 106, -280, 244, -193, -162, -73, 64, 54, -72, 167, -94, -6, -128, 88, -264, 104, 142, -209, -3, -111, 120, -162, 90, -165, -132, -85, -73, 169, -320, 45, -406, 3, 28, 290, 56, -111, 287, -62, 102, -227, 236, -109, 186, 210, -203, -16, -210, 148, 33, 347, 66, 169, 231, -277, 5, 10, 141, -102, 72, -134, 70, 48, 80, 28, -232, 107, 2, 33, 57, -123, -8, 31, 147, -319, 98, -212, 41, -8, 145, 78, -327, 264, -35, -27, -77, 248, -7, 167, 162, -172, -72, -303, 24, -296, -23, -50, 92, -100, 6, -91]
4598i1N0J76m35L38l4n5J20r1J44k02M07m82L42O7l75m6n6L75m46L80l55M00n1
4621H0j44L35l99M17m80M42k19K8J90l79L12j81K27l54M72l82r9K77j85L86l55
4642a1N10m13J92k88J08L2k12L78k84K11n48M18j14k08L64J78k42l42N73l16K42
4663B28j43K12k72k63M36k97J08j46M48k79Q3j65k42M42j56K12j08r8k92K29J95
4684A32l84M59j93Q3k05J65q0k32L71j85K15k52K57j02K21l85P8pj77K18j22J46
4706B1l08J50K54j26j32P1L29n85M57m07K99j15j95P66q38N59l48K59k10J35O2
4727I8k7J50m07O01k23k33N4j39J45j78L86l56L90k87L39k12r2N5k14J25k11K64
4749B8k28J39J00M6Q7j94L28l80K27k05K85l29N4n0k09M67k83N11k40M9l98K9
$$ y = [-91, -41, 135, -300, 38, 4, -51, 69, -22, 122, -80, 327, -155, 187, 254, -121, -167, -223, 152, -294, 86, -269, 131, 80, -64, 271, -128, 289, -191, 251, 32, 60, 250, -129, 183, 2, 229, -125, 347, -35, -134, 143, -42, 344, -11, 499, 86, 278, -10, 98, 130, -82, 296, 12, 223, -325, 93, -21, -229, 135, 313, 71, -271, 302, -14, 228, 85, 297, 25, -238, 198, -99, 9, -137, 311, 32, 115, -50, -292, 150, -6, 206, 98, 0, -292, -63, 132, -252, 207, 14, 97, -108, 57, -23, -255, 116, -69, 146, -106, 151, 49, 270, -115, -37, -44, -221, -3, -125, 21, -287, -137, 117, -9, -141, -70, 259, -326, 131, -276, 23, -92, -287, 479, -359, 200, -148, 111, -99, 36, 98, 71, 221, -186, 415, 192, -41, 13, -126, 19, -159, 227, -129, 261, -26, 313, 101, 9, 64, -150, -25, -236, 28, -200, -61, 39, 85, 172, -22, 306, -74, 153, -52, 233, -96, -42, -92, -301, 166, -117, 394, 154, 203, -195, -166]
4771a66J40o4L92n59L75j87K70j22M7p3j0L80p81M74q8J59j74p5K27%O7n13N77
4794B96n04L82l61K62K5k88N70l35K06n23N50l39k57M31j02n9j44L73n64N16N7
4815A92k38K40m54N68l33L1j17R9J02j15K74o85O64n55L89j4%Nk34K79l42K80
4837C6k45K74k63J75q4q9M16l82L19m62K90J44N6p8j19K52k62Q9j83J46Q3J19
4859B32k80j21L83m86N08k84L61j0k73M8m5R1l41J72j88M27k72K77Q7n92M24m40
4881c22O66k31m0j51j05P0k18O19o87M17r8J7k58k06N28l08M23k62L68l95M9J69
4903D5j43L17m22L64k94L33m12L13k7j22L74p61O89m45J92O7j31K04l22N05o22
4924b98M82l51K97j17J71J4l31J15m6M10l80L44m83L21j20q7M24m43M28k75K82
$$ y = [-166, -26, -90, 302, -257, 118, -69, 201, 79, 126, 53, 43, 423, -358, 116, 28, 187, 13, -62, 165, 165, 232, -281, 296, -208, 174, -187, 75, 100, -188, 382, 47, 253, -270, 280, -59, -316, 115, 13, -46, -190, 183, -381, 135, 192, -46, 194, -260, 308, -25, 6, -111, -12, 90, -25, 249, -436, 228, -327, 62, 48, 48, 53, -181, 98, -244, 36, -209, 65, -198, -23, -107, -196, 220, -162, 157, -305, -15, 129, 185, 107, -12, 240, -22, 67, -116, 30, 113, 232, -48, -169, 214, -272, 236, -48, 313, 303, 30, 78, 33, 124, -217, -45, -233, 194, -78, 199, 286, -306, 118, -322, 344, 113, 73, -78, -183, -113, -331, 288, -399, 18, -80, -63, -321, -527, 1, -307, 116, -146, 222, -173, -124, 45, -98, 219, -203, 161, -133, 200, -212, 101, 74, -48, 326, -435, 254, -191, 1, 68, -63, 141, -181, 324, -298, 184, -167, 130, 13, 184, 198, -133, -18, -64, 346, -34, 310, -173, 148, 28, -59, 365, -78, 350, 75, 357]
4945C57n2m58J07k0K6j45M29k06QN2r4K2j44N50n31L70n65K40j5J98k93j25M55
4968A66l94L99k17K80l42J03J68n52O27l55K65m62M37K5l17K94k84M12m14O6K3
4989g2L1J00m8O0qM6j52M01k67J60p0j83LP0Q5m28K44L5P2j33r2L65j17L9k67
5014a26L48n47M44j43n3L17k17K67m86K28j65J12k9j71L80k67R8k57K26Mn9J09
5036A3j91J66lj00j48K01j95L12J33p45Q28n78K99o7P9pk86J88j55K87j61J51
5058B1k03L41j40j2N4p9K50k95K57n80L52M5N5J32m01M71l65N00l74O1j27J24
5080H7K64m10K67j67L16m71K99J28m25M35n44P10p24N10l52K62l00J0L25l11J88
5101I7m94L36j44L16k33n3J39k87M26n62N74j13L6j01o8L78m55M40o62N51l33
$$ y = [357, 305, -153, -46, -66, -40, -185, 244, 38, 46, 98, 4, 26, -118, 432, -99, 271, -294, -54, -69, 129, -164, -289, 166, -228, 171, -46, 234, -108, -5, 163, -389, 238, -117, 148, -314, 123, 148, -169, 125, -159, 253, -161, -95, -72, -41, 59, 11, 71, 63, 109, -43, 358, 91, 251, 181, -2, 1, 71, 156, -272, -28, 7, 79, -54, -146, 219, 102, 141, -126, 222, -325, 119, -24, -77, 240, 23, 290, -196, 32, -133, -21, -50, -221, 159, -108, -10, -267, -41, -37, -96, 13, -178, -12, -15, -115, -263, -62, -257, 55, 188, -557, 271, -307, -8, -75, 4, -3, -289, -101, -256, 31, -130, 21, -182, 159, 19, 7, 61, -18, 232, -63, 194, -386, -34, 11, 66, 198, -203, 268, -97, 403, 29, 90, -37, 87, 351, -59, 208, 41, 357, -114, 185, 313, -112, 323, -221, 489, -235, 275, -77, 185, -115, -105, 220, -91, 97, -397, -61, -205, 111, -122, -175, -36, -323, 103, -459, 115, 2, 38, -63, -131, 247, -208, 232, -430, 121, -212]
5122b12J01j35O8J62l18M73l11p6MJ50K95m96L56l34L04n6Ok87J14L50m37L13
5144C4k85M56l58O7J73O5qk90M66l56M2K13J43m03k4K06j68M29o59N08k48l6J35
5167A02m47N25l74M99m71L78k68L31j95r0J76k22K10l13L69k36L62l11jJ04m53
5188c25L19j51O1j59P4R6n3Pp0L52k22N9l07J83K63k05pk16M23k31J73l15J36
5211a15L3j50J93j10N0j36K18P3O1k06J17J13m06K35j28K28k4j1m9n8L30o40M53
5234G1r8K35k03P9k4j17mj22K08j54J12Qj17M19l62L48k19J91k29J99L1k13K78
5257C17m30L30l71N24o86L61k18K22J73k87L2l68N49m53K52K84j04J56n15L31
5277I9k30K52k98K16kj86L95k18K08n80J13J4K18j40J42L99p47M26l45M25k02
$$ y = [-212, -111, -246, -178, -16, -334, 139, -172, -248, -244, -94, 201, -295, 61, -273, 31, -25, -19, -306, -192, 158, -279, 34, -251, 205, -153, -86, 87, 152, 144, -146, 320, -36, 6, 219, 362, -41, -65, 141, -27, 402, -257, 251, 3, -33, 102, -345, 180, -194, 305, -166, 212, -56, 275, 80, -10, 166, -56, 154, -159, 210, -26, 336, 25, 24, 128, -325, -6, -157, -96, -255, -181, -85, -138, -131, -201, 151, -71, -12, -319, -136, 127, -78, -85, -301, 122, -109, 64, -251, -115, -82, -232, -39, -149, -99, -235, -17, 56, 117, -89, 28, 141, -265, -30, -158, 70, 46, 35, -14, -72, 258, -382, 71, -27, 208, 5, 84, 60, -57, -61, -183, 25, -129, -17, -9, -126, 293, -69, 279, 60, 251, 22, 221, 252, 39, 317, -113, 217, -154, 370, -316, 45, -173, 49, 222, -65, -33, -401, 148, -305, -53, 231, 127, 283, -232, 99, -131, 121, -177, 39, 37, -149, 246, 28, 236, -344, -231, -217, 1, -139, 3, 402, -345, 81, -264, 161, -41]
5298d1K83r6k97K27k72K85j80L09k32M3j61J63R0l03N51n09J99j88J68n6r6L43
5320B30n71O14n14K62J2n4K3m02O48l98J82j01K96j98M8p3m42M95j62K00j72J21
5342D4j05LJ34n75M17L5K47j05k9k08K0K74l13L17m92Q82p94J94j28lL26m29L48
5365F0n22N58p0J40k57J29j11m1K63n0okK12l71M9J59k56J93P3j7l19K93J79m92
5389b06N19l97M23k32J61m85M14J26l47J06l98M47k99K07n0K72j70k00M90l34
5409D7J05m93K93K85k90L3j0N64r66J56J61R7j11J62J01K1K96n47J58j26K44k42
5431f2r7L19j79L85n08J91l54K08Q0k53L63k36J26j0K90m80J19O6j13K38l38N32
5453B87m34K15m0kJ46k19J43p9P6k65J15l4L73l54K58j85j2J73k8k56M30j70j79
$$ y = [-41, 242, 146, -151, 76, -196, 89, -91, 218, -14, 29, -132, 31, 121, -182, 369, -140, 59, -129, 39, -17, -113, 230, -341, 273, -241, 21, 33, -21, 2, -400, 248, -150, 32, -69, 227, 29, 77, 4, -438, 57, -105, 95, -77, 44, -61, -58, 76, -499, -82, -47, 200, 95, 66, -142, -122, 152, -161, 156, -336, 546, -248, -54, -182, -185, 141, -288, 60, -462, 96, 26, 166, -91, 38, -73, -114, 149, 99, 93, 91, 303, -68, -19, 140, -116, 77, 150, 133, -186, 107, 286, -206, 313, -84, 339, 107, 268, -217, 197, 323, -24, 82, -316, 131, -168, 39, -11, 261, 91, -109, 381, 47, 152, -341, -48, 237, -53, -20, -30, 534, -432, -276, -115, -18, -129, 33, 134, 155, 451, -96, 62, -64, 180, -62, -159, 160, -19, 366, -142, 49, -305, -97, -17, -270, 93, -143, -17, -27, 263, -217, -98, -32, -145, 93, -245, 287, -147, 68, 28, 26, 172, -47, 96, 17, 93, -172, -57, -91, 282, -72, 186, 1, -11, 162, 134, -122, 308, 138, -41]
5476d1J8K71l56J80%J90k14j00qj61L07m38M36j72K91k70j63M10m39N10m39K96
5498A08l32L60l75L26J29l99L11m27O10o39L7M00k30L43l85L64l96O31l84j28
5518g6M0n7J55l85M55k26J87j22N7j42K2K03l99K78j2J29j82K25L9k20N8j10j08
5541a91K3K12m5j88P7m5Q0%K30n05M87k43K88l39J23j4j23K97j91K25O6m23K26
5564B7j44J20k47M26l41M04l89J97P6o37P45l91L30l65K35j38N4j4m2K44k73J36
5586A3j68L08j87L5J88k94L12l23J54j84J52J12j35J27k54J19j30L52l80M6K07
5607G0J56l11pJ28k89P2l8K25K7O6k00j27L56l47L87l64O6Q7K68r7m81L92k17
5630a78K91l34J56k3J3qk22O7n6L65l96J24K01k78M13j93L57n63N26m99m0L32
$$ y = [-41, -23, 248, -108, 72, 72, 262, 48, -52, -60, -221, 86, -352, 84, -88, 203, -67, -230, 180, -259, 251, -188, 108, -224, 136, -239, 87, 216, -183, 128, -299, 311, -328, -291, 109, -121, 222, -163, 201, -195, 436, 52, -76, -36, -93, 62, -323, 132, -94, 93, -29, 28, -114, -92, 111, -288, -10, -22, 107, -75, 150, 189, -31, 27, -83, -191, -168, 44, -1, -189, -112, -157, -77, -77, 153, -352, 135, -108, 180, -159, -36, -50, -173, 124, -67, 158, 224, -199, 27, -117, 3, -244, 182, -159, 245, -144, 53, 129, -508, 237, -154, 176, -189, 46, -92, -38, -52, -94, 150, -123, 13, -155, 153, -34, 1, 189, -105, 207, -116, 38, -146, 6, 118, -17, 110, -144, -25, -155, 197, -183, -137, 70, 226, -85, -92, 36, -253, -181, -219, 6, 33, 99, -101, -228, 128, -219, 168, -196, -130, -43, 225, 128, -353, 39, -178, 113, -221, -65, -88, -75, -83, -305, -238, -294, 71, -325, -201, 0, -278, 135, -58, 299, -264, 262, -237, -277, 55]
5652E5j24lM4N13o74L79k77K02j82n3K82n33N16k64L22j17L81n67R0K12k68L64
5674B98j99j8l31N09j41k26N14l84K73k76K39r5j62M4n3Q0j86L99l37K83k79j27
5696a75K88j24J58q8L46l92K01j44Q3j95JJ46n04N94j15J64j20k10R6j71K29m03
5718c35K95L1J31k40j5J31j29M49m07J90k85L51j36l21L51j71K74L0o8k95J58
5739a1J22j97Q0p1M3j05K49J8l41K07j74L28l90K91k69L05j72o6J30K48rm88L33
5762F1j54J95p4n3j54O6P2j95L16o2O8n46L77K21l02M15m68K03j06j7j30m2M03
5785I4k73K1O4J76k04O0J75j81J26j16J05k68K30j92K76J28k57N5m9K17m58M61
5807A90k91L96k70q1J03L5K10k88j65L72o1p9J6K42l91L68l93K32r4j26K16J3
$$ y = [55, -69, -72, -28, 485, -189, 190, -87, 115, -67, -120, 162, -371, 145, -119, 203, 86, 467, -100, -10, 202, -66, 298, 99, 81, -250, 259, 118, -108, 406, 22, 295, 19, 258, 163, 1, 45, -8, 72, -114, 285, -52, 231, -48, -175, 113, -11, 147, 59, 405, 13, 214, 70, 153, -42, -41, 105, -399, 195, 80, 244, 124, -86, 10, -161, 68, -335, -40, -9, 122, -118, -133, -2, -131, 318, -89, 101, -184, 167, 31, -290, 61, -110, 164, 194, 126, -169, -11, 111, -86, -6, -77, -34, -139, 110, 128, -213, -6, -180, 148, -242, 49, -220, 85, -87, -153, -23, 225, 216, -272, 61, -93, 102, 28, -25, -179, -113, -41, -236, 80, 18, 86, -460, -83, 138, -164, 251, -217, -14, -120, -137, -267, -309, 94, -179, -158, -94, 82, -122, -62, 113, -68, 58, -58, 47, -221, 9, -183, 93, 221, -36, 19, -30, 187, -271, 190, -101, 295, 25, -56, 47, 82, 292, 4, -161, 211, 150, 71, 87, 329, -62, 306, -87, 145, 51, -75, 141, 154]
5829A54J66k19K07m38L63k7m5j50j70R9q3L23l20K15l9J06p0j7J93k65L03n35
5851b49M70j71L0J15j20Nj60K30j85Q9j81M40q7m73M84j93j12J2L26m18J74k28
5873b02J61K21k62J09l40L20q7O7J46j5K7l24L16m04J70J49qJ34k63J12j83K20
5895F4k78K59N0Q4j60j0M55o78L67k71K24k3m10J52j46L44qJ28k06j09M0J54Q9
5918A11J5j96j39K64k22L03k50k62M24m26L39m5R7k62R0J9q6M43m46J59k79M74
5940A25j90j3K2K26m3n35O92o71M28J00k23J35N1j99k23K74m9O1l14M98q8k90
5962b26P2j49M82k64L23j79M1j63K9L17l64j04o3N46j84J42k5l63L7r9M95j82
5984A19Q5j75k69L53l33K91j11L36m34O1J05q5J91k97R9K34l8j90J22L6K5P8l63
$$ y = [154, 320, 101, 308, -130, 233, 206, 161, 11, -159, -60, -143, 180, -140, 75, 36, 142, 72, 55, 248, -17, 286, -249, 221, 50, 80, 195, 75, 80, -80, 150, -35, 54, -127, 313, 226, -247, 237, 44, -68, -56, 270, -148, 26, -202, -41, 180, -82, 27, -313, 7, -80, -13, 133, 118, 145, -179, 137, -267, -97, 52, 44, 178, -85, 27, -156, 64, -214, 45, 95, 179, 19, 9, 464, -214, 153, -118, 106, 83, -327, -175, -321, 23, 15, 143, -63, -172, -132, 22, 111, 126, -70, -209, 55, -167, 136, -114, -376, 48, -378, -39, -84, 13, -249, -159, -140, -226, 217, -229, -70, -349, 125, -65, -78, -56, 170, 127, -408, 284, -387, 41, 141, -82, 53, 104, -95, -318, -44, -93, -32, -346, 152, 64, -226, -154, -303, 179, -85, 238, 59, 100, -63, -34, 283, -81, -185, -248, 298, 114, 256, 231, -132, -95, -194, 301, 119, 204, 29, -240, 113, -220, 71, -40, 296, -138, -77, 28, -57, 134, -163, -64, 170, 132, -58, 64, 100, 125, 203, -160]
6007a60L40m04L33j62J97k58k7M66m34J90l75M86l19L71k10j15J25l1P4m34N41
6028A94k65K89j84k84J42J36O7l25M21k44J10r2n2O6m95Q97m76P4l10J63L5OL69
6051B42l03K25l72j6K90Q9k39Q8K93n39M09p9j14qK20j91P8J74l23M64l80K79
6073B87k44J5j94j49O87k49N2l55K90l5k16q5J3J4K89K26p63M53J38j31k7r7J88
6096A07l60K84l33K85L6j26L9RJ51l31K80k5lj16K27l58L3M63m49L11j70K10k96
6119a32J64rk51K42P9J8k99J85n0P3J66m45N16l86R8R5J3j55l14N31m04L37k41
6142a69L48n64M37P1m12L09k74M34j70R0o2J97k54m6K34k90K52m40L15j38P0%
6164f2l11N43j76k01j40M46k15q5K30k29L86n02N53k77K43j73k89L93M9m6k05
$$ y = [-160, 180, -224, 109, -53, 144, -114, -141, 325, -109, 81, -294, 192, -127, 244, 34, -81, 44, 13, 87, -347, 194, -71, 218, 34, -250, -108, 28, 95, -230, 191, -53, 57, -35, -87, -21, -516, 381, -95, -21, -331, -168, -133, -127, 242, -61, 164, -208, -224, 66, 155, -84, 4, 297, -242, 167, 88, -26, -34, 186, -5, 73, 247, -76, 388, 8, 287, 43, 58, -136, -285, 402, 153, 205, -150, 140, 105, -111, -196, -183, -169, 120, 346, -417, 36, 174, 43, 16, -81, 107, -253, 31, -302, -17, 19, -107, -68, -59, 92, -239, 41, 16, 13, -103, 124, -234, -201, 262, -187, 124, -46, 164, -132, 32, 23, -228, 14, 93, 111, -188, -3, -53, 20, 186, -259, 257, -129, -31, 64, 77, -78, -392, 139, -265, 72, -169, 179, -385, 52, 123, -289, 20, -254, 180, 10, 100, 38, 235, -19, -65, 169, -121, 131, -309, 6, -132, -62, -62, -373, 170, -6, -207, -347, 99, -116, -201, 29, -200, 186, -316, 237, -40, 203, 30, -259, 134, 183, 137, -68]
6185f8K74m16L98j75j36J58P1q6k96N95m36K70j28k1J45m64P28o55N12k00j19
6206d9R3l17N29m26O20n50K22l64M78k14N5J45j79j07P1K16m29L13P2k42K44k75
6228i4J32K9J84k20k0j17kM16m52L79m59M58l37J36j24J26l5j69L62l05K7j9J87
6251H3j07M9J21l17K74k30L79k48rM7k08L23m81L46k8K97l06K03Oj65L36l60l9
6274c4j58O36m77J58q3J2j07J33nl32K68j33J00Q9r6J9k34N02l44j24J47J07o4
6297b0k58M97l84K68k54l2k2J73J95l02J06l34M98m77L35l03K39O7l08L44l51
6318c23J33k00N62n05pL44l37M54m47N85n64K28L55m25J34j94L33j72J19j54n
6339h6Q2Km6K6M24m05R7k35K47J79l04OP0J85j96N0j17J33Q4n5M0n30L14k7L87
$$ y = [-68, 206, -210, 188, 13, -123, 35, 106, 20, -276, 319, -117, 153, 25, 4, 149, -315, 413, -242, 270, 70, -49, 44, -273, 256, -170, 450, -100, 122, -242, 236, 22, 77, 222, 43, -64, 7, 223, -206, 107, 179, -63, 181, -94, 38, 67, 251, 31, 11, -106, -108, 308, -144, 235, -224, 234, -103, 33, -91, 35, 0, -169, 193, -112, -85, -104, 83, -24, 25, 146, -171, 103, -127, 252, 4, -5, 42, -166, 157, -324, 22, -6, 291, -15, 188, 194, 29, 365, 5, -34, -192, 444, -33, 125, 42, 54, -53, 80, 75, -257, 11, -122, -22, 67, -29, -10, -244, 258, -86, -210, -63, 44, -20, -278, 219, -165, 103, -151, -183, -205, -32, 163, -139, -33, -367, 131, -346, -11, -314, -75, -8, -316, 28, -323, -190, -390, 172, -333, -340, 4, -333, 121, -326, 259, -305, -77, 278, -147, -13, -207, 126, -46, 73, -81, -86, -4, -2, -48, -22, 402, -3, 94, -141, 106, 285, -19, -13, 57, 242, 46, 96, -21, 112, 196, 141, 181, -349, -35, -62, 325]
6364C25m36L68k63j09K72k24J74l16M27j61j7Q7j20J13q5K12n04L87j3k17J36
6385C6J28k6l23M28m34M15q8j64k19J29K51l54K81j88J41%L12k02j91K75j79K70
6407B98l95J21j40J04j34O1K13J00j17l91N40m39j02M59m9jk11L80l23J95j22
6428D7j37K66n2L0m30N36k53Q0k26M62j22j00K1k99L41k02R4m0o5K08l39M68m09
6451a21M1q8K89m49L74L3l58N98n51K61m96M36J2k82M74k37k5k59N68k85j09J9
6473a55j51L48j24K11l03K88j89k5O5n0N2j95N43o00J17L22l5K2O8K71p17M17
6495A80l26Q8o8k0M54m39N72m59K02k97J60p9K6Nk25N31l71Q3j99M30r4j30K24
6518B48k85kn1M37o87N21l8m29L82l0K24m96K56O8o7j89k0K56pK23l72J17R1k50
$$ y = [325, -111, 257, -6, -115, 157, -67, 107, -209, 218, 57, 40, 127, 7, 120, 35, 247, -257, 130, 117, -100, 36, 164, 138, -185, 243, -191, 224, 136, -28, -247, -118, 133, -221, 60, -128, 13, 13, 325, 123, -68, 207, 28, 298, -97, 24, -116, -12, -146, -85, 128, 228, 111, -280, 260, -179, -281, 178, 129, 128, -83, 297, -26, 169, 47, -90, 176, 124, 154, -276, 260, 7, 87, -139, 323, 201, 101, 122, -177, 164, -38, 56, 16, -49, 159, -180, 288, -121, -80, -168, 121, -328, 46, 79, -279, 319, -232, 29, -467, -31, -19, -301, 173, -64, -89, -348, 220, -65, -174, -155, -306, 42, -82, 129, -174, 114, -75, -100, -35, -85, -33, -228, 315, -285, -168, 154, 119, 141, 209, 480, -237, 180, -146, -58, -126, -146, 308, -131, 441, -18, 184, -113, 47, -32, -6, -1, -226, 305, -66, 17, -182, 248, 154, 24, 248, -37, -39, -90, 347, -340, 181, 143, -286, 96, 66, 290, -206, 50, 118, 51, -138, -158, 98, 91, 314, -58, 59, 150, -100]
6542a00P4l8R4k86M45k99Q4o8N5j5k4K39m45K94l92L88j15K92P0n97N53n43L46
6565A2l49N04l06L32k65J43J61j06K84q31P06m91L55m2l46M90l93L73j74Oo2L22
6587C23k33r1M8k72Q1o9M01m23M74k71j13J81j47Q4l85K68n7K05J26l58L28J75
6609B75j36j45j6P5l87L39j73J05k48L64l76N15l21J56J62k19M76p41P34m23J92
6630B08J8k30k4j61M48m12J97P9j23j0m3J67m72M31j62J50o5K63l73L18q9k05
6652i0K99k51L24n42L82q3j64K78k22K23l6ml28M8J55r3J20k30K77j68L9L0j6
6675e2J20P8o9l33K54k73M59J94l61j89L53J9m37L68l07L22j15k31L40j8L1k39
6697h6M55p14L15j04P7K41k82K28j87K08m79L58j87J09N5k8q5L2J43k80J29j28
$$ y = [-100, -26, -64, 30, -256, 189, -110, -26, -94, -39, -54, -78, 161, -284, 10, -382, 6, -109, 183, 253, -344, 209, -334, 12, -337, 167, -139, 193, -72, 71, 232, 126, 410, -421, 285, -206, 149, 107, -239, 251, -142, 231, 57, 63, 1, 323, 90, -1, 47, -225, -144, -213, 188, -235, 239, -32, -145, 36, -111, -27, -412, -144, -201, 4, 130, -228, 100, 275, 139, -6, -22, 53, -334, 5, -168, -63, -311, 53, -323, 192, -129, 27, 189, -30, 446, -295, 439, 16, 208, 226, -4, -28, -189, 259, -153, 44, 123, 0, -10, -53, 114, -358, 73, -89, 61, -4, 259, -114, 204, 115, -90, 209, -42, 282, -260, 122, 39, -125, 153, -69, 154, 118, 114, -214, -166, -11, -104, 16, -214, 63, -105, -66, -36, -52, 68, 146, 77, -256, -2, -275, 184, 378, 17, -172, 181, 200, -237, 131, -176, 146, 31, -200, 140, 122, 153, -86, 369, -345, -30, -134, -57, 184, -98, 130, -57, 151, -328, 30, -157, -48, 7, -21, -106, -74, 69, -211, -82, -210]
6719b10J3K98o9L9k21M14n60J62K30o6r0O0J60n02M27r1k30J82Q0J57k89L20k77
6742f3L1j12M65o05K02J31j53J44k59L90l81L58j30l55P46m73N0K38k19j65J74
6763A4J12l47L57k30J25n8J65k72K79n3K8N9k53L10o56M84k5J83j36m5J65k04
6785BK69j41J38k32J97n1m61L83l16L32p7J16l06J65J46n30M89j98p4K6L53k96
6807f6J39L1P6j62O8K03l40L8K31j93j36K65o2k05K61l76J95j2J83k22k0J56k54
6830b02L90N4j10k86M22k48j71N32m84K39K04k61k59J67o5j27K26rpl56L49L1
6852B9r2K99l92J02j85K35j27J73L1l68M62k77L25m24O60m40J21J61k22j54j12
6873a95L26l45K64j5j47J91n7J81m02K48K9j16m1L40l77K38j40p6J67rr6k52N44
$$ y = [-210, -197, 101, 32, 71, -150, 264, -296, -134, 96, 30, -60, 0, 160, -342, 85, -6, -236, -54, 26, 183, -106, 214, -63, -32, -144, 321, -284, -82, 49, -104, 40, -219, 171, -210, 148, 18, -337, 409, -64, -14, 224, 5, -160, 14, 126, -221, 136, -94, 31, -27, 138, -134, 145, 92, 120, 179, -74, 236, -420, 64, 39, 222, 86, 41, 206, 2, 271, 130, 268, 36, 233, 182, -279, 104, -212, 120, 43, 159, -147, 18, 164, -366, 123, -75, -149, -123, 230, -66, 73, 104, 180, 18, 86, 289, -51, -13, 218, 25, -111, 154, 92, -113, 148, -228, -33, -45, 138, -84, -104, 52, -202, 188, 242, 132, -154, 268, 20, -151, 381, -103, 136, 340, 79, -180, -13, -78, -205, 21, 12, 5, -351, -2, 29, -63, 236, -156, -54, -239, -4, -131, 42, 73, -295, 167, -110, 215, -209, 451, 11, 132, 293, 71, -83, -195, 131, -214, 50, 35, -112, 79, 22, 203, -199, 49, 78, -38, -79, 261, -116, 122, -18, -94, 73, 64, -32, -284, 260]
6896B60j37l96M74k42J11k81K57r5RJ69j66l9J46q6j73M5P5J53k5M4l23j47M07
6919D0Lj46R1J1o3o4K6r9M80l53O7J75j05K44m18K71m2j16J02K0j16k15N09n40
6943b38M30k88M23l82K78m86K41K07k97L65l75K2N9J28J02j55K29n06M40k92J10
6964A5R7l27L43j00J70l82O08o18M19k09k53J84k42J66m01Q44n69K55j15P6J76
6985A37l91M49m17L91j45k58M4M43k48j55K21j94K62p1J19l36J34K12j95qJ62
7006A56J66l96l1J3l06L75J0K94j49k9j10n3K46j95o8K85J4k56K93j36r0j42J80
7029G1J43P2M5l18J92k30j97K01M6J39l04L41l12M21m32N53o08N0L24r1j08N9
7051E7J62m78K40l8m16M88p2J5l3L16m27J62J29k35O1J34K18m84L3K18k29O5P7
$$ y = [260, 123, -273, 201, -41, 70, -211, 46, -49, -40, 129, -37, -76, 70, -16, -189, -144, -69, 84, 59, 103, -220, -367, 40, 43, -103, -12, -1, -64, -128, -102, -201, 279, -74, -7, 168, 63, 307, -111, 160, 118, 2, 104, 124, 8, -207, 302, -238, 192, -96, 327, -55, 223, -263, -22, 185, -112, 253, -122, -100, -41, 87, 189, 34, 263, -243, 197, -95, 15, 112, -215, 128, 28, 198, -184, 424, -194, 225, 16, -237, -53, -295, -129, -530, 314, -255, 0, -115, -39, 137, -254, 195, -222, 169, 24, -234, -190, 253, 5, -150, 71, -123, 139, 68, 187, -149, -15, 197, 2, -6, 156, 322, -74, -105, -92, -398, -23, -13, 281, 132, 103, -7, -60, 186, -9, -77, 208, 222, -34, 259, 123, 33, -109, 71, 214, 286, 331, 13, 205, -25, -222, -21, 25, 164, -140, 201, -111, 310, -122, 431, -177, -127, 197, 106, -2, 57, 219, -259, -19, -57, -473, 15, -57, -42, -75, 241, -186, -24, 105, -130, -69, 65, 283, -201, -168, 50, -179, -114, -37]
7074c7L70k97K59m43P6j48J93j48K65j48k52M69j19J91k74K1J80m04K83j9Nk17
7096a94k5K57p7J69m13M16j27J10l62L30O9j89k2o9J94k55L25j92l2K93l05L16
7118B17m84M95m97L13K4l0j48M06q3n44N06m64L35l51K95j62n6J47j20J63L0k51
7140b59K42K4j45ML33m08J90j51K34k55M47m74M8j2J0Q3N9K26l55J94M7q4n2k04
7164b58O32r13P23k96J12rJ78K71m68L61j13j27k65K52j93R3M9m4K00m52M15k97
7186a49K88n0k04K03j49J97l32nK05qK24k76J33r4J42l81L81j20k29K03r8K27
7208A08j12L89o25M32j39k7O2M4M9k16%K25q4k80L41M1k34M9N4r3Q4J5LJ61l82
7233a35J43J11l62J45K19P6m7j32K91n73N37r6K18o95K48K60m13K92j42J81k3
$$ y = [-37, 333, 36, 295, -148, -72, -220, -27, -175, 90, -58, -310, 159, 40, 231, -43, -22, 158, -246, 37, 18, 23, -194, -219, 38, -39, 130, -283, 133, 6, 116, -246, 84, 153, -36, -58, -127, 67, -188, 137, -55, -87, 206, -99, 217, -267, 228, -269, 44, 68, 38, -110, 296, 213, -331, 175, -289, 46, -305, -10, -172, -228, -81, -201, -38, -8, -259, -17, 7, -138, -134, 199, -209, -19, -170, 64, -191, 256, -218, -170, -182, -172, -89, -30, 196, -159, 35, 82, -2, -54, -258, 374, -539, 184, -112, 0, -9, 169, 440, -28, 333, 220, 93, -172, 80, -113, -20, 29, -15, 185, -267, 148, -149, 139, 89, -115, 88, -61, 136, -196, -201, 4, -4, 220, -56, 77, -17, 125, -256, 125, 5, -224, -21, -119, 108, -4, 385, -240, 192, 53, 26, 88, 132, 181, -35, -35, 190, 106, -174, 167, 208, -26, 23, 77, -16, 68, 83, 86, 247, -135, 8, 119, -243, -98, 121, 197, 150, 18, 309, -264, 273, 177, 395, -300, -52, 208, -205, 87, -55, 126, 103]
7254A03M4j90l8J76j48P7j02L85n73L84l8l54J71Lj11OL11l51N44k50J16k04P6
7277C7P7k81M60l66r2J55L2k50k6O75n00J51q2R5k47K56Nj67K48k59J99q7j00
7300f7j48nK35Q2L2l32L97k26M07j18m22O9m4K55j56J30k36k02L34r5P6k44N20
7323B42m26K84n0j1l21L63j51k39L62Q8l43j1L79l10j22N19n46J63m7L68m11L65
7345A45m36R9K79J25k66k15M73m61M20j31Qk5l67M90l28L37Jj52J74m14L53m3
7367F6Q1j49J85k27k6j06L38k17J9J57j03r7L2J37k2p5M15l22o8j78L73k75R5
7390C3J98m55L43p6J66k93K80j72k00K99k12Q4o2J43l83L76q5j8k46K74K49k24
7412A9J81m28L17j20J10M9j90J48l46M68l47J11j67K54J20l86M95k90lJ1n9j1
$$ y = [103, 147, -43, -81, 95, -53, 24, -78, 307, -266, 118, 80, -274, -103, -100, -211, -205, 106, -245, 299, 49, 165, -39, 37, 114, -167, 293, -73, -165, -10, 22, -228, -254, 421, -79, 72, -10, 85, -162, 94, 99, -68, 180, -79, 120, 33, -67, -215, -220, 15, 97, 129, -203, 194, -32, 375, 257, -165, -96, -140, 115, -41, 89, -147, -349, -15, -110, -34, -278, 242, -184, 100, 50, 39, -282, 81, -70, -309, 53, 141, -202, -213, 166, -144, -266, 253, -293, -130, -177, 191, -220, 145, -291, -192, 87, 212, -54, -269, 204, -257, 163, 32, 40, 15, -352, 138, -190, 147, 148, -4, 170, -244, 109, 66, 147, -2, 183, -44, -70, -176, 162, -55, -36, 121, 18, -79, -47, 90, 68, -7, 408, 86, 18, -160, 213, -62, 33, 231, -224, 119, 43, 209, -84, 196, 24, -176, 123, -89, -5, -67, 76, -307, 69, -16, -34, -280, -6, 243, 19, 200, -228, 89, -31, 79, 128, -62, 86, -260, 208, -139, -28, -195, 59, 179, -207, 288, -2, -5, 6, -53, -64]
7434f4K42j79j73M69n77M66l01J14o3nJ65r5Q4r1L64m67J97J82k12J39j58N33
7456E70q18L90J08l24K12k08K76l50M64l64J97J2j61J16n3J80m12J77J52j74l16
7477c26L92j83L9L53m60M67k88K47k47l2K44l97M04l20j02L6K34j67J28%N8L1
7499A11j03J7k60M06j37j00J6P4J24m47N10l57L26m23L59k73P8L15m93J88RN4
7521fj82J76M5l25K35K4j29P8K21j80K39J30m18j16Q8N14m86O9R3j89L47k03K04
7544B29m09J70j26L50k55J4R4m9L00m51K53pj57QK02k67k41P89o07L98j38j5J37
7567B22j43j08j61K96o07N47RM31l62l5J74m44J16k9n3Q1n0L37m75L40n3Lm1n2
7591e7O7m30N35j79J41k43P8p8K38p8k48K38P9K8k34K15j06J23j10P2q1j90L01
$$ y = [-64, 178, -1, -174, 295, -282, 184, -117, -3, -66, -71, 94, -1, 83, -8, 356, -111, 86, 268, 56, 195, 37, 570, -248, 142, 250, -74, 138, -70, 206, -144, 320, -44, 153, 165, 4, 120, 67, 247, -165, 12, 164, -10, -326, 66, -117, -78, 275, -185, 282, -6, 241, -6, -38, 206, -191, 213, -107, -209, -173, 61, -106, 22, 22, 80, 111, 8, 25, -235, 171, 34, -66, -50, 24, 148, -299, 211, -146, 180, -243, 116, -157, -79, 236, -257, -69, -60, -6, -188, -12, 33, -292, -57, -33, -162, -84, 137, -43, 196, 326, -92, -208, -120, 394, -92, -23, 70, -119, 228, 25, 229, -180, -10, -136, 214, -41, -27, 67, 18, 318, -133, 120, 113, -44, -36, 166, -101, -342, 447, -160, 238, 100, 85, 222, 79, -29, -190, 106, -501, 46, 55, 486, 124, 89, 263, -181, -65, -94, -147, -66, -116, 221, -254, 86, 33, 36, -5, -57, 10, -420, 115, -64, 77, -166, -88, -166, 72, -6, -254, -16, 63, 91, -143, 72, -34, 89, -21, 51, -30, -220, 81]
7614H1l45K45J7Q6k9j60L01m57K08j7K12l69N3K08L4N2m64N00m3J94o51N06q1
7637H1n5J76m60K24K8j4j36J77j50M2J99m7Rk41L58k83K16q1J12q6k01Q4m66P15
7661B01q0n7l00R2J04J23J29k85P5j33k1J55l55P9m1L64J32j63k45L78j47l9K17
7684A83k62l21L46J42l25K97J61m21J61J22O8l24M26j62k90M73m19K2J41J6k19
7705a85KM10j08j64P6M8p8K07j94k67J65K14k40j94M15j15j71Q6J10j59K71k54
7727a25QJ35j41R7k68L28j1j88J64j1N9K2R6k86K7R4n3J08J8j45l6L48l13J14
7751D1K12M9m56j5M04k77k8j3K63l23J81L01l10K66m07N2o5J80J35r9K01k40K
7774E4l63L01j80K30j4k86N36k28L05m89J97j95J88J17k14K07j82L71k53j56j81
$$ y = [81, -264, -19, -2, 84, 55, -105, 196, -261, -53, -70, 142, -227, -174, 34, 68, 120, -344, 156, 113, 307, -344, 162, 81, 26, 202, -258, -34, -6, -20, -156, 21, -129, -87, 112, 65, 74, -167, 191, -92, 124, 43, 155, 69, -132, -48, -514, 201, 121, 64, -236, -144, -40, 83, 212, -73, 2, -131, -152, 3, -352, -273, -314, 50, 182, 19, -226, 152, 5, -34, 183, -79, -400, -54, 88, -237, 60, 221, -200, -39, 83, 151, -173, 253, 91, -199, 274, -145, -123, 18, 34, -185, -183, 227, 119, -45, 31, 79, 1, 208, 14, -253, -88, 126, -114, -308, 107, -8, -179, -93, 17, -142, 129, -125, -117, 18, -123, -26, -294, 34, 23, -165, -1, -12, 47, 69, 165, -121, -94, 0, -53, 55, 73, -72, -108, 240, -73, 41, 253, 302, -154, -169, 235, -42, -70, -83, 180, -143, 38, 339, 29, 295, -112, -60, -125, 55, 190, 91, 292, 52, 54, -309, -8, -188, 42, 28, -258, 278, 50, 355, -134, 63, -132, 56, 173, -41, 166, -16, 355, 102, -54, -235]
7795b35M61j98R2j81K0K1k8J15J08k79J50J6N8p7R6k15j2j57K32P6j69J79k93
7818b20M17j24J49k17Q8K67n06L67j56p0j40J19L0j42LJ77j79P3L91m87L02l01
7840a59k11L34J93l2j22J0n0K11m31N42k28J40J13m73R3RJ6r4m8J34L9J89l93
7863b18L06k7l3j40p7L28l36J83k59L53j16M12m88m6L50k31J59o9N0j52J4K15
7885A78r4k45K1J58l05N85l47J28L75l48J43k25J89l48M03j25J37j32k32O1j24
7906a47O02l48k29K9q8K84k02J75l46R1J90r5O3J50j39j42J54n6o3J87K6k74j9
7929a97L54m68J45L64l64l73L50N4n8K07J64L8l27j0M3j36k57L25J17k84L70k98
7951b41M26m37K98N8k73J05j27L99k76L7k5J83k26K8K38j30J53R8j35q3L7O7k76
$$ y = [-235, 226, 28, 120, -61, -41, -20, -48, 67, 175, -104, 46, 62, 120, 43, 139, -76, -88, -245, -13, 63, -106, 73, -220, 197, 73, 222, 5, 93, 360, -146, 221, 65, -5, -145, -26, 4, -138, -135, 42, -137, -64, 327, -160, 142, -159, -370, -36, 157, 125, 3, 13, -37, 174, -257, 285, 57, 197, 310, -163, -70, -61, -45, -139, -187, -53, -14, 175, -218, 88, 61, 28, -112, -189, 139, -197, -14, -273, 80, -36, 376, -112, -158, 192, -39, 120, 51, 101, -51, -37, 178, 84, -161, -140, 18, -287, 298, -49, 79, 454, 106, 249, 24, 213, -135, 268, 143, 280, 148, -84, -23, -147, 455, 107, -122, -93, -181, 103, -99, 76, -270, -179, 11, -84, -21, 129, -10, -152, 2, -54, -117, 70, 96, -178, -197, 157, -311, -166, 198, -166, -539, -189, -135, -193, 14, 178, 216, -111, -121, -78, -214, -471, -146, -29, -313, 57, -241, 185, -252, 46, 104, -169, -64, -191, 208, -68, -31, -56, 127, -99, -71, 167, 37, 190, 288, 153, 70, 107, 174, -102]
7974a02L67M6j92k1n6j04J85j68N9m6J87o8k46M59k24jl9o7Q0J33j82RJ31P9k38
7999a9J52L9m13L9M48j32k6r3N1N9m22K40K91j08j24J79m49L17l0n7K1j77K12
8022bl28N41l09K09l16Q5K88m85L40j14K62p1m64K72J47J85n35O15m07O5j06J21
8044gR3m7m9j21L0M9J26q7j24J84m11O77m10R2K07q2k31J01K04l58K7n6L22j97
8068f8K37l68j25O19j95q9K2O0j17L0L05m28J91k09K51m22N46k16k00n3L69k74
8090a34p8M09k36J1J18k56L36k68J85l88M08k41J7J08J25j39o9J63j45J50l56
8111b80L75j50L5J0k00M23J9j98k13M96l47k02L12k80K14J75j69k5j20M42o21
8132c04L54j3K56l79L21l32j05J54o4J76J01J66m24M8p6L70q9l20L99m99N56l67
$$ y = [-102, 265, 311, 119, 98, 42, -62, 123, -45, 14, -32, 155, 87, -159, 300, 76, 75, 36, -31, 49, 182, 0, 9, 140, 219, -19, 133, 172, -241, -202, 246, 114, 88, -5, 46, 105, -317, -77, 214, 106, -18, 161, -288, 29, -1, -58, -37, -214, -2, -330, 211, -98, 111, -205, -120, 168, -317, 23, -91, 171, 100, -364, -92, 55, 240, -295, 320, -87, -22, -128, -7, 86, 39, -10, -131, -101, -52, 74, -13, -137, 47, -364, 313, -97, -5, 202, 120, -111, -10, 194, -164, -137, -193, 129, -68, 169, -199, -324, 295, 100, 11, 33, 93, -24, 6, 311, -117, 74, -135, 116, -306, 240, 24, -176, -229, 140, -134, -212, 197, -39, -28, 90, -166, 170, -98, 87, -301, 107, -134, -117, -9, 116, -23, -92, 71, -74, 76, -280, 95, -55, -20, -10, -210, 213, 232, 34, -179, 317, -30, -232, 80, -200, 14, 189, 20, -5, -125, 317, -304, 50, 37, 293, -86, 235, -97, -202, -48, -112, 64, 165, 331, -93, -45, -121, 249, 160, -160, 239, -260, 296, -71]
8154g1l2J20J35k6o8j28j60L37k91J88l6J70L8k05M94o16J69j56L28k35J10j02
8176c7j34K61k85J48k42L67j95K78k83O5J31q7K2j99M04
$$ y = [-71, -103, 17, 152, 126, 58, -70, -230, 107, -184, 4, -32, 138, 176, -29, 465, -151, 18, -138, 190, -45, 65, -37, -171, 90, -195, -47, -289, 78, -117, 161, -122, -57, 74, -13, 9, -190, 214]
8191B14
$$ Imaginary data points
##PAGE= N=2
##DATA TABLE= (X++(I..I)), XYDATA
0@%%%%%%%%qJ6j6J6k4L2m0N6p2Q4j00J21j45J75k08K44k85L33l87M47n15N94o79
31c61P74q80R97j126J268j426J599j788J994k220K466k734L031l355L704m087
47b144M506m965N470o024O635p310Q063q905R852j0926J2154j3582J5258j7255
61i173J9689k2728K6648l1918L9410n0963P1223j16782L93003L9456n76004M90355
73B72216m4873j92993Q7916O8470j44229L6834M5965J6475j27783p691K3557P583
85D1447K8812p2395O3444k3751o4611O1181j148n3517l8407J21584j5379m3356
97C904l5914O0033j978j21167R0369P4906j30735J7272J46651j79866K043J23931
109D9449j12098n852P4449J7117j02745J08845K303j77036J20361J02798j57076
$$ y = [0, 0, 0, 0, 0, 0, 0, 0, 0, -8, 8, -8, 8, -16, 16, -24, 32, -40, 44, -56, 65, -80, 95, -113, 131, -154, 179, -208, 239, -276, 318, -361, 413, -467, 530, -596, 672, -754, 845, -943, 1051, -1169, 1297, -1437, 1594, -1761, 1943, -2144, 2362, -2603, 2867, -3157, 3478, -3832, 4231, -4674, 5178, -5748, 6406, -7176, 8082, -9173, 10516, -12212, 14436, -17482, 21928, -29035, 42188, -74594, 318409, 357865, -218139, 272216, 227343, 34350, 122266, 190736, 46507, 83341, 129306, 145781, 17998, 10307, 33864, 41447, 70259, -2136, 61308, 37557, -27054, 34127, 32979, -20538, -58945, 62639, 47260, 3904, -32010, 28023, 26045, -95122, -4753, 70153, -60582, -43310, 103341, -76525, -74482, 49449, -62649, -68501, 5948, 23065, -79680, 29165, 31468, -145568, -25207, 77591, -79485]
120g9485J7448J44164j18320J2407L7568m4501r225J9348M1888m0558L4095j3204
132A625q911j6213O308K1365j2008K1548l2313N0428J5767n6648l9236Q2864J125
145C5701q3671R3151L3978r6062m1228J59032p6002j24499J56075j4284p8623
156c6432P9826K1735j26150M6808M8070m0481Q474Q401l339j6416O6318p0382
168a3568l4887N5154j0710L190K0693j3326o1347P1992o78p0780K459O3642o165
181E669o2958P1490j3272o1692J6020N7514o2000O853P3316p8261L0613L3948
193A7240n4507l2402Q1721l966o1312O4985J805m4188J7299M0074q9913M1724
205b1440O9673p3622J9374K9831k4229l7691N5085j5841l4109M0997J8993k5400
$$ y = [-79485, -62037, 82127, -36193, -23786, 13782, -30719, -39944, -20596, 21292, -19266, 14829, 1625, -7286, -23499, -17191, 4174, -7834, 13714, -18599, 31829, 47596, -9052, -48288, 34576, 35701, -47970, 45181, 79159, -16903, -58131, 100901, 24899, -99600, 56475, 42191, -36432, 43394, 65129, -61021, -14213, 33857, -6624, 1850, 10251, 6912, -9504, 56814, -13568, -48455, 6699, -4011, -821, 19872, 6546, -54801, 17191, 16513, -54267, -51808, 11834, 5669, -57289, 14201, 929, -60763, -44743, 12771, -49229, -42376, 30940, -47321, -16708, 17240, -37267, -69669, 12052, 8086, -53226, 11759, 13564, -30624, -13325, 26749, -63164, -21440, 48233, -25389, -6015, 23816, -413, -38104, 16981, 1140, -32969, 8028, 27021, 1621]
217A621j8939M7014n7097N161M6676k5990j9933M5149P545o9814N4294l671m3268
230c1252J8468N3638l3594l3099O9595m9178j4291M2946k1586m0501P8842L105
242D3093q1613N6970K267l6099k174M7426l8374r651O6652m4571k8498L0680O226
255A2334n5938N8817J2378n5680L1210J5630k1173k7793M4243k8713r044N0872
267B7143n419m6885J4014M4585p0580K9749L2134m2213K886M9263k0585m8824
279c4732N1103k3933j2329L4040J0184m4722K4436L0898p0698M2410J6952n1317
291b7708P499P2069l8613m4424N5166k1633k2239J9518L5900n8512R421O1995
303D8439m7140k2559K7250M660m0195M9371l653k7892K2785o136j3997k0K9419
$$ y = [1621, -17318, 29696, -27401, -22240, 24436, -1554, -21487, 23662, 31207, -38607, 15687, 12016, -31252, -12784, 40854, 7260, -25839, 43756, -5422, -19713, 23233, 1647, -38854, 39988, 43093, -38520, 18450, 20717, -15382, -17556, 29870, -8504, -18155, 48497, 3926, -24572, 6108, 12334, -43604, 15213, 27591, -28089, 3121, 18751, -2422, -30215, 14028, -14685, -23729, 27143, 21724, -25161, -11147, 33438, -37142, -7393, 24741, -17472, -14586, 34677, 14092, -34732, 16371, -7562, -19891, 14149, 24333, -20389, 4047, 34945, -35753, 6657, 23609, -27708, -20209, 51860, 13247, -31177, 23989, 2356, -19883, -365, 35535, -22977, -13556, 48439, 1299, -21260, 5990, 10650, -29545, 19826, 16173, -11719, 11066, 4930, -9067, -9087, 20332]
316B0332m7619K1771L8266l9978j2963M1169j7361n6658P2516o797m3016L0667
328C29K5741m7874j1985O0511m2564j2888L1336O677k7382L0768m827n3506N1980
341F316k10k3047J2350K2550l8184J0176M0378n0406j2351L3166J7899m9143L7814
354G308J4519o0693K3636L2017k4082k6841M8738k1299l398L0820k3129k3438
366b5842J9543K7250l9935L4567L012l8539K4776K9850m2116k0631O2161l2308
378A788q357L4319n170m3465J7915L9430m8894J0958K3594j3802j3833L8774k5018
391H239l1452M6959j8801r093J8574Q791l8583K1204K0307m7466J2798K8065j5586
404C956l0918N3453j6242l7889L3958k228k3623J1289L6065m1871O718K1411j9391
$$ y = [20332, -27287, -5516, 32750, -7228, -20191, 20978, 3617, -53041, 19475, 12678, -30338, 329, 26070, -21804, -33789, 26722, -15842, -28730, 2606, 9283, -18099, 12669, 7842, -45664, 6316, 6106, -16941, -4591, 17959, -20225, -10049, 30329, -20077, -32428, 738, 18637, -30506, 7308, 21827, -38866, -15230, 16787, -7295, -34136, 14602, -6697, -10095, 20725, -2404, -25842, -6299, 20951, -18984, 15583, 18595, -19944, 4832, 34682, -7434, -28065, 34096, 1788, -6569, 27750, 22580, -20885, -2970, 36460, -12434, -1476, 22118, 8316, -5517, 33257, 8239, -23213, 23746, 4945, -4148, 14426, 23217, -15366, 5838, 26145, -21321, -8523, 19542, 3956, -26962, 26491, 10249, -27640, 6318, 4090, -19533, -8244, 27821, -14050, -7332, 14079, -5312]
417e312n901J7417m389l0085N1448j1945l0940K1380M486l2260J4855L4184n0223
430b7285J0932K6821j2699k6251K5464J675l9336M2431P076k7932K322K9848l3162
443b0096p98L6164l2002R39K2970M503l1360K7622o7l4846L0372J4594k1410o530
457i945L8777l3073M9K9196k7385p236K8492J0645l7771K9141J827k7742J3508
470H483K2404k5861j5432N3505k9009j5219K2635m943k5661K0255J9712l7872
482g003J7221J2083j1645j4489K1993j3810j3926L9934k1965j1011J9591L351
494B0324l4775K3973J1668l8752K4005J8888k1165k2855L9667j8207k6036L3106
506I841k279k1906J0790K6179m0724R002J4699j8605M564J4153n798j9007L4276
$$ y = [-5312, -11213, 6204, 1815, -28270, 23178, 11233, -19707, 1673, 6159, -26101, -11246, 22938, -27285, -16353, 10468, -2231, -28482, -3018, -1343, -40679, 1752, 8828, -19104, -16782, 13066, -20096, -20894, 15270, -16732, -15793, 7177, 11680, -19680, 7942, 7875, -26971, 3401, 17995, -3415, -9945, 28832, -4241, -4192, 25004, -2381, -9617, 18875, 29520, -8251, 20890, 22717, -5025, 8483, 30887, 5026, -10406, 43099, 14090, -1129, 21506, 16563, -9098, 11157, 30869, -7003, 10218, 22301, 10656, -3833, 18160, 4350, -9576, 30358, 8393, -2618, 16973, 20324, -14451, 9522, 21190, -17562, 6443, 25331, 4166, -18689, 20978, 2771, -23265, 9841, 7562, -14344, -3554, 22625, -18099, -9097, 5602, -13003, -8439, 5714, -84, -19091, 15185]
519A5185j6159k0108K0114O592k5171J4923L0774m7438J1290K3757j7341j9012
531b2594K5787N136k7236K8239q46j8851j394K1635k0651K356K2297k7403J2662
544h63J4570j6603k2553L5041p729k6188L5280j492k7992O346L7055m2636r884
557b7648L9667j0761j6927J7256R270l4397K1137N052j4061J863J0868p81q885
570h347K1123k7853J601K1833j3479j3975K9764J361l7411L3250J196k6538L092
583a4383L1910j9884j5823L7156j4651j5333P596J1662k1386J5294J2106k3961
595i697J4999M815j2527o821K2192k2041J164L3060k0581k0344K0565J7939m5018
608b2295J7942K2687k7293N006K2877j3323k7921K9406k048j2607L594R693n744
$$ y = [15185, -974, -21082, -968, 5624, -19547, -4624, 26150, -21288, -9998, 13759, -3582, -22594, 3193, 8329, -18907, 9332, 8486, -10365, -11759, 9876, -10775, -8419, 13878, -13525, -863, 13707, -2896, -25449, 9592, 1863, -24325, 10955, 9463, -18529, -12183, 24872, -17764, -27648, 12019, 1258, -15669, 1587, 10857, -23540, -2403, 2649, -11412, -9549, 1319, 538, -8347, 12776, -15077, -13476, 8357, -5122, -19097, 10667, 12028, -25383, 7867, 9063, -17475, -14383, 17527, -2357, -18180, 18976, 4325, -11008, -3412, 8250, -13136, 2158, 14264, -9697, 5302, 10117, -2410, -9231, 12961, -9080, -7916, 25144, 4563, -15781, 4784, 22723, -22295, -4353, 18334, -8959, -3953, 18924, 5601, -22320, 7086, 5038, -7569, -3975, 5718, -26]
621b6N94J0341k8461J4849P372j1139R51J6693j4029j2176L4462k3417k1233K2765
635b454K1093l1097M534K5728l0602L323J8330r569k5297L3704O144k2956J1465
648B346m687m463K887J4170k4335Q268K2703j5853n931J0146m864j9960L6459
661A6886p820k2991J9503J1936j7870r939K2784j9226L581J7250n564j5350J4024
674G204N477k4807J7091k609p045J0014J3385k3472k935K5789k5192j948J6788
687G740O45k0343K4755M726l6468J6786J3878j5240q934K8310j3488o674J5032
700A0725j2597p547O590J3551k0518J3097N720j4441P645K461j5289l267L0533
713A6663j8640n914J6108m561j5181J0259R850l0051K0743J6641j6614j0601J9623
$$ y = [-26, 568, 10909, -17552, -2703, 4669, -6470, -5519, 11174, -2855, -15031, 19431, -3986, -25219, -2454, 18639, -12458, -7924, 17804, -12798, -9475, 8855, -714, -26011, 7693, 13837, -9119, 2346, -2341, -6804, -3917, 10253, -14082, -5814, 16889, 1036, -4895, 5251, 387, -19573, 16886, 9066, -13925, 5578, 17514, -356, -10295, 12489, -6737, -3156, 14094, 8530, -6820, 7204, 12681, -12126, 4965, 2356, -4689, 5325, 18710, -4762, -7697, 18092, -7100, -9048, 7740, 8385, -11958, 12797, 17523, -18945, -2159, 11719, -3521, -12455, 15855, 2367, -4307, 10725, -1872, -9419, -2829, 10722, -9796, 3301, 9021, -5420, 2225, 4686, -10603, -13870, 16663, -1977, -7891, 8217, 3656, -11525, -1266, 8584, -21467, -724, 15917, -697, -11298, 8325]
726H325p569j8048K5966r676p873J3554J0242k1265K462J0905j7781J1887O551
739G680o601q248K4423j2842j8159K0866o819o988J0418J2749k5611Q396J5353
752A4617j9898o591J3978N099j8136K2473n894j6744J0138M398j2069j242J8730
765H859j7372R834N962j5016n615J5502k301j8129K7314m381j4877Q865J2588
778A1233k4526k139K8324j7423j373J2166J129j9759J2650N368j8927J2879O165
791E767m097l675J2779j8443J320J3970j4816L687J1850J63j9299J9161j769k1035
805a4437J1053J3568j0860q408K6936j7977j0033J4283j416j2569R057J3337j8371
818e837J2314r41j0819J171J1331r690l983K4186j6008m984J1063j000j9423J3793
$$ y = [8325, 756, -17292, 8674, -1002, -8875, 4679, 14921, -6344, -3882, 7023, -10758, 1129, 7680, 1079, -7169, 17254, 4412, -13747, 7119, 300, -6688, 3730, 16479, -9132, -736, 14617, -5281, -11872, 2106, 7205, -10931, 11542, 5648, -11096, -958, 3440, -8629, -9871, 8859, -8513, 1321, 7283, -7733, -13348, 2154, -147, -18276, 9038, 4657, -10220, -1355, 11233, -13293, -15432, 12892, -4531, -5904, 6262, 7391, -12368, 282, 5650, -13277, -398, 5767, 1670, -2005, 10774, -7669, -6349, 7621, -7195, -3508, 8342, 8505, -10794, 8367, 6598, -14437, -3384, 10184, -676, -9084, 17852, -125, -10158, 4125, 2709, -9860, -803, 12534, -5837, 6477, 5536, -5283, -4112, 7219, -2471, -6454, 17732, 1724, -3260, 7803, 6803, -12620, 1173]
832A173J3604k1382J0103Q994r093j4484J8778m901j3460J6998r50n083R07N866
846G070j8337J0205M620j3065J1236O329r226r248K1724j6122j1308J9227K853
859E958j4601N934J8851k7543K432J3885o379r215J4305N458j5906J3634n554
872A259o123K828P637r137O238J2654k0242Q022M979r561o652K0635n127j6099
886h689K1001o28j4225l574J7024j5072O39J7522j1445n214O466L409j6864J3126
900C476j910p854J2727K657j0506m862J5553j7713L339J4433q060q249J3259N608
914A1898k3450J2577J530p777L781J2606q573q682J5443j2940j73O498l28j0122
928g712J4768L610j9870J2803j175j0598P93J9588j3009q613J7925o871r524L294
$$ y = [1173, 14777, -6605, 3498, 12492, 3399, -11085, 7693, 2792, -10668, 6330, 5380, 297, 1204, 7070, -11267, -1062, 3558, -9507, 1729, 8058, -1168, -10416, 11308, -4814, -16122, 3105, 5958, -8643, -2709, 16142, -11401, -8969, 4916, -1463, -10678, 3627, 9085, -6821, 6813, 1259, -4864, -2036, 5601, -3536, 2702, 15356, -4886, 3136, 8115, -1446, -8098, 12537, 7410, -8689, 12312, 11684, -2541, -6115, 10909, -4163, -3524, 13998, 2553, -2661, 3805, 7214, -9650, 3476, 1566, -6288, 6439, 9096, -1410, -6272, 9281, -8432, -5093, 9340, 1280, -6969, 6290, 11898, -11552, 1025, 2555, -5222, -1441, 11165, 2592, -6090, 9353, -3587, -3760, 2738, 2410, -7712, 7056, 10666, -9204, 3599, 2424, -8174, -7381, 12207, -802, -9415, 8510, 1639, -7885, -4591]
942d591R951j7637R981J0241j0754n67K461j911q004J5053p931k146J0551m301
956C96p329N696O041k1353J3657J0176j1052j277J1856q369j3315K0974p206p090
970h195O617P942j0142J277R000j7795N526P640r94n979J0754o709q390J6088
984F640p547q236L467J5470j3372J346J0369j4131j532Q577L237j4183J4208o75
998C638q352P758j389p714K32J3703j4209P186R065j1993n486J1644J078j6821
1012a1660J7896r16r903O703Q449j3377o805J6978q016M31L915J616r475O111
1026A947L185j1970R317k496j358L524Q475j5973j511J5498j1055l666Q597N479
1040G993j6317J1699M843j5657L188Q439k882q676J6887p988n224P137l507l584
$$ y = [-4591, 5360, -12277, -2296, 7945, -2809, -3376, -915, -2826, -10830, 4223, -3708, -5854, 4697, 396, -6933, -1237, 4804, -16549, -2892, 7284, -3768, -5045, 6811, -1558, -14873, 6101, -1105, -8195, -1578, 6364, -3778, -2501, 6499, -11296, -5770, 1870, 876, -5103, 5651, -1058, -9448, 6640, -907, -9143, -5676, 9794, -3578, -2232, 8137, -5994, -7526, 1051, 4288, -9895, 4313, 3638, -4714, 3044, 1655, -6059, -5827, 7876, -6333, 853, 9918, -2075, -7561, 4083, 5161, -11660, 6236, 5320, -4583, 2120, 10569, -2808, -9613, 7365, -651, -220, 3695, 5311, -4164, 1947, 5132, -6838, 2479, -17, -1375, 2149, 10624, -5349, -6860, 8638, -2417, -6083, 2514, 7993, -8324, 3375, 8218, -7439, -4251, 4188, 1306, -7370, 9517, 1529, -3695, 3442, -65, -3649]
1054c649L981O083j2851J1547L05r005K898N842r762l640K1135j1905o460P500
1068B019L891j1752J854J0687j2889M785N352l99q885O392k898n248J2545o527
1082a073l498N218O912j5496N753O817j2996N935Q432m063j1104J6320n393j0806
1096i042J0510K122p112L66J3405j2423R81L260l639k16M151J31p643J3635p332
1111A154o584O339K982j0361K582J4839j4945P87P579j443j0553Q959L898j1146
1125e913J0200P44m501l278R180q226j219J0472q106J638L783n29j0028J1540
1139E757k894j0545J1685L445q393l151J4433j2986k947J1364l138o099L630P816
1153G977j1110N299j684m198K122O184m050o382J1826q776n48M172j078p899Q235
$$ y = [-3649, 332, 6415, -6436, 5111, 5416, -3589, -691, 5151, -4611, -8251, 12884, 979, -5481, 2019, 5910, -5842, -3988, 6699, -6190, -1405, 3947, 3548, -5337, 1055, -1843, -7091, 5454, -1073, -4571, 647, 7559, -7937, -2184, 4633, -8363, -2428, 6004, 1941, -9163, 7157, 1764, -9042, 1468, 3590, -3522, -3156, 10249, -2174, -1193, 2067, -1572, -1788, 2363, 2494, -5149, 8486, 1154, -5430, 909, 3891, -6470, -3888, 10951, -3994, -3207, 4372, 2929, -7624, 1335, 5233, -5913, 4287, 5031, 530, -2748, 6432, -1794, -3013, 7459, -647, 991, 4774, 4245, -5783, 5757, 2863, -7682, 4003, 7448, -945, -4096, 10337, -2649, -5596, 5768, 2630, -3469, 161, 7977, -3133, 2166, 482, -3716, -1594, 4590, 540, -5842, 5984, -2792, -3340, 832, -246, -8145, 90]
1168I0O901j4262Q074J603n775j870J1509o568o788J4689m693n525K079O180j1276
1183e632N162N654q965N700K035m451p459J2727m481n909P748j477l350K759P190
1198G251j4983L668O251j669l5J283k404n862J4326o950p234M112N236m686J454
1213b42O688j5064M741Q212l900q180R503O91q860J1415l367o512J9J0635p104
1228a325j460Q054p355J446J481n57o278R786k808p033Q827M32n005l126Q899
1243C978r385M081Q520p139m637O294N556j1215O797j576m219O436N720p888o466
1258e143J2027p100O92L907k242n903Q325M922j4236N610J646k341j523Q320m955
1273B006m714Q335m751j175L29L329o093N736P31o829O579j845n904q98J2973
$$ y = [90, 6991, -7271, 803, 2406, -3369, -5239, 6270, -298, -7086, 7603, 2910, -2615, -536, 5644, -5632, -470, 5184, -3781, 1919, 3954, -497, -7956, 4771, 290, -5619, 2129, 652, -2698, 61, 7251, -7732, -4064, 2187, 518, 483, 1766, -638, -6500, 7826, 876, -6358, -2246, 2990, -1696, -242, 6446, -8618, -3877, 4335, 435, -7745, 1758, 2449, -6411, 5004, 1637, -4875, -4856, 5779, -1325, -2785, 5269, -2086, -640, 841, 284, -5994, 3792, 984, -6049, 2778, 3210, -1795, -4921, 3978, -5407, -1326, 7194, 55, -4582, 1712, 7268, -3947, 2850, 1274, -2945, 3491, 9211, 1323, -5143, 6884, -216, 476, 4383, 2141, -3762, 4563, 9485, -4751, 859, 2505, 164, -1359, 6961, 2006, -2708, 5627, 876, -299, 30, 3359, -2734, 3002, 3733, -3096, 3483, 1638, -4266, -5164, 7809]
1288G809q340m877Q903l618n022N149N761j6513O305J1415n882o352L390J781
1302i1o645R227m025k862J485L541r27j627J403q452R058J766m740j294O853m474
1318a804m944J1622o734m808N540P581j0361L95R243q530r45M096K407p201P690
1333C247q95n970N982o49k774k196Q236o875L319M605p694j998N518L087j0583
1348e640Q023K28m053L054J857n385k628Q779o083K566J605k123k795M643m64
1363A584p997R169k065l660K771O140r762k688J1635o585m095N246N642j0732
1377e397L384N466p505J106J813J070l220O330m811l80L365m532J284K568O22
1392A163o768R454m76q678L580N168m906m359J2965o303n198O661K201q563Q39
$$ y = [7809, -531, -5408, 3495, -123, -5145, 4, 5765, -10748, -4443, 6972, 1090, -5262, -1872, -91, -6736, 2491, -1534, -4396, -2911, 630, -297, -1924, -521, -8973, 85, 1851, -2889, -4183, 2670, -1804, -6748, 4874, -1860, -6668, -1128, 6453, -3908, -3513, 5730, -2800, -3745, 351, 2758, -4443, 3247, 2352, -3618, 2364, 1715, -1059, -3255, 4981, -1894, 1425, 6030, -1664, -3662, 1856, 4943, -5640, 2383, 2611, -1442, 1612, 3469, -1916, -4544, 4235, -1848, 718, 2323, 200, -2595, 2048, 1584, -6413, 2756, 691, -2969, -198, 5942, -3820, -6508, 5127, -1458, -5553, -307, 5335, -5397, -2013, 3453, -4052, -2946, -1133, -63, -3283, 3047, -1764, -2144, 1221, -3311, -2027, 541, 1163, -5605, 3849, 3373, -5305, -1725, 3443, -1463, -5822, 7143, 840, -4358, 2303, 4504, -4059, -3220]
1407c220R086p778K449K649r55m129L578n24l685O799m710N02K452J610p370K686
1423e60M304o630L792J939j649m001P327m107n013O589j029k333J475N735r080
1438c241K468L726n004N07M096q00o182J0128l034o898L864M047n123j101R254
1453F707p372n09L414l75m449K514K576m331N397k540p19l8R21m303L059N772
1469E724q504L175L409j618o113P029l74p441P388L126n052m526Q790n060l401
1484c448O373j179k949Q22N300o348K150p49k429L419K149j952k875O604o412
1499a524O86L957l025l217N204L336q638N267p12m009J47N605k656m119O851l827
1515f74n74R82R81o275M736N495o625J981J283j540m198P737k293n360O045R34
$$ y = [-3220, 5866, -1912, 537, 3186, 2231, -1898, 1680, 1156, -2529, 4270, -440, 62, 2514, 4124, -3246, -560, 3744, -2886, 906, 2845, 1196, -2805, 4522, 415, -4598, 1991, 962, -1371, 104, 5839, -3241, -773, 2953, -2051, -1544, 2552, 1752, -4430, 5698, 2664, -4234, -370, 3677, -1446, -2547, 6707, -665, -1174, 2240, 1865, -2584, -70, 2506, -1825, 3572, 1032, 313, 275, 1196, -3107, -48, 5724, -2780, 395, 3804, 2186, -3927, 3102, 2728, -4713, 2675, 5801, 749, -3777, 5013, -47, -3448, 2925, 1746, -1203, -381, 4919, -1429, 721, -28, -2457, 962, 3111, 1159, -1716, 4888, -1524, -838, 3119, 94, -3123, 2081, 5417, -3221, 2046, 1334, -2675, -2528, 3077, 421, -3698, 3153, -674, -1248, -266, 715, -5560, -824, 4671, -1954, 27, 1310, -230, -4428, 3309, 1016, -4344, 1701, 2635]
1531B635k822j567M741o691J824L378k068J401l43q12k599O377n800p61N095r47
1547A041k536L278L204j0677M147N251l667k644N447J98p662O523j20m227k005
1562d449O064j057k041L271m425P69O65J715l814L609l25k578N140k507l461N19
1578b905N681o608J910O241n913k418M300J414p553N744O37l322L151J818k834
1593f57l541N423l501K262K327k265j852K768K387o775L406K0r73M53M010l148
1609C44m247N567k609q32J259K022m415L418K833o984K447J019j035p68N127m199
1625a053r19N607m857j977L361K903p156M643L497n335M41J864o27m159O207r46
1641A494j474P22L59j095q53L181n182L437J573q40j743J282p95l116O063l538
$$ y = [2635, -187, -1754, 2987, -3704, -1880, 1498, -570, 831, 488, -324, -2923, 3454, -2346, -3107, 1988, 1041, -1495, 1783, 4987, -5690, -1543, 3708, 41, -2603, 2844, 3042, -4620, 1903, 1783, -2444, -4449, 1615, 558, -1483, 1788, -2637, -1868, -1203, 512, -3302, 307, -18, -2596, 2544, 37, -3424, -2905, 2776, -3832, -1922, 4319, -1594, -4012, 288, 1702, -5851, -107, 530, -2792, 359, 2177, -657, -4198, 1225, -2276, -14, 2313, 48, -1804, 964, 3351, -3424, -18, 2, -971, -518, 3492, 344, -3903, 1664, -945, -1777, -518, 1504, -2911, 507, 3340, -3644, -1197, -178, -1213, -1981, 3146, -1053, -1972, 3635, -1222, -3199, 162, 3065, -4091, 552, 4049, -1286, -845, 1019, 392, -3767, 2440, 1494, 20, 742, 1101, 6, -847, 2334, -2848, 589, 2162, 1322, -421, 861, 66, -3050, 3013, -525]
1657e25j468K910K256n424R61M584p187K397M108r57m800N699p07m550M078j391
1673a6p12N36L988m886J322K493l713L88J301J531l788M739j916k104K363n00
1689A026j640l76N262m711R25K435j936k968K550K189n801M857K05k191nK773
1705B594m048j310O138m516Q16K066n5m118L216P73m672L976n6q02q28L350m688
1722b164m92M763l289m96J535K829n042K174P32l172J023J839N9l134M509k877
1738a203n31J705j116j870J840L482n447L024P39k996j14L147j747k969O651k889
1754b94j759J157J614l744J608L868m708K141Q35l36k470K606j106j076M201l028
1770d91m61J343K730n488J557L149l104R94J880j83m600N392m24l811J647K090
$$ y = [-525, -1993, 917, 3173, -2251, -1290, 3294, -3893, -1496, 2612, 1655, -3145, 2554, 1847, -2703, 1375, -16, -728, -192, 3796, -1090, 232, 2725, -988, -600, 701, 2232, -1556, 3183, 1267, -837, 1526, 1026, -614, -990, 4272, -439, 486, 2921, 985, -1983, 567, 2756, -3045, 1812, 2017, -174, -179, 2594, -1454, -2764, 3374, -1142, -326, 1740, 1685, -2433, 783, 1556, -3116, 860, 804, 2, -826, 2524, -2164, -2656, 2107, -1182, -1678, -143, 2686, -2356, -182, 550, -2622, -1599, 240, 299, -2835, 1674, -1203, -1734, -29, -1145, -3015, -1175, 2307, -3140, -116, 623, -2373, -2487, 660, -1087, -4056, 2595, -294, -2053, -896, 718, -3026, -1418, 2450, -2258, -117, 718, 382, -2088, 518, -588, -1664, 2537, -491, -952, 391, 3121, -2367, -810, 2339, -765, 229, 2109, 1926, -2674, 2718, 2294, -1517, 130, 2220]
1786B220q87q47L312m813J160J812r20q82J343K11k313M665l582k168K405J902
1802B618l412L86M469n023Q41J899m82m400L853K251m741K184M58j01k511K623
1818I12k271%L498k687k16K46J030k963L340j357k721L974R65k328k980N460l515
1835a613k96K857j229j778J816L147n347J851J85J54J22J314j466j113M121l570
1851h45K03Q39O96j763K106J348n163L656Q32j825k899M802j69k732L301j924
1867D63q69K43L323m597J599J998j930R50n94m46j753M493k778j610L039o01j589
1884f59L70K643n752K949K644k286j483J955Q02l872L975k383l33R42J704k028
1900h12r17K736l252J892On28j423L625q99l741L647o89j120m9L032l224M13L153
$$ y = [2220, 1333, 486, 3798, -1015, 145, 1957, 1037, 155, 1498, 1709, -604, 4061, 479, -1689, 716, 2618, -794, -408, 4061, -962, -121, 1778, 1296, -3104, 749, 3000, -1741, 443, 901, 800, -1711, 912, -1359, -1359, 2139, -548, -764, -518, 512, -2451, 889, -468, -3189, 785, 1750, -578, -3558, 1902, -1613, -1909, 948, -281, -2059, -243, 2904, -2443, -592, -407, -253, -131, 1183, -283, -1396, 2725, -845, -642, 197, 893, -870, 1236, 2584, -2579, 1077, 1909, 84, -2815, 1987, 1818, -914, 2387, 463, -406, -163, 3160, -1437, 162, 2160, 230, 1180, 586, 140, -1613, 2880, 102, -1508, 1531, 930, -659, -289, 2354, -3398, -449, 2195, -91, -1574, 381, 1183, -2689, 1286, -1097, -1430, -488, 1216, -812, -1729, 1007, -2245, -353, -347, -875, -2298, 1327, 428, -3313, 334, -355, -1475, -1524, 1508, -1716, -1303, 1850]
1918A850l120k79J476J360l640L680n48j979J955q0r88j090L805l085Q73J526
1934A716j632n59J507J028m561L971j0j402N13J265j835j168L880l136J42J047
1950G66J058k501J512R50l942K929J16p93j362L333k201j400K656k223L53N06
1966b43J426l263K247R39l102J838Kn48j644M032k649r85K341r05j574P69K620
1983A301m121K492O31j524p46J580J32k346L450j593j14P18O45j930N71K098l458
2000b214K457L79r34j296L123j334k863L991q69j085L7K895l470L52K266k279
2016h44P36L25J124k614K858r89j236J661p40lk86K001l002J467J648k428l80
2033g02J796Q19l780L765m74j793L17J712j443j593L990k654Q06l13O83j860J427
$$ y = [1850, -1270, -1549, -73, 1287, -2353, 1327, 779, -1200, 755, 675, -313, -1403, 2402, -683, 190, 1716, 84, -475, 1032, 2060, -2501, 1470, 1460, 58, 571, 1836, 1, -1167, 2713, -423, -281, 766, 1824, -677, 835, 1785, -2157, 772, 888, 95, -1267, 2066, -135, -1535, 1121, -1102, -749, -243, 1183, -2080, 167, 1106, -1996, -158, -156, -704, -2348, 1684, -965, -1950, 391, -514, -2088, -1319, 1301, -2820, -328, 303, -1221, -1967, -387, -255, -2601, 849, -744, -858, -140, 505, -1425, -854, 1244, -2214, 243, 622, -312, -1608, 1515, 181, -2682, 1309, 440, -645, -608, 2287, -1183, -831, 1435, -844, -108, 217, 1341, -1273, 1585, 596, -640, 1021, 281, 278, -8, 1993, -1009, 458, 2106, -322, -702, 1094, 1913, -1867, 1898, 1424, -369, -52, 1660, 217, -1376, 2614, -40, 766, 453, 1136, -724, 703]
2050G03O42k483K882j114m76k93K521k697p78L502k723J86P12J495l826K244J001
2067A498k509J256M55L5j681K773k261j33J329j245K85M54J085l372L351l57k204
2084a241M20J830j075k008M223k365r79R10J383k070J66K218k663J441k08J55
2100A37j316J266m16r82K924k349K82Q4R64k490J974J072k796J492Q13j39l062
2117b542L423r68j479K140j48j179m62K961k944O70N16o67L46Q23M99k538K547
2134I98j516j51N97N64r01o55K835l014J508K72o07j196J672J012k730K356j233
2151a89l33K62J529k202j29K431j495L78k75K53j893K567J32k679J842L4J46j397
2169a018K237k391K45J682k87n61l37J102k445K452p43r54J125N94n56j305K765
$$ y = [703, 1345, -1138, 1744, 630, 154, -139, 2382, -315, -1093, 2409, -314, -128, 584, 2079, -1747, 497, 1498, -1011, 245, 700, 735, -946, 1827, -434, -567, 762, -483, -198, 256, 1341, -2031, 1320, 963, -1241, -821, 1009, -66, -2074, 2149, -216, -1195, -285, 1098, -972, -806, 1412, -1251, 190, -18, 137, -1179, 87, -329, -1311, 1613, -736, -454, -370, 594, -1896, 78, 1150, -1646, -154, 659, 520, -2542, 881, -87, -1566, 574, 426, -753, -1215, 1746, -1198, -528, -12, -679, -333, 490, 989, -1549, 998, -518, -669, -72, 492, -409, -1064, 1771, -1243, 265, 537, -70, -1266, 406, 1418, -1312, 1044, -189, -522, -260, 1269, -933, -1062, 1369, -126, 252, -23, 230, -1663, 904, 1036, -1643, 199, 233, 379, -1018, 1219, -1172, -927, 755, 468, -93, -430, 672, -1773, 679, -64, -1018, 107, 701, 145, -1160, 1605]
2186A605k843M65P24N72j385J272J054l249J922K64n79q86J774n56r45K621k108
2203b78p19N39J526j648J162O00k135J524O33n17k234K601l97p25J021n87j70
2220A96l80J908k658J296O58r88O78J12o2k378L175j343n98J290N58j810k50K483
2238A887l028J061P76k44j540J949L66k628J805r76N65m16Q55p69j23J114j976
2255a322J488k67o32p81K913r88k208K125k01n95j148K531j684r9J792q77j155
2272a108N1J892k254J596n2l65L2P8Rr03J650j776J220M70j048p11J358N97k916
2291b180K649j59o09p79K048j014j453K110j383O72j69J169j783J052L70j805
2307a264J703l24J0j154K534j582q64J488r72k59j67K279l052J385R91j313m30
$$ y = [1605, -1238, -773, -49, 523, -862, 410, 1464, -1785, 137, 401, -178, -1064, 710, 154, -791, 1830, -278, -997, -458, 1068, -580, 582, 1182, -953, 571, 1204, 687, -1547, 1054, 657, -68, 953, 366, 196, -184, 1724, -934, 362, 1020, 32, 710, 822, 760, -1618, 1557, 214, -384, 906, 1464, -346, -596, 1887, -1141, -80, 696, 452, -1088, 861, 1227, -1401, 404, -572, -7, -423, 432, -337, -460, 654, -1322, 166, -101, -733, -1514, 1399, 411, -1797, 328, 127, -468, -1616, 915, -769, -868, 924, 47, -1108, -1057, 835, -1419, 177, 125, -240, -208, -130, -121, -1024, 626, -1150, 70, 540, -508, -1219, 139, 736, -2180, 469, 310, -299, -1078, 970, -44, -1497, 613, -770, -98, -267, 902, -881, 171, 541, -1264, 439, 115, 125, -1029, 1505, -77, -941, 547, -425, -684, -851, 1428, -1624, -239, 752, -561, -991]
2324i91R20N33j903J891o81L99l19m47K24L36M58k575K733K37j151o93J681n97
2342E5k027L384j129r66q0K009j838k66J919j693P60L10J032k239R51L19p8L59
2360G82j094J182j89N95j782J448M44k020O95J149L02k341K644o91j513L56J317
2377A284m80j452K062j051P75k96n08n89Q90J247k129J200o43L98r1P36j517l58
2395e22K277j564N07j09K94j781J758P28k178L23P12J060j904N49p91N93O36j325
2413g37P58J50M05k044J508l9j016N02L02Q7j191K478j413p95K80O62l85j24J322
2432G10k352J166R31L5j837M72J081p2Q85j975M82L98M18r63P84Q25j910J326
2450D04N09k96k451K129L35j181J101q35L61k42Q70j678R96N72r46K72K62J139
$$ y = [-991, -71, 462, -1441, 450, -231, 168, -151, -598, -374, -38, 420, -2155, 578, 815, -336, -1029, 652, 55, -1972, 1412, 283, -683, -763, 1246, -592, -858, 1061, -632, 128, 438, 1470, -769, 182, 501, 423, 782, -312, 870, 681, 1276, -506, 942, 1386, -634, 61, 1210, 1512, -829, 1815, 1124, -389, -33, 1284, 804, -648, 1414, 363, 1138, 842, 334, -255, 635, 1882, -247, 953, 310, 708, 617, 1353, -164, -522, 1755, 191, 698, 589, 883, -898, 860, 1588, -590, -267, 445, 1505, -399, 150, -641, -48, 588, -737, 21, 171, 576, -1468, 40, 1, -1015, -513, -211, -124, -1315, 1163, -250, -1045, -765, -103, -488, -612, 710, -1642, -476, 455, 490, -1347, -875, 206, 134, 1019, -956, -474, -76, 342, -621, 163, 988, -922, 404, 913, 617, -1834, 295, 630, -551, 550, -285, 76, -166, 704, -974, 22, 594, -352, -80, 182, 1321]
2468A321j972R38n73P5R28k81q72k71J676j698O35R2n02j89J240O95k390Q33l11
2487f26P04j2j01o83L7J747j540l3J73L41r06J239M37j504J83J88N02r77Q22j082
2507a091L78J323j358P4M34M67j882J371N47p30K83k18M48r50K017j978J42J130
2525D07j96m82j91J190j888J168L55m5p20K06J40k63P61j671Q91N51P16j469M45
2544i5R12j850J298k6O6j290J577l65o17P53n62J16m64J431j364M31O88r22M23
2563A40KL15j016J151p90L04O92n49n28K3J465j643M77N61j37p33L13Q45j593
2582g01J133l23J13m3L36o64j84J276j579J015j19r5m21J056l15j423J321k28
2600A55q5n89J617q74o24Q56n61R5k84J244j456P01k04k20O03p09K97j71J036
$$ y = [1321, -651, 287, -286, -211, 717, 436, -436, -707, 969, -729, -94, -2, -504, -693, 547, 1242, -1148, -315, -626, 78, 66, -35, -718, -681, 1066, -474, -507, -334, 7, -899, 340, 777, -727, -544, -356, 146, -831, -9, -1091, -713, 610, -748, -674, -240, 227, -1655, -284, 263, -467, -184, -402, 46, -904, 1113, -865, -723, 407, 211, -271, -462, 728, -1160, 8, 363, 318, -402, -196, -56, -319, 442, -1229, -338, 213, 929, -540, -95, 817, -1033, 265, 239, 305, -985, 592, 227, -390, 363, -199, -83, -547, 884, -480, -49, 639, -283, 140, 142, 457, -559, 592, -198, 106, 798, 249, -279, -256, 1209, -434, 43, 604, 467, -266, 47, 892, -701, 432, 109, 222, 179, 515, -149, -333, 943, -636, 379, 260, 165, -256, 800, 485, -938, 383, 155, 70, -519, 1098, 224, -400, 456, -105, -10, -294, 950, -506, 195, -9, -229, 374, -335, -38, -209, 827]
2619H27j605P65P13j036k7L01P75j604J446r2n68k04R31n07r46J241l63j07m78
2638e38P78n23N4M79r23J037n96J06j07Q15j303j38J568j281N11KO96j295P96
2657A38M69q92O5n9P48j101J127m35n21K63N5K75p91R58j015R27R4n32j65M77
2677H5J52q66J375q15j13J8M92m41j35J013j279O90kJ68n12M43l65k02J352j056
2697Bj54K34O93j025K73O66j131N10N18K60j797J286K45p17J70L41M15j440J070
2716D19n09L37n62J57M04k14L50o32O11o48J48L74N58j207r9J503j534R38j06
2735B88k37q65J207N07j464M65K53K23q53J044l88n48P89l98K58q99P83o80O66
2754A51rn89N19k40N62r44R52q43j49P40j06k42J67P11j844J178L62o49k9M35
$$ y = [827, -778, -13, 700, -336, -363, -62, 713, -891, 555, 463, -105, -309, 622, 115, -831, 410, 47, -60, -538, 240, -283, -229, 250, -673, 364, -232, -126, -233, 582, -721, -859, 709, -572, -61, -59, 637, -658, 138, 607, -285, -220, -279, 469, -632, 495, 60, -461, -198, -143, 132, -659, 299, -716, 211, 305, -227, -392, 85, 237, -629, 746, -69, -182, -164, 328, -113, -248, 765, -514, 176, 174, 342, -170, 273, -92, -294, 1058, 2, -152, 82, 775, -250, 23, 689, -442, 68, 586, 846, -951, 335, 580, -137, 33, 374, 789, -651, 419, -90, 247, -315, -158, 246, 32, 382, -250, 361, -287, -139, 235, 793, -414, -513, 990, -544, 394, 288, 51, -814, 393, 900, -564, -99, 154, 377, -476, 568, 180, -368, 421, 23, 281, -618, 165, -515, 151, 142, -447, 72, -168, 394, -550, 402, -441, -590, 150, 44, -198, -31, 680, -1164, 14, 376, -273, -302, 133]
2774A33q6r02J667q94m14K30P50q31K78M18j085Q47R6J12r56K84R83o86P70j017
2794c03O12n15R62m27j96L76n72Q17o54Q0n92J351q70j68Q27l41m76R8J101j555
2814d45O26M84p44k31N84N41j554Q43k55J63n41O81k68l71P25q13O26m73J10j5
2834c27M16K07j020K94q6N79m87L83p04R3J050r44K91l09P34r29N76Q0r05N02
2854e06K90J0r37J325p31K27M22k36k2k76O55p67P52j56q1O4k26K52n69R83r55
2875d82N96j07K27j50j32M52j077J180k55Q5o37Q66O8j213J349n08j26j53R60
2894I43r50J73M26n60L37l11O20j207J102l60m18N17m01K15m47Q05r60P61q1j53
2914E1R8p1On62J114r14K73P3K20m63LN93j326R01K7R4n20K12O80j042Q44p17
$$ y = [133, 47, -855, 812, -82, -496, -266, 484, -347, -69, 349, -736, 111, 207, 319, -637, -353, 630, -56, 714, -303, 309, -206, 756, 329, 133, 509, -63, 754, 100, 180, -412, 939, 69, -99, 728, 387, -89, 9, 1110, -445, 181, 665, -79, -310, 274, 815, -739, 104, -151, 12, -529, 152, -116, -487, 238, -575, 51, -422, -312, -327, 89, 296, -724, -430, -516, 63, -424, -41, -745, -652, 398, -546, -255, -564, 170, -759, -183, -103, -1008, -506, -216, -206, -1143, 182, -549, -322, 100, -136, -158, -434, 221, -546, 206, 50, -31, 33, -193, 59, -510, 473, -482, 114, 7, 234, 84, -48, 404, -673, 507, 252, 337, -300, 566, 634, -579, 770, 262, 136, -17, 943, -7, 166, 592, 32, 369, 58, 678, -529, 573, 213, -205, 312, -89, 126, -321, 484, -476, 285, 204, 51, 149, 78, 84, -478, 636, -278, -5, 68, 288, -175, -172, 421, -905, -4, 23, 117, -403, -191, 489, -553, 291, -426]
2936d26L93o00J085q12k23P13m36N03n99N50o74Q77m00m50J056p45M13m43M30
2955B12n76M40M28o17J00r6J088j483J034l32n2p7M21k20r50J127k92L10n63M18
2975C20n4j0L27j052Q41l34M03n39O67o75k87Q49q27M64m04O01n23L73K16o73
2995c17L34j34K88p72J001n99k15J88O1J37k76Q78j317M56K37j71j12O8O00r32
3015e97J346j114O4m6O12j50m24M99o80Q28k17k79k82L88O93q62P02p52N12j57
3035H4K99m50l18P77l51P2K6L90q97R83l92n28N62JK06p82P54n29L17O6l25P0
3057C5j01P20j080O41n64J65L49j07pn22R58o64P3j62Q5j62K44M67j263R86Lo6
3079B8o15L15k74M7P41o40J77k01O74o94L03K61m02N21m00M50p31Q30o00N1K72
$$ y = [-426, -33, -633, 452, -360, -583, 130, -306, 197, -402, 148, -526, 351, -49, -499, 557, -188, 225, -218, 212, -364, 76, 504, -113, -13, -109, 979, -504, 530, 198, 146, 69, 490, 270, -680, 447, 155, 465, -98, 320, 266, 256, 583, -469, 372, 38, 441, -98, 569, -106, -393, 456, -371, 93, -311, 290, -233, 140, 356, -317, 17, -117, 171, -601, 400, -199, -414, -226, -165, -28, -304, 574, -743, -287, -50, -221, -333, -265, 335, -597, 749, -365, -301, -347, 265, 115, -309, 190, -490, 338, 121, -158, -440, -52, 641, -221, 481, -271, 241, 84, 383, -67, -385, 392, 41, 113, 139, 529, -368, 615, 223, -305, 257, 258, 464, -318, 436, -93, 224, 290, -35, 35, -66, 654, -426, 215, -349, -184, 165, 58, 51, -471, 487, -177, -104, -266, -181, -343, -99, 368, -895, 91, 94, 28, -587, -272, -546, -499, 242, -398, -221, -422, 252, -442, -139, 122, -280, 241, -159, 291, -440, 390, -210, -159, 113]
3100A13l54N35l92O89r59M65J9n0K67n3N65j100P56n86L46n2L97k60m02J175j286
3121a67Q02m77Q7l05N10L4p39O25k71K67l79N54m46p1O47p53K8r4P08q18M25r3
3143G4j27N13q54O87n00N27n41K54J71m76L35j83M92j295J209l02k98P8L44m21
3163c13l71Q82o89K8K36M00m36n9M46q33Q54l98L17k43J97j66k40P64q65L76m7
3184a60M81r35Q43R5m55L51l45L86n11O71k46J10J16j01P6l65M55o87O14k67k73
3205a47R2j7L17m07P76o98K34n2J08j99K9M89j366J174j93J16l19J70K42q97P48
3226B00n25K07l78M85k49J96k0o99M75o3L85o45O36k57j23O48p66O17o05P23r78
3247g36M76J57j92O2J82L75p55N85o0l6k98J17q3k35N20o03Q38l37k8P9m6L27
$$ y = [113, -241, 294, -98, 591, -368, 97, 116, 66, 333, 280, 845, -255, 501, -85, 261, 209, 606, 346, -56, 1119, -167, 635, 158, 245, -60, 450, 484, -255, 370, 99, 366, -13, 541, 95, 24, 671, -82, -54, -148, 560, -258, 167, 74, -53, 460, -394, 293, -207, 320, -221, 33, 204, -272, 63, -120, 372, -923, 286, -16, -314, -236, 108, -313, -684, 198, -491, -463, -227, 173, -263, -322, 124, -709, 145, -253, 64, -179, 18, -148, -388, 376, -489, -113, -160, 321, -614, 229, 324, -131, 220, -125, 261, -250, 421, 175, 285, 401, 300, 376, 11, 466, -221, 393, 126, -147, -55, -72, 245, -162, 614, -84, 150, 98, 206, 7, 36, 525, -841, 333, 140, 256, -63, 107, 349, -548, 200, -325, -118, -496, -11, -260, -64, -84, -783, -308, -371, 14, -631, 5, -252, -375, 273, -493, 124, -481, 242, -736, -260, -103, -295, -233, -51, 324, -431, 154, 94, 58, -240, -123, -206, -441, 79, -524, 314, -23, -51, 28, -18, 309]
3269C09m47Q15q80K65l62N88m65k67N95l39K84q9J78l90J65L5k63J92m20P50m79
3290b25M47n60Q0J71l60L45O1O06j205R09k41l69J60K27q4m67Q66m12L10k98K12
3311A73j49m06P74q46N12k50K96l4J10l2k83P76p37N98l72L11m72o8N16n24N09
3332D02l00J49o38R19m46k68O50l22K07n12P07o92L81K3m17O62m11K05n29M51
3352B21l71L40j7j29L06m96O16q00K84lL46n41J75K14n37M61m97L93J2jL0n00
3374d94O23o90J047q80K71n50P40j85m47J002o38K73n67Q02n86m4J31Q5r1r1N22
3395B33n45N04m16Q7q3n7N89m45L07q22R79j84k78J84L2L59p07L34J43N0k71M71
3417D64Qp63N52j9J19n27N65k48j75K65r7L07n16M32l15M10n30J95K94o80L57
$$ y = [309, -138, 677, -203, 62, -300, 288, -177, -444, 151, -188, 96, 7, 185, -205, -40, -5, -268, -76, -496, 254, -225, 222, -338, -258, -87, -447, -102, -41, 565, -640, 269, 28, -341, -181, 46, -38, -505, 361, -51, 259, -39, 173, 24, -382, 392, -454, 58, -192, 104, 70, 180, 148, -135, 641, -96, 502, 130, 441, -31, -99, 417, -107, 402, 102, 251, -387, 532, 86, -182, 468, 146, 353, -159, 548, -144, 237, 260, -157, 505, 94, 299, -230, 221, -150, 190, 173, 44, 350, -146, 470, -330, -46, -49, 297, -244, -69, 145, -392, 69, -428, -35, -23, -24, 6, -494, 129, -561, 486, -394, -123, -673, 67, -118, -565, 437, -201, 72, -495, 307, -279, -323, -192, -107, -198, -289, 233, -312, 192, -224, -137, -220, -277, 312, -133, 174, -648, 331, 147, -131, 53, 85, 444, -263, 71, 214, 264, -7, 464, 472, -291, 261, 242, 361, -166, 399, 151, -24, 241, 144, 451, -65, 367, 52, 462, -68, 127, 421, -259, 98]
3438I8J53K96o85P9L54p6J26j85J98q12R11k86j11j78O7N33o10M69m07J42r3j9
3460c6P4K40j63n01J028q07j14K73M10m35p8M28n89M51l18L37k89K8J93j66L6
3481Bk78O63n70K85o58O21J88l66L46k29L10q55J060m04l34K13K57j7o05P16j89
3502A56J68k41J08k86m1L61j25K34o82P00l1l91K6R1O7n31P55k58K5n51M89M34
3524D77q74M55K1P1n18O89k38n67O31o8Pn32N78k32k8Q0k48M55m61L42m70M95
3546F5m15K85J15k06O5j11N32r59N78p1PNR9J27m69N29l34J75k75M58J34m30j0
3569a06l44Q13j95J02l87K51o1k56K63l93M10m14P68o96L00n7O8r2m82O03n39
3590d44N12k03j31K13k79N00l15L35q56P36o4k42P3J03J34n82P06l45L9p5J38
$$ y = [98, 251, 547, -138, -59, 295, 219, 345, 160, 358, -454, 457, 171, 60, -118, -51, 482, -128, 341, -66, 76, -17, -36, 38, 278, 115, -386, 642, -165, -279, -6, 404, -31, -109, 319, -270, 181, -137, 200, -89, -61, 132, -34, 2, -276, 387, -183, 102, -556, 65, 253, -113, 233, 4, 314, -541, 519, 115, -219, -6, 251, 234, -371, 345, 156, 324, 83, 191, -95, -136, 225, 100, 334, -348, 352, 321, -70, -44, 47, 114, -417, 338, 80, 105, -446, 43, 477, -397, 58, 79, 150, -368, 321, 83, -484, 147, 79, 86, -446, 132, -100, -128, -48, -296, 159, -302, 40, -430, 65, -350, -65, 50, -156, -91, -202, 330, -629, -51, -122, -115, -110, -11, 116, -353, 176, -158, 17, -258, 200, 334, -96, -106, -450, 363, 168, 270, -117, 134, 73, -183, 80, -313, 97, -317, 451, -245, 55, -2, 66, -26, -508, 95, -444, 68, -135, -266, -53, -332, 168, -147, 188, -668, 68, 4, -238, -165, -62, 72, -510, 196, -149, -110, -185, -47]
3611d7k6l00O48l31J26l62J85K37k97L66p04O00m61N14p0o0k19J54M51p57N11
3632A58j36J26k47L58O1k63l3J04j5n13O39m3j06k0K7q1k59N76m62M29l09J36
3654A27j10j34K49k54M67p38O82k25O2k68qK60k99L03j67J3j81L36l0r7R3o64
3676e83N80m12N49k39M8Q1l10O13n10K39m88N39j71k24K62o9K90m40N43n33M17
3697A82l78R8K13j49N42p39L37j61L33l33J16j08r6M16l44L80m21L51l71N99j31
3718C36p67N34j77L01n85O25k85mL57j81R3k26M48m28R4N9j98K73k29L95l33Q4
3740A86k11K72j66q9N2J08J98p01O67j90r6J5j00L42m83M82o78N65l73L90M9k44
3762eJ69j92L19l39K75l40K16J14k10K19l96N01j88J76l71J89O7j49L77n36N80
$$ y = [-47, -73, -373, 275, -56, 70, -292, -107, 130, -167, 199, -505, 95, -366, 148, 78, 18, -201, -47, 404, -353, 158, 22, 148, -99, 259, 320, 57, 24, 128, 113, -400, 239, 196, 90, 70, 97, 16, -243, 333, -129, 300, -9, 127, 17, -117, 132, -122, 345, -393, 289, 64, 126, -142, -150, 110, -189, 114, -53, -40, -221, 115, 85, -12, 81, -583, -3, -415, 134, -105, -57, 24, -286, 327, -183, 56, -432, 107, -64, -288, -26, -95, 195, -245, 298, -235, 182, -196, -98, 115, -34, 508, -231, 106, -55, 278, -55, 61, -47, -143, 273, -71, 309, -112, 239, -132, 467, 336, -431, 103, -74, 227, -358, 267, -18, -22, 335, 154, 247, 21, 469, 41, 135, 194, -4, 269, 40, 435, 102, 186, -25, 247, 81, -8, 44, 152, 350, -351, 316, 126, 30, 45, -55, 287, -196, 286, -392, 173, -200, 190, 239, -5, 164, -28, 291, -48, 227, -113, 103, 217, 7, 226, -170, 331, 143, 319, -52, 137, 204, 55, 432, -104, 476]
3783D76q36O06p6m15N68j97j96j62O08l77J75l12K83j07j06L02l74N43m33O5j35
3804a00J26n6j41N64q01P13m77K30j57M2J45m94N34l30K39n3J24j15j11O5k74
3825c27L07j29L39m82M15k47q3J77n63M34Q4K37m56J74l6K93J38l27M12n68R9
3846a09Q3J54j76l00N03k78P2l01P33k23l45K27O4J81o49M35l02K55l34L03k47
3867b54J50K85k04J59o06R60q07L15O1l45O7Q5M68n24J32j91K06K78l37Q0p2J49
3889E5n06L89q6M1J43O7M3l93L7k09M31p8K72j70o9J40l16J93k38L73J10k60k67
3912b98QO62m98N1m6L09m9k99K39j85L08j40K41n09M37o3j46J94r2L59n86M16
3934C13m24J00n4J22O5j78J75j0L78n56K85j37K9N4k36O75p72L10j23OK6j29O10
$$ y = [476, -360, 246, 170, -245, 323, 126, -70, -232, 376, -1, 174, -138, 145, 38, -68, 234, -140, 403, -30, 35, -100, 26, -30, -171, 393, -408, 305, -172, 58, -99, -57, 88, -406, 128, -202, 37, -16, 108, -7, -118, -53, -327, -20, -149, 190, -292, 123, -124, -207, -30, -593, -159, -75, 162, -294, -120, -156, 137, 275, -52, 360, -208, -109, -26, 128, -48, -348, 155, -123, -51, -352, 381, 158, -187, 40, 104, 285, -364, 71, -231, 24, -310, -7, -254, -104, 181, -23, 136, -470, 490, -317, -2, 59, -286, -219, -134, 334, -190, -58, -249, -43, 235, -102, -22, -94, 55, -451, -62, -148, -107, 36, 103, 146, -247, -210, -419, 12, -66, 206, 36, -33, 107, -209, -16, -254, 119, 229, -31, -298, -290, 372, -126, -75, -121, 188, 139, -160, 79, -106, 202, 62, 303, -206, 231, 168, 22, 216, 124, 483, -103, 313, -111, -11, -65, 57, 122, -56, 119, 109, 487, -69, 216, 79, 108, 162, -74, 601, -171, 139, 16, 22, 48, -81, 529]
3957E29o76L71k90K11m12N29o8m07M39k95M51p54M31l93N27j50m60M24k09L34
3977A32n09N23n03J82L69k29J46n88O82l10K09m33M26j6m26J49q7L69k36J53j42
3998a39K00j06j26L16k44M59l81Q3k84N95n45m7O57o10L34m11N70l41m3K39j05
4019G1L21p10N56l03K44p4j50J57m27L48l12M47j66R1j5p2q8O3K19n11Q25l67
4041A47j60J30Q3p4o49P71m28K97l36L80k38q7L71l47M12o20J16J60j21p5Q5L28
4063A45n14K48j68L53l39M07j78O1k0k44N33q09P56l09O7J01N6K88p30L03mL89
4085C92o74J50M30k86J68k98M82m76K58m26M88O6n65M80j20J25k03J64j64J29
4105A20K1N4j96j33L09j39j94J83o0J68m02O06m69J72k44N95l94l97N39O6l06
$$ y = [529, -147, 224, -66, 145, -267, 262, 194, -213, 226, -69, 382, -372, 59, -334, 193, 43, -417, 7, -202, 132, -377, 146, -357, -175, 194, -35, 111, -477, 205, -105, 104, -329, 97, 81, -345, -196, -283, 86, -150, 3, -139, 61, -45, -171, 145, -99, 360, -21, 62, -222, 373, -172, -219, 438, -172, 162, -249, 321, -20, -63, 176, 71, 392, -318, 238, -65, 179, 105, -45, 112, -315, 33, -279, 168, 2, 93, 78, 6, -82, -19, 200, -311, 514, 147, -13, 117, 200, 126, -523, 248, -180, 117, -219, 161, -77, -164, 207, -140, 272, -348, -232, -72, -193, -268, -183, 145, -369, -121, -289, 64, -275, 132, -46, 15, -5, -249, 284, -525, 231, -78, -11, 90, 146, 434, -296, 7, 3, 392, -282, -132, 298, 12, 180, -118, 364, -112, 146, -280, 208, 274, -291, 189, 69, 194, -9, 155, -9, 120, 141, 195, -1, -134, 175, 36, -158, 25, -35, 133, -269, 337, -132, 40, -204, 391, -3, -400, 139, 205, -101]
4126a01k91O30j4On54M01O1n36O32k08J98l63J28J47j67J20k18M48n33N21m10
4147a03L89n30K51L50n84N75l49J03l41M66L9j95J02q6K41n99M36p3J20k64K83
4168B31J7m95L37j15J66j12k91M51p6j2k39P13o34L06j53m9L5j38J78k89M07l70
4190a32R6r2p2K49J42J46q30N48n3o1m1J81j3k95O59l79J97o52N08k37R8P8k35
4213a90M52m73M86n09J76L0j24J64m47N76k01L04n12L12n1j52Q3K5L69m82L78
4234B14p0j26PJ44L7k78K46l65P68n57O4j36O6R8j88N06o98K90k39M59m25R8L55
4257B70n71L64m11M03k72L57q0j45M5k36N94o41K86l50M49j62k65L53q0p2k68
4278d32L21l5J48k01m4L41k86J24j20K84l70K86Kk68K54m68M95k87L09k49M53
$$ y = [-101, -392, 238, 224, 230, -324, 77, 138, -398, 234, 26, 224, -139, -11, 136, -31, 89, -129, 319, -214, 307, -103, 286, -244, 7, 357, -227, 348, -1, 102, -239, 227, 266, 71, 173, 87, 328, -271, 165, 92, 212, -52, 231, 248, -247, 90, -25, 141, 29, -262, 189, 113, 101, -138, 575, -59, 247, 94, 45, 80, -58, 120, -169, 238, -132, -36, -128, -200, 49, 191, 337, -493, 55, 2, -59, -100, 81, 68, -227, 432, 53, 250, -402, 106, -131, -33, 45, -190, 262, -211, 275, -234, -58, -28, -152, 12, -435, 141, -60, 244, -268, 44, -7, -159, -76, -51, 318, -164, 214, 144, 18, 25, 169, 206, -72, 174, -191, 577, 20, 84, -52, 14, 112, -76, 430, -268, 22, -217, 242, -183, -85, 270, -301, 63, -348, 55, -217, 140, 60, -85, -40, -276, 318, -323, -37, -387, 62, -100, -365, -12, -92, -164, -432, -111, -146, 2, -199, -243, 98, -188, -64, -184, 100, -270, 16, 18, -250, 4, -464, 31, -256, 53, -196, 257]
4299B57q0l78N75n91N20m82M12k53j3K89m87O32n82M98l89J67%l7P1l58O98n38
4321f9K79l87L76oj00J97j10K5k76O21m54p1J73o3rl50L66l45L42m37M06Jk30
4344a21L50k89K97l21K71k94K16k65K84J36l90L04m74L85j27R9P6r4R1l21M79
4365B92m34J47k9j00J55k54M15l42L42m52O03k60j70J51p3J22m11M24m16K30K08
4386A48O7r0j71K13k20J52m82O03m66K61Q1oL6l49M36l41J49k19J08K87l38K33
4408I2l86K90k38M46l66L4K31m24N54n59M24k70J00q0J82O2k79K73m07K52j19
4429a88K97k73j38L01k63M12l37L73j41r5j22K46ll69N85n35K83k38L31Q3k46
4450c7J39j63L45n14K30J16L8O4l97N50n10L68k41K00j80K89k30o4j3j22K97k26
$$ y = [257, 177, -201, 374, -217, 303, -179, 233, -20, -33, 256, -231, 401, -181, 317, -72, 95, 95, 58, 129, -229, 469, -69, 210, -177, 199, 193, 93, 290, 180, 205, -71, 550, 96, 25, 198, 135, 126, -224, 142, -203, 139, -298, 108, 109, -121, 229, -60, 237, -84, 187, -107, 109, -156, 128, 264, -126, 178, -296, 89, -38, 61, 137, 43, 134, -187, 292, -142, 5, -24, -124, 31, -223, 192, -150, 192, -260, 343, 83, -87, 64, -9, 113, -298, 126, -290, -60, 148, 215, 125, -46, 167, -53, 99, -383, 220, -246, 15, 96, 90, 126, -223, 213, -128, 21, -198, -90, 197, -141, 92, -294, -4, -242, 204, -162, -128, 103, -321, 233, -326, 98, -172, -72, -152, 30, 92, -187, 86, -321, -69, -188, 109, -164, -302, -1, -264, 148, -189, 184, 43, -52, -174, 72, 69, -300, 285, -250, 33, -205, 126, 209, -37, 102, -61, 284, -230, 0, 116, 154, 218, -179, 371, -139, 229, -12, 188, 8, 297, 67, 3, -10, -132, 165, -61]
4472f1J42m96K29N9J47J02j77K50l09M15m25j85L65j84K87m31L57j95J96k6k1
4493C9J1j34Q4m38N81m02L37j96j08J21K7L70m99N22l76J63l47K24J32l78N60
4514B93o17M50k83J58r9J10K53k59J65n02O16j60Q7j01m9P6q5L66m68M12m05J42
4536A00r6l9M4M1K49k90L20j82j9j15K4J34j87J43k03K47j82J90k19o7K18k72
4558a61M75p48N83j11q3J59m75M51m59M46k09J18p3N7P4m3q8o7M09n63M89j48
4580C3j12K59j02K2l64K24j05L04j52p9J56j77M01p75O65l99K50k30J67m4k4J62
4602H0l28L35l04L91m56J82R7k0J61m43N34m68L19j85L02j28k3O1m42L14k66K89
4624BM0j11K10r8N4l32L04mj73K66k17N0k24M15k57J54m11R2K61l33J68k58N85
$$ y = [-61, 81, -415, -186, -127, 20, 122, -55, 195, -114, 301, -124, -309, 56, -128, 159, -272, 85, -110, 86, 60, 39, 50, -84, 0, -438, 143, -259, 78, -118, -226, -105, -78, 292, -207, 315, -61, 102, -245, -21, 111, -267, 293, -324, 126, -157, 1, -98, 12, 265, 6, 171, -331, 285, 125, 212, 111, 62, 138, 53, 419, -49, 363, -42, 100, 4, -35, 9, 50, 299, 9, 329, 147, 128, 13, 37, 171, -16, 127, -76, 171, -11, 179, -40, -107, 111, -161, 314, -434, 149, 38, -45, 114, -361, 90, -369, 77, -132, -14, -87, -30, 44, 1, -87, -154, 255, -308, 181, 33, -79, 180, 78, 100, -264, -40, -145, 159, 7, -72, 84, -93, 308, -467, 198, -201, 49, -181, -14, -58, -82, 80, -248, 87, -217, 174, -282, -100, -3, -23, 138, -305, 229, -239, 80, -105, 197, 69, 46, 107, -335, -21, -287, 2, 42, -69, 141, 43, 97, -235, 69, 65, -108, 158, -59, -9, -233, 182, -75, 79, -332, -240, 21, -312, -144, -402, 183]
4647A83o52M73J8r2p9M9K38n30M13k03L55k14J46kl33O09l46L45n63O1K1J11o9
4670f1j94N39l99N05l13K13k72k0j19J42N1l46O10n14K70L9k76K67j07J45k31
4691g1K63j52J77j82R2j8l36M11n53N28l88L65J49k84j53k10O56n46M41l28R0
4712d9j61p6N69n40J42l8N38k73j14o3M1M04p84L89j90K56k62L68j46k56L37k38
4734a46L60p33N74k09L81k94l8L43m05L64k73L32j93n8K78l31J38k89O39m07J78
4755B11k1j13L70n00M55m82K06k03M32m13p0M72m81K62r6K87m33L03K4k08J59
4776A61m38N64m75M66k51K58m43R3K30n4p6j78M23k71K14k4l20Nj5J05l60M03
4798A7j64J72N0k23K62m18K74j80K15k30J60k47L82K7n76Q88o55L56l01R8L34
$$ y = [183, -469, 4, 22, -70, -149, -100, 138, -392, 21, -182, 173, -41, 105, 103, -230, 379, 33, 378, -185, -124, -103, 8, -61, -255, 284, -115, 390, 77, 290, 18, -2, -121, 21, 72, -274, 336, -178, 92, 131, -145, 122, 15, 160, -71, 192, 40, 217, 35, 127, 109, -227, 184, -369, 159, -229, 136, 285, 1, -152, -362, 294, -252, 189, -139, -49, -210, -286, 283, -257, -115, -153, 385, 112, -2, -65, -24, 380, -404, -15, -205, 51, -211, 157, 11, -245, 92, -146, 214, -519, 55, -154, 227, -67, -105, 238, -167, 197, -76, 256, 63, 5, 283, -48, 90, -199, 440, 33, 211, 190, 77, 447, -53, 402, -80, 126, -77, 355, -58, -128, 344, -137, 125, 29, 316, -117, 186, 210, 2, 161, -277, 287, -188, 278, 27, 285, -158, -65, 165, 111, 35, -143, 280, 9, 223, 199, -121, -116, -131, -26, -386, 17, -147, 25, 75, -148, 114, -304, -30, -210, 5, -225, -65, -312, 70, 97, -479, 409, -246, 110, -191, -93, 241]
4819B41n02L62k12K40m72M80r1r8K3j52L69l25J88k38K92k45J84J67j69P5k86
4840a69N02k60M4j63R9j6j8K42k95M82m87K34k57J58rj09K56l88L57k14K90k95
4862a6J16m0j42K40k52P8k63K68j20j5N5k71K96qK26m15L37j71j24M59k18N9l73
4885b94P36o23K05nK2N7q9M9J3P4k75L38Q8l51N0m5N63m70K58m26j58L43KJ38
4909B00l34K28j50M05j98%l3j39K88m05M77m98N49l42o4J93j40L30k17Lk61K10
4931A02l15J18J08L4L1j25K06m08L28k85J0Q5l09P04n18J55p8J47l04K89J02l94
4953c17K69j58M77n46L06q0K02l45n3M29l62J12J13j04k02K06K86k17J90M5j00
4974A51n23M58q6J4N8J9J50k43K44n66K44J19j33L13m38M95n66N18l88K66j24
$$ y = [241, -261, 101, -111, 129, -343, 137, 46, -52, -29, -181, 188, -137, 51, -187, 105, -140, 44, 211, 42, 117, -169, 333, 73, 117, -46, 53, 37, 19, 261, -34, 448, -39, 195, -62, 96, 87, -22, 234, -154, 203, -11, 279, -16, 100, 60, -82, 158, -94, -16, -279, -11, -131, -146, -91, -362, -66, -74, 152, -263, 74, -97, -221, 238, 20, 79, -294, 442, -181, 24, 19, 41, 98, 9, 58, 71, 145, -130, 208, 296, -55, -5, -50, 513, 43, 301, -125, -283, 60, 62, 200, -134, 94, -56, 349, 151, 151, 118, -21, 267, -138, 339, -159, 390, 48, -16, 177, 37, 367, 150, 153, -108, 102, -213, -95, 13, 47, 78, -47, 159, -249, 79, -206, -196, -111, -420, 284, -234, -79, -157, -10, -314, -25, 77, -317, -48, -206, 271, -275, 31, -49, 153, -192, -245, 184, -178, -66, 47, -57, -259, -53, 233, 16, 206, 251, 151, -372, 86, 0, 14, 72, 91, 241, -2, 242, -324, -80, 39, -94, 219, -219, 276, -290, 228, -160, 106, -18]
4995a8j37M37n68O57p41P40m79J97k33m5N32l63K38l68L96m08L32j03p7K70j66
5016I3R9n69M24q3K25j10j05N5k80M58k93L25o86O43l51K12r1j96O26p35K85J04
5038E0O6j2l57K56k76L44k18K27p2l3J47k76L56m25L15j92N4Q3j20K57m1j50m1
5061e8J84m06N47l6k60j42m3M26l47L00j35J00j20k6J17r8L03k80J57m14J84n
5083e2J64J6o3O7k41K60j46q5J34q3L04n87N47l09K71l36L7K14j69l4k23O73n15
5106a56NJ5K56p9k78M09k59L07l37K21j04m1L12o34N90m83N42k08n9j08J99j70
5128f0J60k6j33J49j2K21j42k80K99k11J07k05Q8M4J20q4j23K36j06J54l91K85
$$ y = [-18, -155, 282, -286, 371, -370, 370, -109, 88, -145, -190, 342, -21, 217, -151, 245, -163, 169, 66, -11, 259, 93, 192, -377, 47, -36, 189, 79, -26, 29, -251, 207, -86, 239, -447, 196, -155, 57, -34, -230, 396, -339, -54, 50, 116, 104, -253, 3, -273, 71, -147, 80, 8, -25, 122, -154, 202, -223, 92, -100, -46, 37, -83, 174, 133, -17, -58, 126, -280, 267, 231, -29, -171, -214, 212, -135, 165, 30, 130, 10, -16, 101, 3, 306, 26, 183, -231, -47, -52, 112, 128, 65, 132, -109, 151, 5, -80, 54, -29, 275, -312, 235, -74, 197, -139, -102, 112, -57, -91, -314, 359, -156, -151, -136, 120, 41, -237, 172, -87, 220, -117, 104, 0, -41, 271, -363, 227, -256, 286, 78, 19, -89, 110, -60, 100, 74, -59, 90, 78, 299, 157, -123, 176, -35, 72, -133, -45, -1, 119, 35, -88, 148, 42, 196, -195, 90]
$$ [...]
8191B93
##END NTUPLES=NMR FID
##END=
