##TITLE=1H_TG-2301-1
 CDCl3, 8 sc, 
 21.9.2020
##JCAMPDX= 6.0         $$ Bruker NMR JCAMP-DX V2.0
##DATA TYPE= NMR FID
##DATA CLASS= NTUPLES
##ORIGIN= UXNMR, Bruker Analytische Messtechnik GmbH
##OWNER= root
$$ XWIN-NMR		Version 3.5
$$ Mon Sep 21 13:15:34 2020 Russian Standard Time (UT+4h)  she@DPX200
##.OBSERVE FREQUENCY= 200.1315066352
##.OBSERVE NUCLEUS= ^1H
##.DELAY= (6, 6)
##.ACQUISITION MODE= SIMULTANEOUS
##.ACQUISITION SCHEME= undefined
##.AVERAGES= 8
##.DIGITISER RES= 18
##SPECTROMETER/DATA SYSTEM= spect
##.PULSE SEQUENCE= zg30
##.SOLVENT NAME= CDCl3
##.SHIFT REFERENCE= (INTERNAL, CDCl3, 0, 15.7039)
##AUDIT TRAIL= $$ (NUMBER, WHEN, WHO, WHERE, WHAT)
$$ ##TITLE= Audit trail, XWIN-NMR		Version 3.5
$$ ##JCAMPDX= 5.01
$$ ##ORIGIN= Bruker BioSpin GmbH
$$ ##OWNER= she
$$ F:/spectra/data/she/nmr/H-F/1/audita.txt
$$ ##AUDIT TRAIL=  $$ (NUMBER, WHEN, WHO, WHERE, WHAT)
(   1,<2020-09-21 13:14:18.60 +0400>,<she>,<DPX200>,
      <created by zg, POWCHK disabled, PULCHK disabled
       configuration hash MD5:
       00 E9 B6 7A A2 85 ED C7 34 08 36 98 17 FE 4E 26
       data hash MD5: 16K
       0D 7A EC D8 AC FA F8 6F ED 09 88 B5 27 74 F1 08>)
$$ ##END=
$$ 
$$ hash MD5
$$ 23 E5 AF 26 8F 01 7A 90 04 71 D9 F2 7E 5C 8E 1C
##$RELAX= 
##$RELAX= 
##$RELAX= 
##$RELAX= 
##$RELAX= 
##$RELAX= 
$$ Bruker specific parameters
$$ --------------------------
##$DU= <F:/spectra>
##$EXPNO= 1
##$NAME= <H-F>
##$PROCNO= 1
##$TYPE= <nmr>
##$USER= <she>
##$AMP= (0..31)
100 100 100 100 100 100 100 100 100 100 100 100 100 100 100 100 100 100 
100 100 100 100 100 100 100 100 100 100 100 100 100 100 
##$AQSEQ= 0
##$AQ_mod= 1
##$AUNM= <au_zg>
##$AUTOPOS= <>
##$BF1= 200.13
##$BF2= 200.13
##$BF3= 200.13
##$BF4= 200.13
##$BF5= 200.13
##$BF6= 200.13
##$BF7= 200.13
##$BF8= 200.13
##$BYTORDA= 1
##$CFDGTYP= 0
##$CFRGTYP= 5
##$CHEMSTR= <none>
##$CNST= (0..31)
1 1 145 1 1 1 1 1 1 1 1 1 1 1 1 1 1 1 1 1 1 1 1 1 1 1 1 1 1 1 1 1 
##$CPDPRG= <>
##$CPDPRG1= <>
##$CPDPRG2= <>
##$CPDPRG3= <>
##$CPDPRG4= <mlev>
##$CPDPRG5= <mlev>
##$CPDPRG6= <mlev>
##$CPDPRG7= <mlev>
##$CPDPRG8= <mlev>
##$CPDPRGB= <>
##$CPDPRGT= <>
##$D= (0..31)
0 1.2 0 0 0 0 0 0 0 0.06 0 0.03 0 0 0 0 0.0002 0 0 0 0 0 0 0 0 0 0 0 0 
0 0 0 
##$DATE= 1600679658
##$DBL= (0..7)
120 120 120 120 120 120 120 120 
##$DBP= (0..7)
150 150 150 150 150 150 150 150 
##$DBP07= 0
##$DBPNAM0= <>
##$DBPNAM1= <>
##$DBPNAM2= <>
##$DBPNAM3= <>
##$DBPNAM4= <>
##$DBPNAM5= <>
##$DBPNAM6= <>
##$DBPNAM7= <>
##$DBPOAL= (0..7)
0.5 0.5 0.5 0.5 0.5 0.5 0.5 0.5 
##$DBPOFFS= (0..7)
0 0 0 0 0 0 0 0 
##$DE= 6
##$DECBNUC= <off>
##$DECIM= 32
##$DECNUC= <off>
##$DECSTAT= 4
##$DIGMOD= 1
##$DIGTYP= 9
##$DL= (0..7)
0 120 120 120 120 120 120 120 
##$DP= (0..7)
150 150 150 150 150 150 150 150 
##$DP07= 0
##$DPNAME0= <>
##$DPNAME1= <>
##$DPNAME2= <>
##$DPNAME3= <>
##$DPNAME4= <>
##$DPNAME5= <>
##$DPNAME6= <>
##$DPNAME7= <>
##$DPOAL= (0..7)
0.5 0.5 0.5 0.5 0.5 0.5 0.5 0.5 
##$DPOFFS= (0..7)
0 0 0 0 0 0 0 0 
##$DQDMODE= 0
##$DR= 18
##$DS= 0
##$DSLIST= <SSSSSSSSSSSSSSS>
$$ [...]
##$SUBNAM2= <"">
##$SUBNAM3= <"">
##$SUBNAM4= <"">
##$SUBNAM5= <"">
##$SUBNAM6= <"">
##$SUBNAM7= <"">
##$SUBNAM8= <"">
##$SUBNAM9= <"">
##$SW= 16.880792210976
##$SWIBOX= (0..15)
0 0 2 0 0 0 0 0 0 0 0 0 0 0 0 0 
##$SW_h= 3378.37837837838
##$TD= 16384
##$TD0= 1
##$TE= 0
##$TE2= 300
##$TE3= 300
##$TEG= 300
##$TL= (0..7)
0 120 120 120 120 120 120 120 
##$TP= (0..7)
150 150 150 150 150 150 150 150 
##$TP07= 0
##$TPNAME0= <>
##$TPNAME1= <>
##$TPNAME2= <>
##$TPNAME3= <>
##$TPNAME4= <>
##$TPNAME5= <>
##$TPNAME6= <>
##$TPNAME7= <>
##$TPOAL= (0..7)
0.5 0.5 0.5 0.5 0.5 0.5 0.5 0.5 
##$TPOFFS= (0..7)
0 0 0 0 0 0 0 0 
##$TUNHIN= 0
##$TUNHOUT= 0
##$TUNXOUT= 0
##$USERA1= <user>
##$USERA2= <user>
##$USERA3= <user>
##$USERA4= <user>
##$USERA5= <user>
##$V9= 5
##$VALIST= <valist>
##$VCLIST= <CCCCCCCCCCCCCCC>
##$VD= 0
##$VDLIST= <DDDDDDDDDDDDDDD>
##$VPLIST= <PPPPPPPPPPPPPPP>
##$VTLIST= <TTTTTTTTTTTTTTT>
##$WBST= 1024
##$WBSW= 4
##$XGAIN= (0..3)
0 0 0 0 
##$XL= 0
##$YL= 0
##$YMAX_a= 378350
##$YMIN_a= -422766
##$ZGOPTNS= <>
##$ZL1= 120
##$ZL2= 120
##$ZL3= 120
##$ZL4= 120
##$ABSF1= 10
##$ABSF2= 0
##$ABSG= 5
##$ABSL= 3
##$ALPHA= 0
##$AQORDER= 0
##$ASSFAC= 0
##$ASSFACI= 0
##$ASSFACX= 0
##$ASSWID= 0
##$AUNMP= <proc_1d>
##$AZFE= 0.1
##$AZFW= 0.1
##$BCFW= 1
##$BC_mod= 2
##$BYTORDP= 1
##$COROFFS= 0
##$CY= 11.3945322036743
##$DATMOD= 1
##$DC= 2
##$DFILT= <>
##$DTYPP= 0
##$F1P= 16.9975609425685
##$F2P= -3.02152046262296
##$FCOR= 0.5
##$FTSIZE= 0
##$FT_mod= 4
##$GAMMA= 1
##$GB= 0.15
##$INTBC= 1
##$INTSCL= 1
##$ISEN= 128
##$LB= 0.24
##$LEV0= 0
##$LPBIN= 0
##$MAXI= 10000
##$MC2= 0
##$MEAN= 0
##$ME_mod= 0
##$MI= 1.114404
##$NCOEF= 0
##$NC_proc= 0
##$NLEV= 6
##$NOISF1= 3.799351
##$NOISF2= 2.8
##$NSP= 1
##$NTH_PI= 0
##$NZP= 0
##$OFFSET= 15.70392
##$PC= 1
##$PHC0= -10126.8
##$PHC1= 12.0009
##$PH_mod= 1
##$PKNL= yes
##$PPARMOD= 0
##$PSCAL= 0
##$PSIGN= 0
##$REVERSE= no
##$SF= 200.130013532006
##$SI= 16384
##$SIGF1= 3
##$SIGF2= 2
##$SINO= 400
##$SIOLD= 16384
##$SREGLST= <1H.CDCl3>
##$SSB= 0
##$STSI= 0
##$STSR= 0
##$SW_p= 3612.71676300578
##$SYMM= 0
##$S_DEV= 0
##$TDeff= 0
##$TDoff= 0
##$TI= <>
##$TILT= no
##$TM1= 0
##$TM2= 0
##$TOPLEV= 0
##$USERP1= <user>
##$USERP2= <user>
##$USERP3= <user>
##$USERP4= <user>
##$USERP5= <user>
##$WDW= 1
##$XDIM= 8192
##$YMAX_p= 0
##$YMIN_p= 0
$$ End of Bruker specific parameters
$$ ---------------------------------
##NTUPLES= NMR FID
##VAR_NAME=  TIME,          FID/REAL,        FID/IMAG
##SYMBOL=    X,             R,               I
##VAR_TYPE=  INDEPENDENT,   DEPENDENT,       DEPENDENT
##VAR_FORM=  AFFN,          ASDF,            ASDF
##VAR_DIM=   8192,          8192,            8192
##UNITS=     SECONDS,       ARBITRARY UNITS, ARBITRARY UNITS
##FACTOR=    0.000296,      1,               1
##FIRST=     0,             0,               0
##LAST=      2.424536,      0,               0
##MIN=       0,             -422766,         0
##MAX=       2.424536,      378350,          0
$$ Real data points
##PAGE= N=1
##DATA TABLE= (X++(R..R)), XYDATA
0 0 0 0 0 0 0 0 0 0 -8 8 -8 8 -8 16 -16 24 -32 40 -48 56 -67 80 -96 112 -136 158 -184 213 -246 283 -324
31 -324 371 -421 477 -539 609 -682 769 -857 958 -1069 1188 -1318 1460 -1617 1788 -1973
47 -1973 2177 -2399 2643 -2911 3207 -3532 3896 -4301 4753 -5268 5855 -6533 7325 -8265
61 -8265 9402 -10813 12613 -15002 18346 -23390 31998 -50755 182353 -186503 -35562 378350
73 378350 -83020 90005 80863 -23901 27323 216 67421 -20407 -170727 62462 19153
84 19153 -43114 -14506 -33113 43992 -53633 -46749 110318 -101689 -63697 138389 -46333 -61388
96 -61388 36371 -74675 17989 -7829 -87111 64788 -21417 -74606 102595 -29365 -109658
107 -109658 85770 32359 -85892 5115 67374 -37331 -64084 83011 -44703 -103073 113480
118 113480 -17719 -99030 74043 -16717 -57531 8521 -47040 -14226 -50383 -52709 30253 -73103
130 -73103 -71870 9815 -39349 -65405 -16001 12687 -50756 -24254 60128 -29143 -36359 54953
142 54953 -7458 11445 33766 -10001 61423 5422 -39136 69124 19655 -62753 32745 64496
154 64496 -35288 -6041 70377 -19972 -49335 72112 10075 -68049 42505 29800 -35864 -6158
166 -6158 3913 -3619 -23020 -17095 38547 -7564 -47873 41469 2121 -48065 15945 -3419 -14914
179 -14914 14717 632 -3008 1491 -3181 -1780 -1459 16567 -6764 2542 49596 -29981 -6259
192 -6259 52186 -39400 5986 50373 -32286 10485 36447 -28063 -4526 5410 -10353 -8512 -2865
205 -2865 21203 -18310 -12661 25360 -18877 -14661 17219 -5715 -8281 10418 8158 -11287 -24328
218 -24328 24212 8985 -42226 30911 28373 -37493 15469 29471 -31446 -2825 22687 -10725
230 -10725 4429 12308 -1484 445 6091 -1041 -2919 7847 -6361 2441 20459 -9085 -17472
243 -17472 20134 874 -24404 12589 12284 -8854 -2638 14333 367 -22322 1314 13266 -10377
256 -10377 -7160 22254 -1206 -15432 18962 2427 -25667 11698 19855 -18097 7448 10836 -18457
269 -18457 3901 6289 -12086 -1428 16952 3366 -5191 8466 -2869 -16563 8865 7949 -17243
282 -17243 12674 10849 -8114 8261 -1991 -4590 4508 3820 9086 4285 -2904 8797 -2608 -3399
296 -3399 9818 -12899 7996 21166 -12370 -3558 12362 -8344 -14005 7065 4207 -11380 2087
309 2087 19079 -16581 -14858 22806 -14679 -15874 19174 -4802 -13194 6924 -4363 -12805 -6091
322 -6091 -5070 1277 -5796 -558 -1432 -11785 2800 -6621 -15786 1798 -359 -8175 9406 1373
336 1373 -11685 6047 6403 -2701 -1715 12664 5878 -6889 14388 9882 -16115 2925 17977 -8804
350 -8804 4865 15631 -9830 790 12093 -4666 -9914 6854 6326 -153 8710 10465 -3713
363 -3713 -511 17128 -1904 -1589 17071 1527 -56 14229 1789 -9754 3743 5652 2132
376 2132 1247 6143 1031 -9734 8145 -2885 -16290 8407 4297 -8220 11303 2558 -13524
389 -13524 5547 1778 -5222 269 4498 932 -9374 3690 -2456 -20769 -667 5120 -16709
402 -16709 -17 4428 -18024 -4946 -3198 -12634 -8678 477 3894 -6983 -490 8535 -7295 -4158
416 -4158 12714 -6304 1370 18141 -3854 -285 6833 -1073 155 5148 6861 2846 4818 13776
430 13776 1402 -5166 13624 -714 1977 21982 1192 2939 17955 7227 1309 8066 8685
443 8685 4957 5677 14180 2624 -9183 12811 1522 -10673 9575 2710 -5243 6120 4722 -5205
457 -5205 -2911 2005 2413 -2301 5913 7246 -5584 9778 6671 -7991 5592 5228 -4374 5485 5241
472 5241 -7171 -2674 892 -3379 -10946 -963 3288 -12617 1397 2646 -16115 -5476 927 -9887
486 -9887 -4772 -30 -3009 -2094 -3217 341 -9544 -5570 5567 -8621 -1030 3170 -10371 -1739 1874
501 1874 -10475 -4352 2948 973 -1319 -635 7205 -7739 -3411 13206 -6895 -1377 15092 1153
515 1153 899 8564 -221 1014 2898 4301 4373 -2818 7468 446 -5810 4794 -6770 -3658 8766
530 8766 -4707 -3184 6806 -5548 -3899 -1820 -2652 -330 -6268 8022 1636 -11688 7568 61
544 61 -12518 5902 878 -6831 4966 -1611 -1584 -4390 -5700 2493 -6308 1833 2832 -8098 5925
559 5925 -682 -14009 4410 -1381 -9662 6847 -290 -3011 -1622 -1599 1457 -10457 1013 8723
573 8723 -9074 -157 8221 -7798 -2218 2210 -2728 3383 1111 5337 2257 -1761 4853 -1600 1254
588 1254 5972 -1720 6271 10341 -3796 4603 7834 -4749 3338 9148 3769 -2550 5611 10825 -4615
603 -4615 -2517 8561 335 32 9377 1287 -472 4089 2726 -943 -3567 5456 2966 334 4710
618 4710 -1331 1149 4310 -4559 -483 6392 -1463 395 3039 799 -4334 -3457 7372 -4910 -4466
633 -4466 9786 -2540 -4064 4045 -5189 -4344 844 -595 2101 -4627 1787 3711 -6525 2328 -3755
648 -3755 -2948 9301 -4065 -2574 7799 -4031 -1655 2950 -1952 2827 -958 6893 4044 -9588
662 -9588 8999 2663 -10930 7245 3569 -3663 5549 -964 585 434 -5800 5121 -3060 -2017
676 -2017 5873 -5932 2449 -630 -10497 6052 -931 -8523 8703 -1449 -4549 3212 -3730 941
690 941 -6449 300 10593 -9921 627 10720 -8640 407 4050 -5275 5066 -806 1176 3611
704 3611 -7697 5076 -778 -5887 6114 -4688 1721 6864 -10376 2056 3836 -10667 3534
717 3534 837 -2898 1789 -2636 6520 -4341 -7178 10622 -3366 -4695 10461 -2555 -421 5712
731 5712 -2892 4277 -1007 1445 8666 -2779 5286 4237 -3502 6692 -1837 -2896 10045 -3835
745 -3835 -204 8625 -5469 85 -12 -1468 1556 -6046 4887 1794 -10548 4523 -1047 -10841 4518
760 4518 -2434 -3353 3565 -4922 1653 -3282 -5329 3512 -5113 1211 4154 -5439 5462 763 -8295
775 -8295 7098 -303 -3656 6176 -431 2070 -1218 -1424 4083 -6310 748 7627 -6337 1246 4906
790 4906 -7147 895 -956 -3115 2620 -2635 2664 929 -3472 2664 -2135 -336 5692 -3383 3563
805 3563 7941 -4200 4112 4532 -1429 4296 3815 5413 2563 1304 7976 532 -2096 8059 126
820 126 -328 7418 -631 1124 1560 -1071 964 -2223 -141 102 -2718 957 -2621 -5960 1003 -4662
836 -4662 -5315 2079 -4096 -3394 182 -1893 -3908 -3744 310 -1047 -3366 2501 2081 -3356 2485 1407
852 1407 -2285 1809 1476 1722 1996 2230 971 -225 922 151 -415 2210 1428 -1443 2854 -214 -4580
869 -4580 43 699 -2520 -1211 3376 -788 -3452 828 -362 -4192 -297 2863 -1614 145 1727
884 1727 -1311 -2149 512 1062 -900 2494 2734 1029 1378 690 -585 1502 2644 264 2899 3434 438
901 438 -232 2125 -198 -2515 3283 1978 -2308 405 1275 -3933 -2656 1226 -2718 -2556 1214 -34
917 -34 -3849 -1328 -794 -3976 -699 444 -1236 -540 1660 -848 -1953 1220 -171 -1147 1715 2136 -1296
934 -1296 1337 1427 -2189 154 1460 -45 -1041 2380 969 -2474 1059 553 -3491 211 2161 -2695
950 -2695 670 1385 -2190 -415 120 -328 -1904 744 1882 -1482 836 1852 -2691 306 3005 -1829
966 -1829 1654 2911 447 950 558 1938 -1229 -592 4008 261 -177 4060 -1546 -1510 3231 -2249 -519
983 -519 1582 1 718 -814 27 -2041 -2471 1942 -948 -2056 3578 -2211 -2572 2736 -3860 -1613
999 -1613 1374 -754 1020 -428 431 -63 -3076 1659 1076 -3084 3811 952 -2104 2947 -1432 -801
1015 -801 724 108 2243 -288 954 1564 -3309 1347 1443 -4688 3285 1107 -3388 3300 -1110 -2589
1031 -2589 599 -449 53 -1007 489 2112 -3135 292 2432 -4239 1984 1878 -2214 2950 148
1046 148 -503 1194 -1302 1078 345 -1048 3296 -1369 -672 3837 -3957 -93 2192 -3545 1119 1247
1062 1247 -2121 -829 -740 -163 -2337 -2896 3016 -2520 -2464 4236 -4340 -2252 2300 -3557 -416 753
1078 753 -1210 1312 -845 -333 696 -3008 2143 506 -1964 4126 -1043 -873 2893 -1832 -98 2073
1094 2073 252 2186 775 1314 1901 -2827 3150 1653 -3478 4986 1737 -2413 2962 -206 -2023
1109 -2023 1247 -651 380 203 -536 1157 -3372 32 745 -4200 1676 1169 -2323 2155 -453 -2546
1125 -2546 1578 -828 158 442 -733 2926 -2072 -1019 2467 -3740 -597 2759 -2669 -208 834
1140 834 -2676 -115 -1236 -828 -432 -1453 2380 -1139 -1161 2316 -2691 -482 3172 -2874 -12 2984
1156 2984 -2241 153 -165 -1208 -183 -1914 838 -729 -2334 2122 -924 -3353 2091 -297 -1205
1171 -1205 2310 267 1676 1309 1201 2324 -338 2306 2815 135 3734 2037 -1822 3779 803 -2412
1187 -2412 2648 -156 -461 1402 174 -986 -1959 583 933 -2583 972 2435 -2069 1618 984 -2127
1203 -2127 1047 192 606 691 -355 1119 -652 -1543 459 -1952 -723 1671 -2850 -173 858 -3024
1219 -3024 -763 196 -910 -476 1369 1537 -1035 -322 2427 -1118 -512 3293 -1148 478 2691 -904
1235 -904 -658 -316 -450 317 -381 -572 -362 -1001 493 -1459 -1874 1411 -1009 195 1922 -414 -201 1189
1253 1189 1044 -233 119 2402 1054 -1036 2686 669 -1726 2140 73 -934 1292 740 -431 -161
1269 -161 177 -578 -489 564 -328 -1111 2068 31 -1462 1357 -932 -1171 1040 415 -1118 -622 1069
1286 1069 196 -1863 -110 458 -2067 911 887 -1731 -77 70 -479 -866 -118 131 -354 850 531 -1276
1304 -1276 545 285 -2342 1502 934 -1752 982 1068 -867 -823 845 110 -1257 1060 1998 -1454 44
1321 44 1755 -1609 289 1422 379 755 702 1522 363 -18 1109 182 786 2538 -95 949 2328
1338 2328 -1038 952 1737 -91 665 1532 1309 -629 -11 1318 -1322 -1038 2372 -914 -1110 1548 -1227
1355 -1227 -847 -370 -765 -495 -712 472 16 -1048 382 -494 -1143 1525 -636 -512 1875 -565 -61
1372 -61 672 -170 -326 71 1457 496 -842 1504 728 -1601 1465 92 -1085 1587 314 -1 292
1389 292 42 -48 -337 345 298 -791 885 490 -1827 831 -449 -1837 881 225 -903 -117 573 -257
1407 -257 -1171 -157 576 -1165 392 1497 -1228 349 721 -734 42 536 104 160 764 -13 -438 -145
1425 -145 16 -1077 197 950 -1403 98 573 -1606 -1409 332 -791 -1618 382 -86 -1575 -836 134
1442 134 -1522 -1170 828 -424 -782 355 264 -1088 317 324 -714 955 803 45 452 808 -363 -87
1460 -87 766 182 -320 617 1052 -1043 434 830 -1435 334 1229 -229 9 959 97 -194 145 726 -305
1479 -305 -68 1868 -568 -120 1136 -1292 -416 699 -801 -553 220 -436 -433 -918 11 -761 -1216 1530
1497 1530 -599 -886 1230 -618 -644 644 -339 57 517 61 722 -674 243 -214 -1523 1012 -532
1514 -532 -1189 1015 -694 -1114 508 -724 -658 297 116 721 -519 816 554 -1428 1391 653 -879
1531 -879 1462 693 -457 822 -230 -314 -44 -307 741 -846 144 709 -1519 594 563 -953 1130
1548 1130 915 -201 1246 601 281 395 369 1592 -235 882 1615 -1017 722 932 -1262 257 647
1565 647 -692 332 38 -22 -543 -541 1250 -966 33 1443 -885 330 997 -913 -141 447 -169 366
1583 366 -279 453 -389 -985 776 -1216 -643 859 -1081 -110 928 -805 -210 564 184 487 185 1487
1601 1487 314 -211 2045 -412 -274 1780 -119 30 1256 3 -171 -219 22 142 -1258 630 -35
1618 -35 -1244 1155 -692 -896 731 -498 100 760 -221 497 4 233 621 -1099 1377 657 -905 1926
1636 1926 6 -692 1184 -181 -112 658 25 840 -271 362 1244 -1498 1086 1006 -1150 1454 250
1653 250 -636 946 -658 -429 408 -651 584 -897 -566 1090 -2080 -87 288 -2232 625 -32 -1456
1670 -1456 425 -720 -516 266 -1251 750 -479 -607 1864 -1570 -58 1191 -1650 936 751 -1280
1686 -1280 1267 267 -155 650 -1109 1169 -9 -875 2160 -1227 -211 2047 -1478 -113 873 -802
1702 -802 1196 -141 -409 1118 -1432 819 283 -1543 1944 -246 -359 1874 -1279 -84 1460 -1147
1718 -1147 818 494 -376 1263 -904 814 300 -1771 2108 235 -1494 1760 -356 -785 1081 -1164
1734 -1164 325 189 -439 1503 -1254 8 1190 -1590 692 282 -1382 1486 -214 -1206 1128 -1014
1750 -1014 -51 444 -834 954 -973 -48 1224 -1775 238 1075 -1614 918 749 -1096 1026 -230
1766 -230 294 502 -998 1073 -43 -348 1181 -901 -2 1354 -1314 444 891 -1157 973 13 -322
1783 -322 298 -686 715 -347 -761 1402 -444 -820 1376 -826 -522 670 -869 345 -313 -280 356
1800 356 -918 -14 -92 -914 586 -250 -986 902 -930 -712 689 -1164 -280 274 -87 -30 -624 234 270
1819 270 -1037 551 494 -1120 983 184 -710 501 -207 240 185 20 528 -20 -52 399 -654 123 480
1838 480 -840 797 275 -775 561 181 -429 -61 468 378 -205 18 716 -521 -42 1029 -602 181
1856 181 743 -19 54 22 -92 107 89 34 134 -122 454 -234 -173 581 -655 121 711 -392 -303 641 56
1877 56 -399 149 228 -137 -386 635 -129 -718 447 -288 -661 -58 -103 -366 55 -204 -248 31 -230 -47 -311
1898 -311 348 -17 -238 660 -31 -275 492 452 -428 372 638 -59 -57 275 197 -547 328 293 -260 260 413 -88
1920 -88 -61 333 -182 257 273 -7 239 343 128 -365 451 200 -199 345 485 -375 -261 516 -419 -415 245 206
1942 206 -302 42 432 -470 -210 192 -32 -172 200 103 -146 76 -312 -108 128 48 -281 177 230 -693 -44
1963 -44 127 -435 -367 451 -120 -498 320 90 -389 -214 389 -292 -258 475 -99 -132 -10 112 -207 189 68
1984 68 -103 187 27 -153 -99 262 -378 -61 476 -154 -140 366 215 -483 269 311 -291 -43 272 159 -296
2005 -296 386 79 -219 91 178 -87 22 249 -360 118 -125 -370 0 90 -104 -284 299 -187 -444 -83 103
2026 103 -539 -180 549 -464 -282 90 -221 -311 51 103 -232 -23 76 -99 -454 84 -135 -247 472 -194 50
2047 50 312 -250 -171 254 -62 -107 220 156 -27 -468 554 39 -506 730 63 -319 355 51 -334 69 -45
2068 -45 141 28 -99 511 -443 267 205 -480 599 48 -359 515 79 -357 444 -110 59 71 -68 606 -548
2089 -548 110 630 -710 178 476 -483 123 188 -317 442 -330 94 202 -486 505 -422 -253 522 -634 45
2109 45 478 -812 234 414 -663 366 -199 47 193 -613 635 -268 -426 984 -191 -359 768 -404
2127 -404 123 443 -572 699 -91 54 564 -689 487 127 -444 868 -163 -503 1000 -563 -303
2144 -303 556 -557 405 -21 -19 467 -702 388 347 -915 514 268 -650 820 -452 -317 496 -654
2162 -654 426 -111 -297 621 -537 -36 351 -923 334 336 -1040 734 -148 -541 472 -538 183 -176
2180 -176 -380 581 -558 -375 644 -897 -56 535 -986 576 -138 -507 486 -578 126 84 -451 396
2198 396 -238 -307 859 -607 -47 796 -799 453 199 -311 392 -256 242 150 -414 581 57 -510 826
2217 826 -266 -212 685 -565 300 135 -279 414 -43 57 173 -302 368 29 -561 745 -230 -255 646 -475
2237 -475 61 58 -122 169 -256 121 167 -523 73 88 -644 447 -203 -257 384 -404 61 -91 -183 32 -211 95
2259 95 176 -445 181 137 -607 425 -122 -264 381 -86 37 -264 -19 172 -268 47 252 -256 198 171 -389
2280 -389 388 -69 83 271 -22 239 -118 192 232 -216 253 386 -377 299 306 -437 310 -135 104 24 -141
2301 -141 370 -256 8 321 -300 10 389 -426 269 146 -413 463 -246 123 163 -222 369 -205 -101 476
2321 476 -485 -242 470 -660 29 109 -507 336 -314 40 -9 -572 318 -179 -562 413 -284 -371 477 -699
2341 -699 103 188 -515 377 -267 -40 147 -512 250 -70 -519 517 -210 -435 649 -495 -81 140 -420
2360 -420 421 -188 27 405 -452 175 348 -607 452 88 -396 740 -428 3 327 -393 364 -15 -68
2379 -68 383 -245 65 408 -668 479 362 -591 621 -165 -14 289 -317 370 15 -190 518 -193 -151 585
2399 585 -550 169 296 -607 551 -82 -225 277 -272 93 21 -345 248 -171 -351 572 -671 -84 391
2418 391 -468 192 -76 -145 160 -194 15 221 -369 260 63 -356 522 -253 71 431 -455 147 141 -206 99
2439 99 -56 28 176 -300 209 104 -434 649 -39 -221 309 -74 24 38 -94 80 76 -2 325 -265 20 204
2461 204 -335 300 -119 -161 309 -46 -182 74 -51 -50 97 -18 261 -246 156 209 -374 263 113 -93 20
2482 20 80 -41 -48 -53 -52 -59 -131 141 -181 -66 46 -267 116 -32 -118 -29 154 -131 -72 58 -30 -70 -105 264 -175 -45
2508 -45 163 -105 -74 -77 -9 -180 -20 -87 -67 -92 -80 -5 -159 91 -168 53 15 -165 -8 76 -14 -221 124 27 -111
2533 -111 -68 104 -59 -193 175 -175 -110 -19 10 -120 -114 66 -105 -16 -47 47 -106 84 0 -124 164 -229 -61
2556 -61 -24 -30 -93 36 61 -177 -37 -1 -16 -199 149 4 -173 73 -79 -7 -11 130 57 13 88 -27 59 25 99 -111
2582 -111 185 73 -95 152 52 -89 31 214 -60 38 164 -1 -46 -122 196 -141 22 183 -108 -12 24 -60
2604 -60 -103 42 -122 55 -2 -69 27 -127 65 -152 43 -35 -138 -66 44 -136 -214 228 -141 -97 -16 46 -26 -175
2628 -175 58 -85 -107 -65 15 -226 8 74 -157 170 -158 -64 21 -23 -49 -65 27 -103 13 -19 114 -255 100 127
2652 127 -239 206 -34 -20 52 50 10 70 21 169 82 -117 289 -70 60 206 -126 218 102 -60 96 137 -41
2675 -41 124 40 45 146 -189 230 -121 -122 260 -130 9 120 -78 -79 75 -225 99 -165 -104 156 -356 42 -142
2698 -142 -283 83 -183 -234 142 -151 -238 158 -353 30 -72 -129 188 -311 113 41 -315 108 58 -289 147 -45
2720 -45 -192 232 -286 70 51 -207 321 -154 -55 175 -179 98 189 -309 242 109 -268 372 -140 132 198 -177
2742 -177 280 -32 -78 416 -143 -148 468 -177 166 181 -256 450 -67 8 231 -211 265 110 -238 278 -23 -116
2764 -116 573 -406 97 329 -387 330 -72 -148 254 -182 51 142 -397 248 137 -399 438 -401 -104 305 -420
2785 -420 149 -66 -296 287 -219 -151 300 -380 147 122 -560 461 -150 -246 346 -289 120 190 -218 206 -42
2806 -42 -227 466 -389 -12 342 -439 354 -83 -274 330 -248 36 202 -346 180 166 -279 456 -261 -4 487
2827 487 -381 302 122 -278 370 52 -127 292 -213 133 200 -398 485 -82 -106 492 -352 107 193 -234 238
2848 238 78 -199 390 -162 -20 263 -430 344 -35 -226 285 -256 -83 176 -258 -26 -10 -286 237 -218
2868 -218 -183 245 -415 129 -84 -250 241 -120 -53 148 -206 -2 223 -299 241 -82 -76 220 -335 84 48 -189
2890 -189 155 12 -135 92 -53 -44 144 -247 248 -43 -107 221 -174 10 72 -75 32 13 -171 111 -73 -172
2912 -172 111 -156 147 -89 -52 122 -217 28 104 -52 1 119 -76 91 43 6 111 -152 193 -25 -63 32
2934 32 -60 19 23 70 -24 35 -100 109 -33 -73 106 -87 145 -90 31 79 -101 7 63 42 -39 102 3 53 -36
2959 -36 149 73 -113 183 -142 93 24 -86 26 18 33 19 22 -110 34 -68 90 -121 -229 142 -193 -39 -27
2982 -27 -97 28 -10 -51 -70 -82 -83 78 -267 13 -19 -105 90 -245 -1 -48 -140 -49 -51 -106 33 -31 -76 123 -221 129
3008 129 9 -197 173 -10 17 1 16 -2 73 -45 94 -12 -121 249 -128 48 46 -59 127 -24 8 81 50
3031 50 -52 146 -13 91 34 -33 206 -158 161 142 -66 67 39 53 -29 34 -68 87 -143 98 31 -226 114
3054 114 -108 31 -24 -29 -35 -21 -8 -120 94 -104 28 -129 20 -107 -109 105 -97 -20 -74 7 -101 -46 -51 -85 63
3079 63 -70 39 -95 29 -39 -37 -8 -47 84 -54 101 -13 85 7 -134 88 56 36 -60 135 -32 36 67 62 89
3104 89 -72 152 23 15 61 17 38 45 88 -40 162 -84 118 59 19 141 6 135 -11 24 59 3 -10 110 80
3129 80 -86 155 -155 13 6 -89 141 -140 48 29 -77 -7 37 -180 -33 -35 -145 89 -251 12 3 -93 -27 -80 20
3154 20 -71 -81 -70 86 -241 -5 -25 -180 90 -183 16 -17 -92 94 -43 -97 90 18 -162 196 -128 99 75
3177 75 -210 213 -93 19 21 -61 -16 43 -20 91 27 -160 217 -145 19 137 -93 94 -22 60 50 -33 -5 109
3201 109 -83 66 78 -145 167 -104 40 91 -64 55 -63 -81 -63 -17 -51 27 -125 -107 60 -194 102 -81 -48
3224 -48 42 -40 -57 -41 -6 -33 11 -124 124 -76 -93 90 -127 6 49 -47 4 18 -111 91 -16 -129 37 -92
3248 -92 122 10 -31 97 -61 52 29 51 -27 86 -57 -25 56 -39 76 -98 10 -55 4 -36 38 -62 -31 27 -97
3273 -97 71 -62 -36 80 -88 4 -24 7 -37 -3 -92 37 -76 -36 90 -155 38 22 -49 28 -23 -4 8 18 -55 31
3299 31 -115 101 -14 -139 104 -75 40 25 -138 42 18 -47 24 12 -83 161 -72 112 -2 -119 193 -71
3321 -71 -3 40 11 -26 184 -36 105 -13 -107 236 -134 4 68 -117 105 -20 -30 78 6 -83 126 -127 -23
3344 -23 69 -171 119 -176 -76 56 -217 27 39 -123 -2 -18 -213 169 -116 -20 14 -223 133 -6 -127 59
3366 59 -97 -66 93 -185 -1 61 -202 294 -17 -59 146 -180 80 -1 -57 141 45 -89 230 -141 -40 208
3388 208 -154 258 -43 -44 160 -118 42 106 -139 87 139 -159 192 -85 -40 263 -172 131 137 -97 167 -84
3410 -84 -30 175 -105 6 174 -284 220 -5 -178 214 -220 45 111 -154 85 -35 -194 112 -88 -161 122
3431 122 -289 142 -23 -254 166 -179 -73 87 -105 -30 52 -214 116 -65 -129 294 -236 58 73 -163 169
3452 169 -44 -58 171 -87 -58 197 -196 142 63 -108 312 -129 48 169 -129 151 81 -96 154 13 -85 257
3474 257 -97 163 100 -198 280 -19 -36 149 -76 42 95 -84 113 50 -112 249 -147 20 63 -146 111 -48
3496 -48 -73 63 -138 -130 156 -152 -23 27 -212 136 -164 -27 55 -181 -43 -21 -149 -5 -46 -173 81 -185 -49
3519 -49 48 -229 94 -131 -25 48 -71 -24 44 -78 -2 137 -140 102 -67 -5 72 -92 123 -26 27 59 -29 3
3543 3 135 -73 37 141 -106 153 -86 -5 91 -46 109 -75 32 89 4 -8 100 -109 -17 130 -72 118 -77
3566 -77 9 44 -47 32 -55 29 7 35 -114 61 -82 -10 60 -128 77 -98 30 16 -5 -21 -33 0 -47 -4 -70 62
3592 62 -86 -81 3 -75 25 -102 67 -51 -78 0 -23 -33 -1 67 -62 73 3 45 37 -10 48 -41 57 11 68 -1 -5 48
3620 48 51 43 -54 115 -31 24 55 -35 88 -12 48 -34 5 41 49 12 -28 48 -102 52 -41 34 -56 -19 42 -48 -4 -63 81
3649 81 -44 39 -47 -21 5 -102 66 -74 -14 -33 -9 9 -15 4 -46 36 -81 31 -25 -31 36 -104 7 -65 39 -53
3675 -53 0 -55 -57 61 -115 80 -49 71 -15 -25 69 -23 58 -18 87 -48 61 -24 22 62 30 116 -47 112 29 -55
3701 -55 22 31 51 88 81 -4 134 -149 1 31 -116 87 -55 6 -38 -76 -11 53 -91 28 45 -152 79 -99 4
3726 4 11 -145 105 -78 -151 70 -46 -77 39 -120 23 76 -195 115 -143 -31 111 -114 51 27 -88 12 39
3749 39 -118 177 -160 -10 149 -153 126 -54 -64 143 -131 35 134 -162 32 41 -158 186 -71 10 151 -186
3771 -186 146 34 -100 84 6 15 174 -143 74 100 -173 213 -26 -79 178 -167 62 42 -151 53 -46 -142 127
3794 127 -113 -98 159 -256 76 -45 -105 116 -191 -54 34 -145 -73 65 -226 149 -105 -91 224 -279 62 72
3816 72 -147 100 -20 -54 70 -126 69 123 -181 165 -22 -184 210 -159 91 50 -120 114 60 -129 173 -28
3838 -28 -96 185 -188 109 13 -111 226 -21 -9 136 -41 16 100 -86 104 -90 -79 258 -167 139 37 -161
3860 -161 116 -31 -6 87 -65 -35 101 -212 63 -15 -156 119 -122 38 -36 -124 79 -48 -165 39 -41 -140 56
3883 56 -182 87 -37 -163 169 -114 -32 24 -51 -33 48 -83 -56 -5 -82 161 -127 32 56 -77 31 -10 66 110
3907 110 -54 2 112 -17 45 74 -72 95 -34 93 48 -19 85 -10 43 -5 48 -16 89 6 30 29 -68 -8 40 -3
3933 -3 30 34 -7 17 70 -16 10 -58 87 -35 -56 -17 4 -67 -54 53 -95 -2 -65 2 -20 -171 -18 -54 -14 -35 -37 1 -59
3962 -59 44 -43 16 -138 43 -66 -26 43 -36 55 25 5 96 15 -97 68 49 -27 93 6 115 21 22 145 -7 68
3988 68 49 46 -38 118 -21 26 -37 -60 160 -56 -6 69 37 15 -24 -55 50 38 6 148 -141 29 35 -75 103 -52
4014 -52 26 13 -61 39 35 -98 -20 27 -117 49 -108 -9 -18 -152 65 -57 -85 -62 -30 -73 75 -25 -31 -7 -123 147
4040 147 -95 -41 52 -75 -33 25 -44 16 -38 -53 117 -124 -6 81 -59 93 -43 52 120 -75 11 141 33 12
4064 12 58 -93 141 -61 49 111 -92 65 39 18 26 66 -11 55 -29 19 25 -124 112 -71 -7 23 -101 39 -38 19
4090 19 18 39 -66 28 -42 -78 45 -114 48 -110 -59 63 -71 -27 -32 -37 -14 -4 -81 -10 -39 -55 65 -99 5 -76 -73
4117 -73 -39 -28 -31 -22 -10 -65 89 -129 18 25 -33 26 -62 24 14 -9 21 97 13 25 50 -64 37 25 80 5 -19 42 -15
4146 -15 45 -36 59 -90 64 -63 19 5 -106 74 -83 -6 42 6 19 -32 2 -30 -100 -89 15 -79 -7 9 -2 -31 35
4173 35 61 -104 -56 -27 -49 13 -5 -25 -82 30 -60 50 -29 1 14 -56 22 -50 17 -15 -55 58 5 -19 -14 17 -14 36 20
4202 20 -22 15 34 127 -52 83 -4 -13 7 20 -12 -13 20 -51 75 -41 59 21 19 66 -33 4 -1 -4 32 26 -2 37 23 -19 76
4233 76 -29 39 23 -85 78 2 11 -13 -59 -98 17 -17 -58 -54 -60 62 -33 16 3 -86 45 -32 -12 49 14 -72 59 -90
4261 -90 42 23 1 89 -86 35 13 -21 12 -14 -48 -37 67 -25 64 -10 1 57 -95 46 3 36 -6 51 68 7 -42
4288 -42 21 92 -65 57 44 30 33 -11 45 6 -5 35 -14 -73 17 -7 -42 21 -84 35 3 -3 39 -12 -13 12 41 -123 -27
4317 -27 -61 13 -28 -98 57 -107 -59 -75 -9 -67 -19 -27 -30 2 -95 27 -83 -48 21 -49 28 -15 -11 -45 -26 5 33 -5 -57 79
4347 79 -41 24 10 42 -19 -22 33 51 -23 -36 85 -76 4 15 -18 102 -82 35 5 -69 -25 31 -32 2 65 -33 71
4374 71 -76 37 44 -124 66 -86 -36 27 43 51 55 -98 64 1 -190 127 -64 -28 24 -91 93 12 -111 48 -35
4399 -35 -109 53 -105 6 20 -167 64 -105 -52 104 -78 -16 26 -98 47 -43 -138 205 -157 21 85 -121 57
4422 57 -54 31 64 -45 12 53 -129 120 88 -119 174 -75 53 105 -108 94 34 -58 107 56 -81 188 -122
4445 -122 60 111 -146 182 -24 -81 132 -86 8 38 -105 41 -61 -112 185 -128 -90 143 -190 63 -9 -72 68
4468 68 -81 -51 75 -203 -20 62 -131 135 -102 -39 174 -218 50 -43 -203 3 -20 -140 41 -109 6 64
4490 64 -216 129 -36 -72 122 -97 67 75 -72 89 -26 -125 232 -67 -62 124 -109 116 -12 -51 159 -81 28
4513 28 204 -95 -44 74 -72 112 -16 -69 135 -122 84 66 -43 58 17 -13 132 -68 22 114 -152 87 36
4536 36 -88 111 -59 52 35 -113 71 37 -107 77 -38 -47 86 -76 72 -54 -115 25 -67 -44 51 -72 -52
4559 -52 7 -95 22 -77 -141 129 -95 -28 20 -111 55 -36 20 29 24 -18 93 -66 -14 18 -30 40 -62 29 46 -97
4585 -97 5 33 12 31 69 -66 36 -25 43 57 -85 109 -51 7 33 27 -51 -10 -47 33 -11 -81 36 -40 -14 -7 -9 69
4613 69 -116 36 -13 -4 -62 36 11 -69 15 32 68 -75 11 31 -81 -9 4 -28 -23 39 -4 -37 -50 71 41 -80 14 -12
4641 -12 52 -74 12 24 -60 15 5 46 -107 11 28 -27 -2 0 63 -28 56 -39 3 11 -22 67 -27 5 39 21 -9 14 45 -6
4671 -6 12 -19 66 -49 43 43 -17 1 6 -10 -38 47 -24 15 -42 -26 9 -107 -4 -46 6 -84 -81 32 -20 -27 -79 48 -52 6
4701 6 -21 22 -5 -26 61 -38 -33 -5 -10 -23 -20 52 -1 -18 -3 55 23 44 64 7 67 -18 17 5 41 -5 73 32 0 43 -8 59
4733 59 -11 -2 12 -41 -3 55 38 -4 76 -7 -3 -25 -51 39 -7 -2 -13 -52 1 17 -69 -59 -13 -12 34 -62 -52 -20 -17 -21 -2 -27 -34 18
4767 18 -48 6 0 -66 39 -44 22 29 -30 -41 -46 -17 -17 -27 -44 46 -58 39 24 -60 35 -38 16 -17 9 -6 -2 -14 -11 57 -57 120
4799 120 -2 63 62 -10 89 14 12 81 9 -47 77 24 41 46 -45 61 -62 -13 82 -10 8 15 -64 -20 47 -72 69 -87
4827 -87 10 77 -59 33 -16 14 -10 -30 28 75 -59 22 16 -120 2 -97 -44 6 -91 -29 -51 -71 57 -45 -94 0 -56 -38
4855 -38 34 -117 3 16 -40 42 -50 -10 74 -28 -7 -7 -26 61 -74 -45 126 -100 27 27 24 69 -5 16 61 -19 2 96
4883 96 -99 27 28 -42 66 -112 21 20 31 7 55 -73 58 39 -22 36 -58 91 22 -82 104 28 -19 16 -28 3
4909 3 -16 -81 69 -3 -66 152 -59 27 7 -88 76 -38 -49 59 -55 -87 44 -60 -41 26 -21 25 -149 26 55
4934 55 -73 -42 -43 -119 -17 24 -42 65 -37 60 44 -92 48 -17 46 -15 -43 48 69 -31 31 43 -93 88 -37 34
4960 34 -3 -17 59 -8 2 48 77 -73 65 -11 28 37 -36 84 -64 -31 84 -3 -5 -39 -3 39 -50 -38 94 -36 53 73
4988 73 -52 20 33 58 16 -72 63 23 -12 23 58 -45 69 -5 32 -1 -99 56 -51 -27 8 6 -29 -5 21 -39 -13 -49
5016 -49 21 -35 -14 52 22 -44 -17 61 -14 1 33 6 10 -32 20 14 27 -31 95 -9 1 3 -6 78 -5 28 35 -30 65 19 -21 1
5048 1 71 -15 1 4 -18 45 -77 3 -3 -13 -53 -19 -8 -9 -81 31 7 -101 41 -21 2 24 -69 29 17 19 62 19 -43 38 -42
5079 -42 5 34 2 101 -83 -40 82 -81 2 17 -8 -47 19 -27 112 -28 18 91 -52 32 -33 15 46 -45 56 44 -67
5106 -67 18 18 3 54 12 12 57 -11 84 3 -85 54 -26 -37 40 9 42 -22 -86 87 -27 11 66 -76 16 -14 -47 31 -40
5135 -40 -37 93 -147 -28 37 -95 57 -5 -43 80 -49 62 13 -54 20 84 -47 23 -4 -17 1 -148 124 20 -55
5160 -55 58 5 8 34 -7 5 31 -49 81 22 12 65 -62 46 59 -3 13 -55 -18 85 -29 -33 23 -29 62 -35 9 76
5188 76 -71 36 60 0 21 17 8 -13 13 4 94 -64 13 66 -24 -17 -10 29 -38 -61 -9 1 -79 19 14 -12 21 -17 -31 -51 -42 23
5220 23 -40 -52 -11 -26 -89 -11 -58 4 -22 -22 6 -45 -27 -7 -16 7 -21 79 -32 -7 -26 116 -32 -17 117 2 64 -21
5248 -21 58 7 -1 22 -7 15 -10 54 -30 -17 -10 72 20 -34 72 30 37 -26 30 51 17 6 22 -9 -37 43 -10 14 5 81 66 -69
5280 -69 63 -17 -13 -14 9 3 -17 -40 -21 -10 -64 20 -6 1 -18 6 26 -45 -41 5 -3 5 0 -46 12 -22 -19 35 -63 43 8 -59 -4 -12
5314 -12 8 -77 7 -9 27 -7 1 -1 -26 31 -25 2 33 -7 81 -12 21 57 85 -46 92 30 6 18 2 81 -17 22 14 7 -34
5345 -34 2 55 28 55 -15 71 3 27 96 -65 16 -19 15 -10 46 53 40 -56 -34 39 -41 -21 -9 15 -12 -16 42 -10 -6 4 -20
5376 -20 -50 -47 -35 -56 52 -72 -29 8 -8 -29 3 -78 0 21 -95 -13 -20 25 -33 -22 63 -25 -69 28 31 -43 -11 21 29 38 -10
5407 -10 48 10 -16 23 -31 19 19 35 6 13 -8 45 -15 -32 77 -50 9 18 -14 10 -10 -36 52 16 -9 99 -78 40 -47
5436 -47 10 21 -77 6 40 -31 -24 23 -17 -14 25 -33 80 -47 44 45 -40 4 7 -87 -16 -4 13 0 -103 16 -6 -70 49 -43
5466 -43 -13 -8 -45 0 -13 -57 -32 14 8 58 -17 19 48 -4 48 -45 -1 42 -72 9 55 -42 28 2 -61 88 -16 -11 38 -80
5496 -80 15 12 -20 32 -76 -54 49 -80 14 44 -48 51 -53 -3 25 -49 72 23 -12 8 34 -37 80 -16 7 57 -28 88
5524 88 13 -57 55 -44 -33 -7 19 -15 19 -87 113 -65 -24 71 -41 25 -36 -38 7 -37 -13 89 -72 -5 82 -61 -23
5551 -23 25 -21 113 -100 12 16 -76 11 41 -85 49 22 17 64 -47 62 22 -67 95 -20 -50 -1 -63 -14 61 -55
5577 -55 49 -34 -39 40 -15 -32 -38 -20 23 -30 -53 19 -55 -29 64 -26 29 1 -50 46 -64 -17 38 4 27 59 -27 15 29 -57
5607 -57 55 -48 22 106 -10 31 29 37 15 -10 -15 57 -76 74 46 -76 27 -30 14 -25 3 80 12 -24 36 15 0 36
5635 36 -16 11 28 -46 72 25 -5 58 -19 28 -12 23 8 -21 2 118 -34 -26 47 -89 -2 -17 8 -43 -20 -51 2 -47 -26
5664 -26 16 -31 41 -33 56 21 -66 37 -3 -81 -34 -64 -29 17 19 11 -10 -15 46 -38 -39 -18 -10 -27 -22 -19 6 31 -42 7 -37 -62 50
5697 50 -99 105 26 45 8 -30 12 -16 -17 39 12 1 16 -6 33 12 18 26 -19 -60 -21 12 32 -25 39 19 -11 8 29 41 -19
5728 -19 28 8 27 25 -5 63 7 21 4 22 -13 -29 -14 14 -41 -45 31 -86 -17 -73 15 -65 -39 -9 -27 1 13 -4 -54 24 -26
5759 -26 44 -7 20 23 -42 -16 32 29 -17 -44 1 -31 -7 -16 24 14 -26 18 -4 21 -23 -30 63 -26 20 -31 -31 3 13 -91 11 -2
5791 -2 17 0 13 30 4 21 -13 14 11 41 -35 18 49 -1 19 8 16 3 40 -42 -53 29 -20 35 -22 20 12 -63 26 -52 -50 -17 -19
5824 -19 -63 -11 -64 4 -33 -111 -36 -59 97 -23 -61 -41 -12 -29 -42 -22 -24 22 -34 -19 -7 -36 37 -25 6 5 40 8 -39 -15
5854 -15 -40 -59 -56 6 -27 13 -58 -41 -9 -37 -22 -9 -53 -17 -2 -21 24 61 -33 -37 9 8 41 -41 2 5 -15 14 20 -5 27 15 12
5887 12 18 -22 0 -10 -6 -17 46 -67 12 17 -21 -7 -64 55 -34 -3 44 -41 -6 -25 -19 -21 24 -41 8 -40 -63 49 -94 19
5917 19 -22 5 -40 -23 -19 54 -20 -64 -41 -60 32 -8 -25 0 -122 8 1 -30 66 1 50 13 -35 -33 -6 -42 69 -7 -64 76
5947 76 -69 30 4 -44 15 -55 -21 18 42 -24 45 -25 24 4 -25 -2 -28 10 23 3 6 30 -60 -15 28 -4 27 -38 44 53 -14
5978 -14 21 -27 -18 -23 25 14 -32 -90 -25 45 -82 11 -53 40 20 -78 36 -9 -5 30 52 -49 47 -32 -42 -5 -48 34 -19 17
6008 17 38 19 -36 67 6 27 46 -9 73 34 -21 -22 -36 6 -49 59 4 -31 4 29 -7 10 23 -110 -68 -29 -26 -52 21 -14
6038 -14 -47 11 34 16 -21 30 5 -33 28 -24 37 -39 24 26 27 -44 21 1 8 -11 25 15 -35 11 17 -17 18 -14 -20 -30 -70 -9 -51
6071 -51 42 -6 70 -36 -21 -2 14 -5 -1 28 41 14 -12 44 8 -46 43 13 46 -4 20 0 -25 -5 19 -30 -22 108 -30 4
6101 4 31 -8 -4 -21 4 -22 -20 -28 34 -40 -42 -32 -45 7 -40 6 10 -42 -20 1 -34 -25 -22 10 19 0 20 35 -42 15 15 13 64 44 -10 -6
6137 -6 -38 12 35 -39 32 18 -55 -35 -72 -8 6 -32 30 45 -37 -20 -17 54 43 1 26 -9 17 49 -1 47 46 -11 -15 27 37 74
6169 74 21 -2 77 27 37 -17 23 11 -54 21 14 6 17 -21 -25 23 -17 -75 4 -56 13 44 -62 8 7 -70 -52 -23 -57 24 -76
6200 -76 -7 -26 -54 3 -32 62 3 -5 -21 7 -62 5 -5 -67 45 -7 19 10 31 39 -7 43 8 -32 3 46 -38 24 3 -5 32 -68
6232 -68 25 -53 21 -3 -31 17 15 12 -3 4 -76 94 46 -5 5 -3 22 32 -35 2 48 -2 59 -46 -80 37 -16 6 -19 4 10
6263 10 6 -16 -14 -14 -42 -26 -11 -29 -57 -36 31 -66 -27 -26 -25 -22 -70 23 -27 -27 -1 16 -38 14 56 15 28 -18 12 -2 -14 -31 10 -6
6297 -6 -16 25 -29 -1 6 24 -24 -2 38 -40 7 29 8 -48 42 -40 -14 -25 -1 -10 -58 -6 -15 -16 -47 -24 5 9 14 12 34 1 5 47 -5
6332 -5 23 -29 -1 26 -15 -6 18 -3 -4 67 -8 15 -18 -71 -18 0 -25 -48 -69 43 -10 -51 -24 37 -24 -3 -24 50 10 4 -30 8
6364 8 44 -21 37 -41 -31 39 -3 51 11 -5 21 51 -28 45 3 -18 17 -5 53 24 -6 -46 -73 -22 -45 -24 -37 -25 -49 47 -13
6395 -13 -4 37 -82 -1 -7 16 -30 34 -9 -39 12 -54 6 3 -29 -12 -35 19 28 -10 21 31 -4 9 -9 10 -51 -43 32 -55 8 -27
6427 -27 -34 69 3 -3 -95 -23 -33 -1 -20 -11 67 -47 62 -40 12 20 -9 -5 19 19 8 40 -7 -44 2 6 13 47 97 22 -2 30
6459 30 12 -9 -44 42 -9 -32 0 -2 -20 -16 -38 -28 14 -24 -2 -16 16 -53 -6 -32 -67 -40 -29 -2 6 -54 -21 9 27 -27 23 26
6491 26 -18 -10 15 -28 -12 -13 30 8 -41 -3 -29 40 -52 -16 -11 -6 32 -15 -11 17 -25 37 -12 -29 28 42 -5 30 5 -2 21 -26 4
6524 4 5 17 68 23 62 67 55 11 15 -11 12 24 64 68 -97 35 -30 23 2 72 -3 -2 -13 31 62 -38 49 -24 -18 -18 -25 2 -7 -27
6558 -27 -28 -55 -22 20 -45 -28 33 -61 45 -6 12 22 -43 -30 -36 0 -44 35 -18 31 -4 -123 42 -25 31 12 5 7 -22 -36 -48
6589 -48 -26 -33 17 -31 29 29 -61 -3 -69 -22 -17 -46 23 -26 5 50 -51 6 46 -61 17 -4 -14 -5 46 -29 -10 33 49 -31 -83
6620 -83 23 -4 7 32 0 -14 -9 -67 32 -69 25 14 11 -1 19 -104 -34 18 28 41 -12 -5 27 -18 -28 -33 -10 12 -22 13 12
6651 12 -46 33 64 -60 33 11 11 -32 -5 -21 27 -19 -47 -13 -40 26 -58 40 1 -77 38 19 33 -30 -25 40 -4 -40 -1 -23
6681 -23 -17 13 -41 22 89 -22 7 0 -16 16 -8 -17 35 -6 -9 79 -17 50 -33 12 -1 2 23 48 -21 20 9 -9 15 -29 23 4
6713 4 -39 26 -39 -19 -2 -51 -45 -16 -15 -24 -20 -35 36 -42 -5 -29 -56 12 -10 35 17 65 -36 34 5 -10 22 -29 7 13 -26 -54 -9
6746 -9 -26 -56 -13 8 20 -46 -79 22 -21 21 -30 20 37 47 16 42 9 -25 32 -44 -20 19 39 12 -4 17 9 36 -39 19 -5
6777 -5 -25 25 42 -24 -29 -47 -46 -6 22 14 -32 -2 -7 -48 12 -2 12 28 9 38 7 -26 -12 -43 -24 4 29 -41 13 -1 17 19 13 -8
6811 -8 -29 49 -31 -2 20 4 -28 -50 -5 -14 6 -2 22 32 10 20 29 -19 -42 39 15 33 7 18 -76 -33 -7 -53 22 -13 3 -33
6843 -33 3 -39 -11 8 -10 -13 -57 -28 -16 -30 8 -12 -2 -25 49 -16 16 -19 -5 -18 -5 -12 -12 -42 -10 -64 -18 -14 -47 27 -36 -53
6875 -53 -7 -32 -16 -8 -44 -63 -33 -8 5 8 -32 39 -2 2 12 -3 26 1 29 -23 -12 35 -68 2 13 -11 -26 61 9 -10 49
6906 49 -13 -20 25 34 -16 -19 -38 1 6 -15 -50 -25 5 36 -55 -4 -46 8 40 -10 -37 37 -8 -21 -32 -21 29 -21 -13 -20 -50 26 31 -32
6940 -32 50 29 4 -14 -14 -37 -1 5 13 -1 28 -31 -27 30 -39 -69 -49 -23 -10 -17 29 -32 -20 -12 16 -39 35 -24 16 -49 11 19 -46 16
6974 16 6 47 -30 -31 41 -12 -1 14 -22 15 72 -15 -14 7 -9 -1 2 -46 20 -35 6 -12 -40 -33 -20 -9 -30 -61 -29 -5 -68 -20 -58
7007 -58 -35 0 11 47 -15 -17 -54 -71 4 -1 -5 -25 -1 -31 65 75 -27 -15 19 15 39 -1 -63 -14 -32 26 -13 32 -9 -21 7 -14
7039 -14 30 -59 6 27 50 -17 1 11 -68 14 36 -32 70 0 -74 53 0 -13 -11 -41 -14 -25 1 -8 -39 25 26 34 -25 38 18
7070 18 10 -22 -15 28 -38 27 -15 34 56 -50 -17 -26 23 -22 0 -81 -4 -43 -24 6 -11 -59 9 -13 -1 23 -25 1 10 -10 17 -30
7102 -30 10 -14 -31 45 -47 12 -61 26 -16 25 -32 16 -9 -66 14 -23 -30 -27 8 -12 -44 47 18 1 36 -1 -29 25 7 -4 22
7133 22 -51 -2 -50 -5 -59 -25 19 -21 -1 34 -3 -13 41 -41 -10 9 12 3 6 -31 -2 -8 -51 -26 15 20 -50 -70 -12 41 -34 14 -15
7166 -15 -18 -21 -32 -47 12 6 -52 10 -44 -30 -25 31 3 13 4 3 -6 -5 58 25 29 52 -1 15 -29 39 -17 8 49 1 2 23 35 -66 27
7201 27 16 -47 23 6 18 -47 60 -64 13 -22 49 -22 -4 48 -33 36 23 32 37 15 7 -40 1 -21 13 -11 4 -3 68 3 -59
7232 -59 13 -48 0 19 -14 15 -5 12 30 4 -53 19 -56 2 20 -70 38 -11 7 -41 52 1 6 -3 -30 12 -14 -3 -2 -6 64 -26
7264 -26 50 64 70 -14 -32 8 35 24 -14 62 -24 60 -30 -2 54 -34 30 17 -18 -45 33 -50 6 -21 -4 -23 3 3 -10 -39 -20
7295 -20 12 17 12 19 -11 30 -29 6 3 26 5 -45 59 37 52 -30 -45 -28 -14 41 24 52 -23 71 -6 -46 5 45 -9 -25 -12 22
7327 22 36 -16 -4 -23 -14 12 -45 20 -36 -3 42 -17 26 -5 51 -49 -5 -23 -8 58 -2 26 21 15 14 59 22 25 -32 -21 -66 -5
7359 -5 -9 -8 -24 -9 45 -30 7 -30 -5 -19 20 -16 -42 16 -4 -40 22 -22 -3 1 26 -17 8 35 36 39 9 16 -11 18 -62 4 18 23
7393 23 -31 10 -18 6 -14 1 15 14 17 30 33 -48 -10 -17 16 -36 27 18 -15 -12 -10 28 -24 -21 -25 -2 35 33 -70 -5 48 28 33 15 17 -11
7429 -11 17 -1 -14 56 -22 65 31 4 28 -51 -29 18 2 38 30 -2 23 -43 -10 -8 -31 -22 -35 4 -10 -7 -1 25 50 -96 45 4
7461 4 48 25 4 18 -12 4 4 -17 12 -17 -5 34 -42 -8 -4 -28 -23 8 -43 -3 -6 28 3 -12 -6 26 -25 -3 -34 -31 -63 28 74 -52
7495 -52 19 8 34 -17 20 -27 -2 5 -61 1 17 22 -13 -40 18 -74 -9 2 -30 -1 1 16 -32 47 -19 11 -40 -17 -2 -30 -33 -44
7527 -44 -16 3 45 -42 -35 -11 -22 -42 -19 -19 3 28 75 6 31 24 29 -4 6 -35 2 4 0 41 35 10 20 16 46 -7 30 2 -14 -18 42
7562 42 -23 12 33 -8 37 -4 -35 -30 -37 -49 -13 11 6 2 -38 -4 44 7 -1 -19 27 0 -4 -9 42 -9 -3 11 3 -14 -31 -14 10 -6 12
7597 12 -8 10 -19 -12 28 9 -48 -10 -28 0 -46 -49 9 -37 -30 26 -55 -43 10 -37 -4 -28 -35 -26 16 30 -4 -30 20 -1 -18 -8 17
7630 17 1 0 43 49 7 -50 43 -52 28 -11 -76 44 14 -13 9 -70 -68 12 -23 20 -31 -75 -16 46 -46 30 2 -6 27 -17 -30 -1
7662 -1 3 43 4 11 43 -60 36 -30 -35 53 0 1 18 39 8 -5 -28 -9 -33 -60 70 -53 11 -23 16 -25 -50 -48 -5 0 -82 -7
7694 -7 -8 28 -9 -60 -14 -57 27 16 -45 7 -1 22 3 -25 7 18 -2 9 -14 -21 53 -14 12 -12 -8 2 15 20 57 -10 -21 27 -34
7727 -34 -10 0 -24 34 33 -3 -83 -28 -26 1 9 30 -55 -56 22 77 -30 40 -48 -2 14 0 23 18 16 -12 -38 -9 90 30 -32 22 -18
7760 -18 12 49 -28 -24 -41 -61 4 -29 25 40 -14 -5 -21 -21 -36 -30 15 5 -43 13 -46 10 33 6 44 54 1 -34 14 -6 -19 70
7792 70 -8 14 -28 62 15 -3 62 14 2 -16 -43 3 -7 39 -7 13 4 26 -30 5 3 -68 18 -50 -39 -41 31 2 51 0 -35 -2
7824 -2 6 40 -9 17 -25 28 35 -20 -33 -7 8 -33 14 34 -4 32 -7 47 -2 25 11 35 28 -9 -56 0 4 5 -34 30 -20 18 -14
7857 -14 -38 36 39 5 68 -25 -22 -32 -33 14 -40 43 23 -55 43 45 -35 -14 23 11 20 15 2 -12 10 -39 -4 -23 23 31 -53 14 -35 -79
7891 -79 15 27 1 -33 -34 10 -15 -19 11 25 -9 14 -6 17 9 -52 -10 7 -15 14 -41 4 41 31 7 -6 -12 -38 33 5 22 -1
7923 -1 69 -42 15 -13 32 20 -3 39 29 -67 17 17 10 -14 -28 -22 21 -24 -5 33 31 11 24 1 -25 -7 -1 14 -23 50 11 10 -10
7956 -10 -14 -45 -16 -4 -6 18 -14 1 4 21 21 -23 -23 -22 -20 21 -22 12 -14 6 9 4 -59 1 -27 -12 22 -31 4 -24 13 4 -18 -59 -38
7991 -38 -39 12 -9 -16 53 -4 -19 21 -1 40 12 -28 10 -1 16 -54 -20 -25 53 -16 17 5 16 0 52 -13 -31 25 -3 21 1 -50
8023 -50 -20 -45 32 -22 -15 26 -23 20 -26 9 20 35 7 0 -5 12 -41 22 19 24 29 -28 2 3 10 3 8 -22 -12 19 24 -27 -36 52 5 -26
8059 -26 -5 -27 -2 -20 -25 35 -1 14 -27 -34 46 24 -13 -29 18 -24 -20 29 -48 -34 -1 10 14 -11 37 -1 -29 60 8 -15 11 -9
8091 -9 6 -4 -24 -13 1 17 14 10 39 -24 -1 22 -11 35 15 -7 -14 -49 18 28 31 3 31 1 -16 33 -41 -2 1 -50 -30 -14 19
8124 19 35 -38 -19 -25 15 -6 16 -3 4 -37 6 48 -10 30 17 14 -61 -28 62 23 -21 28 -16 1 12 9 -34 5 16 65 -7 -18
8156 -18 -12 -5 -10 41 47 -11 69 8 -18 -14 -21 44 -25 -29 8 -27 -37 15 -24 20 9 -36 -13 7 4 -7 -3 47 28 2 10 -12 6 -20 6
8191F
$$ Imaginary data points
##PAGE= N=2
##DATA TABLE= (X++(I..I)), XYDATA
0 0 0 0 0 0 0 0 0 0 0 -8 8 -8 8 -16 16 -24 26 -32 40 -48 56 -70 80 -96 112 -128 152 -174 200 -229 261 -295
32 -295 334 -381 429 -479 538 -602 672 -747 830 -919 1019 -1129 1247 -1375 1517 -1671 1842
49 1842 -2026 2233 -2460 2713 -2995 3313 -3673 4084 -4561 5121 -5785 6592 -7594 8876
63 8876 -10573 12941 -16458 22214 -33165 61011 -269420 -422766 277020 -180764 -200690 13145
75 13145 -155777 -84881 -52483 -65957 -50763 -205461 -903 51653 -107340 -37093 -34094 4176
87 4176 -5938 -68187 104388 -11378 -79237 161175 29526 -93892 77151 -6314 -1790
98 -1790 58548 -61641 46857 48051 -81224 75811 33770 -108393 80932 90735 -73123
109 -73123 12844 90719 -2861 -61902 64267 18902 -113141 79489 34938 -140958 37039
120 37039 15756 -102677 2659 -24088 -31114 -3557 -40205 42383 -14679 -61975 46498 8881
132 8881 -38428 10055 36261 -16446 -25624 55910 -4286 -58871 47970 12198 -27848 31527
144 31527 -21459 8887 6411 -71133 22012 15600 -86975 -8811 49120 -52789 -54318 37620
156 37620 -21189 -76341 39138 28809 -79591 21791 53685 -41360 -8236 24030 6071
167 6071 -1188 1297 40184 19841 -38354 36556 40312 -39160 27838 40696 1787 35719 28505
180 28505 11585 22446 17570 17948 18233 24545 16567 364 42185 -5978 -29194 56560 -13045
193 -13045 -20378 60390 -18512 -17043 42925 -24162 -19772 19316 -7527 -2239 1695 15052 -6067
206 -6067 -23102 24158 -5888 -22870 20656 3058 -13189 8900 4273 -12206 -19244 11826 18323
219 18323 -40357 6342 34321 -45499 -13689 27211 -35327 -24746 23293 -13327 -14287 7053
231 7053 -11722 -11729 -3892 -6940 -12086 -349 -5992 -8698 10404 -9538 -23525 12677 10200 -23890
245 -23890 9596 21607 -9148 -3318 12436 4238 -17184 3302 22038 -1387 -6020 20793 7955
258 7955 -17773 13663 11957 -20875 7450 27756 -14502 -5983 17417 -16755 -2910 13075 -8761
271 -8761 -2120 15643 3287 -12312 1917 616 -12617 6949 17198 -11207 5919 19832 -11070
284 -11070 2741 4854 -5541 7905 6747 5111 3546 -5239 3546 2980 -7125 10526 -2631 -820
298 -820 21235 -12342 -14183 10533 -5953 -16121 5985 7191 -10765 -3695 12407 -11319 -23558
311 -23558 18848 -2646 -24487 17490 1693 -20501 3491 -85 -14762 -2174 866 2887 -433
324 -433 -3245 3326 -7937 2213 4201 -8931 7833 12141 -1709 8718 9186 -9661 5722 10874
338 10874 -3037 -2096 7331 5103 -11795 2487 6801 -18619 -6558 16491 -8491 -10177 11649
351 11649 -12706 -11056 8168 -6669 -13214 4854 8724 -3169 2798 5980 -4657 -5112 13100
364 13100 2469 -8120 14370 3938 -6610 9105 2770 -10686 4368 11311 2650 2569 4288
377 4288 4397 -5956 6645 8941 -9413 12032 17034 -4127 8458 10192 -11623 4886 10115
390 10115 -4873 2115 4215 1001 -8444 -1231 2752 -14822 -129 14002 -8764 -3325 12215
403 12215 -11545 -4571 8621 -3985 1035 9135 10312 -117 111 10753 -1004 -5402 13150
416 13150 1282 -6036 15329 -4292 -10952 5025 -3430 -4159 1821 2027 -2256 -3261 2587 -3858
430 -3858 -14198 4010 1082 -9843 11973 -3100 -13106 6607 -2453 -12294 -3203 -391 -5045
443 -5045 -4933 -31 -4318 -16930 2018 4561 -14985 5485 7567 -6782 4422 7048 -3706 -444
457 -444 7494 7233 3560 6068 11159 -2172 4660 10660 -8012 2096 8660 -4674 486 4702 -8601
472 -8601 -5674 1726 -3133 -7311 -1893 6717 -8570 -3872 6295 -13070 -6567 6883 -4687 -4215
486 -4215 4311 -1617 -2339 -3042 -1990 -5025 -7274 6643 -4472 -6723 4553 -8771 -5426 4195 -7258
501 -7258 -4814 6208 670 -2487 -3318 2126 -4834 -9420 10282 -3924 -10050 10618 -2051 -10906
515 -10906 818 -5560 -8420 -1736 -3706 -2230 -8355 -3149 -1346 -12509 -15 -2834 -6902 8324
529 8324 -926 -6811 7361 -1206 -4590 5104 1903 5724 2112 7857 10150 -7446 7546 10982
543 10982 -7219 8281 12247 -3329 7789 6236 -743 3527 -265 8303 3554 2494 9735 -3541
557 -3541 3730 6692 -9957 4688 9637 -6549 7775 6518 -4657 2001 -116 3374 -3165 102
571 102 12590 -4374 -3827 10755 -3967 -4633 7545 -17 3208 3593 1514 2514 -4486 2110 229
586 229 -2361 5184 -1442 -245 6671 -6424 -4973 5423 -7464 -3262 5685 -1916 -7123 -2002 4892
601 4892 -7863 -9525 5154 -153 -6037 3854 -1057 -7156 504 -782 -3128 -3979 3031 4241 -3183
616 -3183 1866 -875 -2151 3725 -2490 -2099 7309 214 -2261 3563 -104 -2208 -2104 7220 1251 -5990
632 -5990 9793 1533 -7278 4458 -816 -4183 4920 2010 2078 -610 -638 6135 -5091 -157 3033
647 3033 -3410 8882 235 -6443 7415 -1078 -5265 5077 -961 1125 1419 713 4072 -10437 1465
662 1465 6647 -12592 2639 7188 -7596 1103 -135 -5381 372 -6403 1014 787 -6843 4672
676 4672 -4630 -4286 2369 -9703 2402 5037 -9615 5301 3250 -9156 3198 -1900 -1840 -382
690 -382 -2242 10563 -5391 -6254 11957 -6347 -5893 7879 -4632 1428 2922 -3909 3781 -6295
704 -6295 273 4669 -7635 5123 748 -3470 7451 -7303 -3422 8817 -8006 882 7465 -4146
718 -4146 3289 -52 2794 1191 -7963 9607 3374 -7928 9624 1713 -5792 6562 -2025 105
732 105 2685 -2348 7157 -2559 -2311 4486 -6639 1000 794 -7052 6502 -1067 -7503 6819 -5301
747 -5301 -5906 2575 -3677 1145 -3659 106 4447 -10143 517 5033 -9856 3618 4872 -5308
761 -5308 4996 -1889 -1285 1947 -5031 5131 631 -1094 6918 -3734 705 4513 -8615 3840
775 3840 4778 -6937 4843 352 -3134 -347 -4206 2652 -3235 -3190 7663 -4761 -4657 6014 -6391
790 -6391 -2515 3623 -3439 3368 208 70 3146 -3677 1952 1699 -1405 5923 -246 -768 8039 -3994
806 -3994 -1504 5813 -3547 1256 2852 334 -124 -3464 1846 -1283 -7225 2951 95 -6574 3185
821 3185 -2508 -5537 -267 -4260 -1777 -2629 -2570 84 -3223 -1089 -832 -5109 1280 793 -3925 4751
837 4751 1096 -2099 3710 1305 -505 477 3828 3651 224 3844 5008 -1658 1589 4031 -2031 1672
853 1672 2586 521 781 -148 -847 -2261 -871 -776 -1598 37 228 -3432 -964 -693 -5817 -965 1481
870 1481 -2041 -1676 2300 -383 -4543 256 939 -2817 -77 4032 -481 -1190 2019 -854 -1499 1219
886 1219 2528 27 1709 2758 -554 -278 -127 -771 513 2238 -489 280 1673 -1841 -2333 -59
902 -59 -300 -3015 1452 2041 -3478 -1291 1177 -2618 -2420 3127 330 -1179 3045 2052 -1604 128 3043
919 3043 -157 1921 4323 1667 1624 3188 1705 -503 2755 2432 412 2367 2977 -623 -32 2155
935 2155 -1834 -113 2153 153 -958 1075 1168 -3080 -378 1351 -2702 -432 3101 -1691 -897 2324
951 2324 -2219 -827 999 120 -618 585 2541 -1025 -442 1864 -1765 -909 3594 -1063 -518 2903
967 2903 -1210 -898 -653 -196 -1154 -2049 2450 14 -3153 1284 -1583 -4371 2022 -1488 -2799 1786
983 1786 -888 -766 -1274 -1180 -870 -1893 2079 1273 -2158 2730 330 -3664 3482 -532 -1831 4307 854
1000 854 1173 1101 88 1161 -1184 1613 3620 -1810 2365 3273 -3390 2042 524 -1904 2089 342
1016 342 1338 41 -1163 997 -2751 -881 2798 -3810 797 3431 -4593 1408 656 -3854 1187 593
1032 593 -241 18 -154 1712 -1818 -1638 3402 -2730 -329 3981 -2895 963 906 -2666 616 -1188 -667
1049 -667 794 -2038 1013 -533 -3663 2287 -2977 -3460 3023 -3277 -1202 1819 -2992 -1639 -228
1064 -228 -636 -920 -2109 2547 630 -3664 4132 -1124 -3796 4386 -815 -715 3348 -151 1265 1066
1080 1066 -738 1915 -879 1388 3424 -2016 3135 1264 -2585 3232 -302 -957 3131 503 761
1095 761 880 -916 1080 -2482 207 2934 -4287 1818 2622 -4985 310 270 -3767 494 -14 -1183
1111 -1183 322 -1562 197 -1921 -1518 2599 -2653 767 3405 -2291 851 1148 -2849 1475 991 -855
1127 -855 1466 -1051 1392 -737 -2997 2448 -1990 -2002 3639 -1588 -1886 1934 -2035 -488 871 -689
1143 -689 1182 -472 1821 675 -2261 2246 -801 -1740 3502 -1271 -1920 3498 -1751 -1650 1140 -1496
1159 -1496 303 -521 548 1099 -1698 1934 1413 -2489 2574 2676 -1147 2954 1637 594 1762 -54
1175 -54 1447 -498 80 2086 -1438 76 780 -4035 29 693 -4801 444 131 -2754 414 -833
1191 -833 -1908 -1716 231 1515 -1689 -130 3002 -1732 -556 1775 -2588 333 1081 -553 410 -1065
1207 -1065 -199 -515 -2021 340 -374 -1151 2199 -1190 -1166 2416 -1659 -275 2195 499 660 1861 1594
1224 1594 -718 -750 2098 -86 -1801 2673 -512 -2006 1907 -1623 -2393 -290 -673 -141 -469 -1078 -336
1241 -336 -694 -36 -202 -1706 1850 622 -702 1995 -434 -995 731 427 -801 -672 983 244 -2407
1258 -2407 82 392 -3444 157 28 -2580 105 -162 -1692 -1229 -388 -945 -924 59 -130 -1312 810
1275 810 507 -2513 624 -86 -1618 1042 570 -958 -566 1106 444 -1480 -243 1557 -832 543
1291 543 2140 -1263 40 1318 189 145 709 1264 462 987 1061 -602 234 1443 -1136 1090 2463
1308 2463 -1456 715 1692 -637 -487 1170 989 -658 934 2140 -951 -958 2133 -746 -494 2090 44
1325 44 173 179 427 -175 -1063 270 40 -461 1056 -687 -1532 916 -1881 -1443 859 -1602 -1220 -170
1343 -170 -687 -2149 -1943 -131 -1704 -2356 1096 -729 -2935 794 -1059 -1981 51 -660 -160 -141 412
1360 412 486 -831 218 587 -789 1406 845 -983 2010 136 -773 1036 52 -41 482 1265 630 -949
1378 -949 616 1132 -1798 543 1199 -1559 1203 692 -904 111 -232 -292 -299 -51 249 -689 -110 606 -1938
1397 -1938 -148 583 -1937 746 832 -1093 -263 447 -347 -1056 -221 709 -532 -393 1453 -1230 -923 829
1415 829 -1112 -483 287 -315 -640 -195 -741 -1324 -772 -415 -971 -669 619 -1480 -1098 466 -1552 -1477 507
1434 507 12 -1299 574 665 -993 -257 963 -10 -448 1806 938 -199 958 1056 -200 564 1497 32
1452 32 1111 1437 50 214 728 -63 -241 997 363 -189 398 1000 -687 -291 1391 -887 76 1630
1470 1630 -192 -445 727 84 -663 52 383 -142 -683 1043 -410 -1625 668 -1236 -1256 704 -657
1487 -657 -981 319 -308 -562 -436 -75 225 -895 1339 488 -1468 1201 -1 -1051 773 106 -340
1504 -340 576 -195 50 -614 -669 194 -1354 550 587 -1376 1012 323 -1078 891 471 -283 1115 709
1522 709 744 172 212 1155 -1125 800 1541 -1173 689 897 -1051 147 106 -769 333 -123 659 16 -341
1541 -341 1270 -784 306 1555 -514 820 1469 -479 545 650 -523 209 -124 769 -244 -705 964
1558 964 -1488 -860 772 -1579 -682 806 -888 -362 194 -542 -230 -667 956 -164 -806 1484 -633
1575 -633 -604 1050 -878 -673 809 -232 -3 -44 -136 136 -1005 794 93 -752 1672 67 -54 1552
1593 1552 42 -92 1333 645 646 598 811 589 -906 1162 -34 -1383 1258 -146 -1121 550 -397 -1119
1611 -1119 -367 -404 74 -846 69 817 -1352 762 316 -1211 1009 256 -215 926 -111 -138 232 -379
1629 -379 569 -758 317 1118 -1596 723 417 -1775 553 -23 -911 450 -222 -127 -169 -736 814 -1262
1647 -1262 -460 1358 -1747 79 452 -1673 170 -449 -1246 437 -546 -207 -122 -1189 1110 -965 -860
1664 -860 1566 -1363 443 1560 -1073 712 709 -273 1240 -44 794 1220 -581 2016 -28 -798 2252
1681 2252 -637 436 1877 -910 775 1281 -751 708 -502 237 1065 -1351 1440 -133 -1531 2068
1697 2068 -915 -1298 1421 -648 108 390 -1334 770 -810 -510 1144 -1757 1026 739 -1688 1188
1713 1188 -768 -1388 1516 -975 -559 892 -1235 446 -643 -775 806 -1914 858 1036 -2389 828
1729 828 336 -1748 875 -497 -602 1015 -829 853 -395 -1074 1630 -1034 -155 1269 -1270 799
1745 799 862 -1606 1085 159 -582 1389 -572 714 328 -564 1648 -822 -413 2032 -798 169 1742
1762 1742 -1144 488 674 -536 828 -868 428 651 -1050 768 -451 -989 1246 -908 -856 1165
1778 1165 -1379 -61 337 -1294 80 -659 -92 33 -1298 654 -128 -1727 689 -446 -1556 722
1794 722 -755 -449 53 -880 249 -722 -507 377 -784 254 455 -1135 612 18 -1086 1161 -258
1811 -258 -361 1145 181 229 -92 356 793 -346 403 1272 -625 673 1114 -764 664 479 236 652
1829 652 83 521 230 -139 442 -66 -72 1030 -385 417 919 -879 416 556 -422 62 536 376 -137
1848 -137 -141 490 -197 -559 889 -373 -483 671 -400 -473 -255 -371 -191 -139 -371 -164 -348 -105 -194 -773
1868 -773 288 -536 -500 569 -486 -674 309 18 -752 -57 75 -161 -471 213 60 -1026 267 108 -571
1887 -571 179 291 -48 223 361 12 474 170 288 289 454 536 -82 797 363 -218 506 729 -246 199 800
1908 800 -146 -153 191 275 -321 197 629 -225 103 308 -78 -353 186 -138 -9 272 -332 -99 -19 -239 -588
1929 -588 -65 58 -579 -85 -4 -648 -748 217 -407 -828 150 57 -451 -433 193 -536 -489 161 -197 -327 -97
1950 -97 55 -372 -65 -259 -238 174 3 -176 -97 227 -483 -140 353 -235 -125 525 356 -419 416 483 -146
1971 -146 4 579 199 -306 613 152 -97 260 313 108 124 357 -56 313 112 -107 -30 274 20 -157 581
1992 581 -47 -231 249 268 -526 -86 390 -420 -200 153 -43 -569 -152 -40 -587 -224 -102 -244 -435 -84
2012 -84 -475 -422 -116 -585 -125 -41 -190 -430 -32 -162 -663 -67 143 -368 -364 605 -290 -504 358 -32 -177 153
2034 153 461 -64 84 259 159 -68 211 605 48 678 272 12 576 91 74 563 375 -38 477 271
2054 271 146 -95 378 598 -467 635 498 -442 297 246 -259 135 250 82 217 -178 365 -138 -243 436
2074 436 -542 216 257 -603 186 155 -647 145 21 -415 83 -374 222 -472 -607 547 -757 -483 443 -549
2094 -549 -401 241 -531 -14 -94 -478 307 -577 140 -24 -591 537 -273 -323 649 -438 -134 864 -497 143
2114 143 400 -252 587 -314 486 544 -471 1021 368 -515 814 170 -241 849 -303 447 475 -310 735
2133 735 -400 60 661 -505 487 275 -776 707 -4 -860 813 -314 18 394 -481 360 -611 -168
2151 -168 598 -868 -23 578 -931 234 1 -933 553 -475 -164 310 -754 295 -315 -639 410
2168 410 -627 -140 719 -1029 108 381 -1039 495 -251 -273 271 -516 408 -139 -597 711 -254 -446
2186 -446 966 -580 84 674 -607 601 -18 -87 665 -252 420 421 -294 812 57 -414 1189 -380 -36
2205 -36 811 -375 486 109 41 501 -361 319 431 -594 470 180 -707 703 -343 -264 502 -512 215
2224 215 35 -302 84 -356 -34 150 -723 283 114 -844 416 -348 -427 261 -307 17 -207 -175 175 -407
2244 -407 -294 304 -571 110 334 -584 480 -170 -174 227 -177 128 74 23 236 -177 10 447 -419 351 420
2265 420 -369 481 101 -7 1 -1 392 -56 80 412 -70 29 447 -302 223 291 -152 363 -138 122 -49 -92
2287 -92 243 -246 -18 293 -411 -229 290 -550 -32 4 -366 73 -362 144 -194 -377 218 -346 -365 336 -406
2308 -406 -271 300 -556 132 -92 -392 216 -421 -10 -68 -422 264 -337 -516 424 -406 -352 485 -440 204 19
2329 19 -248 326 -368 277 328 -349 471 281 -346 617 -50 -104 762 -363 395 275 -194 465 -175 195 424
2350 424 -303 495 376 -583 664 82 -358 631 -296 270 154 -282 489 -283 -169 539 -517 -12 406
2369 406 -687 339 -72 -620 487 -447 -8 167 -422 181 -291 -406 323 -568 -219 520 -779 146 117
2388 117 -516 328 -374 4 191 -407 187 -63 -536 450 -214 -266 596 -545 258 294 -486 384 3 43 312
2409 312 -112 286 302 -287 641 43 -252 933 -113 175 496 -67 447 155 87 391 -35 245 474 -292
2429 -292 458 154 -279 569 -306 -80 356 -193 -25 24 -107 49 -212 -92 231 -514 186 36 -612 135
2449 135 -170 -239 -91 -274 -140 -86 -330 -52 -404 -481 88 -432 -100 -95 -524 77 -232 -376 -61 -48 -173 21
2471 21 -105 11 -124 -227 293 -355 1 273 -194 47 49 6 -15 49 -8 139 17 179 106 -117 321 -27 249
2494 249 325 -18 172 300 99 -57 236 65 136 53 253 28 -161 267 -111 -122 31 31 -87 -12 -26 -106 53
2517 53 -86 18 -105 4 -54 -121 90 -240 -121 -72 -32 -263 -91 -24 -273 -108 -98 -82 -342 -37 -164 -332 -89
2540 -89 -56 -167 -231 0 -130 -113 -33 -18 -39 -39 -37 -207 166 -54 -110 148 25 3 0 177 -107 47 201 62 22
2565 22 138 313 -76 216 173 76 237 182 227 3 165 73 189 132 148 94 113 205 -131 129 32 -102 12 55
2589 55 -59 -132 111 -72 -62 -133 92 -89 -203 140 -178 -124 -8 -42 -134 -68 -48 -99 -8 -176 -12 -112 14 -68
2613 -68 -164 70 -181 -48 4 -44 -236 144 -49 -231 67 -110 2 -178 29 36 -159 58 54 -53 13 250 -111
2636 -111 102 40 -137 101 -32 99 -37 44 18 28 -20 74 -35 7 297 -196 100 137 -133 113 1 64 9
2659 9 85 33 82 -185 57 25 -232 167 -212 33 56 -198 -81 22 -76 -145 35 -124 73 -201 28 -31 -269
2682 -269 261 -92 -172 102 -80 -128 84 -89 -16 64 -213 185 -164 -52 207 -213 138 109 -64 227 60 -137
2704 -137 353 -9 27 207 -94 327 -82 -4 366 -221 106 206 -219 143 271 -265 272 -104 -88 329 -213
2725 -213 194 18 -236 199 -85 -121 179 -227 -71 256 -449 118 28 -323 216 -410 -48 -19 -342 139 -124
2746 -124 -386 281 -128 -258 328 -436 203 -33 -307 248 -230 -26 177 -349 0 181 -303 356 -133 -302
2766 -302 498 -311 138 257 -267 313 45 -49 299 -202 139 514 -308 301 165 -276 559 -147 46 359
2786 359 -166 301 173 -263 369 -25 -62 527 -388 304 325 -419 387 -79 -135 298 -204 -3 132 -316 258
2807 258 -142 -479 431 -430 -28 163 -569 195 -119 -231 195 -282 -181 254 -411 101 -49 -522 432 -415
2827 -415 -135 252 -503 108 -15 -381 120 -122 -205 290 -457 94 228 -464 400 -145 -252 311 -218 94
2847 94 219 -264 271 151 -251 396 -210 66 307 -313 384 13 -171 366 -11 -88 360 -68 191 246 -242
2868 -242 464 -86 66 321 -270 233 142 -129 171 -40 -148 270 -158 -58 172 -275 178 -252 -100 166
2888 166 -322 0 55 -280 -2 -21 -247 108 -227 -20 64 -307 97 -182 -158 45 -222 -84 -46 -180 -64 -16
2910 -16 -310 61 -46 -55 53 -162 142 -145 -23 87 -48 -49 86 -30 -73 188 -47 130 -50 43 171 -116
2932 -116 160 15 49 47 66 -6 123 34 54 165 -37 186 -32 145 57 -29 272 -2 77 82 109 19 98 89 -3 7
2958 7 -3 117 -161 45 -8 -123 100 -173 -31 -48 -8 -77 -66 -109 -35 -76 -79 39 -235 120 -26 -179 46 -113
2982 -113 6 -95 -50 -27 17 -81 54 -116 -121 157 -191 73 -24 -116 133 -99 7 82 46 -52 81 -79 148 0
3006 0 9 210 -217 156 73 -19 39 -19 -1 33 7 21 103 -118 128 -5 -71 149 -126 143 -13 -66 45 21 -54 17
3032 17 43 -139 127 -146 102 -36 -120 173 -179 -14 -8 -74 -84 4 -69 -52 2 -98 69 -154 108 1 -8 69 -49
3057 -49 65 31 43 -101 134 -18 56 35 -50 83 -95 130 -56 -53 75 58 -15 -61 62 -34 114 -13 37 17 -47
3082 -47 136 -78 86 -43 74 23 -9 22 -45 90 -149 15 21 11 -42 -46 -40 -91 71 -57 33 -67 18 -8 -206 -8
3108 -8 -162 -6 -81 -26 -122 -8 -89 -91 88 -196 67 -102 -44 2 -148 5 4 -4 -16 25 -169 73 -44 -130 78 -123
3134 -123 124 -98 -56 148 -71 32 121 -59 76 158 -93 158 39 -17 216 -86 170 22 26 88 16 1 125
3157 125 -18 -97 184 -122 149 -4 -41 163 -138 76 28 -22 15 22 -116 67 -27 -99 169 -180 61 -25 -168
3180 -168 41 -122 -70 -78 -153 -97 8 -291 73 -2 -203 169 -227 -48 -3 -123 32 -35 -61 47 -62 -121 62
3203 62 -214 11 48 -160 83 -125 -39 58 -43 -9 43 10 15 81 -41 262 -66 118 167 -31 88 69 59 43 121
3228 121 28 152 96 80 112 -117 208 -44 56 70 -13 97 25 41 1 114 -120 72 15 -12 21 -80 145 -79
3252 -79 -36 42 -60 -116 -75 24 -155 12 -105 -60 -130 -108 14 -110 -63 -60 -92 -94 44 -91 -27 -10 -151 94 -110 -97
3278 -97 -73 -74 11 -34 -44 -77 69 -74 109 -105 -27 77 -79 67 60 17 34 47 27 39 53 50 156 -87 139 -17
3304 -17 35 113 -4 116 111 26 30 83 -112 172 42 22 151 -87 193 95 -86 134 18 -18 130 12 -101 134
3328 134 -150 94 -24 -181 160 -146 32 2 -134 55 -34 -161 87 -11 -145 150 -248 -5 -36 -134 161 -216
3350 -216 -73 110 -171 6 112 -146 54 38 -81 184 -211 30 78 -105 87 -12 -65 88 -43 -112 215 -187
3372 -187 84 110 -246 195 -45 2 127 -33 46 91 -90 196 97 -134 259 -94 79 184 -163 252 14 -35
3394 -35 125 -55 -24 130 -156 47 127 -179 314 -110 -56 149 -218 80 48 -141 101 -41 -121 154 -222 -20
3416 -20 181 -282 150 -70 -154 101 -154 -26 71 -163 48 79 -211 157 -96 -25 204 -272 150 53 -193 136
3438 136 -51 -116 98 -32 7 143 -243 255 -40 -113 248 -156 90 44 -138 123 63 -143 195 -30 -58 224
3460 224 -211 124 48 -145 188 -104 23 170 -135 -5 158 -226 125 -26 -63 216 -258 150 -12 -187 103
3481 103 -34 -114 23 -83 -67 120 -242 92 13 -130 118 -194 -6 15 -114 70 4 -144 87 -10 -160 186
3503 186 -172 86 5 -167 202 -158 -33 66 -58 19 161 -76 80 47 -116 103 -101 71 92 -80 116 -33
3525 -33 -23 43 -37 -3 146 -117 84 77 -158 143 -84 25 41 -83 53 -26 -29 -2 -20 -56 94 -162 -11 38 -144
3550 -144 54 -38 12 -56 -56 -6 -9 -43 -50 -73 -151 113 -104 12 -4 -88 17 -63 26 -41 -33 -9 61 -64 23 34 -43 109
3578 109 -73 37 23 -64 88 -41 91 18 41 -42 55 8 31 89 -24 155 3 19 9 55 158 29 75 -2 81
3603 81 40 75 -15 40 65 -1 123 -86 134 27 -27 54 -8 24 -6 35 -31 20 -77 2 -2 -62 59 -95 17 -61 -7
3630 -7 -19 -63 5 -8 12 -97 36 -84 -61 -60 -15 21 -98 17 -91 -22 -2 -18 -66 -41 20 -42 94 -56 3 23 -19
3657 -19 48 -32 57 -23 74 29 78 -32 19 48 -88 106 -28 11 5 8 53 37 29 17 32 33 100 15 33 77 -5 131 39 34
3687 34 -16 13 53 2 45 -58 95 -43 90 -3 -50 45 -122 58 -46 -55 -26 -18 -113 7 -54 -71 53 -174 50 -15
3713 -15 -63 24 -117 -54 -21 -82 -112 23 -156 39 4 -128 134 -111 80 -8 -60 114 -40 -123 34 -25 -82 15 -101
3738 -101 48 3 -155 129 -51 5 48 -62 15 82 -120 89 -16 -154 220 -110 76 77 -105 172 -47 0 106
3761 106 -108 49 133 -122 123 67 -178 170 -76 61 138 -140 119 -17 -104 107 -47 -99 122 -204 31 134
3783 134 -269 143 -120 -101 63 -158 12 21 -185 39 46 -186 203 -150 -52 171 -185 139 -85 -81 87 -65 -78
3806 -78 91 -180 41 95 -209 241 -120 -64 243 -184 119 73 -80 106 25 -95 164 -124 6 156 -160 198
3828 198 -16 -122 192 -65 63 132 -126 136 55 -108 146 -53 -32 163 -208 161 70 -117 154 -41 -70 28
3850 28 -52 26 25 -147 173 -93 -84 184 -210 79 -21 -161 88 -93 -79 83 -124 -80 165 -188 57 -10 -101 85
3874 85 -182 33 66 -123 19 81 -149 115 10 -13 143 -108 112 -11 -74 58 0 -16 50 5 0 120 -122 75
3898 75 46 -1 150 -110 110 57 -36 92 29 24 27 50 -71 146 -53 59 34 -57 88 -118 -8 19 -11 20 40 -20
3924 -20 -6 27 -80 70 -49 67 80 -23 1 -63 -7 -35 49 -26 -20 -44 -33 76 -128 -5 -39 -54 -26 39 33 -43 -7
3951 -7 -16 64 -124 28 4 -9 17 -45 21 -22 29 -5 36 -15 -88 114 -109 23 0 20 33 10 54 -3 -20 76 156 -99
3979 -99 114 38 0 43 -72 122 -6 27 79 49 -35 68 -31 -27 15 -94 70 -29 -73 61 -83 -30 -33 2 42 8 -53
4006 -53 60 -36 -113 135 -173 -35 -41 -65 83 -56 -55 24 -36 -64 134 -139 -47 -1 -35 82 -158 76 28 -38 42 -3
4032 -3 -29 75 31 -31 131 -96 102 -29 -142 168 -51 13 28 4 8 21 -16 52 19 -89 177 -85 25 11 -54
4057 -54 72 -58 -32 43 -35 -67 81 -63 28 -40 -12 107 -127 -5 37 -53 -32 -16 -20 -31 -29 -115 86 -121 34 19
4083 19 -144 97 -35 -13 4 -27 51 5 -120 -12 24 -106 47 -53 -15 24 -116 48 -31 -53 37 -18 -19 25 -57 -39
4109 -39 71 -29 57 -78 16 95 -60 69 15 26 23 21 -4 82 -14 -36 56 -45 66 -43 48 60 -20 46 18 -44 -4
4136 -4 88 -92 36 -54 -18 9 -76 48 -81 -24 30 7 -75 -44 -32 -53 -17 -96 -4 2 -40 -4 -44 5 -83 -10 -71 41 -30
4165 -30 -47 -39 -108 61 -117 28 -81 69 1 -70 35 -66 98 -9 23 -47 -11 4 -12 22 -9 66 30 50 -4 -14
4191 -14 74 -7 72 -16 62 28 27 34 -1 43 -24 64 -44 8 -14 73 104 -20 87 4 -11 -22 23 -12 -36 -8 -74 46 -41
4220 -41 55 -57 -7 -2 -80 -34 -8 -10 -43 -45 10 32 11 -74 -26 -157 70 -55 -48 -4 -76 41 -30 19 -126 91 -76 27
4248 27 24 -119 1 5 8 -33 -1 15 31 -58 17 59 -81 66 -49 70 -38 -27 124 4 -19 48 -18 -36 68 -7 31
4275 31 33 -103 121 -53 99 97 -22 -3 -63 57 -20 47 -13 64 -103 -25 69 -87 14 -27 59 -59 -73 18 -19 -56
4301 -56 -53 11 -120 5 -48 -7 -36 -60 20 -76 -80 -64 -45 -68 -37 -42 -51 -8 -105 -17 -35 -45 -31 -12 -54 -29 64 -17 29 -27 16
4332 16 35 -36 63 2 21 23 55 4 4 43 79 84 -108 83 -37 -20 39 -30 -1 -25 6 50 21 9 124 -5 -38 133 -24
4361 -24 112 -5 33 59 -41 2 43 -31 -68 12 -51 40 -61 -94 89 -57 -14 49 -30 10 -19 -31 18 -43 -35 107 -135
4388 -135 25 70 -79 92 -97 22 -40 -128 89 -13 -135 105 -33 -53 67 -114 69 -26 -67 107 -50 -60
4410 -60 73 -16 -29 49 -55 135 -30 -141 179 -159 -33 56 -69 73 -18 5 68 -59 -5 151 -141 44 67
4433 67 -75 161 -103 36 89 -117 89 76 -174 59 68 -92 100 -157 81 39 -173 136 -82 -145 36 -62 -41
4456 -41 15 -157 83 -8 -204 182 -133 -37 67 -107 25 -56 -143 96 -70 -102 106 -102 4 58 -104 117 -69
4479 -69 -31 98 -119 21 16 -89 29 45 4 194 -130 97 88 -190 89 -5 -96 149 -63 5 53 -147 109 90
4503 90 -192 182 -31 -49 145 -108 141 -25 -70 127 -32 -53 164 -34 35 46 -139 96 -108 -79 107 -133
4525 -133 -7 72 -57 14 -61 -85 99 -88 -28 98 -183 71 -46 -78 40 -84 12 32 -150 12 59 -159 57
4548 57 -68 -71 59 -67 111 -30 -81 79 12 -22 -5 -26 -2 85 -24 123 7 -29 174 -39 -4 95 -13 64 -25
4573 -25 70 152 -82 21 87 -39 36 13 38 22 -109 41 49 -50 -29 62 -31 -13 3 -72 6 -74 59 -42 -88 14 -17
4600 -17 -25 -28 -7 3 13 -54 15 -3 -101 -5 -29 -24 -3 -16 -4 -86 -37 49 20 -155 29 -33 32 -45 -81 -18 -103 -33 -27 37 -30
4631 -30 -15 -11 -15 -28 5 56 17 22 29 -17 33 35 69 -23 2 24 67 6 -1 48 -24 -19 53 -13 -72 33 24 16 -21 7 87 -29 -16 30
4665 30 0 -58 -36 27 -36 -8 -20 26 -11 -55 26 -54 -31 5 -6 -58 -19 -2 -4 -53 -61 38 -92 -79 18 -7 -19 -75 -31 -58 -30
4696 -30 -38 -42 23 -78 3 -27 -3 -43 -9 -60 -59 23 3 -26 -57 11 -20 10 -13 72 26 -33 47 0 6 2 63 21 13 44 12 13 -35
4729 -35 40 -6 3 -8 16 13 -52 14 6 8 4 52 43 -39 7 -28 0 15 -17 32 -30 33 23 36 -53 -1 -15 -85 18 -55 -33 -36 -7
4762 -7 -20 1 -22 26 9 -82 46 -83 7 -61 -8 -18 -54 18 15 17 -115 17 -10 30 -15 -6 44 -60 25 67 -11 16 -34 -56
4792 -56 23 22 5 58 -60 59 72 -54 52 -72 15 49 -26 98 40 14 75 38 -70 59 -16 64 12 -85 48 -39
4818 -39 -1 7 -36 -41 43 4 64 -25 -53 122 -45 5 34 -38 -13 -61 -14 3 -79 -24 65 -48 4 61 -72 60 2 4 47
4847 47 -54 36 22 -67 26 47 -86 69 -83 -21 52 -54 10 -13 -43 38 6 8 99 -32 -9 24 -149 90 -45 27
4873 27 52 -65 41 45 21 34 -11 -26 126 -92 13 56 -116 71 -9 20 80 -97 14 103 -42 -61 54 -31 -18
4898 -18 -16 45 49 -135 63 29 -60 23 3 -19 -35 -22 -34 33 -144 95 30 -114 40 -99 50 -16 -59 82 -22 -24 35
4925 35 -20 3 68 -61 66 -2 -46 113 -65 11 98 -18 12 42 -35 -3 -60 20 167 -90 8 74 -45 31 -19 -27 -7
4952 -7 1 -8 41 -19 58 56 -50 86 -69 94 35 -85 30 -38 -16 23 20 -40 -11 -45 78 -52 -67 59 -45 -68 26 -28
4980 -28 -8 -31 -39 27 2 -43 99 -30 -26 -17 -9 6 -104 -11 -5 -35 -16 41 -21 -27 98 -35 26 -22 10 74 5 82 28 -21 0
5011 0 84 -9 25 35 74 56 -46 61 44 -2 18 27 42 -24 29 7 55 -29 59 22 -24 -12 50 21 -62 51 -22 -6 -34 23
5041 23 -43 -85 51 -67 -16 -39 16 -19 -77 -91 -54 4 -61 -18 14 -65 -37 -5 -4 -22 -48 27 19 -120 -13 35 -13 58 -87
5070 -87 20 -24 -16 95 -23 -63 18 27 -19 43 9 21 1 -62 87 -25 -20 -4 -4 17 4 -1 42 14 -14 133 -83 35 93
5099 93 -26 1 7 41 20 -69 60 72 -70 6 94 9 112 -20 0 63 -66 49 20 -87 40 4 -82 -10 -57 22
5125 22 4 -69 43 -17 -62 31 -29 -15 -30 -71 34 1 -98 67 -54 -38 15 -93 -16 -112 57 46 -40 3 58 -28 -35 16
5153 16 -110 35 -67 25 42 -67 8 55 20 -32 37 -26 62 -32 46 122 -87 79 17 -17 24 2 85 54 -20 78 20
5180 20 18 82 -2 28 72 -41 67 -61 -4 81 -34 -10 118 22 -17 80 -38 1 -27 -9 41 -52 32 10 -19 -51 -58 -26
5208 -26 -12 -89 -100 18 -52 -2 -27 -25 6 -45 41 -56 -47 40 24 -55 32 5 -5 9 -2 59 -110 -6 28 -44 -7 -54 37 18
5238 18 -41 31 44 57 -66 97 -13 12 -26 -23 -29 -19 62 16 -18 19 44 8 9 39 -39 22 -43 21 -16 -5 7 17 58 -38
5268 -38 29 33 2 -35 62 28 -22 2 0 43 -50 16 -3 -40 40 56 28 -14 -7 0 14 -35 68 -12 -40 64 -1 24 -21 -19 30 -5
5300 -5 1 10 -21 -81 32 -16 23 -17 18 28 -44 45 98 11 54 31 43 -7 -9 30 23 2 40 -4 -4 15 -64 45 6 -13 -22 15 20
5333 20 -32 36 -69 29 26 1 -4 -75 69 -4 -49 40 -2 5 -12 -46 31 -58 -64 31 -32 -58 -5 -41 -32 -4 39 -2 52 -53 66
5364 66 -44 -10 35 -21 1 15 -13 2 -4 -12 7 -3 -40 7 -17 29 -7 -11 -3 17 54 -22 73 -9 35 -3 -22 37 -27 44 13 21
5396 21 45 44 50 42 24 -25 33 10 53 41 8 35 -62 30 51 -58 2 33 -51 -2 -18 49 37 -67 70 27 -47 -7 -87 10
5426 10 -29 -15 -11 -32 -41 62 12 -52 19 -63 -18 -48 -81 76 -34 -2 38 -45 -47 22 -2 61 1 10 50 -30 2 14 -32 43 52
5457 52 -35 50 -2 54 76 -95 61 7 -75 25 -18 47 86 -54 49 22 -114 86 57 19 67 -36 19 36 -39 12
5483 12 -18 3 7 45 -28 -8 -36 72 39 -74 37 -60 -10 -18 -73 -24 -32 -72 15 -31 -66 23 -76 -25 -4 -49 26 2 -32 -11
5513 -11 -70 44 54 -75 5 4 -36 61 -78 21 93 -63 92 -8 -83 -3 -10 5 75 -32 56 37 -78 72 2 -60 71
5540 71 25 -20 37 -2 108 29 -10 152 54 9 134 -19 27 34 -19 81 21 -38 84 1 18 62 -71 71 -85 -20
5566 -20 38 -44 58 -11 -86 25 37 -34 48 -22 9 2 -105 26 -85 -81 -4 -59 10 -9 -46 20 18 -109 -12 -9 -58 41 -57
5595 -57 49 48 -72 -4 -66 -16 76 -18 15 40 -29 30 -16 -24 76 -27 26 68 -33 3 16 -18 99 -55 -29 74 -39
5622 -39 42 83 6 105 -53 57 100 -48 49 30 -21 -38 14 -24 68 -48 25 22 -28 44 -8 28 0 3 17 32 -6 97 22
5651 22 -67 83 -32 2 -29 -14 -30 -43 -15 31 -78 -23 -2 -39 -21 -64 -71 -24 -34 14 35 -24 7 -17 -39 -22 -5 -17 53
5680 53 -20 20 -6 -78 53 2 -8 16 10 -18 29 22 0 72 -43 46 13 37 13 23 26 -45 -16 14 1 5 -13 -14 -3 27 4 58
5712 58 -68 55 6 -73 20 2 -12 -19 -5 -20 23 -51 -19 -30 -48 22 -67 -17 -40 -25 -18 -22 -57 -23 78 -20 1 -12 -9 -21 -1
5743 -1 71 -33 13 55 34 -39 52 32 -33 -37 -9 9 -26 0 40 2 9 -39 102 37 45 -31 15 38 -25 23 -19 57 -6 49 -45
5774 -45 -24 90 -7 10 22 41 0 18 8 10 17 -63 -18 -88 4 -2 19 -11 -14 0 8 -26 7 21 -27 -29 -1 -13 0 -34 45 38 -8
5807 -8 -17 -39 12 -28 30 -33 39 -27 11 8 -3 31 19 19 15 37 -18 56 15 5 31 -54 -6 -7 31 33 -21 54 -2 30 29 32 -4 30 25
5842 25 -13 5 47 49 15 26 -4 8 36 10 -11 -55 39 -61 16 -30 9 68 7 -21 21 -21 28 -15 -24 -31 -30 -63 -15 -45 -5 22
5874 22 -57 -34 -47 -13 1 -5 31 -1 -47 9 -15 -106 -49 -31 26 62 -46 4 18 -6 65 44 -13 -14 -2 15 5 -4 71 22 26 -2
5906 -2 17 16 2 53 1 35 -44 25 37 -11 20 -12 83 28 42 78 -9 42 76 20 5 66 -17 24 11 -35 18 -4 35 -25 24
5937 24 -39 19 -30 14 10 -3 12 -91 8 -33 -15 -9 -16 -61 11 23 -60 49 -57 34 -24 -9 -18 -21 -7 -13 -16 65 -30 -35 -3 0 -37
5970 -37 30 -30 4 -27 -13 64 -55 -34 3 -25 -33 -63 -15 57 -23 9 57 -22 34 -11 23 42 19 36 -22 -35 6 26 6 11 43
6001 43 -40 43 12 72 -19 -9 30 -29 9 46 28 24 32 -49 -4 34 -37 50 -31 -13 -32 -11 -52 -54 -1 14 -43 -40 0 -9 -38 21 -99
6034 -99 -42 -35 26 -4 -41 -8 -36 -7 -3 83 -48 23 -54 33 7 16 36 13 25 -7 6 18 -47 2 20 52 -17 56 41 -11 49
6065 49 25 27 -2 30 10 11 -28 0 20 -34 30 22 -9 14 12 15 20 -1 41 29 -38 31 51 -9 3 -8 21 -30 27 13 -35 8 13 19
6099 19 -59 -11 -29 -17 -93 -1 4 -58 -24 -26 -27 -3 -9 -46 36 16 35 36 -48 6 -72 1 -27 -8 -31 9 -73 -37 -10 -39 19 20 -48
6132 -48 11 -17 -5 5 16 -17 44 -7 7 -6 -96 68 -23 39 68 -46 79 -6 46 56 48 -11 66 -17 -9 14 -55 -12 14 -53
6162 -53 13 7 -51 -2 -20 -24 -1 10 53 -38 -9 -6 -60 14 -24 -10 -56 -47 -26 -23 -25 3 15 -55 -45 -54 -2 2 -37 13 39 -9 8 14 -88
6197 -88 49 -28 -6 21 -64 79 -20 12 -44 10 16 8 -6 23 16 -100 51 26 -7 15 16 -6 -34 13 -35 -38 -27 7 -55 -28 54
6228 54 -30 28 -54 -26 70 14 34 8 2 37 4 -2 33 -33 -2 25 -69 8 -45 -9 -49 -57 9 -57 17 2 32 -31 -12 -10 -52 12
6260 12 -65 15 -84 -17 42 -11 -7 -8 -1 -12 36 -74 -11 -29 -26 57 -57 54 43 -6 -7 -2 21 48 -1 -49 67 -18 3 38 -20
6291 -20 45 41 -27 -51 47 -17 5 -35 4 -10 -15 12 -32 31 4 -21 2 8 -6 4 -35 -9 -17 -4 51 -1 -56 -11 -30 -8 23 -16
6323 -16 12 -17 47 23 13 -37 10 -45 -27 16 -62 -4 -7 49 -44 10 -37 -4 27 1 -11 26 43 -7 11 4 -23 34 -45 27 -1
6354 -1 4 46 -8 -19 -26 -22 -23 21 -45 28 18 22 59 -38 4 32 26 8 -3 48 31 32 28 30 -36 40 -34 -26 -13 -5 -17 -28 -5 -1 16 -22 -4
6391 -4 -36 6 -61 -66 56 -52 -10 -45 -81 -23 4 36 -31 50 -25 -28 -30 -62 39 -18 -24 -21 -13 -27 3 -32 -17 -9 0 55 16 -19 -66
6424 -66 -7 21 -46 51 14 -26 23 8 -39 0 53 25 31 48 44 39 -25 18 -28 -31 18 28 -11 -5 8 13 -11 4 -11 -13 28 -37 8 30
6458 30 18 14 -11 11 -61 -36 6 14 18 23 -20 5 38 0 -14 21 -10 28 -65 -46 -12 18 -30 -1 -26 14 -20 -1 20 -18 -8 -25
6490 -25 -2 -38 -69 52 -60 -15 -13 44 -20 -14 21 6 6 -40 65 -23 1 24 -29 51 -5 37 0 -15 19 36 -22 18 47 -49
6520 -49 19 -38 6 -17 20 65 -3 51 25 -36 20 41 22 -33 21 16 -36 -54 -4 9 21 16 -29 -37 -36 12 8 75 -37 -65 -15 -33
6552 -33 0 -2 -37 -34 -49 12 36 -12 18 52 -52 -28 -30 -12 31 -47 4 -45 5 49 -46 4 24 -50 -31 56 -42 37 -18 -46 35
6583 35 -69 -22 -19 -16 -4 1 -3 38 15 -36 -16 -50 72 18 -42 55 -17 3 42 6 12 31 -33 73 -12 -7 85 -37 60 34 -13
6614 -13 55 9 17 23 -60 -8 -13 -30 69 -14 -22 -28 -37 -45 8 8 -7 -31 12 15 16 -30 10 -14 58 25 -81 31 -44 -2 -53 -14 13 14 -45
6649 -45 30 -12 -39 36 -103 5 11 -9 -10 24 5 72 14 7 70 -31 36 24 0 10 -18 78 21 -22 31 -8 11 -1 14 -1
6679 -1 18 -43 28 -25 -54 61 -69 -4 0 -15 -8 -9 -26 18 -28 -8 44 -27 -11 4 -8 17 4 -64 -38 10 -51 4 -22 13 23
6710 23 -47 27 -58 7 54 -2 -12 18 -20 4 10 24 -3 -36 -13 12 27 82 -74 -19 -26 18 5 -18 -9 -43 38 -22 1 -8 -10 44
6742 44 45 17 -16 47 -46 -38 -33 -1 25 -14 54 -31 -18 -39 44 -43 -5 21 -23 67 -36 29 24 21 -11 -4 -13 -19 20 12 20 1 -28 27 -14
6777 -14 15 -33 -20 -11 17 57 -5 14 -29 2 -5 -17 22 -20 49 7 -33 -65 39 -25 36 11 -14 53 -50 -31 3 11 -18 41 -15
6808 -15 -38 -10 1 -42 -17 -21 0 2 -31 0 8 16 21 -73 1 -60 -21 28 -24 15 -32 -12 -37 -10 1 -65 -47 42 51 -13 45 21 44
6841 44 64 -20 19 21 12 19 55 -76 1 -14 -42 -27 29 -4 -43 -24 -58 8 -36 -26 10 -55 42 -3 -14 39 -21 64 9 16 38 9
6873 9 -55 28 56 25 41 -1 -14 -12 5 61 -30 11 50 -37 9 35 7 17 -35 -2 10 27 3 24 11 2 10 22 5 25 20 44 41
6906 41 -39 -10 5 -1 -23 28 -49 41 9 1 6 -21 34 -18 -26 -60 8 -5 -19 -31 -25 37 -46 -14 -16 -27 -35 -12 16 10 -19 0 -2 20 23
6941 23 0 -74 19 -25 -21 15 0 -51 -6 15 11 -45 -49 -14 -61 42 -1 -75 -17 -43 -48 -15 -10 -1 -10 23 -3 3 -66 19 -105 3 -41
6974 -41 21 32 0 33 -28 11 -16 3 10 40 21 1 67 7 -9 5 35 61 -17 5 4 -24 12 -21 -21 8 -34 -52 0 -17 5 10
7006 10 -58 -15 7 -14 -89 -54 17 26 -45 -39 7 -35 102 19 17 12 15 -27 -7 -8 27 54 -12 -11 -3 41 -19 -49 26 -19 42 -23 -11 -41
7040 -41 60 3 13 29 -46 18 -67 6 12 0 -14 -4 -11 15 -21 49 17 8 -24 26 -2 29 -11 21 2 -33 28 55 -29 -29 24 -11
7072 -11 -12 -38 -35 10 29 -19 21 3 -11 -56 0 15 -61 -12 -11 -24 25 -7 22 46 -13 44 -18 -2 -51 -4 -20 7 -11 -10 25 -28
7104 -28 65 18 37 -19 32 1 -37 4 -20 -15 -51 43 -14 -26 3 24 -18 20 10 -3 -7 9 1 10 -1 -23 -26 16 35 -22 8 -55 29
7137 29 8 18 43 22 -6 -11 -7 -13 45 -55 31 -8 2 -43 8 -2 -41 38 -21 56 3 5 -6 -36 -26 -3 31 3 -42 -33 6 27
7169 27 3 37 -12 -37 -6 4 10 -6 31 4 36 42 21 -18 -18 7 -35 6 -29 26 38 -27 -1 -45 0 23 25 37 52 -40 14 18 23
7202 23 5 -13 54 53 12 -3 -31 31 52 -12 23 91 -61 16 15 -16 11 -16 -13 10 35 -22 2 1 -1 15 -13 36 -32 -41 40 -46 -27
7235 -27 9 2 -22 1 -52 -14 4 33 -24 11 74 -17 -32 17 -11 25 39 -39 35 42 16 6 -53 35 19 -50 103 -17 -24 23 -6
7266 -6 -17 -21 43 -16 35 26 49 -24 -17 -2 -2 32 26 -23 19 -10 -21 -4 -9 -23 48 -14 46 -31 -28 49 -14 19 -19 10 -18 34 -10 30
7300 30 -34 -19 35 -18 71 -4 20 17 12 -14 39 7 -60 59 25 0 34 -4 -46 -38 -27 -31 1 -15 -1 -15 -31 33 -33 41 -32 41
7332 41 -17 -33 3 4 34 10 -3 24 20 -49 32 -5 -2 -20 -2 21 14 34 -83 -23 27 11 75 -2 38 31 63 -1 15 62 -17 -28
7364 -28 33 72 35 2 30 -36 -48 4 10 0 28 16 -33 56 -26 -22 -9 -43 -16 -7 -12 9 77 -59 -32 -30 25 23 0 12 -14 24 19
7397 19 33 7 -45 -5 -24 18 -48 40 4 -35 -27 -28 12 -25 -13 -34 2 -9 -1 73 -5 7 10 12 -7 47 -15 -22 -29 -5 73 -19 -14 -112
7431 -112 -37 40 -34 27 58 -35 -13 -31 25 -48 -29 20 -6 -11 45 29 -34 -1 -8 42 -2 -4 -67 38 -4 -25 0 -59 61 49
7461 49 26 9 19 -13 24 13 -52 -30 29 0 -52 -4 -32 -2 3 19 36 -28 -4 -8 -12 -29 13 -23 3 35 8 20 2 -7 17 30
7493 30 -6 36 2 -42 1 22 -47 6 20 -8 16 6 -3 -9 33 43 -41 -8 48 -25 31 -22 5 13 -18 15 -29 48 -6 -56 -58 4
7525 4 -16 -12 22 2 -11 -22 40 -27 50 7 1 18 -21 -15 17 4 1 -35 24 29 -63 4 -22 14 36 0 -59 -9 7 12 -23 36 13 -8
7559 -8 7 -5 1 -33 58 24 -6 -23 -1 15 -22 -11 -18 4 -47 13 -6 40 -2 6 5 -22 -17 60 37 50 28 -8 -19 -23 8 1 24 7
7593 7 -1 -29 25 -7 9 -31 7 24 -10 -2 1 -19 -44 30 9 6 -62 -6 32 -41 -48 16 33 5 -10 37 -4 -2 -3 87 33 20 17 -14 1
7628 1 -24 29 -14 9 -31 4 -22 50 32 39 -42 5 37 13 28 18 -49 -32 -13 52 -6 94 -49 30 33 -24 -11 -57 -11 40 1
7659 1 1 -25 -16 19 4 17 43 -19 -19 -3 -14 34 -41 -18 -8 -22 -47 39 1 16 45 24 -50 -11 -6 -51 -27 31 -44 8 7 -7 -4 9
7693 9 18 -36 47 -19 42 -13 -39 -7 14 9 -10 16 -14 26 3 -1 51 -31 -22 -101 35 -6 -8 19 -30 -41 16 -26 -8 -5 -21 -20 42 4
7727 4 -3 -21 34 30 -16 -31 -36 -9 59 6 -15 44 -42 -15 17 -5 -10 -36 4 -24 -5 -43 73 -30 3 15 -50 34 -15 -12 34 -33
7759 -33 23 -16 41 -4 13 -7 -9 -34 -27 9 -6 58 3 -17 -64 44 22 -6 -6 25 14 -42 43 -15 30 33 -32 24 -28 27 -30 22
7791 22 18 4 0 -52 20 2 25 -37 22 36 39 19 -20 21 -16 -24 62 14 16 -14 27 -21 15 -41 27 38 -30 -6 17 -29 -22 48 15
7824 15 -36 14 -7 8 31 16 -4 10 -8 -1 -15 -1 -38 3 45 26 6 -20 57 28 -31 51 16 -24 -17 -70 14 18 -24 -31 5 -35
7856 -35 -5 -49 12 -13 10 -3 -8 22 20 22 29 6 15 -6 56 13 7 -1 21 -29 6 41 -11 -68 -34 9 24 4 -13 -16 15 -45 13 15 -24
7891 -24 5 -12 -47 40 -13 1 -2 -8 -42 -23 54 -27 -87 -10 -2 -15 -34 -26 29 -28 -38 1 -22 -9 37 12 4 17 4 14 -28 5 -21
7924 -21 -30 -13 -3 18 5 2 18 25 7 14 -2 10 -8 7 35 2 6 54 -19 -4 -32 20 -5 -20 -35 39 -18 38 46 -14 17 28 8
7957 8 17 -36 42 26 19 17 71 -57 -4 -10 -53 4 5 4 -39 -4 -12 44 12 -43 18 0 -33 20 -3 47 -26 -15 17 9 -21 5 19 27 24
7992 24 18 -19 6 -11 10 -37 -62 12 -2 -14 -27 -13 -75 -31 10 0 15 -32 -43 -51 -7 -24 -20 -12 59 4 7 -14 51 33 -7 22 12
8025 12 15 -3 15 27 15 -23 11 -17 -18 30 15 7 25 31 -30 79 25 -5 -5 -9 32 -50 -3 0 23 -71 10 3 43 -27 -25 73 -35 3
8059 3 54 3 12 42 8 -22 33 33 -22 -20 14 -35 -3 -29 -41 -32 12 57 -2 -14 38 29 12 -4 -30 6 -50 32 -63 29 -19 32 -54
8092 -54 -21 -35 -42 -19 47 -5 1 -5 -9 -5 -15 -58 28 -51 45 34 28 -6 -4 5 23 -23 -28 17 -43 9 -5 -18 -6 -8 24 15 8 -32 19 -38
8128 -38 -23 -21 -50 -24 -6 -26 -1 22 23 24 -50 43 -5 -41 -2 -2 21 -34 -11 -4 29 18 16 22 -36 -9 17 -7 26 -22 -2 -32 18 19
8162 19 27 2 -39 6 -61 -57 -55 -10 55 25 28 -37 -17 21 7 -24 -17 -1 -17 -12 17 22 -31 17 11 18 29 -4 48
8191D8
##END NTUPLES=NMR FID
##END=
